##TITLE=31Pdec_SR20 Gly
 CDCl3, 24 sc
 31.08.2021
##JCAMPDX= 6.0         $$ Bruker NMR JCAMP-DX V2.0
##DATA TYPE= NMR SPECTRUM
##DATA CLASS= NTUPLES
##ORIGIN= UXNMR, Bruker Analytische Messtechnik GmbH
##OWNER= root
$$ XWIN-NMR		Version 3.5
$$ Tue Aug 31 10:35:14 2021 Russian Standard Time (UT+4h)  she@DPX200
##.OBSERVE FREQUENCY= 81.013821
##.OBSERVE NUCLEUS= ^31P
##.ACQUISITION MODE= SIMULTANEOUS
##.ACQUISITION SCHEME= undefined
##.AVERAGES= 24
##.DIGITISER RES= 16
##SPECTROMETER/DATA SYSTEM= spect
##.PULSE SEQUENCE= zgpg30
##.SOLVENT NAME= CDCl3
##.SHIFT REFERENCE= (INTERNAL, CDCl3, 0, 248.564)
##AUDIT TRAIL= $$ (NUMBER, WHEN, WHO, WHERE, WHAT)
$$ ##TITLE= Audit trail, XWIN-NMR		Version 3.5
$$ ##JCAMPDX= 5.01
$$ ##ORIGIN= Bruker BioSpin GmbH
$$ ##OWNER= she
$$ F:/spectra/data/she/nmr/P31/1/pdata/1/auditp.txt
$$ ##AUDIT TRAIL=  $$ (NUMBER, WHEN, WHO, WHERE, WHAT)
(   1,<2021-08-31 10:34:10.82 +0400>,<she>,<DPX200>,
      <created by zg, POWCHK disabled, PULCHK disabled
       configuration hash MD5:
       00 E9 B6 7A A2 85 ED C7 34 08 36 98 17 FE 4E 26
       data hash MD5: 32K
       72 0B CD CC 82 2A EB 3D 4A AB 8A 02 41 9B 61 9B>)
(   2,<2021-08-31 10:34:13.81 +0400>,<she>,<DPX200>,
      <Start of raw data processing
       efp BC_mod = 2 LB = 1 FT_mod = 6 PKNL = 1 PHC0 = -7715.949 PHC1 = 34.27333 SI = 64K 
       data hash MD5: 64K
       8F 93 C1 7D D6 2A E8 37 3F F3 B8 BA 4C 57 EF 00>)
(   3,<2021-08-31 10:34:41.95 +0400>,<she>,<DPX200>,
      <pk PHC0 = -54.7148 PHC1 = 119.2 
       data hash MD5: 64K
       0E 61 92 79 82 BC 76 F1 83 CE A3 0B D2 B0 1B 84>)
(   4,<2021-08-31 10:34:47.45 +0400>,<she>,<DPX200>,
      <abs ABSG = 5 
       data hash MD5: 64K
       B0 1D 79 C3 47 B9 57 18 77 CC C7 95 B6 6B CB 51>)
$$ ##END=
$$ 
$$ hash MD5
$$ 98 FB C5 71 6D D7 6F 16 F4 61 1A 56 3B A1 D2 D2
##$RELAX= 
##$RELAX= 
##$RELAX= 
##$RELAX= 
##$RELAX= 
##$RELAX= 
##$RELAX= 
##$RELAX= 
$$ Bruker specific parameters
$$ --------------------------
##$DU= <F:/spectra>
##$EXPNO= 1
##$NAME= <P31>
##$PROCNO= 1
##$TYPE= <nmr>
##$USER= <she>
##$AMP= (0..31)
100 100 100 100 100 100 100 100 100 100 100 100 100 100 100 100 100 100 
100 100 100 100 100 100 100 100 100 100 100 100 100 100 
##$AQSEQ= 0
##$AQ_mod= 1
##$AUNM= <au_zg>
##$AUTOPOS= <>
##$BF1= 81.014009
##$BF2= 200.13
##$BF3= 200.13
##$BF4= 200.13
##$BF5= 200.13
##$BF6= 200.13
##$BF7= 200.13
##$BF8= 200.13
##$BYTORDA= 1
##$CFDGTYP= 0
##$CFRGTYP= 5
##$CHEMSTR= <none>
##$CNST= (0..31)
1 1 145 1 1 1 1 1 1 1 1 1 1 1 1 1 1 1 1 1 1 1 1 1 1 1 1 1 1 1 1 1 
##$CPDPRG= <waltz16>
##$CPDPRG1= <>
##$CPDPRG2= <waltz16>
##$CPDPRG3= <>
##$CPDPRG4= <mlev>
##$CPDPRG5= <mlev>
##$CPDPRG6= <mlev>
##$CPDPRG7= <mlev>
##$CPDPRG8= <mlev>
##$CPDPRGB= <>
##$CPDPRGT= <>
##$D= (0..31)
0 1 0 0 0 0 0 0 0 0 0 0.03 2e-05 3e-06 0 0 0 0 0 0 0 0 0 0 0 0 0 0 0 0 
0 0 
##$DATE= 1630391650
##$DBL= (0..7)
120 120 120 11 120 120 24 19 
##$DBP= (0..7)
150 150 150 150 150 150 150 150 
##$DBP07= 0
##$DBPNAM0= <>
##$DBPNAM1= <>
##$DBPNAM2= <>
$$ [...]
##$SUBNAM3= <"">
##$SUBNAM4= <"">
##$SUBNAM5= <"">
##$SUBNAM6= <"">
##$SUBNAM7= <"">
##$SUBNAM8= <"">
##$SUBNAM9= <"">
##$SW= 501.771253377433
##$SWIBOX= (0..15)
0 1 3 0 0 0 0 0 0 0 0 0 0 0 0 0 
##$SW_h= 40650.406504065
##$TD= 32768
##$TD0= 1
##$TE= 0
##$TE2= 300
##$TE3= 300
##$TEG= 300
##$TL= (0..7)
0 120 53 12 22 120 120 120 
##$TP= (0..7)
150 150 150 150 150 150 150 150 
##$TP07= 0
##$TPNAME0= <>
##$TPNAME1= <>
##$TPNAME2= <>
##$TPNAME3= <>
##$TPNAME4= <>
##$TPNAME5= <>
##$TPNAME6= <>
##$TPNAME7= <>
##$TPOAL= (0..7)
0.5 0.5 0.5 0.5 0.5 0.5 0.5 0.5 
##$TPOFFS= (0..7)
0 0 0 0 0 0 0 0 
##$TUNHIN= 0
##$TUNHOUT= 0
##$TUNXOUT= 0
##$USERA1= <user>
##$USERA2= <user>
##$USERA3= <user>
##$USERA4= <user>
##$USERA5= <user>
##$V9= 5
##$VALIST= <valist>
##$VCLIST= <CCCCCCCCCCCCCCC>
##$VD= 0
##$VDLIST= <DDDDDDDDDDDDDDD>
##$VPLIST= <PPPPPPPPPPPPPPP>
##$VTLIST= <TTTTTTTTTTTTTTT>
##$WBST= 1024
##$WBSW= 4
##$XGAIN= (0..3)
0 0 0 0 
##$XL= 0
##$YL= 0
##$YMAX_a= 2490
##$YMIN_a= -3253
##$ZGOPTNS= <>
##$ZL1= 120
##$ZL2= 120
##$ZL3= 120
##$ZL4= 120
##$ABSF1= 248.5645
##$ABSF2= -253.2056
##$ABSG= 5
##$ABSL= 3
##$ALPHA= 0
##$AQORDER= 0
##$ASSFAC= 0
##$ASSFACI= 0
##$ASSFACX= 0
##$ASSWID= 0
##$AUNMP= <proc_1d>
##$AZFE= 0.1
##$AZFW= 0.5
##$BCFW= 0
##$BC_mod= 2
##$BYTORDP= 0
##$COROFFS= 0
##$CY= -3
##$DATMOD= 1
##$DC= 0
##$DFILT= <>
##$DTYPP= 0
##$F1P= 0
##$F2P= 0
##$FCOR= 1
##$FTSIZE= 65536
##$FT_mod= 6
##$GAMMA= 0
##$GB= 0
##$INTBC= 1
##$INTSCL= 5.30512e-09
##$ISEN= 30
##$LB= 1
##$LEV0= 0
##$LPBIN= 0
##$MAXI= 10000
##$MC2= 0
##$MEAN= 0
##$ME_mod= 0
##$MI= 50
##$NCOEF= 0
##$NC_proc= -8
##$NLEV= 6
##$NOISF1= 182.463
##$NOISF2= 159.3651
##$NSP= 0
##$NTH_PI= 0
##$NZP= 0
##$OFFSET= 248.5645
##$PC= 4
##$PHC0= -7770.664
##$PHC1= 153.4733
##$PH_mod= 1
##$PKNL= yes
##$PPARMOD= 0
##$PSCAL= 0
##$PSIGN= 0
##$REVERSE= no
##$SF= 81.014009
##$SI= 65536
##$SIGF1= 159.3651
##$SIGF2= -187.1042
##$SINO= 113.3802
##$SIOLD= 16384
##$SREGLST= <1H.CDCl3>
##$SSB= 0
##$STSI= 65536
##$STSR= 0
##$SW_p= 40650.406504065
##$SYMM= 0
##$S_DEV= 0
##$TDeff= 32768
##$TDoff= 0
##$TI= <>
##$TILT= no
##$TM1= 0
##$TM2= 0
##$TOPLEV= 0
##$USERP1= <user>
##$USERP2= <user>
##$USERP3= <user>
##$USERP4= <user>
##$USERP5= <user>
##$WDW= 1
##$XDIM= 65536
##$YMAX_p= 500177822
##$YMIN_p= -76026817
$$ End of Bruker specific parameters
$$ ---------------------------------
##NTUPLES= NMR SPECTRUM
##VAR_NAME=  FREQUENCY,     SPECTRUM/REAL,   SPECTRUM/IMAG
##SYMBOL=    X,             R,               I
##VAR_TYPE=  INDEPENDENT,   DEPENDENT,       DEPENDENT
##VAR_FORM=  AFFN,          ASDF,            ASDF
##VAR_DIM=   65536,         65536,           65536
##UNITS=     HZ,            ARBITRARY UNITS, ARBITRARY UNITS
##FACTOR=    0.620285442955139, 1,           1
##FIRST=     20137.2065510759, 0,            0
##LAST=      -20513.1999529892, 0,           0
##MIN=       -20513.1999529892, -76026817,   0
##MAX=       20137.2065510759, 500177822,    0
$$ Real data points
##PAGE= N=1
##DATA TABLE= (X++(R..R)), XYDATA
$$ [...]
##PAGE= N=2
##DATA TABLE= (X++(I..I)), XYDATA
13034B30856j397676k204990J814643N257189K894833j633704j687172J181052
$$ 230856 -1166820 -3371810 -1557167 3700022 6594855 4961151 3273979 4455031
13026D455031M5682m875894n655038L05092N317178K849508l157140m939996j612585
$$ 4455031 4500713 -375181 -6030219 -5725127 -407949 2441559 -715581 -5655577 -7268162
13017g268162J658080J659059j84787j199437k52661J745504K542886J111921
$$ -7268162 -5610082 -3951023 -4135810 -5335247 -5587908 -3842404 -1299518 -187597
13009a87597l23705O50453K068089J87175l486918l266614J533853M466202J508299
$$ -187597 -511302 139151 2207240 2394415 -1092503 -4359117 -2825264 1640938 3149237
13000C149237k941706l231653n91303L33226q52336r00174J245011L416971L708864
$$ 3149237 207531 -3024122 -3615425 -3282199 -4134535 -5034709 -3789698 -372727 3336137
12991C336137K174902K16054l07021R27577J267742j517693m727977l913750k61067
$$ 3336137 5511039 5727093 5420072 6347649 7615391 6097698 1369721 -2544029 -2805096
12982b805096R24355p77920n17204K272787K362104r02883j081427L429299M752885
$$ -2805096 -1880741 -2658661 -3175865 -903078 1459026 556143 -525284 2904015 7656900
12973G656900j176644o391236l799443R06490j53197l030236M024N447895M561612
$$ 7656900 6480256 89020 -3710423 -2803933 -2957130 -5987366 -5983342 -535447 4026165
12964D026165p08746j414696K113827J673839k792714k884692K340514M237328
$$ 4026165 3317419 1902723 4016550 5690389 2897675 12983 2353497 6590825
12956F590825K81741j746606J274555J919828l459707o861438k218393L720140
$$ 6590825 6872566 5125960 6400515 8320343 4860636 -2000802 -4219195 -499055
12948d99055K482404k598069k874348J804341M544446K654170l23180j470970
$$ -499055 1983349 -614720 -3489068 -1684727 2859719 5513889 5190709 3719739
12940C719739j206366n79894k92513j058638k146524j546056O45631J876312J350697
$$ 3719739 2513373 1933479 1640966 582328 -1564196 -3110252 -2464621 -588309 762388
12931G62388Q20307L68260j662400l580553j257073M160529O066669K364523j297509
$$ 762388 1582695 1950955 288555 -3291998 -4549071 -388542 5678127 8042650 6745141
12922F745141j111824l41022j276362l39989L483525L800576k461702p259959
$$ 6745141 5633317 5292295 4015933 3675944 7159469 10960045 8498343 1238384
12914A238384l088715M186146M111753j921563m058902m55431J381571j188280
$$ 1238384 -1850331 2335815 6447568 4526005 467103 11672 1393243 204963
12906B04963k039243J658148L894053K68453m279886l310686J396483L296027
$$ 204963 -1834280 -176132 3717921 3986374 -293512 -3604198 -2207715 1088312
12898A088312O07926k533338k712300r01658M42651J107891K508234M166916L002373
$$ 1088312 1696238 -837100 -3549400 -4451058 -4008407 -2900516 -392282 3774634 6777007
12889F777007k103813o547601m646822J880199M951127J333062k599516q13528
$$ 6777007 4673194 -1874407 -6521229 -4641030 310097 1643159 -956357 -1769885
12881a769885L115412K310739k071242l003341R54141L672274J025611l656399
$$ -1769885 1345527 3656266 1585024 -1418317 -464176 3208098 4233709 577310
12873E77310m912570j528875L480180O126001M310089j55010k908660k324759
$$ 577310 -4335260 -5864135 -2383955 3742046 8052135 7897125 4988465 2663706
12865B663706j457166k453938k526250O98144L728117K547882j50974L23265J825912
$$ 2663706 1206540 -1247398 -3773648 -3075504 652613 3200495 3049521 3372786 5198698
12856E198698q71111n648652n371606n7466K651685L0472k069885j84025J449571
$$ 5198698 4327587 -1321065 -6692671 -6750137 -4098452 -4067980 -6137865 -6321890 -4872319
12847d872319K1933k77378L294746N984329L777433P27044J543574K924409m96346
$$ -4872319 -4850386 -5127764 -1833018 4151311 7928744 8655788 10199362 13123771 12627425
12838A2627425o370941q329043n845937l114479j027136K205717M614638K527338
$$ 12627425 6256484 -2072559 -7918496 -11032975 -12060111 -9854394 -5239756 -2712418
12830b712418j776155k023289K230380M746872K403381q82538j574437j360216
$$ -2712418 -4488573 -6511862 -4281482 465390 2868771 1986233 411796 -948420
12822i48420k055678j648348J049056K812188J136144j151898p23252L79280j366335
$$ -948420 -3004098 -4652446 -3603390 -791202 344942 -806956 -1530208 -1150928 -2517263
12813b517263l966848k534246K378061M901317K542024o16153o60221J105405
$$ -2517263 -6484111 -9018357 -6640296 -1738979 803045 186892 -473329 632076
12805F32076K018434K479010L311587K480685j360798m666815l088807J576301
$$ 632076 2650510 5129520 8441107 10921792 9560994 4894179 1805372 3381673
12797C381673L256136n391m085538n310020m203654j912751K022363O140151O021660
$$ 3381673 6637809 6632418 2546880 -2763140 -6966794 -8879545 -6857182 -717031 5304629
12788E304629L27669n514209n479399m82046L724014M106258K229757K47965j171908
$$ 5304629 5632298 118089 -5361310 -5843356 -2119342 1986916 4216673 4464638 3292730
12779C292730j677328j173189n61621m07100M3242P37106p0008k257298k396879
$$ 3292730 1615402 442213 -119408 -526508 -483266 253840 183832 -2073466 -4470345
12770d470345P62687K704874k86872m106188k417109L057302M953922J794174
$$ -4470345 -3707658 -1002784 -1289656 -5395844 -7812953 -4755651 198271 1992445
12762A992445p35760j08972j84665k441729k497196J126753K729186j001774m175016
$$ 1992445 1256685 1147713 963048 -1478681 -3975877 -2849124 -119938 -1121712 -5296728
12753e296728q68141M641836M335984r50790l539204j271687M65394j101333j873987
$$ -5296728 -6164869 -1523033 2812951 1862161 -1677043 -2948730 -2483336 -3584669 -5458656
12744e458656J183948M279093K600095k194100m273869j496215K431439L271589
$$ -5458656 -4274708 4385 2604480 410380 -3863489 -5359704 -2928265 343324
12736C43324J215660l55089K44122J143585L31133r60610l46803J334911Q60906
$$ 343324 1558984 1203895 1448017 2591602 2922735 1962125 1615322 2950233 3811139
12727C811139k152118m249730l210288p76677R06108K083563K956633K129189
$$ 3811139 1659021 -2590709 -5800997 -6577674 -5671566 -3588003 -631370 1497819
12719A497819k80733j548400p62043n05891j527526l99837L762584N346119M23300
$$ 1497819 1217086 -331314 -1093357 -1599248 -3126774 -3526611 235973 5582092 6005392
12710F005392n604627n227555r2011K464781J284705J194516K612613R83102l143623
$$ 6005392 400765 -4826790 -4918801 -2454020 -1169315 25201 2637814 3620916 477293
12701D77293l303574J440615L663661r6297l030446N93816N624347M387542j265128
$$ 477293 -2826281 -1385666 2277995 2181698 -848748 -254932 5369415 9756957 8491829
12692H491829l805407j620537P04219Q23559L11465k87824j688514k338247m10865
$$ 8491829 4686422 3065885 3770104 4593663 4905128 4617304 2928790 590543 179678
12683A79678J734447N21429k494761k755284k17684J037186J23001J62971J739322
$$ 179678 1914125 2435554 -59207 -2814491 -3032175 -1994989 -1871988 -1709017 30305
12674C0305J779485k03406r03089L27396r8921l025280m023895q69864K069860
$$ 30305 1809790 1606384 703295 1030691 931770 -2093510 -6117405 -6987269 -4917409
12665d917409P74540k058480k009931J3979O82578N35508J875378L136174J252182
$$ -4917409 -4142869 -6201349 -8211280 -8197301 -7514723 -6979215 -5103837 -1967663 -715481
12656g15481k036484k154071Q17198K405529J432102J491044L754025M188767
$$ -715481 -2751965 -4906036 -4088838 -1683309 -251207 1239837 4993862 9182629
12648I182629M88156l217063k249250J565595K818665K95224k229512k009220
$$ 9182629 9670785 6453722 4204472 5770067 8588732 8883956 6654444 4645224
12640D645224m36058J5078r61735k146628k784134k925752k725413k053614n47613
$$ 4645224 4209166 4224244 3262509 1115881 -1668253 -4594005 -7319418 -9373032 -9920645
12631i920645J792283L683982L052539m05726l759933l617503k73466K713516
$$ -9920645 -8128362 -4444380 -1391841 -1797567 -5557500 -9175003 -9448469 -6734953
12623f734953L328167L253059M151515M264096J275264l029080m506854k728500
$$ -6734953 -3406786 -153727 3997788 8261884 9537148 6508068 2001214 -727286
12615g27286j409481k026231j343076K342935M802005K016059k521401k342425
$$ -727286 -2136767 -4162998 -5506074 -3163139 1638866 3654925 1133524 -1208901
12607a208901J928601L531319K72407k746924k275286j380333j939902k87262
$$ -1208901 719700 4251019 4523426 1776502 -498784 -1879117 -3819019 -4106281
12599d106281M677979O178295m37293q053179o864998Q55351M673714K172789
$$ -4106281 571698 6749993 6312700 -1740479 -8605477 -7750126 -3076412 -903623
12591i03623N44117K566853K549092j549490l241091N16414K662324j961609o752124
$$ -903623 -359506 2207347 4756439 3206949 -34142 482272 3144596 1182987 -5569137
12582e569137l802746K858121L973502j53860j763143O83554J495924o46144n28543
$$ -5569137 -9371883 -6513762 -2540260 -2694120 -4457263 -3773709 -2277785 -2923929 -3452472
12573c452472L053986M166930M2316l741875k479756K19013o89574k850084o39006
$$ -3452472 -398486 3768444 3810760 68885 -2410871 -2191858 -2881432 -5731516 -6370522
12564f370522N140156P773318L893953k564704n931827m873562k085884k60261
$$ -6370522 -1230366 6542952 10436905 7872201 1940374 -2933188 -5019072 -5279333
12556e279333K82630P66043J911452L150167L550039K632248J82662l282830n364600
$$ -5279333 -4996703 -4230660 -2319208 830959 4380998 7013246 7195908 3913078 -1451522
12547a451522l396748J257337L219578P7312l415108j989836J928050K122338
$$ -1451522 -4848270 -3590933 -371355 -294043 -3709151 -5698987 -3770937 -1648599
12539a648599j096859j473160K246000L657657o00977m713630k601899K848992
$$ -1648599 -2745458 -4218618 -1972618 1685039 1084062 -3629568 -6231467 -3382475
12531c382475M898563K896512J204766J235333P10869p46194j106931n34640j358369
$$ -3382475 1516088 4412600 5617366 6852699 7563568 6817374 5710443 5175803 3817434
12522C817434l288540l210459m36960J773228J024176j113801k024767j470230
$$ 3817434 528894 -2681565 -3118525 -1345297 -321121 -1434922 -3459689 -4929919
12514d929919p82372n05824n8651J208043L102202M261408L251696O66563j099397
$$ -4929919 -5712291 -6218115 -6276766 -5068723 -1966521 2294887 5546583 6213146 5113749
12505E113749j194457j545778l098591l274240o6869L536699L183316j45122j420967
$$ 5113749 3919292 2373514 -725077 -3999317 -4066186 -529487 2653829 2508707 1087740
12496A087740R32544L227574K410864l50635k594002l288785k034996P36591K241739
$$ 1087740 2020284 5247858 7658722 7308087 4714085 1425300 -609696 126895 2368634
12487B368634k0149l604092l522326P8901J890248K84654n829L370694N578791
$$ 2368634 2348485 -1255607 -4777933 -4699032 -2808784 -2524130 -2529959 840735 6419526
12478F419526K831287q45876q76133l81218l735507o748177k646104M965419N634024
$$ 6419526 9250813 8404937 7528804 7147586 3412079 -3336098 -5982202 -1016783 4617241
12469D617241j712331o646224l331475J550112J176308p26441J688225N091140
$$ 4617241 2904910 -3741314 -7072789 -5522677 -4346369 -5072810 -3384585 1706555
12461A706555K845073k849028l967773N27680L693014J980952m36313Q0493J106899
$$ 1706555 4551628 1702600 -2265173 -1737493 1955521 3936473 3500160 3580653 4687552
12452D687552m61344k833559k426054Q29327L916040M223675J140856l527631
$$ 4687552 4226208 1392649 -1033405 -204078 3711962 7935637 9076493 5548862
12444E548862n875717l380919J135238K167852r60400k987563o72804K306884
$$ 5548862 -326855 -3707774 -2572536 -404684 -1365084 -4352647 -5025451 -2718567
12436b718567J360051j774960j999379J153664L119602J310433j615240k132525
$$ -2718567 -1358516 -3133476 -5132855 -3979191 -859589 450844 -1164396 -3296921
12428c296921l23865J351112J658742J363970J344836J311079M84677j048258
$$ -3296921 -3620786 -2269674 -610932 753038 2097874 3408953 3893630 2845372
12420B845372k148382j918255p86950J11576J99616m41378j455983j806956r9432
$$ 2845372 696990 -1221265 -2008215 -1896639 -1697023 -2138401 -3594384 -5401340 -5500772
12411e500772L167708M927569L317382Q32079P36839J636998j66167l591305l503983
$$ -5500772 -2333064 2594505 5911887 6743966 7480805 9117803 8951636 5360331 1856348
12402A856348P28690L378031J325351j104325l6416J040806k161127o034735m095549
$$ 1856348 2585038 5963069 7288420 6184095 6147679 7188485 5027358 -1007377 -5102926
12393e102926K166873N129293K662150K85172J210267J706251j228254m108366
$$ -5102926 -2936053 2193240 4855390 5140562 6350829 8057080 6828826 2720460
12385B720460k913698k5097l31739l174215l220504J248235N296851L888654j289793
$$ 2720460 -193238 -218335 -550074 -3724289 -6944793 -5696558 -399707 3488947 2199154
12376B199154m036561j873312Q42563n68264m002157l553992J357372M699024
$$ 2199154 -1837407 -3710719 -2868156 -3436420 -7438577 -10992569 -9635197 -4936173
12368d936173K718597q91968j392862K17156P57342Q42280K200314K696330j8884
$$ -4936173 -2217576 -3109544 -4502406 -4285250 -3527908 -2685628 -485314 2211016 2192132
12359B192132k824421j587692J143428J05631k975199j894832K714494L722827
$$ 2192132 -632289 -2219981 -1076553 -970922 -3946121 -5840953 -3126459 596368
12351E96368k25996k347987J19803J075430k988427n910883k329163K762115K407083
$$ 596368 370372 -1977615 -1857812 -782382 -3770809 -9681692 -12010855 -9248740 -6841657
12342f841657p48929K98687M726016N797892K316006m48837k90675o16666l074770
$$ -6841657 -7590586 -7291899 -2565883 3232009 5548015 5099178 4808503 4191837 1117067
12333A117067m550394k926548k29310J661308L682408N999163N810627J395580
$$ 1117067 -3433327 -6359875 -6589185 -4927877 -1245469 4753694 10564321 11959901
12325A1959901m208416o091607k978754J634727L336747J048296k391494l619626
$$ 11959901 7751485 1659878 -1318876 315851 3652598 4700894 2309400 -1310226
12317a310226k256654l25117R56134J687697J130142j612083m289747k894472
$$ -1310226 -3566880 -3891997 -2935863 -1248166 -118024 -1730107 -6019854 -8914326
12309h914326K089459M934005K595731p31068k56044K251798K226913k34584j664597
$$ -8914326 -6824867 -1890862 704869 -26199 -282243 1969555 4196468 3961884 2297287
12300B297287j331751q61373J41777K625117L841852M50581m823893n504005n59430
$$ 2297287 965536 104163 245940 2871057 6712909 7163490 2339597 -3164408 -3723838
12291c723838M153322M350083K014573M32484m40204j574553k057328j229323
$$ -3723838 429484 4779567 6794140 7226624 6786420 5211867 3154539 1925216
12283A925216n38339j000206j290268k62836Q36214M28369r87679k010546k320597
$$ 1925216 1386877 386671 -903597 -1166433 -330219 98150 -889529 -2900075 -5220672
12274e220672k188780j419773K1820J398273K078464K174770J833554Q01876q62828
$$ -5220672 -7409452 -8829225 -8807405 -7409132 -5330668 -3155898 -1322344 -520468 -1383296
12265a383296k271952k169299R2546L473127N213441L325043o02713l002655l113002
$$ -1383296 -3655248 -5824547 -5732001 -2258874 2954567 6279610 5676897 2674242 -438760
12256d38760l389494m318207k682581K711723P462321P182398L416944J88173
$$ -438760 -3828254 -8146461 -10829042 -8117319 -654998 6527400 9944344 10132517
12248A0132517k050095m551253n624765l297698j55246J73650p44114O56540K663256
$$ 10132517 8082422 3531169 -2093596 -5391294 -5546540 -5372890 -6117004 -5460464 -2797208
12239b797208J029747k607259k637609Q80214K399140P44695M62595K397978J700437
$$ -2797208 -1767461 -4374720 -7012329 -6132115 -3732975 -2988280 -2525685 -127707 1572730
12230A572730k589173m713624k277614n97403k624578l011229J898159O043214
$$ 1572730 -1016443 -5730067 -8007681 -8605084 -11229662 -14240891 -12342732 -6299518
12222f299518L146733k162877j303201M707435P493627M366338M99629p43781
$$ -6299518 -3152785 -5315662 -6618863 -1911428 5582199 9948537 10448166 9704385
12214I704385j587093l637706m838172l896515k410066j343722K52495K146517
$$ 9704385 8117292 4479586 -358586 -4255101 -6665167 -8008889 -7756394 -5609877
12206e609877K502409J313544O86226J098945P84004n92045j003144L24784J425919
$$ -5609877 -3107468 -1793924 -1107698 -8753 775251 183206 -819938 -495154 930765
12197I30765Q43210j38589K72873J753370K562765J759633R9630p97674m09312
$$ 930765 1773975 1635386 1908259 3661629 6224394 7984027 8083657 7285983 6876671
12188F876671n80276l331314o782987n942481L65961O076513M836770j475768
$$ 6876671 6296395 2965081 -3817906 -9760387 -9394426 -3317913 1518857 43089
12180D3089n243764l082818J100950K919288K658264K261847J323567j080501
$$ 43089 -5200675 -8283493 -7182543 -4263255 -1604991 656856 1980423 899922
12172H99922l100427j973613J475000K932167j3134m157006m027504J157341N764975
$$ 899922 -2200505 -4174118 -2699118 233049 219915 -3937091 -7964595 -6807254 -1042279
12163a042279M363908j424128n233976m267277j671618m05657P69821L163423
$$ -1042279 3321629 1897501 -3336475 -7603752 -9275370 -9681027 -8911206 -5747783
12155e747783M327172K027970j036613p87901J836791K271793q93815m375738
$$ -5747783 -1420611 607359 -429254 -1217155 619636 2891429 1997614 -2378124
12147b378124m941746k420187J483246M335814L689911k40336l381723k397610
$$ -2378124 -7319870 -9740057 -8256811 -3920997 -231086 -471422 -3853145 -6250755
12139f250755N35262J019609p04154o00723K009045L172495R07115j648014j376411
$$ -6250755 -5715493 -4695884 -5400038 -6000761 -3991716 -819221 87894 -1560120 -2936531
12130b936531M68359J200252Q42103J017050J916532K362346J446652r63643l846429
$$ -2936531 -2468172 -1267920 -425817 591233 2507765 4870111 6316763 5353120 1506691
12121A506691m755041k052740K140388L657865J563133q22746r04073l9695n58681
$$ 1506691 -3248350 -5301090 -3160702 497163 2060296 1237550 333477 293782 -264899
12112b64899k128324k763269j570365Q96734L437148M383158K629864o60759k855306
$$ -264899 -2393223 -5156492 -6726857 -5830123 -2392975 1990183 4620047 3959288 1103982
12103A103982k771010j309867N49287K189698K243537K3958k120244j327762R48431
$$ 1103982 -1667028 -2976895 -2427608 -237910 2005627 2029585 -90659 -1418421 -469990
12094d69990P17873j715224j694968J845414L945166J595642j323417o93015J389245
$$ -469990 247883 -1467341 -3162309 -1316895 2628271 4223913 2900496 2207481 3596726
12085C596726J343114N54090J543846J839193j693311n474529l673369J623635
$$ 3596726 4939840 5493930 7037776 8876969 7183658 1709129 -1964240 -340605
12077c40605K603447k068400n176909k482189J324687J180935o58174O5460K030100
$$ -340605 2262842 194442 -4982467 -7464656 -6139969 -4959034 -5617208 -5551748 -3521648
12068c521648J465947p39780n94326K216083L918105K261060j212045l957576
$$ -3521648 -2055701 -2795481 -3389807 -1173724 2744381 5005441 3793396 -164180
12060a64180m470434k272661J287070L038539J601338l449J491153L888763K146910
$$ -164180 -4634614 -6907275 -5620205 -2581666 -980328 -983777 507376 4396139 6543049
12051F543049l329337n778077j315958M944936N361457j19563m343895k797653
$$ 6543049 3213712 -2564365 -3880323 1064613 6426070 6306507 1962612 -835041
12043h35041J051791J687779m89428o78728J938775K049329l400044q564727n482903
$$ -835041 216750 1904529 1415101 736373 2675148 4724477 1324433 -7240294 -12723197
12034a2723197L928251Q951894M446456k273096k665250R92905J222764j646257
$$ -12723197 -8794946 156948 4603404 2330308 -334942 657963 1880727 234470
12026B34470j002284L389382M286043l33449l394503j155040M6289m395220p483382
$$ 234470 -767814 2621568 6907611 6574162 3179659 2024619 2070908 -2324312 -9807694
12017i807694j551782P430770P545900m95256m318916Q62028N732377K463856
$$ -9807694 -11359476 -3928706 3617194 3121938 -1196978 -334950 5397427 7861283
12009G861283l750672m398054p00024L46728k205420k961424N47289M611269M986870
$$ 7861283 4110611 -287443 -987467 -640739 -2846159 -5807583 -5260294 -649025 4337845
12000D337845J556759k588134m094155j902220J451555K256828L62320o94251
$$ 4337845 5894604 3306470 -787685 -2689905 -1238350 1018478 1380798 686547
11992F86547P82092K256661J654186N49759L85519k66966j625822m98713L634147
$$ 686547 1468639 3725300 5379486 5929245 6314764 6047798 4421976 3923263 7557410
11983G557410M944346o75066p650129p522028j079829L443454K615557N72664
$$ 7557410 12501756 11826690 4176561 -3345467 -4425296 -981842 1633715 2206379
11975B206379O9512j062064l204978k488518J916080M483549J278667l752123
$$ 2206379 2275891 1213827 -1991151 -4479669 -2563589 1919960 3198627 -553496
11967e53496m546692j170355J717846J758323M24491m37643l54765L87575R15844
$$ -553496 -5100188 -6270543 -4552697 -2794374 -2369883 -2807526 -3162291 -2774716 -1858872
11958a858872L19615p75281o73453O60314J418088R80337M57547j85285k014202
$$ -1858872 -1539257 -2314538 -2987991 -2327677 -909589 70748 528295 343010 -1671192
11949a671192l395077q50548M489672O116221J120757m430698l630572J242594
$$ -1671192 -5066269 -5916817 -1427145 4689076 5809833 1379135 -2251437 -1008843
11941a008843K402782j709049m511989j325967M087821N152291J149609k558351
$$ -1008843 1393939 -315110 -4827099 -6153066 -2065245 3087046 4236655 1678304
11933A678304j666935K080540L525019P04033k672027k203650J131830K366898
$$ 1678304 11369 2091909 5616928 6320961 3648934 1445284 2577114 4944012
11925D944012l65667l367404k882058R5007K234589K338416J284362r4509q52391
$$ 4944012 4578345 1210941 -1671117 -1576110 658479 2996895 4281257 4186748 3334357
11916C334357J87537K231030K408478N3344j490424k5746J306950j316618n760964
$$ 3334357 3521894 5752924 8161402 8214746 6724322 6698576 8005526 6688908 927944
11907I27944o421501k411084J178086M65950k422573k775562R15948N572062O707893
$$ 927944 -5493557 -7904641 -6726555 -6260605 -8683178 -11458740 -10542792 -4970730 1737163
11898A737163K842779k593909m544862k050249J084015K023213K209909L146613
$$ 1737163 4579942 1986033 -2558829 -4609078 -3525063 -1501850 708059 3854672
11890C854672K790695k18331k242652L70367M393924L614586j603123m715531
$$ 3854672 6645367 6427036 4184384 4554751 8948675 12563261 10960138 6244607
11882F244607k841320j32354l56399j916781k257985k042806k166528j030190
$$ 6244607 3403287 3270933 2914534 997753 -1260232 -3303038 -5469566 -6499756
11874f499756J868600L181473L40347l473835k918884J996215N454652L125936
$$ -6499756 -4631156 -1449683 -1109336 -4583171 -7502055 -5505840 -51188 3074748
11866C074748k503194n230276k612260J219487J121497j880553j938647K628788
$$ 3074748 571554 -4658722 -7270982 -6051495 -4929998 -6810551 -8749198 -6120410
11858f120410N959344L258108j347281r85227K762879K091892m192424p963230
$$ -6120410 -161066 3097042 1749761 764534 3527413 5619305 1426881 -6536349
11850f536349l834259L173617N648929L613720J713609J122612m18911l150925
$$ -6536349 -10370608 -7196991 -1548062 2065658 3779267 4901879 4482968 1332043
11842A332043m784294m250319k417739n9355K292424L669553L841116L592017
$$ 1332043 -3452251 -7702570 -10120309 -10179664 -7887240 -4217687 -376571 3215446
11834C215446K450695j209942o008100o891171j609634N044912O799925L283936
$$ 3215446 5666141 4456199 -1551901 -8443072 -10052706 -5007794 1792131 5076067
11826E076067j253301l853891l877432r17627L776205N786952K232247l205419
$$ 5076067 3822766 -31125 -3908557 -4826184 -1049979 4736973 6969220 3763801
11818C763801m506215j611394K65703r13434j536477Q94746L437334K356386j304465
$$ 3763801 -742414 -2353808 -2088105 -3001539 -4538016 -3643270 -205936 2150450 845985
11809H45985l356539j841368J205598K533959J077887j178155j554594P7604J274346
$$ 845985 -2510554 -4351922 -3146324 -612365 465522 -712633 -2267227 -2189623 -915277
11800i15277N29065q88169j431142j394674j106706L82690K640734K646975p61722
$$ -915277 -386212 -1274381 -2705523 -4100197 -5206903 -4824213 -2183479 463496 -298226
11791b98226l778298k533768J076205K397562Q71762m35046m29501l55658J28205
$$ -298226 -4076524 -6610292 -5534087 -3136525 -2264763 -2699809 -3129310 -3484968 -3356763
11782c356763K143012L660038J629666k282068l324904r75796P07733J50677l3811
$$ -3356763 -1213751 2446287 4075953 1793885 -1531019 -2506815 -1799082 -1648405 -1682216
11773a682216J004100P00057j283096j670887L06113J183019k05574m44002J504562
$$ -1682216 -678116 21941 -1261155 -2932042 -2625929 -1442910 -1648484 -2092486 -587924
11764e87924J372767k510840m536396k98512N350977M934884o35490m106758k636624
$$ -587924 784843 -1725997 -6262393 -6560905 -1209928 3724956 3089466 -1017292 -3653916
11755c653916k30729l52316j638850j302896J115543L808880M239230J336799
$$ -3653916 -3884645 -4236961 -5875811 -7178707 -6063164 -2254284 1984946 3321745
11747C321745k185391j832974K333474M501696J155390l373745l459962m90186
$$ 3321745 1136354 -696620 1636854 6138550 7293940 3920195 460233 -29953
11739b9953P35912M55244J985397L662012P00653n284422o696402j372787L688747
$$ -29953 705959 1161203 3146600 6808612 7509265 2224843 -4471559 -5844346 -2155599
11730b155599K698264j199590k114592P4742J712963J810881J888767J894272
$$ -2155599 542665 -656925 -2771517 -2696775 -983812 827069 2715836 4610108
11722D610108M03673k338749m453629m558113k279498J681341M772051M280589
$$ 4610108 5013781 2675032 -1778597 -6336710 -8616208 -6934867 -2162816 2117773
11714B117773J194807m61986L78547J85050k593051l770058k60019L463757J564532
$$ 2117773 3312580 2850594 3229141 3414191 821140 -2948918 -3208937 254820 1819352
11705A819352l282863l312660J841256L830842j448922o829282m174401L608821
$$ 1819352 -1463511 -4776171 -2934915 895927 -552995 -7382277 -11556678 -7947857
11697g947857O856765K708385j972482j102808K765775L191776j142893n165854
$$ -7947857 -1091092 1617293 -355189 -1457997 1307778 4499554 3356661 -1809193
11689a809193l908517J982037P229966P372065K919401j811068l732853l775417
$$ -1809193 -5717710 -3735673 3494293 10866358 13785759 11974691 8241838 4466421
11681D466421m000690l758143j185718K439316L386481R18669j492706j584581
$$ 4466421 465731 -3292412 -4478130 -2038814 1347667 2266336 773630 -810951
11673h10951j216348j866329j289972J874499L931932J433546k258461j628411
$$ -810951 -2027299 -3893628 -5183600 -3309101 622831 2056377 -202084 -1830495
11665a830495J759087J670680j869619k100146K736932N486882J448555l972319
$$ -1830495 -71408 1599272 -270347 -2370493 366439 5853321 7301876 3329557
11657C329557m190269j344405p30298j067991J616151M562671J949404m026079
$$ 3329557 -860712 -2205117 -2935415 -4003406 -2387255 2175416 4124820 98741
11649I8741n161844k84689K892837N45430j450223J986809O533815N597068L72110
$$ 98741 -5063103 -5347792 -2454955 -1909525 -3359748 -1372939 5160876 10757944 11130054
11640A1130054l019904k667783j546546j388132j007857K28619J305017J569806
$$ 11130054 8110150 5442367 3895821 2507689 1499832 1728451 3033468 4603274
11632D603274J071682n02328l019517m904256m810635l233863j066981J659725
$$ 4603274 5674956 5172628 2153111 -2751145 -7561780 -10795643 -11862624 -10202899
11624a0202899M030666L667096K80492k479180j608655Q20986J003807p10340
$$ -10202899 -6172233 -2505137 -2224645 -4703825 -6312480 -5491494 -4487687 -5198027
11616e198027j042378M44952J070280Q8737k80219P00380R09946l35044l48019
$$ -5198027 -6240405 -5795453 -4725173 -4636436 -4916655 -4216275 -3306329 -3641373 -3989392
11607c989392K432485M882909K899128k804680p047616n875341l45721N001465
$$ -3989392 -1556907 3326002 6225130 3420450 -3627166 -9502507 -9848228 -4846763
11599d846763O288789L277036p27974k006559j06695J773228N67787k871967m627672
$$ -4846763 1442026 4719062 3991088 1984529 1877834 3651062 4218849 1346882 -3280790
11590c280790k387857J662616L415895J848929N3699P60786K468811J916986n73944
$$ -3280790 -5668647 -4006031 -590136 1258793 1312492 2073278 4542089 6459075 5885131
11581E885131j254460J110894K755362M11038l399341l799753o76256J541239
$$ 5885131 4630671 5741565 8496927 8907965 5508624 1708871 1032615 2573854
11573B573854Q70931L51582K330543L897230R99328m855699p470953l517641L349260
$$ 2573854 3444785 3796367 6126910 10024140 11023468 6167769 -1303184 -4820825 -1471565
11564a471565O848264M895407P06993j980539k746837l011735k663520m57135
$$ -1471565 5376699 10272106 10979099 8998560 6251723 3239988 576468 119333
11556A19333K619945L222470K00374k963416k515396K85681J056510j333258l490788
$$ 119333 2739278 5961748 6162122 3198706 683310 968991 2025501 692243 -2798545
11547b798545k714121k28821J671736K644091K965289K078770N30209O89890K913532
$$ -2798545 -5512666 -5741487 -4069751 -1425660 1539629 3618399 4148608 4838498 7752030
11538G752030L446928m00030m922748m179970J311083M688913K050989k747273
$$ 7752030 11198958 10798928 5876180 1696210 3007293 7696206 9747195 6999922
11530F999922m096725j595235J185484J756159Q4600k514915l524311p84340L675941
$$ 6999922 2903197 1307962 2493446 4249605 4334205 1819290 -1705021 -2489361 1186580
11521A186580M249169p23182n059828k606416L617984N596751K021495p42088
$$ 1186580 5435749 4712567 -347261 -2953677 664307 6261058 8282553 7540465
11513G540465N30164J293915k120291n678915m010350R26162K883965M47956k087676
$$ 7540465 8070629 9364544 7244253 1565338 -2445012 -1518850 1365115 1813071 -274605
11504b74605j796577l51181j47773r95790j407839o68504Q88747J969123R63322
$$ -274605 -2071182 -2422363 -2570136 -3565926 -4973765 -5642269 -4753522 -2784399 -1821077
11495a821077j702043k644204N70461N079452N279515J94399m504432l254854
$$ -1821077 -3523120 -6167324 -5596863 -517411 4762104 4956503 452071 -2802783
11487b802783K520630O167172L706191j784353m214835j784306J418547J328773
$$ -2802783 -282153 5885019 9591210 7806857 3592022 1807716 3226263 4555036
11479D555036q54139j422261k45013k56771j507835o86194K357073K909679r86594
$$ 4555036 3700897 2278636 2033623 1776852 269017 -417177 1939896 4849575 3862981
11470C862981m211858k146932J640815Q02492l688861n052942q49907M411687
$$ 3862981 -348877 -2495809 -854994 -52502 -3741363 -8794305 -9644212 -5232525
11462e232525O360033M951935J696048j948020l148346r939L979274K955112k850737
$$ -5232525 1127508 6079443 7775491 5827471 2679125 2669186 6648460 9603572 6752835
11453F752835o692677m661135l47853J623598J629707K005603K498770J921358
$$ 6752835 60158 -4600977 -4948830 -3325232 -1695525 310078 2808848 4730206
11445D730206Q51827j28890j833495l777137l412017n30010R63637j373631m168993
$$ 4730206 5582033 5453143 3619648 -157489 -3569506 -4099516 -3135879 -4509510 -8678503
11436h678503k756679K113798N212790L240467j831214m880236k275273M057696
$$ -8678503 -11435182 -9321384 -4108594 -868127 -2699341 -7579577 -9854850 -5797154
11428e797154P412628L929300j332404o24320M534106M523643l455761r550113
$$ -5797154 1615474 5544774 4212370 3588050 8122156 12645799 9190038 -360075
11420c60075n188335M049354O571283R24486m249623l694929p42546M54052M38028
$$ -360075 -5548410 -1499056 5072227 5996713 1747090 -1947839 -2690385 -2236333 -1798305
11411a798305Q60735J023604O7228r88158q54595O29213K864087M226978K440152
$$ -1798305 -937570 86034 153262 -834896 -1689491 -1060278 1803809 6030787 8470939
11402H470939k230719n627417m657857j858979j307371k017409l19343K729094
$$ 8470939 6240220 612803 -4045054 -5904033 -7211404 -9228813 -9548156 -6819062
11394f819062K427439j132614k131955J850773N589090L986368o56347k844746
$$ -6819062 -4391623 -5524237 -7656192 -5805419 -216329 3770039 3113692 268946
11386B68946j750167n98171m28764R43871M021905N532830K690080k420785m548089
$$ 268946 -1481221 -2079392 -2508156 -1564285 2457620 7990450 10680530 8259745 3711656
11377C711656j245937L937204N065915N06539n049157n934093j966165J808216
$$ 3711656 2465719 6402923 11468838 11975377 6926220 992127 -974038 834178
11369H34178J535412j024410j449423J036957K321420o15937m426414l314336
$$ 834178 2369590 1345180 -104243 932714 3254134 2638197 -1788217 -5102553
11361e102553J987710L853896j189883o009959k863054M039803M118485k909734
$$ -5102553 -3114843 739053 -450830 -6460789 -9323843 -5284040 -1165555 -4075289
11353d075289n911253J95754O054213K445946n395697o191116N88092N493281
$$ -4075289 -9986542 -9790788 -3736575 -1290629 -6686326 -12877442 -12289350 -6796069
11345f796069L584520n89555j587523O60933L317710L796224O41340m275704n695174
$$ -6796069 -3211549 -3801104 -5388627 -4727694 -1409984 2386240 3027580 -1248124 -6943298
11336f943298j555206K641954J337356k113220q52568L614647L605744j506124
$$ -6943298 -8498504 -5856550 -4519194 -6632414 -7484982 -3870335 -264591 -1770715
11328a770715l690079O47614M931001L128436j433579k436174K16604K275938
$$ -1770715 -5460794 -4813180 117821 3246257 1812678 -623496 -406892 1869046
11320A869046J811044k88454l010616m765626l193239J411907N020916M707289
$$ 1869046 3680090 3391636 381020 -4384606 -7577845 -6165938 -1145022 3562267
11312C562267K079390N4110q07083r36462r3891Q21867l29642k890488k739034
$$ 3562267 5641657 5695767 4888684 3952222 3858331 4680198 4350556 1460068 -1278966
11303a278966J470473M724565K036974l909328n638246o09092N496974N775062
$$ -1278966 191507 4916072 6953046 3043718 -2594528 -3203620 2293354 8068416
11295H068416J69978m709982l405338J930263M269739P95661l542798l266423
$$ 8068416 8238394 3528412 123074 2053337 6323076 7118737 3575939 309516
11287C09516J3931Q99271j332868k604227j197253M45464J002018J896631K962298
$$ 309516 323447 1222718 -110150 -2714377 -3911630 -3466166 -2464148 -567517 2394781
11278B394781J790666j267956k456296o60037O00928q43685k384039j446111M85401
$$ 2394781 4185447 2917491 461195 -198842 402086 -441599 -2825638 -4271749 -3786348
11269c786348J182481J267547J945904K403118J809961J110041R95830P88216
$$ -3786348 -2603867 -1336320 609584 3012702 4822663 5932704 6928534 7716750
11261G716750M26364N06227j77283l168747n952330l986293J705468M489565J673345
$$ 7716750 8143114 8649341 8472058 5303311 -649019 -4635312 -2929844 1559721 3233066
11252C233066j591966p82983J391343Q29880p87210J88165K263447J052147l444940
$$ 3233066 1641100 858117 2249460 3079340 2292130 2480295 4743742 5795889 2350949
11243B350949o506252m791051K95505M545480M567905Q25795k244799j293079
$$ 2350949 -4155303 -8946354 -8650849 -4105369 462536 1288331 -956468 -2249547
11235b249547J049573R336l152643k499971K494735N138298K005420j808234j424001
$$ -2249547 -1199974 -1190638 -4343281 -6843252 -4348517 789781 2795201 986967 -437034
11226d37034O21797L87754o45128J4664M21855j215779j813406R27807L235756
$$ -437034 184763 572517 -72611 -57947 363908 -851871 -2665277 -1737470 1498286
11217A498286J659073l58028J207928L142240Q28656k688804j588629K452843
$$ 1498286 3157359 2799331 4007259 7149499 7978155 5289351 3700722 6153565
11209F153565L225900L53076j643556k199590m058050n618526k779650K544111
$$ 6153565 9379465 9732541 8088985 5889395 1831345 -3787181 -6566831 -4022720
11201d022720M388163K704691K722618M528930K535685l573376o614979l233057
$$ -4022720 365443 3070134 5792752 10321682 12857367 9283991 2669012 -564045
11193e64045Q90737O72182r60395L82972K845675K162811j254593l685264l486795
$$ -564045 326692 998874 38479 421451 3267126 5429937 4175344 490080 -2996715
11184b996715j556013R82014K666617J715038j311970k940482j028411K189010
$$ -2996715 -4552728 -3570714 -904097 810941 -501029 -3441511 -4469922 -2280912
11176b280912L048203R75162j341636j292624R31857K459353Q22748k681367m186530
$$ -2280912 767291 1742453 400817 -891807 40050 2499403 3322151 640784 -3545746
11167c545746k574248j019014j677352k286391o99516J071274J029181J295666
$$ -3545746 -6119994 -7139008 -8816360 -11102751 -11802267 -10730993 -9701812 -8406146
11159h406146L400462L853058K68331k542814J26057L712131J361665l532339
$$ -8406146 -5005684 -1152626 -884295 -3427109 -3301052 411079 1772744 -1759595
11151a759595k406009L073139K916763l774386o261673J54740O368563M506569
$$ -1759595 -4165604 -1092465 1824298 -1950088 -8211761 -8057021 -1688458 2818111
11143B818111m46676p99656J687264J570827j67337J50429J184689J29804j177238
$$ 2818111 2371435 1571779 3259043 4829870 4662533 4812962 5997651 6127455 4950217
11134D950217m53737k37971k551638l588587m02600K505726N50438k258421l2599
$$ 4950217 4496480 4258509 1706871 -1881716 -2284316 221410 771848 -1486573 -1519172
11125a519172M373227M254590O08571n29131P72331m05230l489894l337085n33564
$$ -1519172 2854055 7108645 7717216 7188085 7960416 7555186 4065292 728207 194643
11116A94643p37098l626717k640442K848528N014523J50948n232829m785466q59959
$$ 194643 -542455 -4169172 -6809614 -3961086 1053437 1204385 -4028444 -8813910 -9673869
11107i673869J672161K889154M065817K893442j741122n216789l218418J494487
$$ -9673869 -8001708 -5112554 -1046737 1846705 105583 -5111206 -8329624 -6835137
11099f835137L522221K503907J386114N28792j015944j360787J194045L283710
$$ -6835137 -3312916 -809009 577105 1105897 89953 -1270834 -76789 3206921
11091C206921Q30533l201979k058735L941149O527779J166500o177412p100970
$$ 3206921 4037454 835475 -1223260 2717889 9245668 10412168 4234756 -2866214
11083b866214j452044L765280L748052M66201j419056k91364J527528J417987
$$ -2866214 -4318258 -552978 3195074 3661275 2242219 1950855 3478383 4896370
11075D896370j11670l04826J688757L155517J513736j930234m063358m450260
$$ 4896370 4784700 4479874 6168631 9324148 10837884 8907650 4844292 394032
11067C94032m768280m683721k179808J836899L442501J503469l36144N27933J643446
$$ 394032 -4374248 -9057969 -11237777 -9400878 -5958377 -4454908 -4791052 -4263119 -2619673
11058b619673J61666j938657j170705J401243J823342l56231j686159m11684J419350
$$ -2619673 -2458007 -4396664 -5567369 -4166126 -2342784 -2699015 -4385174 -4796858 -3377508
11049c377508J665281O63857k69491l42619O75994J667575L14336l204720m304417
$$ -3377508 -1712227 -1048370 -1317861 -1660480 -984486 683089 997425 -2207295 -6511712
11040f511712J16084N378960M245815k029476m582294O500M793729L645882K00045
$$ -6511712 -6395628 -1016668 3229147 1199671 -3382623 -3376123 1417606 5063488 5263533
11031E263533N56737L066815K136364j989673m470872m184227l611407k290063
$$ 5263533 5820270 8887085 11023449 9033776 4562904 378677 -3232730 -5522793
11023e522793K017950O338951M692925j766968m593141m76743L441980P17729
$$ -5522793 -3504843 2834108 7527033 5760065 1166924 690181 4132161 4849890
11015D849890m393362l915816J386517L548559l55605m249811k227430L349714
$$ 4849890 456528 -3459288 -2072771 1475788 1120183 -3129628 -5357058 -2007344
11007b007344N395683J147854m811286o040661j392799L807610L832689p25484
$$ -2007344 3388339 4536193 -275093 -6315754 -7708553 -3900943 -68254 -793738
10999g93738l682427j031804L972807N106565J078176l273652l329316J05586
$$ -793738 -4476165 -5507969 -1535162 3571403 4649579 1375927 -1953389 -1847803
10991a847803K500633Q75136l410647o162201m206610J335573N411907L902893
$$ -1847803 652830 1527966 -1882681 -8044882 -12251492 -10915919 -5504012 -1601119
10983a601119j464107m549244j957744K938223M647130K493218K71533L5447q8051
$$ -1601119 -3065226 -7614470 -9572214 -6633991 -1986861 506357 777890 813337 725286
10974G25286j426888j973231j43624J781614J051949q66468n69148J596465K052754
$$ 725286 -701602 -2674833 -2818457 -1036843 15106 -851362 -1420510 175955 2228709
10965B228709m4344j334767L69354K692663K420776O7718j403826r32206l74066
$$ 2228709 2184365 849598 1218952 3911615 6332391 6400109 4996283 4064077 3690011
10956C690011j512999l321079k723610J618851O563612P155007K808114j441527
$$ 3690011 2177012 -1144067 -3867677 -2248826 4314786 11469793 14277907 12836380
10948A2836380j683919m14857j866276m717420m330105p11435J461021M83596
$$ 12836380 11152461 10737604 8871328 4153908 -176197 -887632 573389 1056985
10940A056985n37195j5139n1495r57642K23085L420756L812094l16407l556450
$$ 1056985 519790 504651 453156 -504486 -281401 3139355 6951449 6635042 3078592
10931C078592j350561K859773L115686l56002k740829j965998Q8057J489362J547551
$$ 3078592 1728031 4587804 7703490 7347488 4606659 2640661 2728718 4218080 5765631
10922E765631J03798j525104j025486J268396K023662J04113j513237r49744j66380
$$ 5765631 5869429 4344325 3318839 4587235 6610897 6715010 5201773 4252029 4085649
10913D085649l73649J29340J081592o79838m199733l511708K047670M479935k43786
$$ 4085649 3712000 3841340 4922932 4243094 43361 -3468347 -1420677 3059258 2815472
10904B815472m492206j401123L294409J396732l322489k254521K586111K906067
$$ 2815472 -1676734 -3077857 216552 1613284 -1709205 -3963726 -1377615 1528452
10896A528452o21286q82107J170989j203722n568046k742068N640533P503535
$$ 1528452 907166 25059 1196048 -7674 -5575720 -8317788 -2677255 4826280
10888D826280M68226l777116N53895M124770l31722n743323m136589P6730K5680
$$ 4826280 5294506 1517390 2071285 6196055 5864333 121010 -4015579 -3938849 -3913169
10879c913169j139603J721473M436941J511703k227331L03939M884781K639985
$$ -3913169 -5052772 -3331299 1105642 2617345 390014 693953 5578734 8218719
10871H218719m215734n658682l48892L199321J153933j305268r00430r14309k798513
$$ 8218719 4002985 -1655697 -2004589 1194732 2348665 1043397 142967 -771342 -3569855
10862c569855k563081J217468L872604K799648J921707L707778L468684k634694
$$ -3569855 -6132936 -4915468 -1042864 1756784 3678491 7386269 10854953 8220259
10854H220259r080884p446871J247637P422701N638579L88763j834213q88249
$$ 8220259 -860625 -8307496 -7059859 362842 6001421 6390184 4555971 3667722
10846C667722n17744j462278j356093J34619N49856p26241r18272J563183M038536
$$ 3667722 3149978 1687700 331607 466226 1016082 289841 -628431 934752 4973288
10837D973288L277713J51738j902170j650789q67739j132458j876956j406788
$$ 4973288 8251001 8402739 6500569 4849780 3982041 2849583 972627 -434161
10829d34161J088885L920659L445197j528337o033334l752684L436271O119414
$$ -434161 654724 4575383 8020580 6492243 458909 -3293775 142496 6261910
10821F261910M03249n678184l866874J959034K498955k319898m570296j935763
$$ 6261910 6665159 986975 -2879899 -920865 1578090 -741808 -5312104 -7247867
10813g247867j46304j701805j889323J691998M290304K399894j90246P81846K935253
$$ -7247867 -7394171 -9095976 -10985299 -9293301 -5002997 -2603103 -2793349 -2011503 923750
10804I23750J829826j508878k449722K94945L400527L385602O3020l555300l942268
$$ 923750 2753576 1244698 -1205024 -910079 2490448 5876050 5939070 2383770 -1558498
10795a558498p55363K422467K522660P33888m55797j456787l147234l143540K75602
$$ -1558498 -2313861 108606 2631266 3365154 2909357 1452570 -1694664 -4838204 -4562602
10786d562602L096627Q41996l116253j965925L058959L999537r24876m474180
$$ -4562602 -1465975 -623979 -3740232 -5706157 -2647198 1352339 427463 -4046717
10778d046717k071356J907133K257255J38153j043308q53327j4448J437597K096395
$$ -4046717 -6118073 -4210940 -1953685 -1815532 -2858840 -3712167 -3726615 -2289018 -192623
10769a92623K06624k162710j263656J658694J889831n78994j328469J45337K14377
$$ -192623 14001 -2148709 -3412365 -1753671 136160 -442834 -1771303 -1625966 -1411589
10760a411589p42709J165287M293504K788169j835451j228482N264047P878182
$$ -1411589 -2154298 -989011 3304493 6092662 4257211 3028729 8292776 16170958
10752A6170958K060766m331402m444094k223805k849220l662288j465222N14877
$$ 16170958 18231724 13900322 9456228 7232423 4383203 720915 -744307 -229430
10744b29430q0339O92023M436862N265923K92454l783496k074000k75821l754744
$$ -229430 -309769 382254 4819116 10085039 10377493 6593997 4519997 4244176 489432
10735D89432p003625l439790K604233L744098J934203K702726L876753Q20546
$$ 489432 -6514193 -9953983 -7349750 -3605652 -1671449 1031277 4908030 5728576
10727E728576l018312j734543J762018P11707l416327l993662p73484J264034
$$ 5728576 2710264 975721 2737739 3449446 33119 -3960543 -4734027 -3469993
10719c469993J271285J658000J212312k103874m750393k404258K127680L559792
$$ -3469993 -2198708 -540708 671604 -1432270 -6182663 -8586921 -6459241 -2899449
10711b899449K733300K947304K574099l96712j785378J703346M307025J20503
$$ -2899449 -166149 2781155 5355254 4958542 3173164 4876510 9183535 9304038
10703I304038n189149k751255M085011M828691j039639m506950k519911o97389
$$ 9304038 4114889 1363634 5448645 10277336 9237697 4730747 2210836 1513447
10695A513447j354844n99677K251902K906762M98630j353923j956456l465776
$$ 1513447 158603 -441074 1810828 4717590 5216220 3862297 1905841 -1559935
10687a559935m243460j146455K682219J640373j818635l54051N228044O398170
$$ -1559935 -5803395 -6949850 -4267631 -2627258 -4445893 -4799944 428100 6826270
10679F826270P38165m610688m545665j880022n6009J598271L412909L405805J482901
$$ 6826270 7564435 2953747 -1591918 -3471940 -3527949 -1929678 1483231 4889036 6371937
10670F371937j53689j135925k231657j848461J004361K722337O36589q74108K379936
$$ 6371937 6218248 5082323 2850666 1002205 2006566 4728903 5365492 4491384 6871320
10661F871320N098896K33141p439924p007980J118792N572609J697217l117259
$$ 6871320 11970216 12203357 4763433 -2244547 -1125755 4446854 6144071 3026812
10653C026812k919433n07069J010742L190395N572921L649610k711336o884138
$$ 3026812 107379 -399690 611052 3801447 9374368 13023978 10312642 3428504
10645C428504m968959p65723J214234J128850L34932j010445j390655R00345L257780
$$ 3428504 -1540455 -2306178 -1091944 36906 371838 -638607 -2029262 -1128917 2128863
10636B128863J602808k270682k889154k66519N79058r83259m75675K548894L041479
$$ 2128863 3731671 1460989 -1428165 -1694684 -1115626 -2098885 -2574560 -25666 3015813
10627C015813l82677k608459n00918K453807K208834n38265k738223k455255M70106
$$ 3015813 2633136 24677 -476241 1977566 4186400 3648135 909912 -1545343 -1075237
10618a075237L683788L442155q2250j566752J392546L593766Q76037k294600p54121
$$ -1075237 2608551 6050706 5968456 4401704 5794250 9388016 10264053 7969453 7215332
10609G215332K075799J160820l63250J853952L201260j727171o969111m068624
$$ 7215332 9291131 10451951 10088701 11942653 15143913 13416742 6447631 2379007
10601B379007K334518J841969l448893l251604J976932K687828j364004j222224
$$ 2379007 4713525 6555494 3106601 -145003 1831929 4519757 3155753 1933529
10593A933529L466495L716171j136197j921063K520749K800470k887591m728130
$$ 1933529 5400024 9116195 7979998 6058935 8579684 11380154 8492563 3764433
10585C764433N52203L610988k04388k873120O77907L319221o32430n221472l908014
$$ 3764433 4316636 7927624 7723236 4850116 5528023 8847244 8214814 2993342 -914672
10576i14672M4283J249789Q40251J445437J909812J502799J539047L85760m363695
$$ -914672 -870389 379400 1219651 2665088 4574900 6077699 7616746 8002506 3638811
10567C638811p781421k448277P452919R144728N88042n950330k955026K537098
$$ 3638811 -4142610 -6590887 862032 10006760 10594802 4644472 1689446 4226544
10559D226544K681629J09485k28509J63234j254832k361891j111070P73476J744238
$$ 4226544 6908173 7017658 6789149 6952383 5697551 3335660 2224590 2998066 4742304
10550D742304K082431J098073j142452j069341K458331L487770j376576m733059
$$ 4742304 6824735 7922808 6780356 5711015 8169346 11657116 10280540 5547481
10542E547481m03418L859784q52469p146529l020666O371417P183465O68718j388369
$$ 5547481 5144063 9003847 8151378 1004849 -2015817 4355600 11539065 12207783 10819414
10533A0819414Q46453j419234n153473q67214O301477M128345k844033j213202
$$ 10819414 11665867 10246633 5093160 4225946 10527423 14655768 11811735 10598533
10525A0598533M953602J817679n953090l082257N694114L660227m623639j450886
$$ 10598533 15552135 17369814 11416724 8334467 14028581 17688808 13065169 11614283
10517A1614283P811938L181634r574056o891848P197287O716613o604692n788834
$$ 11614283 19426221 22607855 13033799 6141951 13339238 20055851 13451159 7662325
10509G662325Q829588R435296m417402m368664R030824N357831j2321914p096759
$$ 7662325 16491913 25927209 21509807 17141143 26171967 31529798 19207884 12111125
10501A2111125J8600231J9733513o648030j0972973J4273912J6391298j2454936
$$ 12111125 30711356 50444869 43796839 32823866 47097778 63489076 51034140
10494E1034140j0440332L1813592L6443471j1134758l626294R4581403J23612618
$$ 51034140 40593808 72407400 108850871 97716113 94089819 188671222 312283840
10487C12283840m6876185k65407702k66415180m7529404J25369122R5053616q307083
$$ 312283840 265407655 -47 -266415227 -313944631 -188575509 -93521893 -101828976
10480a01828976j7069203L6432399L7034261p809779j4944731J5286377J8312302
$$ -101828976 -118898179 -82465780 -45431519 -53241298 -68186029 -52899652 -34587350
10473c4587350q565499j2823580J0303374J6977659m87697q055079J926345M654577
$$ -34587350 -43152849 -55976429 -45673055 -28695396 -29183093 -37238172 -35311827 -30657250
10465c0657250l317552k144225O816890M852844l899252r33302P829283L636012
$$ -30657250 -33974802 -36119027 -29302137 -24449293 -28348545 -29281847 -21452564 -17816552
10457a7816552o036167r20081J1087511O994627p868372r493959J098122L071574
$$ -17816552 -23852719 -24772800 -13685289 -6690662 -14559034 -24052993 -22954871 -19883297
10449a9883297l446200p14714Q758225O034084o400137p378592M131497P812770
$$ -19883297 -23329497 -24044211 -15285986 -9251902 -15652039 -23030631 -18899134 -11086364
10441a1086364p25431m510557J799145M496659j098481l543474P04691J891803
$$ -11086364 -11811795 -16322352 -14523207 -10026548 -11125029 -14668503 -13963812 -12072009
10433a2072009j782068j212508L509376K449392l690312l951262J754560K903210
$$ -12072009 -13854077 -15066585 -11557209 -9107817 -12798129 -16749391 -14994831 -12091621
10425a2091621p26139N15846N528028L662665l833542m905823Q89652K312955
$$ -12091621 -12817760 -12301914 -6773886 -3111221 -6944763 -11850586 -10960934 -8647979
10417h647979j261116O00209O719524L974684p352412j0397802M16061R086116
$$ -8647979 -9909095 -9308886 -2589362 1385322 -5967090 -16364892 -15948831 -6862715
10409f862715L454758p048806q194832r27869M636410M361435J408976k08539
$$ -6862715 -3407957 -10456763 -18651595 -19579464 -14943054 -10581619 -9172643 -9381182
10401i381182J421590M355802L279557k880697o723055k904671K165970O11538
$$ -9381182 -7959592 -3603790 -324233 -3204930 -9927985 -12832656 -10666686 -10055148
10393a0055148l056508k43749N528284M638947j250361k663994O17534J064283
$$ -10055148 -13111656 -13355405 -7827121 -3188174 -4438535 -7102529 -6484995 -5420712
10385e420712j190707J52750L246155R14864m190438k997981K897365L338120
$$ -5420712 -6611419 -6458669 -3212514 -2297650 -6488088 -9486069 -6588704 -3250584
10377c250584k198802m363936j405439r37373m017339l216098K399563N380259
$$ -3250584 -5449386 -9813322 -11218761 -12156134 -16173473 -19389571 -16990008 -11609749
10369a1609749M095191M367416O176113L284243l102914m924289k195386k594056
$$ -11609749 -7514558 -3147142 3028971 6313214 3210300 -1713989 -3909375 -6503431
10361f503431n721218l428449L305183M405912m76196k65634P088989R604046
$$ -6503431 -12224649 -15653098 -12347915 -7942003 -8418199 -8683833 -1594844 8009202
10353H009202J775043o161086n767027k210910j757107j523079J006478J284564
$$ 8009202 9784245 3623159 -2143868 -4354778 -6111885 -7634964 -6628486 -5343922
10345e343922j959809j725455M422869P826122K670566m009011m006373j83541
$$ -5343922 -7303731 -9029186 -4606317 3219805 5890371 1881360 -2125013 -2308554
10337b308554O41726j184772j443291K84749K180092L619249L177897n78508m126141
$$ -2308554 -1666828 -2851600 -4294891 -4010142 -1830050 1789199 4967096 4388588 262447
10328B62447k318530K019698J013727m529794n266478O80017M108482Q24514j513228
$$ 262447 -2056083 -36385 977342 -3552452 -8818930 -8138913 -4030431 -3205917 -4719145
10319d719145J793431L471941k290697q584380o683965R12202O661230R005885
$$ -4719145 -2925714 546227 -1744470 -10328850 -17012815 -16100613 -9439383 -433498
10311d33498R346527N868092j430408o369162m927541j736562j559869j318517
$$ -433498 8913029 14781121 13350713 6981551 2054010 317448 -1242421 -2560938
10303b560938K192342M059414n33481o080290m301504K533331N260757J857115
$$ -2560938 -368596 3690818 3157337 -2922953 -7224457 -4691126 569631 2426746
10295B426746j230903l68767J052013M9000j239788k04134J439281Q5132m234202
$$ 2426746 1195843 827076 1879089 1928089 688301 484167 1923448 2008580 -2225622
10286b225622o752875l280378L652654O439897J991755l554906l447884K7426
$$ -2225622 -8978497 -12258875 -8606221 -2166324 -174569 -3729475 -7177359 -7149933
10278g149933M14837j831850j345423J234233K01911l629067k893307L162543
$$ -7149933 -6735096 -8566946 -9912369 -8678136 -8476225 -12105292 -14998599 -11836056
10270a1836056O130657K290302j323242O62562L281660J051508k313910j298694
$$ -11836056 -5705399 -3415097 -4738339 -4075777 -794117 257391 -2056519 -3355213
10262c355213J498886O73388k208691j866362J407525K686452K62676l040245
$$ -3355213 -1856327 -1182939 -3391630 -5257992 -3850467 -1164015 -901339 -3941584
10254c941584m608313l853108j134041J842646K484567N92730r20575n5036K087487
$$ -3941584 -8549897 -12403005 -13537046 -11694400 -9209833 -8617103 -9537678 -9592714 -7505227
10245g505227L713640L706702Q64750l898533n466483m69400N579872M520975
$$ -7505227 -3791587 -84885 779865 -3118668 -8585151 -9054551 -3474679 1046296
10237A046296j560421k844133K118926L684403k405792p289756l776291J622219
$$ 1046296 -514125 -3358258 -1239332 2445071 39279 -7250477 -11026768 -9404549
10229i404549n9337n320786m476624K654038P232646M740127o15618l511574k874707
$$ -9404549 -9463886 -14784672 -19261296 -16607258 -9374612 -4634485 -5250103 -8761677 -11636384
10220a1636384l74823J526753Q64404j222333j035946K097406M043758K263481
$$ -11636384 -12011207 -10484454 -9620050 -10842383 -11878329 -9780923 -5737165 -3473684
10212c473684j62483j13795N29493o48201j625354l5953J773382O26697j891663
$$ -3473684 -3636167 -3749962 -3220469 -3868670 -5494024 -5529977 -3756595 -3129898 -5021561
10203e021561k299507o42578J033983K419280L190773J125850l660778o062853
$$ -5021561 -7321068 -7963646 -6929663 -4510383 -1319610 -193760 -3854538 -9917391
10195i917391k387812L441677M826410J230164k462080l096743j396265J163736
$$ -9917391 -12305203 -8863526 -4037116 -2806952 -5269032 -8365775 -9762040 -8598304
10187h598304L362659L344416L44328l387930m754776k895357J051239N018695
$$ -8598304 -5235645 -1891229 -1546901 -4934831 -9689607 -12584964 -11533725 -6515030
10179f515030N919498J935865l584424m464433Q8654L842321K472709n52674l10525
$$ -6515030 -595532 1340333 -2244091 -6708524 -6619870 -2777549 -304840 -857514 -1168039
10170a168039J929736J746029j201861l477395l180110j279136O42054J319787
$$ -1168039 761697 2507726 1305865 -2171530 -5351640 -6630776 -5988722 -4668935
10162d668935K91640q53243m1510J572482R13248j289229q49738K414732L188097
$$ -4668935 -4377295 -5230538 -5272048 -3699566 -2786318 -4075547 -4925285 -2510553 677544
10153F77544q75523m828692l949725l17366J861648K406595K559639J170111j921166
$$ 677544 -197979 -5026671 -8976396 -9293762 -7432114 -5025519 -2465880 -1295769 -3216935
10144c216935l075591j50917L251343L236635J477649J276394J706502L64602
$$ -3216935 -6292526 -6443443 -3192100 44535 1522184 2798578 4505080 4869682
10136D869682j614508k008794j801647k626726k989827j145082J341832K607940
$$ 4869682 3255174 1246380 -555267 -3181993 -6171820 -7316902 -5975070 -3367130
10128c367130L576695M489909K580184k666416o277323m468045m47592J054558
$$ -3367130 209565 4699474 7279658 4613242 -1664081 -6132126 -6579718 -5525160
10120e525160O72771R41812Q17498o02600J88864M852365P254290J780218n998087
$$ -5525160 -4852389 -3910577 -3093079 -3695679 -3506815 1345550 8599840 10380058 4381971
10111D381971n971520J165316M632586l54117o250652n091454Q00859L766070
$$ 4381971 -1589549 -424233 4208353 3854236 -2396416 -7487870 -6687011 -2920941
10103b920941J381696k013663j888139J528873M332254L607413N51823j617503
$$ -2920941 -1539245 -3552908 -5441047 -3912174 420080 4027493 4579316 2961813
10095B961813k182684k886444l560274j917793J224019J550786j522532k636075
$$ 2961813 779129 -2107315 -5667589 -7585382 -6361363 -4810577 -6333109 -8969184
10087h969184Q93894L835177J386243k607692k081658J289581J913772K78563
$$ -8969184 -8075290 -4240113 -2853870 -5461562 -7543220 -6253639 -4339867 -4061304
10079d061304Q59149K613524N47881m130285m444231R66364N201677L819242P13714
$$ -4061304 -3202155 -588631 -40750 -4171035 -8615266 -7648902 -2447225 1372017 2085731
10070B085731M21182J244988o2056k169309k178598q69982n82180o19781J010817
$$ 2085731 2506913 3751901 3689845 1520536 -658062 -1528044 -2110224 -2730005 -1719188
10061a719188L031183K155499j563498m161354l082644l86877O39695J13852O53879
$$ -1719188 1311995 3467494 1903996 -2257358 -5340002 -5726879 -5087184 -4973332 -4319453
10052d319453K681190L393905J162077j654155k187228j198318j047443j396946
$$ -4319453 -1638263 1755642 2917719 1263564 -923664 -2121982 -3169425 -4566371
10044d566371m61431Q45194K50757j172200l90614J727073J219288j761004k237139
$$ -4566371 -5027802 -4182608 -3931851 -5104051 -5494665 -3767592 -2548304 -4309308 -6546447
10035f546447J484201M517638K725388j496763l561121k645535o97840P77284
$$ -6546447 -5062246 -544608 2180780 684017 -2877104 -5522639 -6220479 -5443195
10027e443195Q08769o42577j191953J107760L350231J630372j199932P27202M820757
$$ -5443195 -4634426 -5277003 -6468956 -5361196 -2010965 -380593 -1580525 -853323 3967434
10018C967434K431427n450870p017646J057775O156545j38179p113752k230840
$$ 3967434 6398861 947991 -6069655 -5011880 1144665 1006486 -6107266 -8338106
10010h338106P425774O354889l994043q084810j244141N157761L613833j55314
$$ -8338106 -912332 5442557 1448514 -6636296 -7880437 -2722676 891157 735843
10002G35843m32621n7711j345227o71970K551636K257605l095966n520466k83305
$$ 735843 303222 245511 -1099716 -1771686 779950 3037555 -58411 -5578877 -5862182
9993e862182N197522K968154k510854j931605L844706N905335J513289k974181
$$ -5862182 -664660 2303494 -207360 -2138965 1705741 7611076 9124365 6150184
9985F150184k881176q74070n90924j133573m56782M79611K5499q12582l87524
$$ 6150184 3269008 2394938 1804014 670441 213659 693270 718769 -93813 -481337
9976d81337K84813o93372k265029j683337O42289J063748j617766l715479j911023
$$ -481337 -196524 -889896 -3154925 -4838262 -4195973 -3132225 -4749991 -8465470 -10376493
9967a0376493J935797L927721L491847K286406K73308k818189m205018j431720
$$ -10376493 -8440696 -4512975 -1021128 1265278 1538586 -1279603 -5484621 -6916341
9959f916341K369747K338528k534R46477M826346N210251N72880k594717k39568
$$ -6916341 -4546594 -2208066 -2210600 -1264123 3562223 8772474 9345354 6750637 6511069
9950F511069L136991K364448j105638l628117m823901m764538j914579K100084
$$ 6511069 9648060 12012508 10906870 7278753 2454852 -2309686 -4224265 -2124181
9942b124181J898789l243472o585709l802914P60639K192132K437763M366694
$$ -2124181 -225392 -3468864 -10054573 -13857487 -13096848 -10904716 -8466953 -4100259
9934d100259N231259K063591k330395m254348m190660k607757K069134O903098
$$ -4100259 1131000 3194591 864196 -3390152 -7580812 -10188569 -8119435 -1216337
9926a216337M819324k996957n322432J538171N872002m86084p382186k984585
$$ -1216337 3602987 606030 -4716402 -3178231 2693771 2207687 -5174499 -8159084
9918h159084N877398N332161k272948l649220K709144O123014K695607j339894
$$ -8159084 -2281686 3050475 777527 -2871693 -162549 5960465 8656072 7316178
9910G316178l132934n169638n547197o06809M588529K443441k845782j600444
$$ 7316178 4183244 -986394 -6533591 -7140400 -2551871 -108430 -2954212 -4554656
9902d554656L581221K253783m107937m192151K244303L727672j960258m392640
$$ -4554656 -973435 1280348 -2827589 -7019740 -4775437 -1047765 -3008023 -7400663
9894g400663j54094K101294o59315p81427L578563M210843n61572k070318J629557
$$ -7400663 -7554757 -5453463 -6112778 -6894205 -3315642 895201 333629 -1736689 -107132
9885a07132K079874k195757k771823M49550j895236p557997l579030O238960K212433
$$ -107132 1972742 -223015 -2994838 -2545288 -4440524 -11998521 -15577551 -9338591 -7126158
9876g126158j2762729o987157K8715075N3814597L1005749j7099344l8045334
$$ -7126158 -19888887 -26876044 1839031 55653628 86659377 69560033 31514699
9869C1514699k0587373L37547J214958m978149k568805K075735n54596m967423
$$ 31514699 10927326 11264873 12479831 7501682 4932877 7008612 6454016 1486593
9861A486593l452329O06730J853267J796398J798722o23912l853826k324073K194345
$$ 1486593 -1965736 -1359006 494261 2290659 4089381 3465469 -388357 -2712430 -518085
9852e18085J623550l731263m586417Q04174L541124O49460l8490L936252L924789
$$ -518085 1105465 -2625798 -7212215 -6408041 -2866917 -2217457 -2255947 1680305 5605094
9843E605094k860783n751842J159615P168583K280900n711862m213353L647797
$$ 5605094 2744311 -3007531 -1847916 5320667 7601567 1889705 -2323648 1324149
9835A324149N310773p68606m819818k691060k80443j574085l162543k031025k73375
$$ 1324149 6634922 5866316 1046498 -1644562 -1925005 -3499090 -6661633 -8692658 -8966033
9826h966033Q2746N50815K317967L630391K988905J577191R47529O53287n50821
$$ -8966033 -8883287 -8332472 -6014505 -2384114 604791 2181982 3129511 3782798 3231977
9817C231977k466643l252343j370130K035714L331448N28676l419442m054291
$$ 3231977 765334 -2487009 -3857139 -1821425 1510023 2038699 -1380743 -5435034
9809e435034j641868l30438j117201l96441L206953N560044L299191p91824j971850
$$ -5435034 -7076902 -7407340 -8524541 -8920982 -5714029 -153985 3145206 2353382 381532
9800C81532J34834K512811L224890K085957m02065k248196j036552J858219J681389
$$ 381532 516366 3029177 6254067 8340024 7937959 5689763 4653211 6511430 8192819
9791H192819k392195m655974j355241K744602J565603k431586k354311J682707
$$ 8192819 5800624 1144650 -210591 2534011 4099614 1668028 -686283 996424
9783I96424K914543q03024l768128j913472J316546J421853m01773o69305M49848
$$ 996424 3910967 3107943 -660185 -2573657 -1257111 164742 -237031 -906336 -456488
9774d56488O10011k29854o33962q83498j738661j631669J205648M706381M770920
$$ -456488 153523 -76331 -710293 -1593791 -3332452 -4964121 -3758473 947908 5718828
9765E718828J162118j727180q85198J261154M45594l498425o369634m945202r14013
$$ 5718828 6880946 5153766 4268568 5529722 5975316 2476891 -3892743 -8837945 -9751958
9756i751958J353884K63852j230237P6332K986199L587429J125585p21301N52617
$$ -9751958 -8398074 -8134222 -9364459 -9288127 -6301928 -2714499 -1588914 -2310215 -1757598
9747a757598K305436Q40794k575937l183999M34123M281757M199355O73233k439850
$$ -1757598 547838 1388632 -1187305 -4371304 -3937181 344576 4543931 5217164 2777314
9738B777314k272990N70635K700768J164901k818907m294257p63372L386077K083154
$$ 2777314 504324 1074959 3775727 4940628 2121721 -2172536 -2935908 450169 2533323
9729B533323l525370n962785j902643L163221L064662o09376j896617P50086L290325
$$ 2533323 -992047 -6954832 -8857475 -5694254 -2629592 -3238968 -5135585 -4385499 -1095174
9720a095174K331938j077957l534088k718510Q64500M020963L555233j2930k747223
$$ -1095174 1236764 158807 -3375281 -6093791 -5229291 -1208328 2346905 2333975 -413248
9711d13248k233775j97427Q95802J168974J557402J465823L71730p09771j323258
$$ -413248 -2647023 -2844450 -1948648 -779674 777728 2243551 2615281 1905510 582252
9702E82252k381684l117770q81249L658188N377958K084915j414869q04539Q06442
$$ 582252 -1799432 -4917202 -5798451 -2140263 3237695 5322610 3907741 3103202 3909644
9693C909644j179435m327071l332394N85506J907166K85447J14378J816814J403000
$$ 3909644 2730209 -1596862 -4929256 -4343750 -2436584 -2151137 -2036759 -219945 1183055
9684A183055j353014j916443Q69578K542977M70993k437904l024584j615663O65986
$$ 1183055 -169959 -2086402 -1216824 1326153 1797146 -640758 -3665342 -5281005 -4615019
9675d615019L267566M120294J338161k408981k466475N14911J441205q38414k167645
$$ -4615019 -1347453 2772841 4111002 1702021 -764454 -249543 1191662 353248 -1814397
9666a814397o71421Q00100Q47573J544326K885470J841609j310465k258400j30031
$$ -1814397 -2485818 -1685718 -838145 706181 3591651 5433260 4122795 1864395 1734364
9657A734364Q56791q84487j782371m05406m6406j431448m39129L530904M574527
$$ 1734364 2591155 1706668 -75703 -481109 -527515 -1958963 -2398092 1132812 5707339
9648E707339k2733m341928l041224O31757J329079p5862k73832P709q46907p27238
$$ 5707339 5684606 1342678 -1698546 -1066789 262290 186428 -87404 -79695 -926602 -1653840
9638a653840J837730L162639o339m293974m527657j314683J118349J336652N30629
$$ -1653840 183890 3346529 3340190 -953784 -5481441 -6796124 -5677775 -4341123 -3810494
9629c810494o75657j271797O82217M078412M321081K90677k861410j408407J488531
$$ -3810494 -4486151 -5757948 -5075731 -997319 3323762 3614439 753029 -655378 833153
9620H33153J708499J63720j030555k579743m010975j844696L599994N972075K365096
$$ 833153 2541652 2705372 1674817 -904926 -4915901 -6760597 -3160603 2811472 5176568
9611E176568j696327j748230j187991k831668k422397J983159L246608k804167
$$ 5176568 3480241 1732011 544020 -2287648 -4710045 -2726886 519722 -2284445
9603b284445p270254j474696P353035O726967r88039l533842N17535J489795k765227
$$ -2284445 -9554699 -11029395 -3676360 3050607 2062568 -1471274 -953739 536056 -2229171
9594b229171l683227J544524M917994K075092j136550n33681l46556l206865l892241
$$ -2229171 -5912398 -4367874 550120 2625212 1488662 954981 608425 -2598440 -6490681
9585f490681R76344N608389L710734k031622m745709k594856J307386L908937
$$ -6490681 -5514337 94052 3804786 1773164 -2972545 -5567401 -4260015 -351078
9577c51078L558311J58219l314581k978018N35925K484238P62553j862160k830978
$$ -351078 3207233 3365452 50871 -2927147 -2391222 93016 855569 -1006591 -3837569
9568c837569k582454j772765l51677K56985j279700k551569k88847L555010M097197
$$ -3837569 -6420023 -8192788 -8544465 -8287480 -9567180 -12118749 -12407596 -8852586 -4755389
9559d755389J323699m13476o3679m20466j516440p71985M24111j773737n167506
$$ -4755389 -3431690 -3845166 -3908845 -4329311 -5845751 -6617736 -6193625 -7967362 -13134868
9550a3134868l057013M330014Q562107N450429M57466j080098q18936j138255
$$ -13134868 -16191881 -11861867 -3299760 2150669 2608135 1528037 709101 -429154
9542d29154l33895J627370M75267m186936n482418J73376N863431M112703j684412
$$ -429154 -763049 864321 1339588 -2847348 -8329766 -8156390 -2292959 1819744 135332
9533A35332l000116R48731L509382J326312k061823k616812n38551J507052J552405
$$ 135332 -2864784 -1916053 1593329 2919641 857818 -1758994 -2297545 -790493 761912
9524G61912k54531j687223p85444J168524J147360p90049j505074l26691m00733
$$ 761912 507381 -1179842 -1965286 -796762 350598 -439451 -1944525 -2271216 -2671949
9515b671949k942439m456126k054717K113033M113372K831434l27019l102840
$$ -2671949 -5614388 -10070514 -12125231 -10012198 -5898826 -3067392 -3394411 -6497251
9507f497251k688717J738985N847702M101836j973392m748271j304069K661891
$$ -6497251 -9185968 -7446983 -1599281 2502555 529163 -4219108 -5523177 -2861286
9499b861286K309620P32800K463973N440366M671248O1226m330241n985714m807920
$$ -2861286 -551666 181134 2645107 8085473 12756721 12817947 8487706 2501992 -2305928
9490b305928j121824L281102M659335J673576j860912j822334P03704J796674
$$ -2305928 -3427752 -146650 4512685 6186261 4325349 2503015 3206719 5003393
9482E003393N75575l94665P00725K718740K873156o03364n895929q050321m433917
$$ 5003393 5578968 5184303 5885028 8603768 11476924 10873560 4977631 -3072690 -7506607
9473g506607R97609K470200M76318J85280K462003K859612R2545j553576j30248
$$ -7506607 -6508998 -4038798 -3562480 -3377200 -915197 1944415 2036960 483384 353136
9464C53136O58683j204901k207559k23368J273984j48208j364756j70126j4391
$$ 353136 1011819 -193082 -2400641 -2624009 -1350025 -1498233 -2862989 -3033115 -3047506
9455c047506l235491n430329k253985L188443N360838M140337K296895j65446
$$ -3047506 -6282997 -11713326 -13967311 -10778868 -5418030 -1277693 1019202 853756
9447H53756l452322m274778q06032K564300J403721j541500j233458J248667J464588
$$ 853756 -2598566 -6873344 -7679376 -5115076 -3711355 -5252855 -6486313 -5237646 -3773058
9438c773058n01592j272762n13232J1479R78326L247364L983891J039583j875823
$$ -3773058 -4274650 -5547412 -6060644 -6049165 -5070839 -1823475 2160416 3199999 1324176
9429A324176p33810J369872o09114m150464l000482J602422K437189j503978l199944
$$ 1324176 590366 1960238 1351124 -2799340 -5799822 -4197400 -1760211 -3264189 -6464133
9420f464133Q44026N170586L991823j041004m510684m039585j076949J646025
$$ -6464133 -5620107 -449521 3542302 2501298 -2009386 -6048971 -7125920 -5479895
9412e479895J918135l2878j104828O73753K685001J568782j048034j031846J387353
$$ -5479895 -3561760 -3594638 -4699466 -4025713 -1340712 228070 -819964 -1851810 -464457
9403d64457K249675N87908o88082l11120R1877K12409J393591K590539J170429
$$ -464457 1785218 2373126 1685044 1373924 1465801 1678210 3071801 5662340 6832769
9394F832769j777563k096748O11712J865762o70739l749289l855012j836500l35932
$$ 6832769 5055206 2958458 3570170 5435932 4765193 1015904 -2839108 -4675608 -5011540
9385e011540n0024l14705o24470k88976J050160K022909J076821o82408r68168
$$ -5011540 -5061564 -5376269 -6000739 -6289715 -5239555 -3216646 -2139825 -2822233 -3790401
9376c790401o8081K04418M58775K420901M298413K520117j689089k911036J40271
$$ -3790401 -3858482 -3654064 -3195289 -774388 3524025 6044142 4355053 1444017 1584288
9367A584288K335046K76603k442747j358049J782709K122397q90780l279512k445615
$$ 1584288 3919334 4195937 1753190 395141 2177850 4300247 3409467 129955 -2315660
9358b315660O1390J449418J069217M90165J082876J953065R31447j885481l158185
$$ -2315660 -2254270 -804852 264365 754530 1837406 3790471 4721918 2836437 -321748
9349c21748p54315K439229K251085l96476r47896J241714J684358j744693m880056
$$ -321748 -1076063 1363166 3614251 3217775 2269879 3511593 5195951 3451258 -1428798
9340a428798l496129M09757K100670J102438O66445J732647J742719l84566j932435
$$ -1428798 -4924927 -4515170 -2414500 -1312062 -645617 1087030 2829749 2445183 512748
9331E12748o93046J092288j81508l582924m063867M74323N389251M870615n07643
$$ 512748 -180298 911990 730482 -2852442 -6916309 -6441986 -1052735 3817880 3310237
9322C310237m840423m545648j506839J100554K150138J321835j154796k401166
$$ 3310237 -1530186 -6075834 -7582673 -6482119 -4331981 -3010146 -4164942 -6566108
9314f566108Q28169O013184O183067R5915m510929j943108K938721K981529M3414
$$ -6566108 -5737939 275245 6458312 6554227 2043298 100190 3038911 6020440 6063854
9305F063854K90593K473704M59274m600093n008344J70085K765082r84146m129886
$$ 6063854 6354447 8828151 9287425 4687332 -321012 -150927 2614155 1630009 -2499877
9296b499877p91703M147246L474674p24774j397023J730560K570092r63610m227942
$$ -2499877 -3291580 855666 4330340 3605566 2208543 3939103 6509195 5545585 1317643
9287A317643l646520j309985m19562o29494J3173J513390K491283K554562K282521
$$ 1317643 -2328877 -3638862 -4058424 -4687918 -4674745 -3161355 -670072 1884490 4167011
9278D167011J769940O15469j022307k375955k983784k986766k588697j873020
$$ 4167011 5936951 6552420 5530113 3154158 170374 -2816392 -5405089 -7278109
9270g278109j190963r51249p39493M23941K316753L100008J807038J13969k3211
$$ -7278109 -8469072 -9420321 -10159814 -9735873 -7419120 -4319112 -2512074 -2398105 -2421316
9261b421316O68384M06365l00025q546P8843j931980l695674r59621M681540O445750
$$ -2421316 -1752932 -1346567 -1646592 -1655138 -1576295 -3508275 -7203949 -8163570 -3482030 2963720
9251B963720K570994o77286O30580J684391j998305n801575l598912J221950J118918
$$ 2963720 5534714 4857428 5488008 7172399 5174094 -627481 -4226393 -3004443 -1885525
9242a885525k755887k726763J984873M071075R66579q59674K722490O245765L321717
$$ -1885525 -4641412 -7368175 -5383302 -1312227 -345648 -1205322 1517168 7762933 11084650
9233A1084650l580060o997956m187094J140941M064143K420742k225428n491312
$$ 11084650 7504590 506634 -3680460 -2539519 1524624 3945366 1719938 -3771374
9225c771374m088038R3895K254183J321968P74727K327757L301982J878635M89313
$$ -3771374 -7859412 -7765517 -5511334 -4189366 -3414639 -1086882 2215100 4093735 4583048
9216D583048J323372K230215L41355k954744l962202j994258K5980m56179k833240
$$ 4583048 5906420 8136635 8477990 5523246 1561044 -433214 -407234 -863413 -3696653
9207c696653m155480k132939K041820M195045J875812k156402l264344r81369
$$ -3696653 -7852133 -9985072 -7943252 -3748207 -1872395 -4028797 -7293141 -8274510
9199h274510J065456P86709q1157N35558K332773L859625L978554K049657j027441
$$ -8274510 -7209054 -6422345 -6503502 -5967944 -3635171 224454 4203008 6252665 5225224
9190E225224k517071j151579L54572q47427k907024k214546L62862J014533l72980
$$ 5225224 2708153 1556574 1911146 1063719 -1843305 -4057851 -3694989 -2680456 -3053436
9181c053436n85737M96632j78906k406587k421427K15529J659541Q77477J261442
$$ -3053436 -3639173 -3142541 -3321447 -5728034 -8149461 -7933932 -6274391 -5396914 -4135472
9172d135472L426214L129361r04115l638265j821741O56253j93950j694941N2678
$$ -4135472 -709258 2420103 1515988 -2122277 -3944018 -3287765 -3481715 -5176656 -5123978
9163e123978K701599J591867k058120k889898K53886K974601J963830j001926
$$ -5123978 -2422379 -830512 -2888632 -5778530 -5524644 -2550043 -586213 -1588139
9155a588139k112160j05348K720969L247691J303590M8651J315641K210143n06540
$$ -1588139 -3700299 -3805647 -1084678 2163013 3466603 3515254 4830895 7041038 6534498
9146F534498m264665l787389M04998K513112P43101n23609Q27959J144850j320255
$$ 6534498 2269833 -1517556 -1112558 1400554 2143655 1620046 2448005 3592855 2272600
9137B272600k261389J045285M241104K926741k59245q78236q7056j029213k061261
$$ 2272600 11211 1056496 5297600 8224341 7965096 7086860 6999804 5970591 3909330
9128C909330R2218L402021K988206j202241m541517m431697k433594o71823J74013
$$ 3909330 4001548 7403569 10391775 9189534 4648017 216320 -2217274 -2889097 -2715084
9119b715084J49085n63O39354J059266o73904l001164j661976K861660L932446
$$ -2715084 -2565999 -2566562 -1927208 -867942 -1541846 -4543010 -6204986 -3343326 589120
9110E89120j402259o438735m023446K725239N214437J671774k009846j834318
$$ 589120 -813139 -7251874 -11275320 -8550081 -3335644 -1663870 -3673716 -5508034
9102e508034K70248J346411R26678m15637k046509k865404k568558k290568k080005
$$ -5508034 -5237786 -3891375 -2964697 -3380334 -5426843 -8292247 -10860805 -13151373 -15231378
9093a5231378j91215L022872M140797K337068J577112L589721L848188n07629
$$ -15231378 -15422593 -12399721 -8258924 -5921856 -4344744 -755023 3093165 2585536
9085B585536m175776j693362K914237K390738j676425j982828J725771K613878
$$ 2585536 -1590240 -3283602 -369365 2021373 344948 -1637880 87891 2701769
9077B701769j131730l616056j781320j633j676314l558731j734436K386697N090966
$$ 2701769 1570039 -2046017 -3827337 -3828970 -5505284 -9064015 -10798451 -8411754 -3320788
9068c320788M945003K165620k337346n357490l095876L214478O961691L776027
$$ -3320788 1624215 3789835 1452489 -3905001 -7000877 -3786399 3175292 6951319
9060F951319l190334p400849o033528j475425K296369L350178K685764K121048
$$ 6951319 3760985 -3639864 -9673392 -11148817 -8852448 -5502270 -2816506 -695458
9052f95458J531267m03638k648364k194825P33330J921039J482o88729K230251
$$ -695458 835809 432171 -2216193 -4411018 -3677688 -1756649 -1755167 -2443896 -213645
9043b13645L934185K57146m187181k852824J755930K117548k049333m253404k405125
$$ -213645 3720540 3977686 -209495 -3062319 -1306389 811159 -1238174 -5491578 -7896703
9034g896703p38988j049551n06876J507389K325523K143807L600314N091485K525313
$$ -7896703 -8635691 -9685242 -10192118 -8684729 -6359206 -4215399 -615085 4476400 7001713
9025G001713k125242k667530M51413M81587l317761l838555R93993L875197N68856
$$ 7001713 4876471 2208941 2660354 3141941 -175820 -4014375 -3020382 854815 1423671
9016A423671l168854k052726N47954M58038N5050J714376K140019l02211o44029
$$ 1423671 -1745183 -3797909 -3249955 -2791917 -2736867 -1022491 1117528 815317 171288
9007A71288L326550M855218o60516o173168l842994J690208J346248l038275k944323
$$ 171288 3497838 8353056 7692540 1519372 -2323622 -633414 712834 -2325441 -5269764
8998e269764J589936L164725Q72806N74385K275224k42461o208393o545346J134147
$$ -5269764 -3679828 -515103 357703 932088 3207312 2964851 -3243542 -9788888 -8654741
8989h654741P330865N096074j31034q37044J092597K31317k053642j092796K008405
$$ -8654741 -1323876 3772198 3641164 2804120 3896717 4128034 2074392 981596 2990001
8980B990001K588891O78503j38992J10540j235568k844538j026949K359990J285670
$$ 2990001 5578892 6257395 6118403 6228943 4993375 2148837 1121888 3481878 4767548
8971D767548l893914m931262J775113Q020286M928018l740664o719036j157205
$$ 4767548 873634 -4057628 -2282515 5737771 10665789 6925125 206089 -951116
8963i51116M468781L336937j492311m034683l763494k991044j310431K087219
$$ -951116 3517665 6854602 5362291 1327608 -2435886 -5426930 -6737361 -4650142
8955d650142M345985K787167J89618O64111K412194P17588l301945l844392j87642
$$ -4650142 -304157 2483010 2672628 3336739 5748933 6466521 3164576 -679816 -867458
8946h67458J887349k57463k079145j07628K345481J647401K18080J440947K902266
$$ -867458 1019891 762428 -1316717 -1424345 921136 2568537 2786617 4227564 7129830
8937G129830N75073l455095l604479M30932L123054R36698l878020p168178o622027
$$ 7129830 7704903 4249808 645329 1076261 4199315 5136013 1257993 -5910185 -12532212
8928a2532212j986804M394569P358978L539034l163172m884357J48640M965525
$$ -12532212 -14519016 -10124447 -2765469 773565 -2389607 -7273964 -7125324 -2159799
8920b159799L427187j440701k384687J447195L718225M10383m589656n155877
$$ -2159799 1267388 -173313 -2558000 -1110805 2607420 3017803 -1571853 -6727730
8912f727730p61519M044650N731222M193821N58317l659491n611367l296613P82778
$$ -6727730 -7489249 -3444599 2286623 6480444 7038761 3379270 -2232097 -5528710 -4745932
8903d745932J963347K44415L85186L631316M656605J94328m483963l127825J508802
$$ -4745932 -2782585 -2538170 -2152984 1478332 6134937 6329265 1845302 -1282523 226279
8894B26279J947967k291920m628250k136726J077970J744058J656113K416308
$$ 226279 2174246 -117674 -4745924 -6882650 -5804680 -4060622 -2404509 11799
8886A1799K217885K66542q89849N3660Q22197j908n99387J6609K282j210286j349252
$$ 11799 2229684 2496226 1606377 1660037 2482234 2480326 1880939 1897548 1899830 689544 -659708
8875f59708N333j16979k431673l018552L24784L809643L246658P8482j645849
$$ -659708 -654375 -771354 -3203027 -6221579 -5896795 -2087152 1159506 1237988 -407861
8866d07861r50401O42542K192910K808059J031407k410050m040748k173973P76721
$$ -407861 -1358262 -715720 1477190 4285249 5316656 2906606 -1134142 -3308115 -2531394
8857b531394K162294J903623K53094k863060m876319k145145L571312N766707
$$ -2531394 -369100 1534523 1787617 -1075443 -5951762 -8096907 -4525595 1241112
8849A241112K511116r56670j311355j623933l488646k818022J606369L714802
$$ 1241112 3752228 2795558 1484203 -139730 -3628376 -6446398 -4840029 -1125227
8841a125227N97214j039551L249011N800446p87628q846036o004342M460148P782707
$$ -1125227 -528013 -1567564 1681447 7481893 6694265 -2151771 -8156113 -3695965 4086742
8832D086742M83789n314132j775491L797612K497723k761419l862454J55L096386
$$ 4086742 4570531 -743601 -2519092 1278520 3776243 1014824 -2847630 -2847475 248911
8823B48911K109532r94668k791023j797664O51791J748121O79374M6818J693356
$$ 248911 2358443 1363775 -1427248 -3224912 -2573121 -825000 -145626 -98808 1594548
8814A594548L042577R68396k905256m909271m874945m304040k046835K406919
$$ 1594548 4637125 5605521 2700265 -2209006 -7083951 -11387991 -13434826 -11027907
8806a1027907M554598R06845l456056j504640L908986M083745j174117l506196
$$ -11027907 -6473309 -5566464 -9022520 -10527160 -6618174 -2534429 -3708546 -7214742
8798g214742j92161K385478Q93908J0154K428301L944612K176498Q55437J515090
$$ -7214742 -7406903 -5021425 -4127517 -4117363 -1689062 2255550 4432048 5287485 6802575
8789F802575J01595l829899l958782J524139M759642O40556m410898l356474j0998
$$ 6802575 6904170 3074271 -884511 639628 5399270 6039826 1628928 -1727546 -1738544
8780a738544j178228m433250l140866J674533L837695K496726J358331O96275
$$ -1738544 -2916772 -7350022 -10490888 -8816355 -4978660 -2481934 -1123603 -427328
8772d27328j460018k873390j58767L734732L124679q64386k165142K2921Q16708
$$ -427328 -1887346 -4760736 -4919503 -1184771 1939908 1075522 -1089620 -1066699 -249991
8763b49991j025701j341538J199021K549943O96227q89336M56775K264731J606482
$$ -249991 -1275692 -2617230 -1418209 1131734 1827961 938625 1395400 3660131 5266613
8754E266613k23375n23119M51280N55932p43124j934966j586759Q0677J371401
$$ 5266613 5043238 4520119 4971399 5527331 4784207 2849241 1262482 1343159 2714560
8745B714560J011837l165J43627N22393j821026o228082p204933j798369N147478
$$ 2714560 3726397 3723232 3866859 4389252 2568226 -3659856 -10864789 -12663158 -7515680
8736g515680P016530L924420Q34689l16706j456466k977488l027333j731966j163654
$$ -7515680 -499150 3425270 4259959 3943253 2486787 -490701 -3518034 -5250000 -6413654
8727f413654j130340M50500K901387L002966L31162j792388j382680j8773P17052
$$ -6413654 -7543994 -7093494 -4192107 -1189141 -857979 -2650367 -4033047 -4051820 -3334768
8718c334768J320301J925871J234041q52674k332211j961813o59094O30160K030817
$$ -3334768 -2014467 -88596 1145445 292771 -2039440 -4001253 -4660347 -4030187 -1999370
8709a999370L072998K426413K70172j108713j48539J857579K132708p28157n050240
$$ -1999370 1073628 3500041 3770213 2661500 2512961 4370540 6503248 5775091 724851
8700G24851o777699l217677K931602N313336J432556l769605m229470l25571K896298
$$ 724851 -6052848 -9270525 -6338923 -1025587 406969 -3362636 -7592106 -7917677 -5021379
8691e021379K859938J173015q0697q364J691692L435319J665219m051072q015769
$$ -5021379 -2161441 -988426 -1069123 -1077487 614205 4049524 5714743 1663671 -6352098
8682f352098n199494J055125L592690J735940N02733J006111m57154l580739k824460
$$ -6352098 -11551592 -10496467 -6903777 -5167837 -4665104 -3658993 -4116147 -7696886 -10521346
8673a0521346K709573N968825K241344l757462n260703k275022J283927M019862
$$ -10521346 -7811773 -1842948 398396 -3359066 -8619769 -10894791 -9610864 -5591002
8665e591002N786090M611035K02985l083112j878888P37560K73652j934461j866810
$$ -5591002 195088 4806123 5009108 1925996 47108 784668 1058320 -876141 -2742951
8656b742951k10248m88073j966782j003176J690479J908484j03751M51094M009539
$$ -2742951 -2953199 -3441272 -5408054 -6411230 -4720751 -2812267 -2916018 -2464924 1544615
8647A544615M641151l05228m876329l149965J771007K726002r28534l541755k163798
$$ 1544615 6185766 5880538 1004209 -2145756 -374749 2351253 1422719 -2119036 -4282834
8638d282834N89348K243060L185606K848077r28270o222002o314764R56419P635293
$$ -4282834 -3693486 -1450426 1735180 4583257 3654987 -2567015 -8881779 -7925360 -290067
8629b90067N451314j824987l275555K890238O534649J093091o524640o696249
$$ -290067 5161247 3336260 60705 2950943 9485592 10578683 4054043 -2642206
8621b642206j117436J204788k079883m774026k791215Q23034K080066J184418
$$ -2642206 -3759642 -2554854 -4634737 -9408763 -12199978 -11376944 -9296878 -8112460
8613h112460K66028O60772L154045O642909O641625K06638p665230q584147k452333
$$ -8112460 -7846432 -7185660 -4031615 2611294 9252919 9459557 1794327 -6789820 -9242153
8604i242153K020749J53300k631729q20683K444721J923414o34335n59070J238839
$$ -9242153 -7221404 -7068104 -9699833 -10520516 -8075795 -6152381 -6786716 -7345786 -6106947
8595f106947R48874l67105R15415L180462J760677k096481k272670J781717L311015
$$ -6106947 -5158073 -5525178 -4609763 -1429301 331376 -1765105 -4037775 -2256058 1054957
8586A054957r22096m940122k430640L886948O409990K985168j452095k166087
$$ 1054957 132861 -4807261 -7237901 -3350953 3059037 6044205 4592110 2426023
8578B426023K44670J969235P39687k201436l908351k963094o42965J212374K337531
$$ 2426023 2670693 4639928 5379615 3178179 -730172 -3693266 -4336231 -3123857 -786326
8569g86326K924315J881790j369743m340968l865190q24311R08987M68483J001284
$$ -786326 2137989 4019779 2650036 -1690932 -5556122 -6380433 -5471446 -5002963 -4001679
8560d001679L550791M246504L72343m273362m020475O76205L947633K418211j367366
$$ -4001679 -450888 3795616 4167959 -105403 -4125878 -3449673 497960 2916171 1548805
8551A548805l444032k868973q43025J579321L280771K757947K4845k347713j948881
$$ 1548805 -1895227 -4764200 -5607225 -4027904 -747133 2010814 2035659 -312054 -2260935
8542b260935L15138J396420R2386j804996k364892j719961p86269M28274J820705
$$ -2260935 -1945797 -549377 -456991 -2261987 -4626879 -6346840 -7133109 -6704835 -4884130
8533d884130J942741p7577k103294j101138K237629L784587J705840r63538j056290
$$ -4884130 -2941389 -3018966 -5122260 -6223398 -3985769 -201182 1504658 541120 -515170
8524e15170L03592M90941r5462K60809N51871r62645k186433K41406M241189L941821
$$ -515170 -211578 279363 183901 444710 996581 33936 -2152497 -1911091 2330098 6271919
8514F271919j055072m065024j315990K298010J230670k271168k861655q82981
$$ 6271919 5216847 1151823 -164167 2133843 3364513 1093345 -1768310 -2651291
8506b651291k98011r36685M43779L133115L327054J196245L46977N38767j853736
$$ -2651291 -2949302 -3885987 -3442208 -309093 3017961 4214206 4561183 5099950 3246214
8497C246214n618989m809798R57531M209677J104498k351116m43686K966067J782430
$$ 3246214 -2372775 -7182573 -6225042 -2015365 -910867 -3261983 -3705669 -739602 1042828
8488A042828j657512j110308K506482K951233o45496k896928j131214J811367
$$ 1042828 -614684 -1724992 781490 3732723 3087227 190299 -940915 870452
8480H70452L350365L321260R21661l959478o841713l076863L799163N411342P57615
$$ 870452 4220817 7542077 8463738 4504260 -2337453 -5414316 -1615153 3796189 4553804
8471D553804k621314q69897J127543m96686k176175m72593J504037M99707n97199
$$ 4553804 1932490 1062593 2190136 1693450 -482725 -955318 548719 1048426 451227
8462D51227J334151L141572R73568k509609k805937j194983j284274j808257L14461
$$ 451227 1785378 4926950 5900518 3390909 584972 -610011 -1894285 -3702542 -3388081
8453c388081K935406J793904j623399k300101p9501R41660J20768N28500K135895
$$ -3388081 -452675 1341229 -282170 -2582271 -2661772 -1720112 -1599344 -1070844 1065051
8444A065051J500046j518593k889794j025599J038648Q39450o98519k018347k371065
$$ 1065051 2565097 1046504 -1843290 -2868889 -1830241 -990791 -1689310 -3707657 -6078722
8435f078722p17303K716069M568833K364289r14118j035440N86988j7244j540413
$$ -6078722 -6796025 -4079956 488877 2853166 1939048 903608 1490596 1473352 -67061
8426f7061O4229K660142J56600o235968p998361k275138L719093L976553J300914
$$ -67061 -2832 2657310 2813910 -3422058 -11420419 -13695557 -9976464 -5999911 -4698997
8417d698997K65339L15364N5237J288309M095917M237820J46791l424098l152997
$$ -4698997 -4433658 -4118294 -4063057 -2774748 1321169 5558989 5705780 2281682 -871315
8408h71315k248220l105472j866832L570427O916322K657580l631607k911865
$$ -871315 -3119535 -6225007 -8091839 -4521412 2394910 5052490 1420883 -1490982
8400a490982L242052N275702K17817n204963n405933j942010J681956M197051
$$ -1490982 1751070 7026772 7244589 2039626 -3366307 -5308317 -3626361 570690
8392E70690M540422J654433k275840l178985p54763J278557R56852n8624n37439
$$ 570690 5111112 6765545 4489705 1310720 555957 1834514 2791366 2732742 2195303
8383B195303j145722j342775P16313M090643M896255J684223k371575l985214
$$ 2195303 1049581 -293194 423119 4513762 9410017 11094240 8722665 4737451
8375D737451l405442k261858p75841J046479J799895M86137j280076q52907J822331
$$ 4737451 1332009 -929849 -1705690 -659211 1140684 1626821 346745 -506162 1316169
8366A316169L528333J431811k996479n034430k431754J448416K107765k1378j143934
$$ 1316169 4844502 6276313 3279834 -1754596 -4186350 -2737934 -630169 -651547 -1795481
8357a795481m58916m18582j051582M01896L402256L702123P94830n83591J101908
$$ -1795481 -2254397 -2672979 -3724561 -3322665 79591 3781714 4576544 3992953 5094861
8348E094861J235230j942021l156203o6877R04246l965439o656155J24809Q432370
$$ 5094861 6330091 4388070 1231867 1164990 2069236 -1896203 -8552358 -8427549 4821
8339D821N675174m769617p761322J45857O156314K107270m100157l038640K183523
$$ 4821 5679995 910378 -6850944 -6705087 -548773 1558497 -2541660 -5580300 -3396777
8330c396777L550555P59326j432043j897703k122846j398358R09416K318221J398398
$$ -3396777 153778 913104 -518939 -2416642 -4539488 -5937846 -5028430 -2710209 -1311811
8321a311811R32419K560797K805677q45935m358882k935230J351222K984975R53219
$$ -1311811 -379392 2181405 4987082 4141147 -217735 -3152965 -1801743 1183232 2136451
8312B136451j711391l400302m018244k333891J735751M506794L073430L32095
$$ 2136451 425060 -2975242 -6993486 -9327377 -7591626 -3084832 -11402 320693
8304C20693O07636K430352J142462k760183l791350P4863M342272M301923M56906
$$ 320693 928329 3358681 4501143 1740960 -2050390 -1975527 2366745 6668668 7125574
8295G125574l284027l821843p81976L205354M085773O77522l008338k407468J288580
$$ 7125574 3841547 19704 -762272 2443082 6528855 7206377 4198039 1790571 3079151
8286C079151K721085o5611l412286l935146k809458k505522k424403m35234L019556
$$ 3079151 5800236 5734625 2322339 -1612807 -4422265 -6927787 -9352190 -9787424 -6767868
8277f767868N089834M292387J975307j07208j855874l638580m455030l017082
$$ -6767868 -1678034 2614353 4589660 4482452 2626578 -1012002 -5467032 -8484114
8269h484114l29827P85593n44200j690806q6649L097932M629085L407656R58307
$$ -8484114 -8813941 -8028348 -8572548 -10263354 -10350003 -7252071 -2622986 784670 1742977
8260A742977j239335k548916k190995j32988J648010J470094P40736J510749K415968
$$ 1742977 503642 -2045274 -4236269 -4369257 -2721247 -1251153 -510417 1000332 3416300
8251C416300R35786j383131r66248R46128n13872n062135o238332j387559L817541
$$ 3416300 4352086 2968955 2002707 2948835 2434963 -2627172 -8865504 -10253063 -6435522
8242f435522M261735K541217K696794K832180L9151k446110l84880K809579O61164
$$ -6435522 -2173787 367430 3064224 5896404 5935555 3489445 3104565 5914144 6575308
8233F575308n102626o216866n96182M580041L790549L405j804497j620580j479217
$$ 6575308 1472682 -4744184 -5340366 -760325 3030224 3033629 1229132 -391448 -1870665
8224a870665p54984J455563K869573J126821j882053k450900l95062J193959O88556
$$ -1870665 -2625649 -1170086 1699487 2826308 944255 -1506645 -1901707 -707748 -19192
8215a9192l36203L350J254848J320384r00092l657288l543424L84051M197821
$$ -19192 -355395 -352045 902803 2223187 1323095 -2334193 -5877617 -5493566 -1295745
8206a295745L101325j979473m752599j733859L063264M008705J531454J73326
$$ -1295745 1805580 -173893 -4926492 -6660351 -3597087 411618 1943072 2116398
8198B116398R74069P99141r97506q05818K414417L662457p24038o009343m968728
$$ 2116398 3090467 3889608 2892102 2086284 4500701 8163158 7439120 1429777 -3538951
8189c538951J047169L458643q41489m870642k357768K859752L194629j179368
$$ -3538951 -2491782 966861 125372 -4745270 -7103038 -4243286 -1048657 -2228025
8181b228025l429113o73731K834679K993408O94225j512317k768988k545596j77149
$$ -2228025 -5657138 -6330869 -3496190 -502782 191443 -1320874 -4089862 -6635458 -6812607
8172f812607K580642K351280p90692k678001j201894P22423M36180k76828P65166
$$ -6812607 -4231965 -1880685 -2671377 -5349378 -6551272 -5828849 -5392669 -5669497 -4904331
8163d904331J720698K02709j840311j055229J606256K516326J313128P59307J348143
$$ -4904331 -3183633 -2980924 -4821235 -5876464 -4270208 -1753882 -440754 318553 1666696
8154A666696N73733k077779l530338j775200J108626K235057J731995J415928
$$ 1666696 2240429 162650 -3367688 -5142888 -4034262 -1799205 -67210 1348718
8146A348718J468953O28900j115293k118838j550995o51802o64701o90673P87012
$$ 1348718 2817671 3446571 2331278 212440 -1338555 -1990357 -2655058 -3345731 -2558719
8137b558719K727359K234544q52542k628320l90913K934838K702280o00110k201973
$$ -2558719 168640 2403184 1550642 -1077678 -1468591 1466247 4168527 3568417 1366444
8128A366444k69691J823347J012962j444065k710935j981238p3960J833213K078590
$$ 1366444 1096753 2920100 3933062 2488997 -221938 -2203176 -2277136 -443923 1634667
8119A634667j08332k380569j490309J657814K726014M37138j771996j674129j135558
$$ 1634667 1526335 -854234 -2344543 -686729 2039285 2476423 704427 -969702 -2105260
8110b105260j299768K6838L348115M721483J691248k329962l515923l293045m243452
$$ -2105260 -3405028 -3378190 -30075 4691408 6382656 4052694 536771 -2756274 -6999726
8101f999726m511841j509118K328621L216437K612515M061505N730408K864177
$$ -6999726 -11511567 -13020685 -10692064 -7475627 -4863112 -801607 4928801 7792978
8093G792978l303486o022165k992057L75960n49627l100804k134508K204199M895070
$$ 7792978 4489492 -1532673 -4524730 -4148770 -4698397 -7799201 -9933709 -7729510 -2834440
8084b834440K876666j090298j894979J406934M034300J813999k429139k510790
$$ -2834440 42226 -1048072 -2943051 -1536117 2498183 4312182 1883043 -627747
8076f27747J456759K593571j831981n378070k543300K071662J191198l158740
$$ -627747 829012 3422583 1590602 -3787468 -6330768 -4259106 -3067908 -6226648
8068f226648l213493J513796L602888N3961l073992m77266M610364N739032J791940
$$ -6226648 -9440141 -7926345 -4323457 -4269496 -7343488 -7820754 -3210390 2528642 4320582
8059D320582k947788m350285j704620K517857M616006K865444n33147j928139
$$ 4320582 1372794 -2977491 -4682111 -2164254 2451752 5317196 4784049 2855910
8051B855910m23655J775637K454650J209735q42715j746039m79012R60846k77208
$$ 2855910 2432255 4207892 6662542 7872277 7029562 5283523 4804511 5765357 5488149
8042E488149k691247j414678L677804O029011K022889k968209k983165l28456
$$ 5488149 2796902 1382224 5060028 11089039 13111928 10143719 7160554 6832098
8034F832098M5462o22042O88891Q41759l707400p616617l794222L327248L488691
$$ 6832098 6877560 6255518 6944409 7786168 4078768 -3537849 -7332071 -4004823 -516132
8025e16132k191108k782229L391346N262669k035324q243750m405568L279355
$$ -516132 -2707240 -5489469 -2098123 3164546 1129222 -7114528 -11520096 -8240741
8017h240741M396985K10697p01695L298254O088912M051119k16163k949935k909072
$$ -8240741 -3843756 -3633059 -4334754 -1036500 5052412 9103531 8887368 5937433 3028361
8008C028361j131700k0146j039951k058511p847L358451L137865n92108k345178
$$ 3028361 1896661 1876515 836564 -1221947 -1229794 2128657 5266522 4674414 2329236
7999B329236l60867O55292j686397l154414q99520J208321l54277k638257j843871
$$ 2329236 1968369 2623661 937264 -2217150 -3116670 -1908349 -2262626 -4900883 -6744754
7990f744754N16160J487486J421282R59964j162539l739748k665551J611719L148375
$$ -6744754 -6228594 -4741108 -3319826 -2359862 -3522401 -7262149 -9927700 -8315981 -5167606
7981e167606O36553K87818M099041M736579j358770n603831q73446N559229L465788
$$ -5167606 -4531053 -4243235 -144194 4592385 3233615 -2370216 -3243662 2315567 5781355
7972E781355l529584m730752j56177J479336j167217j298697K213063K883225
$$ 5781355 2251771 -2478981 -2635158 -1155822 -2323039 -3621736 -1408673 1474552
7964A474552j079176l635625j498191J573613K443807K364488K124812Q30274
$$ 1474552 395376 -3240249 -4738440 -3164827 -721020 1643468 3768280 4598554
7956D598554k44828M90266K34540l639847o382167k183178M408071M062476j583716
$$ 4598554 4353726 4843992 5078532 1438685 -4943482 -7126660 -2718589 1343887 -239829
7947b39829j968938M201411O122497p65207o754635l784780K306981K730194p85641
$$ -239829 -2208767 1992644 8115141 7349934 595299 -3189481 -882500 1847694 1062053
7938A062053j575437N11229J243317j08592j822004l701254m594243j474972M010131
$$ 1062053 -513384 -2155 1241162 1132570 -689434 -4390688 -8984931 -10459903 -6449772
7929f449772M607166j331202m871279L42304P119487N522213j606451l992166
$$ -6449772 -1842606 -3173808 -8045087 -7702783 -583296 4938917 3332466 -659700
7921f59700k82146J879578k70203j631205P7386P43497j580053l199608k082376
$$ -659700 -941846 937732 667529 -963676 -886290 -142793 -1722846 -4922454 -7004830
7912g004830j217632k143023j707303J689079M233392K443419j528406l348352
$$ -7004830 -8222462 -10365485 -12072788 -10383709 -6150317 -3706898 -5235304 -8583656
7904h583656j916375R52189L255006L508915J596873j6141J003091K543925N80302
$$ -8583656 -10500031 -9547842 -6292836 -2783921 -1187048 -1203189 -200098 2343827 2924129
7895B924129l480970l402014K103966O059172L202975k120824k995951l58667
$$ 2924129 -556841 -3958855 -1854889 4204283 7407258 5286434 2290483 1931816
7887A931816j66929l082976l967718q46481K203024J912974M9829p58978p71040
$$ 1931816 1764887 -1318089 -5285807 -6132288 -3929264 -2016290 -1966461 -2725439 -3496479
$$ [...]
##END NTUPLES=NMR SPECTRUM
##END=
