##TITLE=31Pdec_SR2_OMe-TFA
 CDCl3, 24 sc
 22.10.2019
##JCAMPDX= 6.0         $$ Bruker NMR JCAMP-DX V2.0
##DATA TYPE= NMR SPECTRUM
##DATA CLASS= NTUPLES
##ORIGIN= UXNMR, Bruker Analytische Messtechnik GmbH
##OWNER= root
$$ XWIN-NMR		Version 3.5
$$ Tue Oct 22 13:54:48 2019 Russian Standard Time (UT+4h)  she@DPX200
##.OBSERVE FREQUENCY= 81.013821
##.OBSERVE NUCLEUS= ^31P
##.ACQUISITION MODE= SIMULTANEOUS
##.ACQUISITION SCHEME= undefined
##.AVERAGES= 34
##.DIGITISER RES= 17
##SPECTROMETER/DATA SYSTEM= spect
##.PULSE SEQUENCE= zgpg30
##.SOLVENT NAME= DMSO
##.SHIFT REFERENCE= (INTERNAL, DMSO, 0, 182.463)
##AUDIT TRAIL= $$ (NUMBER, WHEN, WHO, WHERE, WHAT)
$$ ##TITLE= Audit trail, XWIN-NMR		Version 3.5
$$ ##JCAMPDX= 5.01
$$ ##ORIGIN= Bruker BioSpin GmbH
$$ ##OWNER= she
$$ F:/spectra/data/she/nmr/P31/1/pdata/1/auditp.txt
$$ ##AUDIT TRAIL=  $$ (NUMBER, WHEN, WHO, WHERE, WHAT)
(   1,<2019-10-22 13:53:37.48 +0400>,<she>,<DPX200>,
      <created by zg, POWCHK disabled, PULCHK disabled
       terminated by command 'halt'
       configuration hash MD5:
       00 E9 B6 7A A2 85 ED C7 34 08 36 98 17 FE 4E 26
       data hash MD5: 32K
       6D BA 70 AC 00 DE 39 2F C4 17 53 4A FF FB 1D A9>)
(   2,<2019-10-22 13:53:40.45 +0400>,<she>,<DPX200>,
      <Start of raw data processing
       efp BC_mod = 2 LB = 1 FT_mod = 6 PKNL = 1 PHC0 = -777.4106 PHC1 = 203.2006 SI = 64K 
       data hash MD5: 64K
       A8 70 C6 D6 F1 3E DF 4C 15 91 99 F6 7D 32 A9 0D>)
(   3,<2019-10-22 13:54:10.50 +0400>,<she>,<DPX200>,
      <pk PHC0 = -73.21265 PHC1 = 227.6 
       data hash MD5: 64K
       50 83 A1 70 1B 21 92 2E 73 65 9C 12 6E 7F 20 13>)
(   4,<2019-10-22 13:54:24.17 +0400>,<she>,<DPX200>,
      <abs ABSG = 5 
       data hash MD5: 64K
       22 75 11 41 AA 29 3D 71 93 5C 41 B8 3B 84 35 23>)
$$ ##END=
$$ 
$$ hash MD5
$$ B5 F5 15 A8 50 33 8F 08 35 09 0D 55 19 ED 8B AA
##$RELAX= 
##$RELAX= 
##$RELAX= 
##$RELAX= 
##$RELAX= 
##$RELAX= 
##$RELAX= 
##$RELAX= 
$$ Bruker specific parameters
$$ --------------------------
##$DU= <F:/spectra>
##$EXPNO= 1
##$NAME= <P31>
##$PROCNO= 1
##$TYPE= <nmr>
##$USER= <she>
##$AMP= (0..31)
100 100 100 100 100 100 100 100 100 100 100 100 100 100 100 100 100 100 
100 100 100 100 100 100 100 100 100 100 100 100 100 100 
##$AQSEQ= 0
##$AQ_mod= 1
##$AUNM= <au_zg>
##$AUTOPOS= <>
##$BF1= 81.014009
##$BF2= 200.13
##$BF3= 200.13
##$BF4= 200.13
##$BF5= 200.13
##$BF6= 200.13
##$BF7= 200.13
##$BF8= 200.13
##$BYTORDA= 1
##$CFDGTYP= 0
##$CFRGTYP= 5
##$CHEMSTR= <none>
##$CNST= (0..31)
1 1 145 1 1 1 1 1 1 1 1 1 1 1 1 1 1 1 1 1 1 1 1 1 1 1 1 1 1 1 1 1 
##$CPDPRG= <waltz16>
##$CPDPRG1= <>
##$CPDPRG2= <waltz16>
##$CPDPRG3= <>
##$CPDPRG4= <mlev>
##$CPDPRG5= <mlev>
##$CPDPRG6= <mlev>
##$CPDPRG7= <mlev>
##$CPDPRG8= <mlev>
##$CPDPRGB= <>
##$CPDPRGT= <>
##$D= (0..31)
0 1 0 0 0 0 0 0 0 0 0 0.03 2e-05 3e-06 0 0 0 0 0 0 0 0 0 0 0 0 0 0 0 0 
0 0 
##$DATE= 1571738017
##$DBL= (0..7)
120 120 120 11 120 120 24 19 
##$DBP= (0..7)
150 150 150 150 150 150 150 150 
##$DBP07= 0
$$ [...]
##$SUBNAM3= <"">
##$SUBNAM4= <"">
##$SUBNAM5= <"">
##$SUBNAM6= <"">
##$SUBNAM7= <"">
##$SUBNAM8= <"">
##$SUBNAM9= <"">
##$SW= 369.568048894756
##$SWIBOX= (0..15)
0 1 3 0 0 0 0 0 0 0 0 0 0 0 0 0 
##$SW_h= 29940.119760479
##$TD= 32768
##$TD0= 1
##$TE= 0
##$TE2= 300
##$TE3= 300
##$TEG= 300
##$TL= (0..7)
0 120 53 12 22 120 120 120 
##$TP= (0..7)
150 150 150 150 150 150 150 150 
##$TP07= 0
##$TPNAME0= <>
##$TPNAME1= <>
##$TPNAME2= <>
##$TPNAME3= <>
##$TPNAME4= <>
##$TPNAME5= <>
##$TPNAME6= <>
##$TPNAME7= <>
##$TPOAL= (0..7)
0.5 0.5 0.5 0.5 0.5 0.5 0.5 0.5 
##$TPOFFS= (0..7)
0 0 0 0 0 0 0 0 
##$TUNHIN= 0
##$TUNHOUT= 0
##$TUNXOUT= 0
##$USERA1= <user>
##$USERA2= <user>
##$USERA3= <user>
##$USERA4= <user>
##$USERA5= <user>
##$V9= 5
##$VALIST= <valist>
##$VCLIST= <CCCCCCCCCCCCCCC>
##$VD= 0
##$VDLIST= <DDDDDDDDDDDDDDD>
##$VPLIST= <PPPPPPPPPPPPPPP>
##$VTLIST= <TTTTTTTTTTTTTTT>
##$WBST= 1024
##$WBSW= 4
##$XGAIN= (0..3)
0 0 0 0 
##$XL= 0
##$YL= 0
##$YMAX_a= 8510
##$YMIN_a= -6455
##$ZGOPTNS= <>
##$ZL1= 120
##$ZL2= 120
##$ZL3= 120
##$ZL4= 120
##$ABSF1= 182.463
##$ABSF2= -187.1042
##$ABSG= 5
##$ABSL= 3
##$ALPHA= 0
##$AQORDER= 0
##$ASSFAC= 0
##$ASSFACI= 0
##$ASSFACX= 0
##$ASSWID= 0
##$AUNMP= <proc_1d>
##$AZFE= 0.1
##$AZFW= 0.5
##$BCFW= 0
##$BC_mod= 2
##$BYTORDP= 0
##$COROFFS= 0
##$CY= -3
##$DATMOD= 1
##$DC= 0
##$DFILT= <>
##$DTYPP= 0
##$F1P= 0
##$F2P= 0
##$FCOR= 1
##$FTSIZE= 65536
##$FT_mod= 6
##$GAMMA= 0
##$GB= 0
##$INTBC= 1
##$INTSCL= 5.30512e-09
##$ISEN= 30
##$LB= 1
##$LEV0= 0
##$LPBIN= 0
##$MAXI= 10000
##$MC2= 0
##$MEAN= 0
##$ME_mod= 0
##$MI= 50
##$NCOEF= 0
##$NC_proc= -9
##$NLEV= 6
##$NOISF1= 182.463
##$NOISF2= 159.3651
##$NSP= 0
##$NTH_PI= 0
##$NZP= 0
##$OFFSET= 182.463
##$PC= 4
##$PHC0= -850.6232
##$PHC1= 430.8006
##$PH_mod= 1
##$PKNL= yes
##$PPARMOD= 0
##$PSCAL= 0
##$PSIGN= 0
##$REVERSE= no
##$SF= 81.0140089999434
##$SI= 65536
##$SIGF1= 159.3651
##$SIGF2= -187.1042
##$SINO= 113.3802
##$SIOLD= 16384
##$SREGLST= <1H.CDCl3>
##$SSB= 0
##$STSI= 65536
##$STSR= 0
##$SW_p= 29940.119760479
##$SYMM= 0
##$S_DEV= 0
##$TDeff= 32768
##$TDoff= 0
##$TI= <>
##$TILT= no
##$TM1= 0
##$TM2= 0
##$TOPLEV= 0
##$USERP1= <user>
##$USERP2= <user>
##$USERP3= <user>
##$USERP4= <user>
##$USERP5= <user>
##$WDW= 1
##$XDIM= 65536
##$YMAX_p= 413280531
##$YMIN_p= -167018150
$$ End of Bruker specific parameters
$$ ---------------------------------
##NTUPLES= NMR SPECTRUM
##VAR_NAME=  FREQUENCY,     SPECTRUM/REAL,   SPECTRUM/IMAG
##SYMBOL=    X,             R,               I
##VAR_TYPE=  INDEPENDENT,   DEPENDENT,       DEPENDENT
##VAR_FORM=  AFFN,          ASDF,            ASDF
##VAR_DIM=   65536,         65536,           65536
##UNITS=     HZ,            ARBITRARY UNITS, ARBITRARY UNITS
##FACTOR=    0.456856943014862, 1,           1
##FIRST=     14782.0589164792, 0,            0
##LAST=      -15158.0608439998, 0,           0
##MIN=       -15158.0608439998, -167018150,  0
##MAX=       14782.0589164792, 413280531,    0
$$ Real data points
##PAGE= N=1
##DATA TABLE= (X++(R..R)), XYDATA
$$ [...]
45825A6806584j0561486q124421J57640J0547636J2895950K548506r349107r592082
45817E329220j496924K845411K944763P428304J5011802J4490467L572359p078856
45809D3046546r685691o321274j60227O555723O292617o387066k0519000j9062329
45801f240701n597952j104064r405880q788882J0903257K6221290J4226348j0396441
45793I816975j6960023m569607J562529o756346j0994676r18831R107360P511562
45785a2201057M402055R399110J1403223j407163j6857733j4867373J178614J0216970
45777h733354N903884K107482O256519Q188459R92222n582716k537040K197983
45769H793439k219787r873083o999936N295594J1735719M527886q260658j6118299
$$ plain form
45825 16806584 6245098 -1879323 -1721683 8825953 21721903 24270409 14921302 5329220
45817 5329220 3832296 6677707 9622470 17050774 32062576 46553043 50125402 43046546
45809 43046546 33360855 27039581 26879354 33435077 39727694 33340628 12821628 -6240701
45801 -6240701 -11838653 -12942717 -22348597 -31137479 -20234222 5987068 20213416 9816975
45793 9816975 -7143048 -11712655 -10150126 -16906472 -27901148 -28819979 -19712619 -12201057
45785 -12201057 -7799002 1600108 13003331 11596168 -5261565 -20128938 -18950324 -8733354
45777 -8733354 -2829470 -721988 5534531 13722990 14715212 9132496 6595456 8793439
45769 8793439 6573652 -3299431 -10299367 -5003773 6731946 11259832 2999174 -13119125
45761a3119125j6499595j0561433K77279J0054797J0483875K483453k521178K076720
45753a7325207Q775115P502610m62795o473583o480125k393665L260611P324311
45745f272728N554001r53274l775454J294009O197453K427210m870712n042986
45737e442481O93337K489280n01784L45234O209691P549011L08536p166666p081191
45728b597033j016526P020515J4546284J4694888L60428k0147959k5925340j0398867
45720b3463610P847417J1091543N730442O403350R813919K720802j1704086j5783904
45712g344127m329721Q037387Q744279J703300l714732n434920n280700k847928
45704a0467162J455256M042648L248088J867648K233874L485429M816987O317703
$$ plain form
45761 -13119125 -29618720 -40180153 -39902874 -29848077 -19364202 -16880749 -19401927 -17325207
45753 -17325207 -8550092 -1047482 -1510277 -7983860 -14463985 -16857650 -13597039 -6272728
45745 -6272728 -718727 -1672001 -5447455 -4153446 2044007 4471217 -399495 -5442481
45737 -5442481 -4749144 -2259864 -2761648 -2416414 3793277 11342288 11650824 4484158 -2597033
45728 -2597033 -3613559 3406956 17953240 32648128 33008556 12860597 -13064743 -23463610
45720 -23463610 -15616193 -4524650 1205792 7609142 17423061 20143863 8439777 -7344127
45712 -7344127 -11673848 -3636461 5107818 6811118 3096386 -2338534 -7619234 -10467162
45704 -10467162 -9011906 -4969258 -1721170 146478 2380352 5865781 10682768 17000471
45696A7000471O031115J565605n031531r187897j0173382j0202392q601060l370473
45688b1969544K836626N450271N268093N527082M030057k526582q554465n329032
45680a5267494L955089P474853L796034L681636J0179564J2016245K951975o846232
45672B1941670p868185o640596j2314851j8392755j1726604O279801K0264883
45665h456637J9807121Q094813n186175j1436231p478692l1058j158305j1671731
45657a7516895j5611173j225316J9170001K3348021R099740m350679l796531L486099
45649A2603267M892811p07742o095462o212847q45705O525494R678522N331717
45641B5170055j157929k261879J09490j933692p682258p970771j804705m62503
$$ plain form
45696 17000471 23031586 24597191 19565660 10377763 204381 -9998011 -18599071 -21969544
45688 -21969544 -19132918 -13682647 -8414554 -2887472 1142585 -1383997 -9938462 -15267494
45680 -15267494 -11312405 -3837552 -41518 3640118 13819682 25835927 28787902 21941670
45672 21941670 14073485 7432889 -4881962 -23274717 -35001321 -28721520 -8456637
45665 -8456637 11350484 19445297 14259122 2822891 -4655801 -4686859 -5845164 -17516895
45657 -17516895 -33128068 -34353384 -15183383 8164638 17264378 12913699 9117168 12603267
45649 12603267 17496078 16788336 10692874 4480027 3634322 10159816 19838338 25170055
45641 25170055 24012126 21750247 21859737 19926045 12243787 4273016 2468311 2005808
45633B005808r718758j9252422j7397151p101318J573587P060134J4251107K2027020
45625f551993K3199186J5158503K882989p396284j1974174r861054m885141m328518
45617c756486r446820j1192505k409162R811516J2823025O394636J538610K595727
45609F358541K278567l428670p023190j773017O670525Q333412K839710k030687
45601A2225191k250754j225286k822119o015207o848017l270751J777798J981075
45593f448070m910587j1207191o187425Q996081J9257833J2601276n761209k0581655
45585a4240947k2341776j0981643Q623853K6259881K8069445J0937641q170940
45578A8155514j0539982j752960l834714j9940984k5733951n103450K2357778
$$ plain form
45633 2005808 -7712950 -26965372 -44362523 -51463841 -49890254 -42830120 -28579013 -6551993
45625 -6551993 16647193 31805696 34688685 27292401 15318227 5457173 572032 -3756486
45617 -3756486 -13203306 -24395811 -26804973 -16993457 -4170432 2224204 3762814 6358541
45609 6358541 8637108 5208438 -1814752 -3587769 3082756 11416168 14255878 12225191
45601 12225191 9974437 8749151 5927032 -88175 -6936192 -10206943 -8429145 -6448070
45593 -6448070 -11358657 -22565848 -28753273 -19757192 -499359 12101917 6340708 -14240947
45585 -14240947 -36582723 -47564366 -38940513 -12680632 15388813 26326454 18155514
45578 18155514 7615532 5862572 2027858 -17913126 -43647077 -48750527 -26392749
45571b6392749K5721188M504825j2182340m943295J4525277K3075772J3009538
45564C7318216n554369j8722317j8811697o802816Q853379J7976837J6211706
45557C0468939O561229m884055j1980535j0644308l457234M63772l677016q835095
45549e984303o716039j324355j347281l226033L140371J2619489P100246j5090642
45541a0828547k9663598j7228520J0046229K5733101K2328974J2482281N179662
45534A8049582k142517j0027255j1457450l177424P462616J0562068L441269q028536
45526D682353j3981612q696035J732538M046374n064404j2678808p075705N987605
45518c1047694J3511375J3737956J2039976N889167r211435k2504367j5968265
$$ plain form
45571 -26392749 -671561 3833264 -8349076 -13292371 1232906 24308678 37318216
45564 37318216 31763847 13041530 -5770167 -12572983 -3719604 14257233 30468939
45557 30468939 37030168 32146113 20165578 9521270 6064036 6527808 2850792 -5984303
45549 -5984303 -12700342 -14024697 -15371978 -18598011 -15457640 -2838151 4262095 -10828547
45541 -10828547 -40492145 -57720665 -47674436 -21941335 387639 12869920 18049582
45534 18049582 15907065 5879810 -5577640 -8755064 -1292448 9269620 12710889 4682353
45526 4682353 -9299259 -17995294 -16262756 -12216382 -17280786 -29959594 -37035299 -31047694
45518 -31047694 -17536319 -3798363 8241613 14130780 4919345 -17585022 -33553287
45511c3553287Q545140K7673025K6640683J4941920N940868k368359j5354156
45504C2465834k4609489j8301792j678619P338036J470122p993610p408355K782472
45496a5935401J0108210M929128q511876j5845523q228690P109231J5213769J0672015
45488d89137J452694k893156O3384P757179J5081712J4616062L546523q709345
45480C0425916r402595r7400N278274J271745l252779l006166m504476r796956
45472F915563q156923M849328J4350596O471959r782260j6219677j1223228n266193
45464a8060835N14115J1489315K0350227J2476711q672305k1294704j4930664
45457a8128140l508008k294455o963862n049746L212492O880026J406202n896049
$$ plain form
45511 -33553287 -25008147 2664878 29305561 44247481 50188349 47819990 32465834
45504 32465834 7856345 -10445447 -12124066 -4786030 -3315908 -11309518 -18717873 -15935401
45496 -15935401 -5827191 -898063 -9409939 -25255462 -33484152 -26374921 -11161152 -489137
45488 -489137 963557 -1929599 -1866215 5890964 20972676 35588738 39135261 30425916
45480 30425916 21023321 20925921 26204195 27475940 24223161 21216995 16712519 6915563
45472 6915563 -1241360 3607968 17958564 24430523 14648263 -1571414 -12794642 -18060835
45464 -18060835 -17546720 -6057405 14292822 26769533 18097228 -3197476 -18128140
45457 -18128140 -21636148 -23930603 -30894465 -35944211 -32731719 -25851693 -24445491 -30341540
45449c0341540o251551K48533N288827K241745m801895m995365M173734J1716379
45441b2721133Q762017K140974K534208N932975J210885q114972p401000L861443
45433a3794603R161899J612431m996976K58315Q053495O175955p33411k187024
45425C550081M1897m96787n5016O469877J0622668J955248j1605347j3234257
45417b751636l397281J993359k149451n162101k735510l320389p949612m506563
45409b9979184Q957446J4893779L395128q816655l463910R902266J0206055m84294
45401D610631l012994L632597M04290j6122666k2839486n175871J9047427K5482063
45393F025991J5556884O393800K859720j297679n081175l556979k692833j0263018
$$ plain form
45449 -30341540 -36593091 -36344558 -31055731 -28813986 -33615881 -38611246 -34437512 -22721133
45441 -22721133 -13959116 -11818142 -9283934 -3350959 -2140074 -10255046 -17656046 -13794603
45433 -13794603 -4632704 -3020273 -8017249 -7758934 294561 6470516 5737105 3550081
45425 3550081 3591978 3095191 3040175 9510052 20132720 22087968 10482621 -2751636
45417 -2751636 -6148917 -4155558 -6305009 -11467110 -14202620 -17523009 -25472621 -29979184
45409 -29979184 -21021738 -6127959 -2732831 -11549486 -15013396 -5111130 5094925 4610631
45401 4610631 1597637 5230234 5634524 -10488142 -33327628 -38503499 -19456072 6025991
45393 6025991 21582875 27976675 30836395 29538716 24457541 20900562 18207729 7944711
45385G944711j6636949o518872J2403611J6380246K606374n953147J318714O119712
45377A7664400n087753j6170104r084316M484446K975144q917842j0093226P37206
45369b3492045N708908M04328p45209P329323J0893154J329568j1478714j5965475
45361b6016162j2572505n429163M157500J1211928R266998L319261N218738J2662962
45353A819557J0624401j431826m493591Q520211J7202665M183316j6791221k1195957
45345a562445q137878M603742R063236J0659269J0702745N406887j117433q69206
45337B8748917K719339n38378r144777j1956666p796713o687773j0450126q558615
45329b3664792K620001J1518290Q849482R66239k028778j393217l989407q713507
$$ plain form
45385 7944711 -8692238 -15211110 -2807499 13572747 16179121 10225974 11544688 17664400
45377 17664400 12576647 -3593457 -12677773 -8193327 -5218183 -14136025 -24229251 -23492045
45369 -23492045 -17783137 -17378809 -18124018 -10794695 98459 1428027 -10050687 -26016162
45361 -26016162 -38588667 -44017830 -39860330 -28648402 -19381404 -16062143 -10843405 1819557
45353 1819557 12443958 11012132 6518541 15038752 32241417 36424733 19633512 -1562445
45345 -1562445 -9700323 -5096581 3966655 14625924 25328669 30735556 29618123 28748917
45337 28748917 31468256 30929878 21785101 9828435 2031722 -4656051 -15106177 -23664792
45329 -23664792 -21044791 -9526501 -677019 289220 -1739558 -3132775 -7122182 -15835689
45321a5835689q605421l397065j040882n826373j0899309o062251Q855919K2142637
45313b0668434K2921943J2490986j90091j0276343j7442624j8075042q671835
45306c9911440L018633M366496j393760K944408J9053235K4544520P311299j0956475
45298H976916o419300Q325251M982930j2503470j4473846K991288R773756p950328
45290f296803k4084568j5309660K966302N671244j734474O90515R404222O242823
45282b2450399m888152j841175J6738316K5358835J0420201r124632j0222348
45275C990646L413511J1513631N954623l667643o433344j262287N515351O493424
45267B5517912j359331j3170269j9678853j6606887q060096J90687N991960P794591
$$ plain form
45321 -15835689 -24441110 -27838175 -28879057 -34705430 -45604739 -51666990 -42811071 -20668434
45313 -20668434 2253509 14744495 14554404 4278061 -13164563 -31239605 -39911440
45306 -39911440 -36892807 -32526311 -33920071 -30975663 -11922428 12622092 19933391 8976916
45298 8976916 2557616 10882867 15865797 3362327 -11111519 -8120231 1653525 -6296803
45290 -6296803 -30381371 -45691031 -42724729 -37053485 -38787959 -38097444 -28693222 -22450399
45282 -22450399 -27338551 -29179726 -12441410 12917425 23337626 14212994 3990646
45275 3990646 7404157 18917788 24872411 21204768 14771424 13509137 19024488 25517912
45267 25517912 24158581 10988312 -8690541 -25297428 -33357524 -33166837 -27174877 -19380286
45259a9380286L072712n633566q964589j950766O895392N926775k124528k965107
45251b5123963P365510J4375521N809461q548561r578055L247683J1498703O245567
45243E291866L93301M844383Q091133m578793k1807601j7671910Q602655K6100251
45235I265285J2801615j4763291k5058825j2586214M46946j950757j0323124o970607
45227d9138972R193866K2160804J9228131N649827k663708J795113J0911421J3639902
45219C0776384R602772M508427j889003j2834925k2674524k1008868r393143n64675
45211b3477555J334993N082728J2521281J1507967j931479j1359496m284540N806003
45203d800098R0805j4192175j4527504J225044J2678129Q721769n38180n435644
$$ plain form
45259 -19380286 -16307574 -21941140 -30905729 -32856495 -25961103 -20034328 -22158856 -25123963
45251 -25123963 -17758453 -3382932 2426529 -6122032 -15700087 -12452404 -953701 5291866
45243 5291866 5685167 10529550 18620683 14041890 -7765711 -25437621 -16834966 9265285
45235 9265285 22066900 7303609 -17755216 -30341430 -29894484 -31845241 -42168365 -49138972
45227 -49138972 -39945106 -17784302 1443829 7093656 4429948 6225061 17136482 30776384
45219 30776384 40379156 44887583 42998580 30163655 7489131 -13519737 -22912880 -23477555
45211 -23477555 -22142562 -17059834 -4538553 6969414 5037935 -6321561 -10606101 -4800098
45203 -4800098 -4709293 -18901468 -33428972 -32203928 -19525799 -10804030 -11342210 -16777854
45195a6777854q958485j1910364o074524Q200056J4586748L480702j0415163o567631
45187c4436515J3403114K8496919K4328163O104735j1501559j8719227j5405607
45180g729977p443469k36287M476545N213156j290812j2910096j7675174o979417
45172d4575531R320493J3727525N822293R37784L795998K510200o271393p366810
45164b2099441O717556J9220806J4649890M047514N524461J3281404Q380804q635419
45156D1087575j9051935j5269786p106344j427272L619845N396476j231893q537628
45148b520962l390989Q862227R533470k250117o967813J817898O557345k197394
45140I443665p832281L329254J7183282J4457599P0394r560743j2723580j5217410
$$ plain form
45195 -16777854 -25736339 -37646703 -43721227 -35521171 -20934423 -17453721 -27868884 -34436515
45187 -34436515 -21033401 7463518 31791681 37896416 26394857 7675630 -7729977
45180 -7729977 -15173446 -15409733 -10933188 -5720032 -7010844 -19920940 -37596114 -44575531
45172 -44575531 -35255038 -21527513 -15705220 -14767436 -10971438 -8461238 -14732631 -22099441
45164 -22099441 -15381885 3838921 18488811 22536325 28060786 41342190 49722994 41087575
45156 41087575 22035640 6765854 -340490 -1767762 1852083 7248559 6016666 -2520962
45148 -2520962 -5911951 2950276 12483746 10233629 3265816 5083714 11641059 9443665
45140 9443665 1611384 4940638 22123920 36581519 36651913 27091170 14367590 -849820
45132h49820j1158558N666732K1654170J8669993K737758n507214l232067m271983
45124B3709011r759142o416557N020026N846921j0271795k5503613k3942219j0242032
45116e1559400M582632J7007353K3385220J7481733M311306j401391J137254m211916
45108A0732791k0591937k6902511j0585703R205454R756536j864346m826727J331589
45100c3744854K498229j438916O66088O625693M339291l129621k92708J2545186
45092a1931612J6904868N674747n675367l638265N083080P368999J693978n177043
45084A0303385q993556r518636q672454r612402j1149848n227259J0861484K4126419
45076g882867K0561048N952699l074203m270539p476323j0938399l245041J0474461
$$ plain form
45132 -849820 -12008378 -6341646 15312524 33982517 36720275 31213061 27980994 23709011
45124 23709011 13949869 7533312 12553338 18400259 8128464 -17375149 -41317368 -51559400
45116 -51559400 -46976768 -29969415 -6584195 10897538 15208844 13807453 14944707 10732791
45108 10732791 -9859146 -36761657 -47347360 -38141906 -28385370 -30249716 -35076443 -33744854
45100 -33744854 -31246625 -32685541 -32019453 -25393760 -21054469 -24184090 -24476798 -11931612
45092 -11931612 4973256 10648003 4972636 1334371 6417451 13786450 15480428 10303385
45084 10303385 1309829 -8208807 -16881261 -26493663 -37643511 -42870770 -32009286 -7882867
45076 -7882867 12678181 18630880 15556677 11286138 3809815 -7128584 -10373625 100836
45068A00836R836858p219414j6808623n156576J0456087R755556j856686p437563
45060h329525l692811L034472J0395553J5200419R722058l344486p230888L991272
45052A9746064J2932747N592417p115594j0680050j0526365j4476468j1518683
45045a6045932O998873K2439975J3991467m999483o605242O533201Q740114l226570
45037B7826403p769437K99462K068354q069358j1648928j225203N412646j967451
45029D926488p555467J598647J2985266J1107606K035952m30307L532201N718665
45021C3919051L145823n021962j8704613k7128844j5826776Q230362J8752232
45014b634727P228317m212471Q84215Q423894K082261p378912l249757O858893
$$ plain form
45068 100836 9937694 2718280 -14090343 -19246919 -8790832 964724 -891962 -8329525
45060 -8329525 -12022336 -8987864 1407689 16608108 26330166 22985680 15754792 19746064
45052 19746064 32678811 38271228 31155634 20475584 9949219 -4527249 -16045932
45045 -16045932 -9047059 13392916 27384383 22384900 15779658 22312859 31052973 27826403
45037 27826403 20056966 20356428 22424782 14355424 2706496 1481293 6893939 4926488
45029 4926488 -2628979 -1030332 11954934 23062540 25098492 24668185 28200386 33919051
45021 33919051 37064874 32042912 13338299 -13790545 -29617321 -21386959 -2634727
45014 -2634727 4593590 381119 1265334 9689228 11771489 4392577 1142820 8001713
45006H001713O554479J10060J028086M952179J04695o672356j350547Q588609
44998B1316918M570149r675801j2869936j896671M245701k869910r437779m088648
44990a0705977P067713J3867172J2655584K367763j2344225j5941639l76981J4220271
44982A0809681K188366k5201632k9526258k024599K1353317J3638521n640949
44975a4403553o325693O083521O576219n955401j0893715j790873P087251O980146
44967a2642098M591261N513139O119596L740075O23494l075471q193459r452316
44959a2775779j796904P623803P014622j373250m011592K378140P143566N564430
44951I767036O130799J2285609J2781094L54149j3005644j2449984k552830J157927
$$ plain form
45006 8001713 14556192 14666252 15694338 20646517 20751212 14078856 12728309 21316918
44998 21316918 25887067 16211266 3341330 1444659 5690360 2820450 -6617329 -10705977
44990 -10705977 -3638264 10228908 22884492 25252255 12908030 -3033609 -3410590 10809681
44982 10809681 12998047 -12203585 -41729843 -43754442 -22401125 -8762604 -14403553
44975 -14403553 -20729246 -14645725 -8069506 -14024907 -24918622 -26709495 -19622244 -12642098
44967 -12642098 -8050837 -2537698 3581898 7321973 7945467 4869996 -3323463 -12775779
44959 -12775779 -14572683 -6948880 65742 -1307508 -5319100 -2940960 4202606 9767036
44951 9767036 15897835 28183444 40964538 41318687 28313043 15863059 13310229 14468156
44943A4468156l359218m562642Q41227K913286k223720m311628K553107P290468
44935A3609036r03463j3043270j2371032K34491Q426115N668052J977349L719750
44927G317028L383063l897673q584410k179430P171462P195642J042505N34727
44919A1982914N849496O674057P01781l685685k925185k681101n246086n448913
44911E221278k111087j601233n896563q240571n525299m189399p671470q279807
44903c8294151L39334J0913643J1809523L088821m783096m293075L567677J2990465
44895d660859J6589902R324742m617244j2801711q245710J876632O510145M294536
44887H270433L24874m401582j0839262j3721505o798224N239692J0823572P631638
$$ plain form
44943 14468156 11108938 6546296 7387523 10300809 8077089 3765461 6318568 13609036
44935 13609036 12705573 -337697 -12708729 -12474238 -4048123 1619929 3597278 7317028
44927 7317028 10700091 6802418 -1781992 -3961422 3210040 10405682 11448187 11982914
44919 11982914 17832410 24506467 25208248 21522563 18597378 15916277 10670191 5221278
44911 5221278 3110191 1508958 -4387605 -12628176 -18153475 -22342874 -30014344 -38294151
44903 -38294151 -37954817 -27041174 -15231651 -12142830 -16925926 -21219001 -17651324 -4660859
44895 -4660859 11929043 21253785 16636541 3834830 -4410880 -2534248 3975897 8270433
44887 8270433 8595307 4193725 -6645537 -20367042 -27165266 -21925574 -11102002 -3470364
44879c470364M391431N573865N300099n0959l918987o63917M164327K861809j730362
44870A2456942j980726P23934j072295n841772l269912P604581J1941758j264951
44862A9297559k0553861k3522604m903916J6375587J9511402L898593j3673999
44855c571239j7976285p741229O712190J3866263J0432734K912156n17222J171156
44847E288524L512217M463191M479172M18849j0715920k0487686j3818789Q232578
44839a8627864K2171855J0124737j4061847k0908983l226417J6915022J8656207
44832A1042710N491042n293481m452610L607083R235440O327772k978172j0124844
44824A2854940r778258o060365m396040j796917N723802J0849975L625437r468301
$$ plain form
44879 -3470364 921067 6494932 11795031 11744072 7825085 7161168 11325495 14187304 12456942
44870 12456942 10476216 11200150 10127855 4286083 1016171 8620752 20562510 19297559
44862 19297559 -1256302 -24778906 -29682822 -13307235 6204167 10102760 -3571239
44855 -3571239 -21547524 -29288753 -22576563 -8710300 1722434 4634590 4117368 5288524
44847 5288524 8800741 13263932 17743104 18161953 7446033 -13041653 -26860442 -18627864
44839 -18627864 3543991 13668728 -393119 -21302102 -24528519 -7613497 11042710
44832 11042710 16533752 11240271 6787661 10394744 19630184 25957956 22979784 12854940
44824 12854940 3076682 -2983683 -7379723 -9176640 -3452838 7397137 11022574 1554273
44816A554273j0958672J512248J1063551P971812K894060N502258P012478k694445
44808B3857563j4327528j2254131L85946O823432K574759m27948M425842P487360
44800A8545295j507747j6591930k1404969r314309O718886P007315j1029960k6205398
44792e3782817j7736326O997419K0951566J3872136M025674P525346J3849074
44785d297928N758603j0674321j4857149k611858J0733271J4695101J3139988
44778A1885707J0049296K815841p358296j2242907q106401p20122L352621J997025
44770A672764n364589j5533680j7180075j437324K1580092K9628499J5400528
44763B8766215m709631j3033162j0175569o144770l224332K565628R812688J1835836
$$ plain form
44816 1554273 -9404399 -7892151 3171400 11143212 14037272 19539530 26552008 23857563
44808 23857563 9530035 -2724096 -2338150 4485282 7060041 6632093 11057935 18545295
44800 18545295 17037548 445618 -20959351 -30273660 -23554774 -16547459 -27577419 -53782817
44792 -53782817 -71519143 -64521724 -43570158 -29698022 -25672348 -18147002 -4297928
44785 -4297928 1460675 -9213646 -24070795 -26682653 -15949382 -1254281 11885707
44778 11885707 21935003 24750844 17392548 5149641 -2956760 -3676882 -324261 1672764
44770 1672764 -3691825 -19225505 -36405580 -37842904 -16262812 13365687 28766215
44763 28766215 24056584 11023422 847853 -5296917 -8521249 -5955621 3857067 15692903
44755A5692903O652195k05534k909383j481270l68176k542596n615820m794653
44747D427666P3977L645593L135232K538266M951306O091233J369856n847283
44739B0385846j0182132j2827394j5567493j2531029M26562J3163055J2032970
44732e099615M20996o144439l594022j677112k796096K653412J5244718J9335726
44724A8343568O213156j0464039j3284193l725789M315114M172818m09621l968665
44716A192349k430182N535108J3387013J0879002o56722p138673k543825J286234
44708A9510304m965634j1114076m494087P587657R391564K350691K92839M146337
44700B2705595J735417q018807j1311910l769530O63459o531804j2391882k684754
$$ plain form
44755 15692903 22345098 22139564 19230181 17748911 17380735 14838139 9222319 4427666
44747 4427666 4501643 8147236 11282468 13820734 18772040 24863273 26233129 20385846
44739 20385846 10203714 -2623680 -18191173 -30722202 -30295640 -17132585 -5099615
44732 -5099615 -4678619 -10823058 -14417080 -16094192 -18890288 -16236876 -992158 18343568
44724 18343568 24556724 14092685 808492 -2917297 1397817 5570635 5161014 1192349
44716 1192349 -1237833 4297275 17684288 28563290 27906568 20767895 18224070 19510304
44708 19510304 14544670 3430594 -1063493 6524164 15915728 18266419 18559258 22705595
44700 22705595 24441012 16422205 5110295 1340765 2004224 -4527580 -16919462 -19604216
44692a9604216J3844399J6663627K779420j0376994j0387007l917701j447339
44685a2445811k21514P958654J8892619J8687916M526629q890815r002188k404776
44677A7100714l401648j1700787j3360232k509802R921893J1949307N214363o09333
44669A2604475n70569L204058O056908L616265m843895j3037133j3287677p379739
44661a3637307m449396o109620l559422O283653J3077157R120701K422516L112808
44653F261090O120011J038572p251777m129029J0114613J7369823P121186q651289
44645B7993200j2996217o596651l532266r616601j4987502q744556O475877J8374184
44637c630532J9339526J1802512J274843q739705j3745484q938920J560895M350797
$$ plain form
44692 -19604216 -5759817 10903810 13683230 3306236 -7080771 -10998472 -12445811
44685 -12445811 -12667325 -4708671 14183948 32871864 37398493 28507678 19505490 17100714
44677 17100714 13699066 1998279 -11361953 -13871755 -3949862 7999445 13213808 12604475
44669 12604475 12033906 15237964 21294872 24911137 20067242 7030109 -6257568 -13637307
44661 -13637307 -18086703 -24196323 -27755745 -21472092 -8394935 725766 3148282 6261090
44653 6261090 12381101 13419673 6167896 2038867 12153480 29523303 36644489 27993200
44645 27993200 14996983 8400332 4868066 -4748535 -19736037 -28480593 -22004716 -3630532
44637 -3630532 15708994 27511506 28786349 20046644 6301160 -2637760 -1076865 3273932
44629C273932n421091j3135515l840980J3737213J8208770O959348k466724k045178
44621A5269775k265442p161206m437183Q805641J3681415q56037j6294201j2524591
44613e781829j36535j311934j2364163j2182215L26472N180453m600125j3743303
44605d4613179j1314640l784905K120091R085017J6309129J4825746K541507r656765
44597b4487999j1989340n218561N430192J4422339J4725301N263518k124802L042682
44589i36670J1952034Q895652k759950o910267l537929p259931j7298555j5434966
44581c3290582J619476J4132180J1138883M646605K849558l953178j7631113j9409963
44573c9898134j026943J5214614Q870095o546662o711906N866544J1813688Q325643
$$ plain form
44629 3273932 -2147159 -15282674 -19123654 -5386441 12822329 19781677 17314953 15269775
44621 15269775 13004333 5843127 1405944 10211585 23893000 23036963 6742762 -5781829
44613 -5781829 -5918364 -7230298 -19594461 -31776676 -31450204 -26269751 -30869876 -44613179
44605 -44613179 -55927819 -59712724 -57592633 -48507616 -32198487 -17372741 -14831234 -24487999
44597 -24487999 -36477339 -41695900 -36265708 -21843369 -7118068 -1854550 -3979352 -936670
44589 -936670 11015364 19911016 17151066 10240799 6702870 -557061 -17855616 -33290582
44581 -33290582 -31671106 -17538926 -6400043 -1753438 1096120 -2857058 -20488171 -39898134
44573 -39898134 -40925077 -25710463 -16840368 -23387030 -30098936 -24232392 -12418704 -4093061
44565d093061P233460R469570N705283l758778j0646180j4295702j6999542j1657072
44557c9042022O016422K0610843J3905315o615680j6804099r035578L302920R465056
44549a8196823R074158J236279j2258816j6794837p21940K1314564K3896429P626987
44541A5176001l765382j468459M68633l402678j87697J2560669J6830883M644229
44533D0856199o787930m142851J037532l854796r204997k178564Q951340R345642
44525C4021575K440349P44607K991579n00701q014038r699742m758794l80514
44517A6844321R57368N60481l003955p440372k826405J2072237J9317969M098736
44509D0580380k0553636k9005180j6578872K9507R617365J3579456J0733524j991265
$$ plain form
44565 -4093061 3140399 12609969 18315252 14556474 3910294 -10385408 -27384950 -39042022
44557 -39042022 -33025600 -12414757 1490558 -5125122 -21929221 -30964799 -27661879 -18196823
44549 -18196823 -9122665 -7886386 -20145202 -36940039 -37661979 -16347415 7549014 15176001
44541 15176001 11410619 9942160 10410793 7008115 6820418 19381087 36211970 40856199
44533 40856199 34068269 29925418 30962950 27108154 17903157 15724593 24675933 34021575
44525 34021575 36461924 37206531 40198110 39697409 31683371 21983629 17224835 16844321
44517 16844321 17801689 18362170 15358215 7917843 5091438 17163675 36481644 40580380
44509 40580380 20026744 -8978436 -25557308 -25527801 -15910436 -2330980 8402544 6411279
44501F411279j3928514q878138P535754J1075159m169058j4505527l167765J3144045
44493f482765J0879936l944300p034159N971501J4772042O373389p597037j0254238
44485B684369k195792L115562q80949p105409o619197j351896j122685q011508
44477b1487505r686532M092414K1260141J7451326r269486k8832912j7111853
44470d3584407Q867214J3601735n316952j4013372N509096K7003199J9869469
44463A1935982l829050p868543J2961140K5377278P142840k2167229l0917673
44456g365255j6196040P56113O640931N802278M393117K174322l48233K0069K254559
44447a868139J890199m55151R5211L248120L925648K456986M748074J0645107
$$ plain form
44501 6411279 -7517235 -16395373 -8859619 2215540 -1953518 -16459045 -19626810 -6482765
44493 -6482765 4397171 452871 -6581288 -609787 14162255 20535644 12938607 2684369
44485 2684369 488577 3604139 2723190 -4382219 -11001416 -12353312 -13475997 -21487505
44477 -21487505 -31174037 -27081623 -5821482 11629844 2360358 -26472554 -43584407
44470 -43584407 -34717193 -21115458 -26432410 -40445782 -34936686 -7933487 11935982
44463 11935982 8106932 238389 13199529 38576807 45719647 23552418 -7365255
44456 -7365255 -23561295 -22805182 -16164251 -10361973 -5968856 -3794534 -4142767 -4122698 -1868139
44447 -1868139 22060 -433091 -337880 2910240 6835888 9292874 14040948 24686055
44439B4686055J1759057M012335o239328j2001640j3292888j1478255m860390
44432g415054M860647R857408O279115L75016j594215k653680p142132j0205533
44424g638428m813898M850571P236429k20334p335895m959887M114533J0297924
44416A531015Q971863M313003K610402L719502J246967p477016j5056953j2875819
44408a3017036l815105J704499J170262J331051L877473K557367k375992j460800
44400a0028281N780889N651782o339267j3018431j729207J1893849O640000r439609
44392a0588275j1401763K287429R098632R82232m617434K692699R660647N653160
44384C767327J150108N616436Q238017j355743j0698359l428460J2147516J4903072
$$ plain form
44439 24686055 36445112 40457447 34218119 22216479 8923591 -2554664 -7415054
44432 -7415054 -2554407 7303001 13582116 13957132 12362917 9709237 2567105 -7638428
44424 -7638428 -12452326 -7601755 -365326 -585660 -7921555 -12881442 -8766909 1531015
44416 1531015 10502878 14815881 17426283 21145785 22392752 14915736 -141217 -13017036
44408 -13017036 -16832141 -15127642 -13957380 -12626329 -8748856 -6191489 -8567481 -10028281
44400 -10028281 -4247392 1404390 -4934877 -17953308 -19682515 -7788666 -1148666 -10588275
44392 -10588275 -21990038 -19702609 -10603977 -9621745 -14239179 -11546480 -1885833 3767327
44384 3767327 4917435 10533871 18771888 17416145 6717786 3289326 15436842 30339914
44376C0339914K935835p279484q601663r005777j1157802o971677M020089Q700133
44368B979568l00213j2583960j4873086p917368j051855K334410N635699R625461
44360a6151344R918808L760310m736098p535392p92700J0012631J4754827R805037
44352A9036079K037201m79021J680931K640757R41921P7944J075032R09088j359737
44343B6560195k250881P02140M784249N319559J268046m009946p362613r836986
44335A5173763j3768630j5945271r301919M438946J0789025O54143j3006088j0361200
44327c1327231O618934J7871615J6723811J5743068J7480866O211104j8717024
44320C0605143k8870042p970081J6549315J1601778j1021847j5676521j60438
$$ plain form
44376 30339914 33275749 25996265 17394602 8388825 -2768977 -9740654 -5720565 2979568
44368 2979568 2679355 -9904605 -24777691 -32695059 -33746914 -31412504 -25776805 -16151344
44360 -16151344 -6232536 -2472226 -7208324 -14743716 -15536416 -5523785 9231042 19036079
44352 19036079 21073280 20594259 22275190 24915947 25857868 25935812 27010844 27919932 26560195
44343 26560195 24309314 25011454 29795703 35115262 36383308 32373362 25010749 15173763
44335 15173763 1405133 -14540138 -23842057 -19403111 -8614086 -7959943 -20966031 -31327231
44327 -31327231 -24708297 -6836682 9887129 25630197 43111063 49322167 30605143
44320 30605143 1735101 -6234980 10314335 21916113 10894266 -4782255 -4942693
44313d942693O881023j146014r05566J3539986J7576973R33435j2883759p994448
44305A1058937j403931o945761p836193R166454K2300814Q474487j5230390j6839977
44297B744440J271991J1532403O328820Q84472K16037l770263p082812K791257
44289A4916345J9312528K1652159P225521o824072j3607059k0424264k3530028
44282a278870r990643J1463251J3319119p680757k0333437n389376J5096885J2477013
44274G683185p364659j8051351j0888552J343788P306579O212912J791965Q2138
44266a1883995N866259J2916168Q562658m939875q910347K405233R232005k687334
44258A0560772j6932283j2024214L656733O835619j935641j800743J0819055J5781627
$$ plain form
44313 -4942693 1938330 792316 -113250 13426736 31003709 31937144 19053385 11058937
44305 11058937 9655006 2709245 -5126948 4039506 26340320 34814807 19584417 2744440
44297 2744440 4016431 15548834 21877654 22762126 22978163 19207900 12125088 14916345
44289 14916345 34228873 55881032 63106553 56282481 42675422 22251158 -1278870
44282 -1278870 -11269513 193738 13512857 5832100 -14501337 -19890713 -4793828 7683185
44274 7683185 318526 -17732825 -28621377 -27277589 -19971010 -13758098 -11966133 -11883995
44266 -11883995 -6017736 6898432 15461090 10521215 1610868 4016101 13248106 10560772
44258 10560772 -6371511 -18395725 -14738992 -7903373 -9839014 -11639757 -820702 14960925
44250A4960925K803860j2777316j4942836p981643l158877k61366O110767J2765762
44242b480724J2143052M557274k974118o958563r385842j1100306r222411k110023
44234b7531661O677879J1997406J3803568J6223139J7814184Q712057j4091152
44227C3605420l2697399k4186849O939962K8209966J9357693k177131q753412
44220B0298250r93773M56817q405460j0737012L41079J0318287P889578J217567
44212B0385333Q35299K326818k820817j1003146j3013567q807125m822586k074150
44204a8993941K972134R063193J0814457P234967K407097j282768m356752n709945
44196B148442l339670K94328J29482k708334n95403Q019085J1864663P48412j6669709
$$ plain form
44250 14960925 17764785 4987469 -9955367 -17937010 -21095887 -21357253 -15246486 -2480724
44242 -2480724 9662328 14219602 11245484 4286921 -5098921 -16199227 -25421638 -27531661
44234 -27531661 -20853782 -8856376 4947192 21170331 38984515 47696572 33605420
44227 33605420 908021 -23278828 -16338866 11871100 31228793 29051662 20298250
44220 20298250 19304477 19761294 11355834 618822 959901 11278188 19167766 20385333
44212 20385333 21220632 23547450 20726633 9723487 -3290080 -12097205 -16919791 -18993941
44204 -18993941 -16021807 -6958614 3855843 11090810 13497907 12215139 7858387 2148442
44196 2148442 -1191228 -896900 -767418 -3475752 -4071155 3947930 15812593 16561005 -108704
44187a08704j9986473m220610J1607699J0286651q5295r84628O810328O670438
44179I989406l920802q438903j40853N533250k880142j3230005j0002473J485338
44171b1605184O739487M741653K626394j56663m871980k393354J1336163J9722365
44163A6138881P803885r478774p181948Q377230P989972j2525525k4692191j2904271
44155b6472741L086647K454065p028439q615859l032946J461785O318243J2881802
44147a8947443J1939037M61563n961479M451574J7608187J2978986n038520j4786930
44139B704975r423041k081888k462241n907871n806476k863634n51582p28689
44131b7120447l647631n751344o41606J1322446J9455356J5759056N519989k220310
$$ plain form
44187 -108704 -20095177 -24315787 -12708088 -2421437 -2506732 -3491360 3318968 9989406
44179 9989406 6068604 -2370299 -2511152 3022098 141956 -13088049 -23090522 -21605184
44171 -21605184 -14865697 -10124044 -7497650 -7654313 -12526293 -14919647 -3583484 16138881
44163 16138881 23942766 14463992 7282044 15659274 23649246 11123721 -13568470 -26472741
44155 -26472741 -23386094 -20932029 -27960468 -36576327 -39609273 -38147488 -31829245 -18947443
44147 -18947443 -7008406 -6546843 -12508322 -8056748 9551439 22530425 17491905 2704975
44139 2704975 -6718066 -8799954 -11262195 -17170066 -22976542 -25840176 -26391758 -27120447
44131 -27120447 -30768078 -36519422 -37161028 -25838582 -6383226 9375830 14895819 12675509
44123A2675509p142331j1856157j1919059l020939P918834J0212591L744822l384671
44115b771401o345013m270392L400915J1832209J0213108k803887j1802160n276882
44107g823503N642415M306591m571649m078509N003183N407451o222493j1892474
44099a4228988q0934J6898972K0920921J0249504l513054j0724993r723332m779032
44091E019064k356460m521388n643738j106077L575627P15669n934386o421226
44083a6672915p55959K400414J284412J802362L735568Q65407m505887k614741
44075a4461339N564449O667671l744072j2831969r911968j091231K943702K077742
44067b4787015J742442K894103M905050R499087J4323458J1129899j820438j3043214
$$ plain form
44123 12675509 5533178 -6322979 -18242038 -21262977 -13344143 -3131552 613270 -2771401
44115 -2771401 -9116414 -13386806 -9985891 1846318 12059426 9255539 -2546621 -7823503
44107 -7823503 -2181088 2125503 -2446146 -6524655 -1521472 3885979 -2336514 -14228988
44099 -14228988 -14309922 2589050 23509971 33759475 30246421 19521428 9798096 5019064
44091 5019064 2662604 -1858784 -7502522 -8608599 -5032972 -4317303 -10251689 -16672915
44083 -16672915 -17428874 -15028460 -13744048 -11941686 -8206118 -7340711 -11846598 -14461339
44075 -14461339 -8896890 -2229219 -5973291 -18805260 -28717228 -29808459 -26864757 -24787015
44067 -24787015 -23044573 -20150470 -15245420 -5746333 8577125 19707024 17886586 4843372
44059D843372j1408752m67812P633610P141610J579415l142535k920057K605171
44051E864022P714741M835618n268785j2576432j0146429j876579M635166O682407
44043a36271N332709K593692K391981P101412J0576537L225395j2326365j9865108
44035a106018r546612Q681332J7843254J3403492L766650k699497m346494l640446
44027B2355661l375570l978698k933136O46440K344816j216028m925926k390562
44019F526997K139144K04386m858294k803671L527845J097816q082279n446668
44011g694724J2695515K3481600J0696295r162398j1616427K59727N388386j385326
44003B2662648o813895m275617J05707L731081R952790J4167781O156063j0741882
$$ plain form
44059 4843372 -6565380 -7033192 600418 7742028 9321443 6178908 3258851 5864022
44051 5864022 13578763 18414381 13145596 569164 -9577265 -11453844 -6818678 -136271
44043 -136271 5196438 7790130 10182111 17283523 27860060 31085455 18759090 -1106018
44035 -1106018 -10652630 -1971298 15871956 29275448 33042098 30342601 25996107 22355661
44027 22355661 18980091 15001393 12068257 12714697 15059513 13843485 8917559 6526997
44019 6526997 8666141 8870527 4012233 1208562 4736407 5834223 -2248056 -7694724
44011 -7694724 5000791 28482391 39178686 30016288 18399861 18659588 24047974 22662648
44003 22662648 15848753 11573136 11678843 15409924 25362714 39530495 45686558 34944676
43995C4944676j9112094j1037886J257255L746985k035451o276767n846575m237024
43987h596881k645311J181567P078998J0576143P467842j364182j0339276j4504449
43979a1145549j3417966q342203J477046J4479871K1367183J3491893k624286
43972A5285989r975941l622376K746577j727261q961424o072425M626021J0550376
43964B849536O597782j791240p519063o141983K061897Q303354K718204q659502
43956a581015p392373Q619892J6157606P1867k0581531j8872908O58423J1238365
43948a1681674L360438q004457j0004336l419553Q385289K0496376K0285944K326833
43940B1744860j4201407o907837J3670986J5847559n103297j9413059q821559
$$ plain form
43995 34944676 15832582 4794696 6051951 9798936 7763485 1486718 -4359857 -8596881
43987 -8596881 -11242192 -10060625 -2981627 7594516 15062358 13698176 3358900 -11145549
43979 -11145549 -24563515 -32905718 -31428672 -16948801 4418382 17910275 15285989
43972 15285989 5310048 1687672 4434249 2706988 -6254436 -12326861 -7700840 2849536
43964 2849536 9447318 7656078 137015 -6004968 -3943071 4360283 7078487 -1581015
43956 -1581015 -8973388 -353496 15804110 15875977 -4705554 -23578462 -22920039 -11681674
43948 -11681674 -8321236 -16325693 -26330029 -29749582 -21364293 -867917 19418027 21744860
43940 21744860 7543453 635616 14306602 30154161 25050864 5637805 -3183754
43933c183754Q207507Q199194m863731j2761712r712312k438891J886471j973410
43925a6640638j3688060k0603952r991308R200400J6127845J1139293J3738460
43918a0717960K3834643J7311103q495431k0147687L34922K2554732J4698810
43911C9373132o343247p063558N307097J1992j8819187j8093030M624965J4317822
43903A3315986k550193j5505345j712581J7052011J1952336p048612j0698705
43896D804897K492692P780148m827793j7261064j2616800K067903R365214N295718
43888b899085q6670m03466n02350m361761m626593O607014K0698381J9589763
43880C4015233K120972j1231955o987971K729950K164817k156990L976399J3155904
$$ plain form
43933 -3183754 5023753 13222947 8359216 -4402496 -14114808 -16553699 -14667228 -16640638
43925 -16640638 -30328698 -50932650 -60923958 -51723558 -35595713 -24456420 -10717960
43918 -10717960 13116683 30427786 21932355 1784668 2119590 24674322 39373132
43911 39373132 33029885 25966327 31273424 31285416 12466229 -5626801 -1001836 13315986
43903 13315986 10765793 -4739552 -6452133 10599878 22552214 15503602 4804897
43896 4804897 7297589 15077737 10249944 -7011120 -19627920 -17560017 -8194803 -2899085
43888 -2899085 -2985755 -3389221 -3891571 -8253332 -12879925 -6272911 14425470 34015233
43880 34015233 36136205 24904250 17916279 20646229 22811046 20654056 24630455 37786359
43872C7786359O103167j3219940j8631253j816838J3125033N745398j0415886
43865A8676040r088787J0559260K4229548J5379912o492557k0215228j6336456
43858A6711732l970186K020042j738560n167931j175374K687943l062754j1498740
43850e193828p312710Q373556J6880603Q659154l783669n752376J22958K543463
43842A4537151j102032n159631n573585j708411M912607Q412362L295129m329913
43834A3283677j256075J1415915J4923955K93855j4927491j1376860K883984N928468
43826B1169428l559883o402875M926120J5296693J1515350m4664p310022r421777
43818B6168370j0810279r754631l596895J901305o94220p773337q343872J14998
$$ plain form
43872 37786359 43889526 30669586 12038333 10221495 23346528 29091926 18676040
43865 18676040 9587253 20146513 44376061 59755973 53263416 33048188 16711732
43858 16711732 12741546 14761588 13023028 7855097 6679723 9367666 6304912 -5193828
43850 -5193828 -12506538 -4132982 12747621 21406775 17623106 11870730 11993688 14537151
43842 14537151 13435119 8275488 2701903 993492 5906099 14318461 17613590 13283677
43834 13283677 12027602 23443517 38367472 38661327 23733836 12356976 15240960 21169428
43826 21169428 17609545 11206670 16132790 31429483 42944833 42900169 35590147 26168370
43818 26168370 15358091 5603460 2006565 3907870 3213650 -4559687 -12903559 -12788561
43810a2788561P541766M988737l574471p139770k047254M788502O885777O554313
43802E209039Q432786R407054K843831q097853j1025711j771658P287220L127226
43794A5411934j0033009j6978727j1373660n81984O668467Q100273M368509k709595
43786g127792p313660l510973N986315J2348252J3356597J5042436J8147099J3434831
43778F0363105k739797j7224251j5093083j252310M632149n443316j7306978j4242421
43770h306902J209068J1744168P366716m171681q617181j351527R667183J3946071
43762B1485915Q725067j81887o078765q691772j2493425j7706322j6607896l122930
43754c4672015J5579415K3810092J5517096J346430o098767p271144r494807j2185165
$$ plain form
43810 -12788561 -5246795 -258058 -3832529 -10972299 -13019553 -8231051 -1345274 5209039
43802 5209039 13641825 23048879 25892710 17794857 6769146 4997488 12284708 15411934
43794 15411934 5378925 -11599802 -22973462 -23555446 -16886979 -8786706 -4418197 -7127792
43786 -7127792 -14441452 -17952425 -11966110 382142 13738739 28781175 46928274 60363105
43778 60363105 57623308 40399057 25305974 24053664 28685813 23242497 5935519 -8306902
43770 -8306902 -7097834 4646334 12013050 7841369 -775812 -2127339 7539844 21485915
43762 21485915 30210982 30029095 23950330 15258558 2765133 -14941189 -31549085 -34672015
43754 -34672015 -19092600 4717492 20234588 21581018 15482251 8211107 -1283700 -13468865
43746a3468865q577717Q57260Q246283J1181905J4094362J5830054R087541m129336
43738C3121487j0676031o642920m945398j2348511j4241381J692146K0026280
43731E985672J7881983K284934O77704J5466575J7442774p130784l0756194k3930618
43723b077954J306017J1048416o10028q616510K97748R295946J953852j1050038
43715A547449r241284O816005J7213144J0452271l338524p955919j162879N341916
43707A9672179K449111n426116p884208l334551m8239j996615j749192O843826
43699H526195J5750297J2431603q06899q677681m459551K142294K164870O08611
43691B7679739M940167J0112883O127771m930087j1182188q324252l464506j235103
$$ plain form
43746 -13468865 -22046582 -21189322 -12943039 -1761134 12333228 28163282 37250823 33121487
43738 33121487 22445456 15802536 10857138 -1491373 -15732754 -14040608 5985672
43731 5985672 23867655 26152589 26830293 42296868 59739642 52608858 21852664 -2077954
43723 -2077954 -771937 10276479 9666451 1049941 1347689 10643635 12597487 1547449
43715 1547449 -7693835 -877830 16335314 26787585 23449061 15493142 14330263 19672179
43707 19672179 22121290 16695174 8810966 5476415 5428176 3431561 1682369 8526195
43699 8526195 24276492 36708095 35901196 27223515 22763964 24906258 27071128 27679739
43691 27679739 32619906 42732789 48860560 43930473 32748285 24424033 20959527 19724424
43683A9724424K640448J0328592J4560554Q962386j616606q622296j1715270j4362089
43675A9900143j2640847o62074J4203509J5689281K023339q730261m770785J182452
43667B6194757o676101j8359478j0850756J4088845K8100802J6625061j233110
43660D7890020m134233Q97197l015337j0495335m747559Q964873Q142936r592539
43652C3910023k0287101j0218550M926332P143189J405841N34433K773380J144079
43644B1331626J269223J1072957K1553088J6292665m279159k3571456l0060911
43637A3608033k4123734q609244J1728105K4368645J8899872K781011o523184
43630C2129504m435372p19225o3736K395374O056638L047440n369920p356588
$$ plain form
43683 19724424 22364872 32693464 47254018 56216404 54599798 45977502 34262232 19900143
43675 19900143 7259296 6597222 20800731 36490012 38513351 29783090 25012305 26194757
43667 26194757 19518656 1159178 -9691578 4397267 32498069 49123130 47890020
43660 47890020 43755787 44652984 41637647 31142312 26394753 35359626 43502562 33910023
43652 33910023 13622922 3404372 8330704 15473893 16879734 17414167 20187547 21331626
43644 21331626 22600849 33673806 55226894 71519559 67240400 43668944 13608033
43637 13608033 -10515701 -19124945 -7396840 16971805 35871677 38652688 32129504
43630 32129504 27694132 26974907 26911171 29306545 35363183 38410623 33040703 25684115
43622B5684115j33535N033052K811050K103874P362351Q691470K89878p413724
43614D4428531n565075j444766k125034J036140J5012210K5692161J5941259n554961
43606H7420465j3632107q6952J9998902L1054687K8965744J4965933l654586j0215820
43598A54816266M061680K1528614J7956057l81044l965100J3531713K4350389
43591B31898575J1732056k540750N929943K4406210K3934114L651585j2979466
43584B86032267j6314442j6809124j7524166r516492K693732o94781k1488458
43577B06378536l3430837k0393497k856214n682624j7285675q715348J6013559
43570A34027900K1482539m511352k9653471k4343335l515881J215438q973115
$$ plain form
43622 25684115 25550580 30583632 33394682 35498556 42860907 51552377 51842255 44428531
43614 44428531 38863456 37418690 35293656 36329796 51342006 77034167 92975426 87420465
43606 87420465 73788358 73701406 93700308 124754995 153720739 168686672 165032086 154816266
43598 154816266 158877946 180406560 198362617 197981573 194016473 207548186 231898575
43591 231898575 243630631 241089881 247019824 271426034 295360148 299011733 286032267
43584 286032267 269717825 252908701 235384535 225868043 228561775 227866994 206378536
43577 206378536 172947699 152554202 149697988 144015364 126729689 118014341 134027900
43570 134027900 155510439 150999087 121345616 97002281 93486400 94701838 85728723
43563H5728723q653598M256291M301632j5704472k7874683j1477049J5129634
43556D5706478K3980514J7295167J4245062J4620190M269033j1752658j1638807
43549I6724979P340156K2473179K0142475J2570280J1707123Q996203n343566
43542A74610829k0718792k0187580m791911J0351216J5818877J1934480J739790
43535A68756909p970020o585011O617777J5655216Q018271m529834n52950J9216781
43527A98627139L1252015K1564958L499148k064603P248130J6609830J4375921
43520B91112538L345399o152857q646052p393542p537328q454831o323401l043153
43512B46906773n770496j4962274k0006920j2422734K082223J1068838J0013609
$$ plain form
43563 85728723 77075125 81331416 85633048 69928576 42053893 30576844 45706478
43556 45706478 69686992 86982159 101227221 115847411 120116444 108363786 96724979
43549 96724979 104065135 126538314 146680789 159251069 170958192 179954395 174610829
43542 174610829 153892037 133704457 128912546 139263762 155082639 167017119 168756909
43535 168756909 160786889 154201878 160819655 176474871 184493142 179963308 179410358 198627139
43527 198627139 229879154 251444112 254943260 252878657 260126787 276736617 291112538
43520 291112538 294457937 288305080 279659028 272265486 264728158 256273327 249949926 246906773
43512 246906773 241136277 226174003 206167083 193744349 195826572 206895410 216909019
43505B16909019K859701o578424j4900569j5124210l211901J2613944J8988083
43498B11555643J3964380P631824O206366N240609M03907m579983m748266j086092
43490B34588388L469839Q983163J4977370J7382332J4335146J1328856J5010501
43483C20075595K3279320K6285764J7993822M052070l706500m64158N675218L236717
43475C96427848p953314j6026232j2559417l911229l088606j3798676k7086270
43468C12004104l1344603k1864070l618730J1035765J0706153l939188j9825478
43461B53153953k5857418k3456196j9026412j3187544m950285M01664j899019
43454A65178743o417456n863793m619768j0950779j9480687j7365700p146851
$$ plain form
43505 216909019 219768720 213190296 198289727 183165517 179953616 192567560 211555643
43498 211555643 225520023 233151847 239358213 244598822 245002729 240422746 235674480 234588388
43490 234588388 238058227 247041390 262018760 279401092 293736238 305065094 320075595
43483 320075595 343354915 369640679 387634501 391686571 387980071 387515913 393191131 396427848
43475 396427848 388474534 372448302 359888885 355977656 352889050 339090374 312004104
43468 312004104 280659501 258795431 255176701 266212466 276918619 272979431 253153953
43461 253153953 227296535 203840339 184813927 171626383 166676098 167077762 165178743
43454 165178743 158761287 152897494 148277726 137326947 117846260 100480560 93333709
43447I3333709n647948j6631727k2398116j0658106O096074R838977L145008J594944
43439E8672815P767884Q496431l100502j5695867j3843038K298638J5730800J0952325
43431G1279486p573744j8406085p778528J2710219K0302450R633852l909769q097974
43423F8159907o798527o113227k853425N365803J1198779Q303018J168295m017776
43415G4412847q086817j0716661o165344K805752R98795j5216447k4235502q526400
43407E270223J4371727J3807569q379922k0865602r846614M880648N696676J625896
43399F560601N093219Q093226l56037j0315647n370102R233208J3189318J292459
43391B7420245j0950438j0728241j410583Q305628J4781747J5874262R196996
$$ plain form
43447 93333709 87685761 71054034 48655918 37997812 44093886 53932863 57077871 58672815
43439 58672815 66440699 74937130 71836628 56140761 42297723 44596361 60327161 71279486
43431 71279486 63705742 45299657 37521129 50231348 70533798 80167650 76257881 68159907
43423 68159907 61361380 55248153 52394728 57760531 68959310 77262328 78430623 74412847
43415 74412847 66326030 55609369 49444025 52249777 53248572 38032125 13796623 5270223
43407 5270223 19641950 33449519 25069597 4203995 -5642619 -761971 4934705 6560601
43399 6560601 11653820 19747046 19391009 9075362 3705260 12938468 26127786 27420245
43391 27420245 16469807 5741566 4330983 12636611 27418358 43292620 52489616
43384E2489616q19757l891894J813832M297217n956454k0769210k4670975j6237913
43376a3745538p521316l081454O132063K2248998K8118453R938223j6108909j9557231
43368F423289K101419J7603465N760680j4533434j3025067Q786384K3920680J9992145
43360E7029561R561425L198704l639398j2715770j3757642k415164R234693J0209952
43352E6706361M983992J267843k592500p643400n876834M982829J0518516j287185
43344F1059622j9685744k5633426j8319021j0570083n258482M228241J4098594
43337h0299J1877039j078551q154254k265869N357859N915302N193402P803131
43329B4567760O211741l516699r457403j300183J0338678P532226p915125j6248675
$$ plain form
43384 52489616 51669859 47777965 49591797 53889014 47932560 27163350 2492375 -13745538
43376 -13745538 -21266854 -24348308 -18216245 4032753 32151206 42089429 25980520 6423289
43368 6423289 8524708 26128173 31888853 17355419 4330352 13116736 37037416 57029561
43360 57029561 66590986 69789690 66150292 53434522 39676880 37261716 46496409 56706361
43352 56706361 61690353 62958196 60365696 52722296 46845462 51828291 62346807 61059622
43344 61059622 41373878 15740452 -2578569 -13148652 -18407134 -14178893 -80299
43337 -80299 11796740 10718189 2563935 298066 5655925 11571227 16764629 24567760
43329 24567760 30779501 27262802 17805399 16505216 26843894 34376120 26460995 10212320
43321A0212320p098989Q164638J3158673N219534o341477j3352776j4681975j2026722
43313a6746774n180190O168673J7166400J8881087Q666056l377719m970427K026073
43305B2633179L867152n320312j5103190j3880966l995823L872376M252691j100723
43297d775616q005735j0385089k629800J1740900K0169354J6677916J0273595
43290C3065525J0170610J1259374M777798m882258p600898n484488q128331j4083526
43282A9093806j3492669p109955n064471o356618J544841J8636699K6488849J4438543
43274D8179025m140027j1329327o761865k05422M857978Q338634N522748m613631
43266C9848113j1439186o017669M126708N530329k205012r704096j3602508j6028024
$$ plain form
43321 10212320 3113331 11277969 24436642 29656176 23314699 9961923 -4720052 -16746774
43313 -16746774 -21926964 -15758291 1408109 20289196 28955252 25577533 20607106 22633179
43305 22633179 26500331 21180019 6076829 -7804137 -11799960 -7927584 -3674893 -4775616
43297 -4775616 -12781351 -23166440 -25796240 -14055340 6114014 22791930 33065525
43290 33065525 43236135 54495509 59273307 54391049 46790151 41305663 33177332 19093806
43282 19093806 5601137 -1508818 -6573289 -12929907 -11385066 7251633 33740482 48179025
43274 48179025 44038998 32709671 25947806 25742384 30600362 38938996 44461744 39848113
43266 39848113 28408927 22391258 26517966 32048295 29843283 20139187 6536679 -9491345
43258i491345j3960835l560378Q225105J0578056N502490M045108P281287N324262
43250A3943750m507444j2777269j3098382q879604k483594Q467328J9494783J7777878
43242A7937446J68009j7809732j9612666p064183N051782P369940K301085k480123
43234a4138442p92972P371817J3346483P042618q944274j8426749j0493285N802169
43226a9232635J2120902K946503r103561q669691O063012K1964210K3755608R218623
43218C9062971q204440j4230209r559031n978296q460256r480762k384989Q220474
43210a1014538J3153413R180853k84100q950023j0044064j997193O314338M018013
43202C76699o266366j1039096o131249j909656l813756k380651Q124826J5317342
$$ plain form
43258 -9491345 -23452180 -27012558 -18787453 -8209397 -2706907 1338201 8619488 13943750
43250 13943750 9436306 -3340963 -16439345 -25318949 -27802543 -19335215 159568 17937446
43242 17937446 18105455 295723 -19316943 -26381126 -21329344 -13959404 -11658319 -14138442
43234 -14138442 -14931414 -7559597 5786886 12829504 3885230 -14541519 -25034804 -19232635
43226 -19232635 -7111733 -4165230 -13268791 -21938482 -15875470 6088740 29844348 39062971
43218 39062971 30858531 16628322 7069291 1090995 -7369261 -16850023 -19235012 -11014538
43210 -11014538 2138875 11319728 11035628 2085605 -7958459 -9955652 -3641314 376699
43202 376699 -5889667 -16928763 -23060012 -24969668 -28783424 -31164075 -23039249 -7721907
43194g721907O820361q056964j1050018k251232K333888l203866q254631n235120
43186c6619489J72596J457157J128456L368168O171743N556133J778786j225317
43178a8211767J056096J0034197J9121896J6675590Q43806j3477512j1949074
43171D093232j96847N474462J876111j009367k60205k534715o275071q79560J1732832
43162A2020872J4023858J85165j1183821m432968Q401910O462234p684791j3537943
43154D254516m732404L385508j378896j1532069j2552370j091876J4197679K2453090
43146A3003178J7600483J990002j3312192j6790154q319785J029755L288173K896479
43138A385939P600222J4166758J0799285n212557j9465815j6295998N98651J1957502
$$ plain form
43194 -7721907 -901546 -8958510 -20008528 -22259760 -19925872 -23129738 -31384369 -36619489
43186 -36619489 -36446893 -34989736 -33861280 -30493112 -24321369 -18765236 -16986450 -18211767
43178 -18211767 -17155671 -7121474 12000422 28676012 29519818 16042306 4093232
43171 4093232 3896385 9370847 11246958 10237591 9977386 7442671 1167600 288040 12020872
43162 12020872 26044730 26229895 15046074 10613106 19015016 25477250 17792459 4254516
43154 4254516 -477888 2907620 1528724 -10003345 -22555715 -23647591 -9449912 13003178
43146 13003178 30603661 32593663 19281471 2491317 -5828468 -4798713 -1510540 1385939
43138 1385939 8986161 23152919 33952204 28739647 9273832 -7022166 -6423515 5533987
43130E533987Q102766L17620J708324P022310L294004o357374o377204M312044
43122A7556477P302680o896861k1472782j6154054L979054J6704520J2749205
43115A3768239L048711q78712N69908K823749M798555N319931J323974o167025
43107B4607330j1033448j0281277p419210n252514j846641L143392M950299J450926
43099a681143j503662J070350M025761K8531o301044l178819Q241606J0821029
43091A1522609m030379j8921656j1177550J3503221K5060662R498419j1835862
43084A3619464j2993456J714865R618305N497042L930064R545551Q657107m741122
43076C4847820j5833083j1857225j049411L145220J938622J926544j43239p232871
$$ plain form
43130 5533987 13636753 13954373 15662697 22685007 25979011 19621637 13244433 17556477
43122 17556477 24859157 17962296 -3510486 -19664540 -15685486 1019034 13768239
43115 13768239 16816950 15938238 16508146 19331895 24130450 29450381 30774355 24607330
43107 24607330 13573882 3292605 -4126605 -9379119 -11225760 -8082368 -3132069 -1681143
43099 -1681143 -3184805 -2114455 1911306 1939837 -4361207 -7540026 701580 11522609
43091 11522609 7492230 -11429426 -22606976 -9103755 15956907 25455326 13619464
43084 13619464 626008 2340873 11959178 17456220 21386284 30931835 39588942 34847820
43076 34847820 19014737 7157512 6108101 9253321 11191943 13118487 12975248 5742377
43068E742377q858015K759168J2951474L251620j5949059j6231101N670224K1317710
43060A0654398J2998715k195624k642772N601526M772799l096544k596210O275230
43052B9771518Q014935j943374j0465987q870979n352822r341683j5805413j3150834
43044b7144639J85466J3693825J6179383O209409n981414o758229O369944J9208589
43036B1962334J6064429k60278j1850429r357352k073553j517048o170332q885537
43028b087766r164652r012352n184439L530340Q218457J449685q089624o157629
43020b6497980N100250J0387181M907748j040462j510155j592485j756404N404608
43012f597699J6037653J2809293o400519j7152756k799527J7319508J6008865
$$ plain form
43068 5742377 -3115638 -356470 12595004 15846624 -102435 -16333536 -10663312 10654398
43060 10654398 23653113 21457489 18814717 24416243 29189042 26092498 23496288 29771518
43052 29771518 37786453 35843079 25377092 16506113 11153291 1811608 -13993805 -27144639
43044 -27144639 -26959173 -13265348 2914035 9123444 3142030 -3616199 2753745 21962334
43036 21962334 38026763 37766485 25916056 16558704 14485151 12968103 6797771 -2087766
43028 -2087766 -11252418 -20264770 -25449209 -21918869 -13700412 -12250727 -20340351 -26497980
43020 -26497980 -21397730 -11010549 -6102801 -7143263 -8653418 -10245903 -12002307 -6597699
43012 -6597699 9439954 22249247 15848728 -1304028 -4103555 13215953 29224818
43005B9224818K70112j911380J1816465J5682546p19431j7361770j8747687j5280670
42997B973003j7449311j4406476L664395K1881333K0527815N362361k348291K562021
42989B2766850O454703N85926r342267j4884377j2812978l727079O733848R225888
42981E000514K737057q36049N796054J1605883M004129r260422j1219920k136955
42973E690291L226852K59955k959255n077001j2037014j7688493o785175J6862681
42965a8507159K7042957J0448779j3094614j8637711q690334k483452n105819
42958b9027353n557351Q15888N893696M469466K164621M649658Q674514P789007
42950a27854J245537n870723q110017l620302M921336J1974808J2872890O943980
$$ plain form
43005 29224818 29494930 27583550 39400015 55082561 54363130 37001360 18253673 2973003
42997 2973003 -14476308 -28882784 -25218389 -3337056 17190759 22553120 20204829 22766850
42989 22766850 29221553 29807479 20465212 5580835 -7232143 -10959222 -4225374 5000514
42981 5000514 7737571 6901522 12697576 24303459 28307588 19047166 7827246 5690291
42973 5690291 8917143 9177098 6217843 1140842 -10896172 -28584665 -35369840 -18507159
42965 -18507159 8535798 18984577 5889963 -12747748 -21438082 -23921534 -29027353
42958 -29027353 -34584704 -33768816 -27875120 -23405654 -21241033 -16591375 -7916861 -127854
42950 -127854 1117683 -4753040 -12863057 -16483359 -11562023 412785 13285675 20229655
42942B0229655k356841r740460j1501603q344794m132026p39488L436083P850814
42934e298660O923643k299021j2880039j4628467o087824N563805J3529480J4042345
42926a134738M661176j0643111j8362470r137807P079951J2011252M362152k27076
42918a1390671M356351N176434o597878j8780324j5377036K47560J1015008Q228988
42910b3121568j371758n743467J843907J6883092K3914762J0747841j2864589
42903A0288220k1215046m537850J6100235J5788642k629386j6575870j4969668
42896a7750723o325402j33904M055013Q151243Q767052L217984m300123n777263
42888a0096123K753796J5032120J6744018R30461j7808373j6446628M007372J4258626
$$ plain form
42942 20229655 17872814 8132354 -3369249 -11714043 -15846069 -16585557 -13149474 -5298660
42934 -5298660 1624983 -674038 -13554077 -28182544 -34270368 -28706563 -15177083 -1134738
42926 -1134738 3526438 -7116673 -25479143 -34616950 -27536999 -15525747 -11163595 -11390671
42918 -11390671 -7034320 -1857886 -8455764 -27236088 -42613124 -42365564 -31350556 -23121568
42910 -23121568 -24493326 -30236793 -28392886 -11509794 12404968 23152809 10288220
42903 10288220 -10926826 -15464676 635559 16424201 13794815 -2781055 -17750723
42896 -17750723 -24076125 -24210029 -20155016 -12003773 -3236721 -18737 -4318860 -10096123
42888 -10096123 -7342327 7689793 24433811 25364272 7555899 -8890729 -4883357 9375269
42880I375269l538100k6765017k1771857Q091479K7123991J6476335n160946j2991682
42872i160528o168809K172394P134322J1667799J4599172J0839522q59526j6425855
42864A3798491k8432176k7627455j0454434J2101823K2182264J5624632O008625
42857C201770M123562M229711j965182q285329l064473J0522278J6084585N943066
42849C0789988q714663j2565654m257912M640273N342137J246914P60519M440325
42841B1681927L909961n967267j8603913k2871062j5757854l804978N801181J1045001
42833b4567004J3420751J4699344J4770029J0553572j93469j1950078j3878269
42826B854876l725088O872925P365999K062445O53919J921200j659157q318008
$$ plain form
42880 9375269 5837169 -20927848 -42699705 -34608226 -7484235 8992100 3831154 -9160528
42872 -9160528 -15329337 -13156943 -6022621 5645178 20244350 31083872 30224346 13798491
42864 13798491 -14633685 -42261140 -52715574 -40613751 -18431487 -2806855 3201770
42857 3201770 7325332 11555043 9589861 1304532 -1759941 8762337 24846922 30789988
42849 30789988 22075325 9509671 5251759 9892032 15234169 16481083 17241602 21681927
42841 21681927 25591888 19624621 1020708 -21850354 -37608208 -41413186 -35612005 -24567004
42833 -24567004 -11146253 3553091 18323120 28876692 28683223 16733145 2854876
42826 2854876 -870212 6002713 13368712 15431157 16085076 18006276 16347119 8029111
42818H029111r492217n231214l586890n991208o694039n745743q100535r903824
42810d6716559j336943J4999158K4021552J9441512J0142293K797603n263187
42803A8085429j2297903r670775Q60798N808991K864537N260671J4643018J2385314
42795C7940080q256143k4218756j5999189J595873M873841r77665L428751J4056151
42787A2442943J1484176k235480o621072Q91720K769273m357784m215764O117174
42779A6275186P867386o107043j7163972j1636371j093993J089089L71036L611123
42771f787559K740868p090235j2420967l194640P365109M031290m723307l030273
42763b3109714M624358N052381L499457J2756015K3182531J2402439j6547882
$$ plain form
42818 8029111 -1463106 -6694320 -10281210 -16272418 -22966457 -28712200 -36812735 -46716559
42810 -46716559 -48053502 -33054344 -9032792 10408720 20551013 23348616 18085429
42803 18085429 5787526 -3883249 -3022451 2786540 5651077 10911748 25554766 37940080
42795 37940080 29683937 5465181 -10534008 -8938135 -4064294 -5041959 -1613208 12442943
42787 12442943 23927119 21691639 15070567 15962287 18731560 14373776 10158012 16275186
42779 16275186 24142572 18035529 871557 -10764814 -11858807 -10769718 -10398682 -6787559
42771 -6787559 -4046691 -11136926 -23557893 -26752533 -19387424 -15356134 -20079441 -23109714
42763 -23109714 -18485356 -13432975 -9933518 2822497 26005028 38407467 21859585
42756B1859585l4296330k5943767q174144O05740L855634J0448945J5235457J0449601
42748e959279K000925M295L055754M209452M063684O158270O429203j002402j2090081
42739F869821j6900063j2051883j697701R075328J4582162Q842426n066251j2103358
42731h449519k910995J0674821J0464199j782505q207198l449772r62870o879052
42723a1502891p164895P657346K1518058J4406663n535008j2818101l116077K875457
42715F320552l162649j725096J9235128L6339596K1893350j1139494k4883587
42708D2877800j2728523o755612k2724215l1764086p266663K7904410L2234040
42701B1777151O642170j1070315n945786j443162j1292941j4679489L634802K1258603
$$ plain form
42756 21859585 -12436745 -38380512 -46554656 -45948916 -42093282 -31644337 -16408880 -5959279
42748 -5959279 -3958354 -3954059 -898305 3311147 7374831 13533101 19962304 18959902 6869821
42739 6869821 -10030242 -22082125 -23779826 -14704498 -122336 8720090 3653839 -8449519
42731 -8449519 -11360514 -685693 9778506 7996001 -211197 -3660969 -4623839 -11502891
42723 -11502891 -18667786 -11010440 10507618 24914281 19379273 6561172 3445095 6320552
42715 6320552 3157903 1432807 20667935 57007531 78900881 67761387 42877800
42708 42877800 30149277 23393665 669450 -31094636 -38361299 -10456889 21777151
42701 21777151 28419321 17349006 11403220 9960058 -1332883 -16012372 -12377570 8881033
42693H881033J2319330r895327j4387269r34580M816717l623218o728698K951356
42685f600656P761883k114911j0293019k373751R417784O824838n030563p331864
42677i740259K884752J0661187O816609j169079k525511K800767O160091J472656
42669A7361213p459183j1095938o703239k967506o064670o584626O762472K3501601
42661F750124K0348641l240569j9646349j2310638J052355m28930p064329J505807
42653a3033888J8357975J8939325Q55429j3857969j3986172r972115q176013p02029
42645b1575457J3091351J8984686J0848556M09350m801101j2086338k1627473
42638a6756426j6826725O887103K4065621J1842532j4259517k0659519k018490
$$ plain form
42693 8881033 21200363 11305036 -3082233 -4016813 799904 -2823314 -9552012 -6600656
42685 -6600656 1161227 -953684 -11246703 -13620454 -4202670 2622168 -2408395 -9740259
42677 -9740259 -6855507 3805680 10622289 9453210 6927699 9728466 15888557 17361213
42669 17361213 9902030 -1193908 -7897147 -10864653 -16929323 -23513949 -16751477 6750124
42661 6750124 27098765 23858196 4211847 -8098791 -7046436 -7475366 -14539695 -13033888
42653 -13033888 5324087 24263412 25118841 11260872 -2725300 -12697415 -20873428 -21575457
42645 -21575457 -8484106 10500580 21349136 21758486 16957385 4871047 -16756426
42638 -16756426 -33583151 -26696048 -2630427 9212105 -5047412 -25706931 -27725421
42631b7725421J6753103J9030445J2446733P037785J221480n482431n954420K8709
42623A7355983Q25938q098593j3362791k680828J4984509J9864387O432908j2178058
42615B3143455k1648451j9194066r867733J249560J0303121J2936067O023217
42608B945170p880791j9312470j8200837l915390J2229679J7608569J1160599
42601e365471L031123K081629P079838J0129823N555652m853593j2859129j0561461
42593e761589J037887J1349487J1208574K836039m944649q441971r850597q853282
42585a1420101k619651N249005N399705l910286j1950196q801082K695241J2523255
42577a2834110J4586446P881691n473626j6697439j2949858O574784K3345456
$$ plain form
42631 -27725421 -10972318 8058127 20504860 27542645 28764125 23281694 17327274 17355983
42623 17355983 18181921 10083328 -3279463 -5960291 9024218 28888605 35321513 23143455
42615 23143455 1495004 -17699062 -27566795 -26317235 -16014114 -3078047 2945170
42608 2945170 -4935621 -24248091 -42448928 -46364318 -34134639 -16526070 -5365471
42601 -5365471 -2334348 -252719 6827119 16956942 22512594 17659001 4799872 -5761589
42593 -5761589 -4723702 6625785 17834359 20670398 15725749 7283778 -2566819 -11420101
42585 -11420101 -14039752 -8790747 -3391042 -7301328 -19251524 -28052606 -25357365 -12834110
42577 -12834110 1752336 9634027 4160401 -12537038 -25486896 -18912112 4433344
42570D433344K0159735M809884p68720P155575R661329l783038j7786733j4709605
42562I171771j292421L339993l132569o238774K06926O541439N613875K840738
42554A7050978L644474M475166K582005K924895P708858R190926J473905r181893
42546C9869314j4308468j4763012j3231275n437921Q426299J3225166k552133
42539A1227970k3439908k2501315N55835J7609194J1983612j089694k429300L101965
42531d981641J461730l884992J50040J0673909J1310585k023869j5057174j5988136
42523a8339548q420864j153526K887641L855244J205492k450142r84995P177572
42515a6223126J5411601J6205415Q380602l919967j4853451j8913743j4575285
$$ plain form
42570 4433344 24593079 29402963 28634243 35789818 45451147 41668109 23881376 9171771
42562 9171771 7879350 11219343 8086774 1848000 2054926 8596365 14210240 17050978
42554 17050978 20695452 25170618 27752623 30677518 38386376 47577302 49051207 39869314
42546 39869314 25560846 10797834 -2433441 -7871362 554937 13780103 11227970
42539 11227970 -12211938 -34713253 -34157418 -16548224 -4564612 -5654306 -8083606 -4981641
42531 -4981641 -3519911 -7404903 -7254863 3419046 14729631 12705762 -2351412 -18339548
42523 -18339548 -26760412 -27913938 -25026297 -21171053 -19965561 -22415703 -23400698 -16223126
42515 -16223126 -811525 15393890 23774492 19854525 5001074 -13912669 -28487954
42508b8487954p021423k688267q83973L825114J0929361J2848576O710343M66812
42500d301411K738199J0894867J4185816P077508m160922q382946j806489P347976
42492B3592598P686409j936288j1203099j1782912o462501j192530M588307J1627169
42484A4917153J1870961j037075j5501865j2306577O868972J7693578O560213
42477B9065360r905521j0047275J618531M902365k850206m236002P982011J7466962
42469C3996225Q401401j0888413j9384759j0881072J144920L530213j648794l813867
42461D55854J220395P121164N401624n030653j6371627j8700293q517401Q262453
42453b6158484K0928127K1707985J0719795m128018j1759314n842499Q440878
$$ plain form
42508 -28487954 -35509377 -38197644 -39081617 -35256503 -24327142 -11478566 -4768223 -4301411
42500 -4301411 -1563212 9331655 23517471 30594979 26434057 18051111 16244622 23592598
42492 23592598 31279007 29342719 18139620 6356708 -105793 -1298323 3289984 14917153
42484 14917153 26788114 25751039 10249174 -2057403 4811569 22505147 29065360
42477 29065360 19159839 9112564 10731095 15633460 12783254 8547252 16529263 33996225
42469 33996225 42397626 31509213 12124454 1243382 2388302 5918515 4269721 455854
42461 455854 1676249 8797413 14199037 9168384 -7203243 -25903536 -34420937 -26158484
42453 -26158484 -5230357 16477628 27197423 23069405 11310091 5467592 13908470
42446A3908470J6839846R585123o951826j6389623j1422785j365250K730572L645540
42438A0580067J0215299J8356914J2972081q651056k7534794k5092945o526730
42431a5681164P314090O389481n87245k520246O11270K721973J797805P98427
42423H44391K483749O371263R051457P044418J196026l036805k502466j308247
42415B0143786m656903j0185739j1160581o505986j027412L170815P759901J0731355
42407H269236O699691k900275q037651k808011O425678J0203939P752051M406628
42399C0011286J942221k090400p466507r681265n773103J453883N654731K277516
42391A6328362p479477j6683877j7417373p152626Q668277J9901723J8558403
$$ plain form
42446 13908470 30748316 40333439 33381613 16991990 5569205 4203955 6934527 10580067
42438 10580067 20795366 39152280 52124361 43473305 15938511 -9154434 -15681164
42431 -15681164 -8367074 -1977593 -2564838 -5085084 -4473814 -1751841 45964 844391
42423 844391 3328140 9699403 18750860 25795278 26991304 23954499 21452033 20143786
42415 20143786 15486883 5301144 -5859437 -12365423 -13392835 -10222020 -2462119 8269236
42407 8269236 14968927 12068652 4031001 1222990 7648668 17852607 25604658 30011286
42399 30011286 31953507 29863107 22396600 12715335 6942232 8396115 14050846 16328362
42391 16328362 8848885 -7834992 -25252365 -32404991 -23736714 -3834991 14723412
42384A4723412N516156q531556j2254262n715544O23107O01069o23617J588161
42376d073074J391196o424936j2840346n439431J0893018J8475349J1166960Q8627
42368A3237363n137375n670973k425591P085209J6069473J0518030p455375j5652319
42360A0568442l268442R975316K396958j5735764j7342883Q85026J5303605J0553905
42352A3336163k848872q955103o624562l020561l67878K875408O089979Q136529
42344H621103R615207J0035106P611412L493352Q37293j070229n728834j1866196
42336B1548214j3507643q713490k099755K263803M308401L698431j039545p554780
42328a096364j0073582o560531k95320O180854J2682702J6750081J4573794P758158
$$ plain form
42384 14723412 20239568 11708012 -546250 -6261794 -5638687 -5037618 -5661235 -4073074
42376 -4073074 -2681878 -9106814 -21947160 -27386591 -16493573 1981776 13148736 13237363
42368 13237363 8099988 2429015 3424 7088633 23158106 33676136 26220761 10568442
42360 10568442 7300000 17275316 19672274 3936510 -13406373 -12521347 2782258 13336163
42352 13336163 10487291 1532188 -5092374 -8112935 -8480813 -5605405 484574 8621103
42344 8621103 18236310 28271416 35882828 39376180 40213473 39143244 33414410 21548214
42336 21548214 8040571 -672919 -2772674 -508871 3799530 7497961 6458416 -1096364
42328 -1096364 -11169946 -17730477 -18025797 -11844943 837759 17587840 32161634 39919792
42320C9919792K270223l93553l633750o676907m335642J907525K764202m544210
42312B7277680j0924821j0218377q705372j1388325r795580L480734J6681930
42305c592131J2725227k328433m425447J1772536K1186959M016271k3192385k9259507
42297a3096910j1395264L989069J141697n932165k33268J1472700J2154945J943913
42289D4717m915808m054276m045310o588086j615244J2823921K1325449J1788447
42281B4763810n274801j0034753j6906Q678393M899350m391989o724609o26496
42273A1271999N998109Q354664Q236621O459716j33313j0526962j4894288o182970
42265H583576O664053P814195k663176q126973j829420J638019p930800j5470402
$$ plain form
42320 39919792 42190015 41796462 38162712 31485805 27150163 29057688 31821890 27277680
42312 27277680 16352859 6134482 -2570890 -13959215 -23754795 -20274061 -3592131
42305 -3592131 9133096 6804663 2379216 14151752 35338711 39354982 16162597 -13096910
42297 -13096910 -24492174 -20503105 -19361408 -25293573 -25526841 -14054141 -1899196 44717
42289 44717 -4871091 -8925367 -12970677 -19558763 -21174007 -8350086 12975363 24763810
42281 24763810 19489009 9454256 9437350 18115743 23015093 18623104 11898495 11271999
42273 11271999 17270108 25624772 33861393 40321109 40187796 29660834 14766546 8583576
42265 8583576 15247629 23061824 20398648 12271675 10442255 12080274 4149474 -11320928
42257a1320928m093363J3720348J3561792k48772j625573J1313553J1582159q425575
42249B4463641j9777483m691673J2094806M511109j1504696p647275P347835N724674
42241A0520938p918053n241540J2736772J4581388o471080j7792248p7236K1156426
42233B1495367J5816243p386543j9964255j5139160p532753n406380m483132j714475
42225b4315088J608169N850464J0576400J1160181O093035J059823o45574k984052
42217H403358o525625m242429M362192P082302k991907j4415259j3407187k900571
42209b4635126N722782R913676J2313140R246391k305901j2929924j1137610j314974
42201a5127546K972551L68271J479594Q229403R017174j813404j2469660q959839
$$ plain form
42257 -11320928 -15414291 -1693943 11867849 11619077 9993504 21307057 32889216 24463641
42249 24463641 4686158 -5515 12089291 16600400 5095704 -2551571 4796264 10520938
42241 10520938 2602885 -2638655 10098117 24679505 18208425 416177 338941 21495367
42233 21495367 37311610 29925067 9960812 -5178348 -12711101 -18117481 -22600613 -24315088
42225 -24315088 -22706919 -16856455 -6280055 4880126 10973161 12032984 11387410 8403358
42217 8403358 1877733 -2364696 1997496 9079798 6087891 -8327368 -21734555 -24635126
42209 -24635126 -18912344 -8998668 3314472 12560863 10254962 -2674962 -13812572 -15127546
42201 -15127546 -12154995 -11786724 -10307130 -2077727 6939447 5126043 -7343617 -16303456
42193a6303456N472298J3566399M388912j4493850k5601245j9750901l471077
42186e6192920J1120301J8802116K0118614J4060176J316432q491518n433367
42179d700166M588628N771873l260476o511876K528058Q542118K69520p750368
42171e22689K773946K1424227K0573849m231455k6683606k5411820r105409J493012
42163a9689945K049627K808634O523942L528685r460512j7864183o491314J6220869
42155b2374197K4331601Q187100j0769621q963978O790548J2118237K856922k215574
42147I961038M337856O649905m604138j3897815o541199O637524Q061069J696900
42139A2301140K653826R631076R262932J678257K13595O754265O760057p591476
$$ plain form
42193 -16303456 -10831158 2735241 7124153 -7369697 -32970942 -52721843 -56192920
42186 -56192920 -45072619 -26270503 -6151889 7908287 9224719 733201 -4700166
42179 -4700166 -111538 5660335 2399859 -4112017 -1583959 6958159 7227679 -522689
42171 -522689 2251257 23675484 44249333 40017878 13334272 -12077548 -21182957 -19689945
42163 -19689945 -17640318 -14831684 -8307742 -4779057 -14239569 -32103752 -38595066 -22374197
42155 -22374197 1957404 10144504 -625117 -9589095 -2798547 9319690 12176612 9961038
42147 9961038 14298894 20948799 16344661 2446846 -4094353 2543171 10604240 12301140
42139 12301140 14954966 24586042 33848974 35527231 35740826 42495091 49255148 41663672
42131D1663672k4010426k5562140j0846345N505605Q141326m199355j6964925
42124b6272588j5039071n09820J0713042J0530874O429970N053401K152433m268749
42116a1210508n793277R64216M885227j314624o964074j632243O040601L547013
42108a1477669m224834o012984l966619m009909P46879J5834484K6371847J5788429
42100B9049624n647986j5109278j1704994j1470541j5447506j0497540K457573
42093c8370648Q880711P146072Q077561J0548520M831534k742400J796592R447426
42085I615368r51533k1703664k2615504j900699Q695661j493336l885685J6466316
42077a7773076L0729859J4275477j0581178j0754482O662043J2515769L250303
$$ plain form
42131 41663672 17653246 -7908894 -18755239 -13249634 -5108308 -9307663 -26272588
42124 -26272588 -41311659 -41821479 -31108437 -20577563 -14147593 -9094192 -6941759 -11210508
42116 -11210508 -17003785 -16039569 -11154342 -12468966 -19433040 -21065283 -15024682 -11477669
42108 -11477669 -15702503 -21715487 -25682106 -29692015 -28945136 -13110652 13261195 29049624
42100 29049624 23401638 8292360 -3412634 -14883175 -30330681 -40828221 -38370648
42093 -38370648 -29489937 -22343865 -14266304 -3717784 1113750 -1628650 167942 9615368
42085 9615368 8663835 -13039829 -35655333 -37556032 -28860371 -30353707 -34239392 -17773076
42077 -17773076 12956783 27232260 16651082 5896600 12558643 25074412 28324715
42070B8324715k766910j360054l205986q000834o127843P5391M29006l213336
42062D154149j513591L922809M690670J318994j212027m997348j0951446j0043810
42054a4631600J045941Q039284L21208r607010p082322n10402l390582p092397
42046c2907880J331191Q780969l734553k0703539r130000K6246720M2561852J9801522
42038C2246282j2030382j8546760m269694N702726L456538j390866l238605m321164
42030b391925n285398m531534k055522K017468O579148N643752m800123j5283558
42022b0107692j1376311L983662J1436812K908956o931581l948967N485135P862153
42014a0687833L524918J841475L627733J460133n513460p938218J212335J6298401
$$ plain form
42070 28324715 25557805 24197751 20991765 12990931 6863088 6938479 7367485 4154149
42062 4154149 2640558 6563367 11254037 12573031 11361004 6363656 -4587790 -14631600
42054 -14631600 -13585659 -5546375 -5225167 -14832177 -21914499 -22424901 -25815483 -32907880
42046 -32907880 -31576689 -22795720 -26530273 -47233812 -56363812 -30117092 12444760 32246282
42038 32246282 20215900 1669140 -2600554 3102172 6558710 5167844 1929239 -2391925
42030 -2391925 -7677323 -12208857 -14264379 -12246911 -5667763 -24011 -4824134 -20107692
42022 -20107692 -31484003 -27500341 -16063529 -13154573 -20086154 -24035121 -18549986 -10687833
42014 -10687833 -7162915 -5321440 -1693707 -233574 -5747034 -13685252 -12472917 3825484
42006C825484K3795636J6561132K006859o338585n406738n034336j1291172j5915586
41998B202694r684462J789172O307397K812663j145590m019727q467359r370909
41990a9576121N26327J4700705J8161831Q649749j889144o337884p639501n912116
41982F83846K018448R279118M362857o569990k996809J7245813K8523866J2238494
41974F4785643j5948747k7897150j8479896l897663N017332J0478461J3662372
41967B7720352R728214j164323q984795m852149P307677J3685221N563143r806163
41959C9197177j6786163j0893584l949274n002588n848955L446520J3825651R157523
41951B3146307o345047j2759123n464545k41360m927106q076011k393923J926994
$$ plain form
42006 3825484 27621120 44182252 46189111 39850526 34443788 29409452 18118280 2202694
41998 2202694 -7481768 -5692596 614801 3427464 2281874 -1737853 -10205212 -19576121
41990 -19576121 -19049794 -4349089 13812742 22462491 20573347 14235463 6595962 683846
41982 683846 2702294 11981412 16344269 9774279 6777470 24023283 52547149 64785643
41974 64785643 48836896 20939746 2459850 -1437813 3579519 14057980 27720352
41967 27720352 37448566 36284243 27299448 22447299 29754976 43440197 49003340 39197177
41959 39197177 22411014 11517430 7568156 2565568 -3283387 163133 13988784 23146307
41951 23146307 16801260 4042137 -1422408 -1663768 -6590874 -14666885 -17060808 -15133814
41943a5133814k665720o959577k918240J768056J53398O24115J0260374J8360345
41935C488937J2836227Q22085l534879j425346k956633p106506m890064L359235
41927E93056Q815351P770362K385203o313786j4973783j4742817l332645P284315
41919a2514744O776737J319871O52181J175864l360381n860517J145956O844039
41911c820994k029464j4591386r471995R103019J5431225L495896l212527R455847
41903D359621K2709015J4309236p243077j6123590o108996L833840j786539j4947518
41895i98008j6584044j932216J3334572J3411410L247189P02399R090296J1475409
41887C1747007j808082j5688449j3526875l480285k820558p545730j761513R998087
$$ plain form
41943 -15133814 -17799534 -24759111 -27677351 -25909295 -25755897 -25131782 -14871408 3488937
41935 3488937 16325164 17147249 13612370 12187024 9230391 2123885 -2766179 593056
41927 593056 9408407 17178769 19563972 13250186 -1723597 -16466414 -19799059 -12514744
41919 -12514744 -5738007 -4418136 -3765955 -2590091 -5950472 -11810989 -10665033 -3820994
41911 -3820994 -5850458 -20441844 -29913839 -20810820 -5379595 -1883699 -5096226 4359621
41903 4359621 27068636 41377872 34134795 18011205 11902209 15736049 13949510 -998008
41895 -998008 -17582052 -19514268 -6179696 7231714 10478903 11181302 20271598 31747007
41887 31747007 29938925 14250476 723601 -2756684 -5577242 -13122972 -14884485 -4886398
41879d886398Q262447m914910n576584J0788529J8463473M192032q909155P42374
41871A8161808J7174435J3932900k870255q143945j399487m360606j9415114k2727427
41863i647691l815811J5569848J3356265l068781j2575870r887364m363801n50856
41855a4984061L700682N624374j05599q336200o329608P719838J9733530J7688298
41847B4711254N971779l795740q622372j2276185j2808418l946597J0481095J5202861
41839A4917677K553335j5100681j9621351q593581N161560J1100934Q770044J158064
41831C46001q597512j3715687q057450L357244Q020521L730008K458647J0857805
41823a600423J7459820Q741661r982973k1170321j7868677q215921L50350Q561720
$$ plain form
41879 -4886398 3376049 -1538861 -7115445 3673084 22136557 26328589 17419434 18161808
41871 18161808 35336243 49269143 46398888 38254943 36855456 32494850 13079736 -9647691
41863 -9647691 -13463502 2106346 15462611 12393830 -182040 -10069404 -14433205 -14984061
41855 -14984061 -11283379 -5659005 -5764604 -14100804 -20430412 -12710574 7022956 24711254
41847 24711254 30683033 26887293 18264921 5988736 -6819682 -10766279 -285184 14917677
41839 14917677 17471012 2370331 -17251020 -25844601 -20683041 -9582107 -812063 346001
41831 346001 -8251511 -21967198 -30024648 -26667404 -18646883 -14916875 -12458228 -1600423
41823 -1600423 15859397 24601058 14618085 -6552236 -24420913 -32636834 -32286484 -23724764
41815b3724764J5720584J4843510L213399j0106229j3813834p071298K240091
41808a8698541Q294121J1337671J3057669J2681092Q135148n11518q787925j0204976
41800A5302741l950695J090884l891100j3334536j1324027N836190K0214440J4512231
41792B4456128k940087q141698N743917J9283486J3370821p131930k2630356k2571940
41784e61659j2133047j192204N082013O913510P025173O726448L688892l442707
41776A2106419r094029o294294J951329O250852O100690Q530073R829178k700810
41768B6679408k3416224k5104829Q08789K2455436J0289516j6573730j8583662
41761b3445296K637805J0122806m757435q461018J5483025L5382925K0828659
$$ plain form
41815 -23724764 -8004180 6839330 10052729 -53500 -13867334 -20938632 -18698541
41808 -18698541 -10404420 933251 13990920 26672012 34807160 34295642 25507717 15302741
41800 15302741 11352046 12442930 8551830 -4782706 -16106733 -10270543 9943897 24456128
41792 24456128 21516041 13374343 19118260 38401746 51772567 44640637 22010281 -561659
41784 -561659 -12694706 -13886910 -8804897 -1891387 5133786 11860234 15549126 12106419
41776 12106419 3012390 -3281904 -1330575 4920277 11020967 19551040 29380218 26679408
41768 26679408 3263184 -21841645 -21032856 1422580 11712096 -4861634 -23445296
41761 -23445296 -20807491 -10684685 -15442120 -23903138 -8420113 26962812 47791471
41754D7791471j0434160k1920623r619428L812796O750839L158674n722423j8160242
41746d343096k1926524j0865486n2075k567339n230199P783682K2273090J5317696
41738C89749k885099l423491J1793966J2569264p366949j8796011n592641J0262803
41730c048409O556377n947067o346039L465090Q084130M412665N61895q5559k66887
41721G386196k238904p609213j5170412j5783566j818326J6510794K0355705J0216144
41713A1848418N565908J2320880J2768237l537911k0778646k1004177q075111
41706a0892402N068825J4581513J8100262P830580j3340254k5714069j8413350
41699b2778895n337652q95993K137443J3094343K0301620R562270q970223j5352634
$$ plain form
41754 47791471 37357311 15436688 5817260 9630056 16380895 19539569 13817146 -4343096
41746 -4343096 -26269620 -37135106 -37187181 -39754520 -44984719 -37201037 -14927947 389749
41738 389749 -2495350 -5918841 5875125 18444389 11077440 -7718571 -13311212 -3048409
41730 -3048409 3507968 -2439099 -8785138 -5320048 2764082 7176747 7738642 7653083 7386196
41721 7386196 5147292 -2461921 -17632333 -33415899 -35234225 -18723431 1632274 11848418
41713 11848418 17414326 29735206 42503443 38965532 18186886 -2817291 -10892402
41706 -10892402 -5823577 8757936 26858198 34688778 21348524 -4365545 -22778895
41699 -22778895 -28116547 -29012540 -26875097 -13780754 6520866 16083136 7112913 -8239721
41691h239721r435125l745688J238917J0536527J4078556J4959j7864035j4317344
41683b7732954P379117J6872205O84289k0036405k1448874n351389J1875466K0686210
41675a7072335K0233595J2827274M568753J648073J317366m398035j3946688j5778998
41667a0600995n455506O482571P327314l648691j5113342j3264017N435581K5845887
41659b991198K5529078K840733j5811261r206033Q628087R340725p399827j5462909
41651d532605l043180J2597220J4047321M949239m337466j2654644k0365266k1288290
41643c4627671j2190453L70161R277521J3584793J2936334O361503j016197k087385
41635g391394k32905m461674j1109586o372015J0020788K0749653J5748127M687144
$$ plain form
41691 -8239721 -17674846 -21420534 -20181617 -9645090 4433466 4448425 -13415610 -27732954
41683 -27732954 -20353837 -3481632 -2797343 -22833748 -44282622 -49634011 -37758545 -17072335
41675 -17072335 3161260 15988534 20557287 22205360 23522726 19124691 5178003 -10600995
41667 -10600995 -16056501 -9573930 -2246616 -5895307 -21008649 -34272666 -28837085 -2991198
41659 -2991198 22537880 25378613 9567352 361319 8989406 18330131 10930304 -4532605
41651 -4532605 -7575785 5021435 19068756 24017995 19680529 7025885 -13339381 -34627671
41643 -34627671 -46818124 -46447963 -37170442 -23585649 -10649315 -4287812 -5304009 -7391394
41635 -7391394 -7624299 -12085973 -23195559 -29567574 -19546786 1202867 16950994 21638138
41627B1638138j401380m421870p895382p918984m329276n329420j1584872j1074985
41619c2318031K18182Q487468M718273Q63476Q570366J6662149Q291882j0105708
41611E388057j6593683m854871R869802J3182394N285797n718563j1561833o177842
41603a1180742Q558886K0240855J7953081N431406m954728p897477p106878n795689
41595A5248714m285662m195760o204146n576531J991612J1399624J2542787L662492
41587B4583130n647094n874364J287744M843469k016117j1077967p338931Q507495
41579G267365J5434809O85276j7130679j2297279P916059J3405418k79635n660711
41571I340623P684523J3332976n018746k0869982p515863J4913157J0988721j1639084
$$ plain form
41627 21638138 20236758 15814888 7919506 522 -4328754 -9658174 -21243046 -32318031
41619 -32318031 -32099849 -23612381 -18894108 -18030632 -9460266 7201883 15493765 5388057
41611 5388057 -11205626 -16060497 -6190695 6991699 12277496 6558933 -5002900 -11180742
41603 -11180742 -2621856 17618999 35572080 41003486 36048758 28151281 21044403 15248714
41595 15248714 10963052 6767292 563146 -5013385 -3021773 8377851 20920638 24583130
41587 24583130 18936036 13061672 14349416 19192885 17176768 6098801 -1240130 7267365
41579 7267365 22702174 23387450 6256771 -6040508 1875551 15280969 15001334 9340623
41571 9340623 17025146 30358122 25339376 4469394 -3046469 11866688 22855409 11216325
41563A1216325j5947266L607404J6062295P457570j641867K101198L336880q612834
41555A7579705j6783893n010854J4050398J7393620K022963j6929874k4789628
41548a2467563j4307244J1123215L2267990K7486410M80421k0300475j7718849
41541F563905m500571K342566N243691J1212197J3050678L562765o622764m569896
41533B6282571K999159J429457p917621j3296971j3485196j4721758j3953727
41526c2664086m221334Q043900J0061765M443887N579108J5088076J8860826J0337439
41518C5529581J22747j772856P81224j02040m278563o904495o014118l154540
41510A4206940k190481p571142j7065763j8597118m140663J5202520K0171882
$$ plain form
41563 11216325 -4730941 -1123537 14938758 22396328 20754461 22855659 26192539 17579705
41555 17579705 795812 -4215042 9835356 27228976 29251939 12322065 -12467563
41548 -12467563 -26774807 -15651592 16616398 44102808 44583229 24282754 6563905
41541 6563905 2063334 4405900 9649591 20861788 33912466 37475231 30852467 26282571
41533 26282571 29281730 30711187 22793566 9496595 -3988601 -18710359 -32664086
41526 -32664086 -36885420 -28841520 -18779755 -14335868 -8756760 6331316 25192142 35529581
41518 35529581 35652328 33879472 34660696 34558656 30280093 23375598 17361480 14206940
41510 14206940 12016459 4445317 -12620446 -31217564 -35358227 -20155707 16175
41503A6175R076121p41283J486786P345398O300493Q90273k174802l215594l299760
41494A5683807J577349J0100864J0254658l624931j7319245j3937718J683937
41487D418721J0128861M700974l518590o055324o596041q593240q432922n372134
41479a9319695m807114n949717N36503J4855932K1213330R908148n078117n038923
41471F320347N592461P657738j460706m958558M213648J1340445M037460q609636
41463B4133199j1730315o395988l185654l676633j595613L673547O881353O207870
41455A4311766K990255k937903q505684n185578P094320J1948759k556349k2038988
41447d879402k2941052o193172P319606J1180322J7215064K3902262J2186729
$$ plain form
41503 16175 9092296 8351013 9837799 17183197 23483690 24373963 22199161 18983567 15683807
41494 15683807 17261156 27362020 37616678 33991747 16672502 2734784 4418721
41487 4418721 14547582 19248556 15729966 9674642 3078601 -5514639 -13947561 -19319695
41479 -19319695 -24126809 -30076526 -29540023 -14684091 6529239 16437387 11359270 6320347
41471 6320347 11912808 19570546 18109840 13151282 17364930 28705375 32742835 24133199
41463 24133199 12402884 6006896 2821242 -855391 -2451004 1222543 8103896 14311766
41455 14311766 17302021 14364118 5858434 672856 7767176 19715935 17159586 -4879402
41447 -4879402 -27820454 -34013626 -26694020 -15513698 1701366 25603628 37790357
41440C7790357j6504768k9004659p535668J7898309J1180446j5853892k2871563
41433b4901438j841193J6550439J3268168L049716J963790M188566J502492k20731
41425A3559809K812056J276889q207751j2027277k479334N507146k575401j5575855
41417a7709718j3192572K773870J2463100O855642m114607q367447k810364Q503924
41409a5598172J6006532R966749n339721j1303893o70139Q082546j477209j4196488
41401a4529795n120175J8029325K3244144L559658j2639920o541292N090554J358325
41393A2450824j0468505j1267612K18257J1363941J5014983R998173l809983j7077162
41385F422916j2872180P924242J9158456M957579j3991986j1431582L253227K256223
$$ plain form
41440 37790357 21285589 -7719070 -15254738 2643571 13824017 -2029875 -24901438
41433 -24901438 -26742631 -10192192 3075976 6125692 8089482 12278048 13780540 13559809
41425 13559809 16371865 17648754 9441003 -2586274 -5065608 441538 -2133863 -17709718
41417 -17709718 -30902290 -28128420 -15665320 -8809678 -12924285 -21291732 -24102096 -15598172
41409 -15598172 408360 10375109 5035388 -6268505 -6938644 1143902 -333307 -14529795
41401 -14529795 -19649970 -1620645 21623499 25183157 12543237 6001945 11092499 12450824
41393 12450824 1982319 -9285293 -9067036 2296905 17311888 27310061 23500078 6422916
41385 6422916 -6449264 1474978 20633434 25591013 11599027 167445 3420672 5676895
41377E676895j4030914j9492655o529699M814588L591829K691190J0042910J3442286
41369B06430M937062l883693l112453j18293k352253m312614k841810n272047
41361a6749671j0594828m260918J3834776J9047093j220917k1864952j4777477
41354c6586894R192771J9785683J3547755R952872J1850548L903294j2019393
41347A9626636j3725623L475382J5195824M636846j3119308j6100339n564753
41340e575335K558794K057758j070446j210920K174326O348084O184524l43770
41332A1123015n906303k414582L972677l18528j3147330j6803724n780437L531429
41324b5743783n18165o202627N41399J1716636J0717702n10229n956597j294947
$$ plain form
41377 5676895 -8354019 -27846674 -34376373 -29561785 -25969956 -23278766 -13235856 206430
41369 206430 5143492 1259799 -1852654 -1970947 -4323200 -8635814 -11477624 -16749671
41361 -16749671 -27344499 -31605417 -17770641 1276452 55535 -21809417 -36586894
41354 -36586894 -27394123 -7608440 5939315 15892187 27742735 31646029 19626636
41347 19626636 5901013 9376395 24572219 29209065 16089757 -10582 -5575335
41340 -5575335 -3016541 -958783 -2029229 -3240149 -1065823 5282261 11466785 11123015
41332 11123015 5216712 2802130 6774807 6456279 -6691051 -23494775 -29275212 -25743783
41324 -25743783 -26261948 -32464575 -31923176 -20206540 -9488838 -9999067 -15955664 -17250611
41316a7250611K586814J79303p97541N149049J0774569O884355l842125r805587
41308f121774m589321N936662J1093141Q237635M961319O764893P387363j854166
41300C1815752j6140503k0550853j0003433L797507P507715k94296j2031160j8139996
41292c4039267j0332327J0375512K6900529K0928549j664176j4789346o718173
41285i338699N778998N661410l63670J164386O787717O701926M756708Q171348
41277B9320124Q490959n554898k3769189k5360318j0211872J973842J945141m91896
41269b3658107J730192L103485N46790k06244K419541K527208j1094J333124M449588
41260g765517n49678j0974091j0274358N795860J9325172J6095309N026957L83536
$$ plain form
41316 -17250611 -14663797 -14484494 -15282035 -10132986 641583 7525938 3683813 -6121774
41308 -6121774 -10711095 -4774433 6318708 14556343 19517662 26282555 33669918 31815752
41300 31815752 15675249 -4875604 -14879037 -11081530 -3573815 -3868111 -15899271 -34039267
41292 -34039267 -44371594 -33996082 -7095553 13832996 12168820 -2620526 -9338699
41285 -9338699 -3559701 2101709 1738039 2902425 9690142 16392068 21148776 29320124
41277 29320124 37811083 32256185 8486996 -16873322 -27085194 -25111352 -23166211 -23658107
41269 -23658107 -21927915 -18824430 -18277640 -18483884 -16064343 -13537135 -13548229 -12215105 -7765517
41260 -7765517 -8315195 -19289286 -29563644 -23767784 -4442612 11652697 16679654 17063190
41252A7063190j05307m868316r029524k866788P707680O681707q093272k0871384
41244a4382014j8533388m218802J0460447J7636580J5997370Q928149K473354
41237A8361696N20117N67995k318113p407743q474556k936426L420193L630118
41229E363281j034244k961712L89481K031593l602146r642866n289290N920366
41221h825537Q309113j985214q848427q10100R700847O098348n082459o313238
41213g756667j88891l790357j4480909r454896J4724396K9605363J5519046q397045
41205A5780040j3316914j447201M234749k201049o470069k540776l72152m547218
41197a0880590n369543L507515J3499470J3894110O091588j352078n173088q807541
$$ plain form
41252 17063190 16957883 12089567 3060043 193255 7900935 14582642 6489370 -14382014
41244 -14382014 -32915402 -37134204 -26673757 -9037177 6960193 15888342 18361696
41237 18361696 18881813 19449808 17131695 9723952 1249396 -1687030 1733163 5363281
41229 5363281 4329037 1367325 1756806 3788399 186253 -9456613 -14745903 -8825537
41221 -8825537 -516424 -2501638 -11350065 -12160165 -2459318 3639030 -1443429 -7756667
41213 -7756667 -7945558 -11735915 -26216824 -35671720 -20947324 8658039 24177085 15780040
41205 15780040 2463126 1015925 5250674 3049625 -3420444 -5961220 -6333372 -10880590
41197 -10880590 -16250133 -12742618 756852 14650962 20742550 19390472 14217384 5409843
41189E409843j4199171j6710983r732990N209378J5444884R794110n945133j4023695
41181b4753757p076762M042652Q230509Q155288R365588P978738O31386m044487
41173B529155J850273R458502N543822n099356o477967K899824Q744186M564803
41165B4013242j077311k643451n588613j1471259j1130209o37828Q796256O038968
41157F299795m259303r649967o248233M22540M821512M679936k19966o489472
41149a0643158q183033l999766M18544R44824R75717M921917J0345997J1573144
41141F354186Q048514M438479L848133M275967J780315l701158o194586k90692
41133A8559158Q552332O545907r255157k0930106j0481815J3123558K2779230
$$ plain form
41189 5409843 -8789328 -25500311 -35233301 -30023923 -14579039 -4784929 -10730062 -24753757
41181 -24753757 -31830519 -27787867 -19557358 -11402070 -2036482 5942256 6573642 2529155
41173 2529155 4379428 13837930 19381752 14282396 7804429 10704253 19448439 24013242
41165 24013242 22935931 20292480 14703867 3232608 -7897601 -8535429 260827 6299795
41157 6299795 2040492 -7609475 -13857708 -13435168 -8613656 -3933720 -4153686 -10643158
41149 -10643158 -18826191 -22825957 -22407413 -21462589 -20486872 -15564955 -5218958 6354186
41141 6354186 14402700 18841179 22689312 26965279 28745594 25044436 18849850 18559158
41133 18559158 27111490 33657397 24402240 3472134 -7009681 6113877 28893107
41126B8893107R366608p724008j0630915n586909n428507o786937j291194L491884
$$ plain form
41126 28893107 38259715 30535707 19904792 14317883 8889376 2102439 811245 4303129
$$ [...]
##END NTUPLES=NMR SPECTRUM
##END=
