##TITLE=31Pdec_SR2-Host
 D2O, 24 sc
 25.10.2019
##JCAMPDX= 6.0         $$ Bruker NMR JCAMP-DX V2.0
##DATA TYPE= NMR SPECTRUM
##DATA CLASS= NTUPLES
##ORIGIN= UXNMR, Bruker Analytische Messtechnik GmbH
##OWNER= root
$$ XWIN-NMR		Version 3.5
$$ Fri Oct 25 15:18:12 2019 Russian Standard Time (UT+4h)  she@DPX200
##.OBSERVE FREQUENCY= 81.013821
##.OBSERVE NUCLEUS= ^31P
##.ACQUISITION MODE= SIMULTANEOUS
##.ACQUISITION SCHEME= undefined
##.AVERAGES= 24
##.DIGITISER RES= 17
##SPECTROMETER/DATA SYSTEM= spect
##.PULSE SEQUENCE= zgpg30
##.SOLVENT NAME= CDCl3
##.SHIFT REFERENCE= (INTERNAL, CDCl3, 0, 182.463)
##AUDIT TRAIL= $$ (NUMBER, WHEN, WHO, WHERE, WHAT)
$$ ##TITLE= Audit trail, XWIN-NMR		Version 3.5
$$ ##JCAMPDX= 5.01
$$ ##ORIGIN= Bruker BioSpin GmbH
$$ ##OWNER= she
$$ F:/spectra/data/she/nmr/P31/1/pdata/1/auditp.txt
$$ ##AUDIT TRAIL=  $$ (NUMBER, WHEN, WHO, WHERE, WHAT)
(   1,<2019-10-25 15:16:56.31 +0400>,<she>,<DPX200>,
      <created by zg, POWCHK disabled, PULCHK disabled
       configuration hash MD5:
       00 E9 B6 7A A2 85 ED C7 34 08 36 98 17 FE 4E 26
       data hash MD5: 32K
       09 80 D6 72 FF 88 9A 01 F7 27 13 C2 81 CB C2 79>)
(   2,<2019-10-25 15:16:58.87 +0400>,<she>,<DPX200>,
      <Start of raw data processing
       efp BC_mod = 2 LB = 1 FT_mod = 6 PKNL = 1 PHC0 = -930.0638 PHC1 = 538.0007 SI = 64K 
       data hash MD5: 64K
       16 E0 FD BE 2D 78 85 CE 2E 34 4D 9B 19 0C B3 F8>)
(   3,<2019-10-25 15:17:09.10 +0400>,<she>,<DPX200>,
      <pk PHC0 = -11.04993 PHC1 = 0 
       data hash MD5: 64K
       6E 69 C9 67 81 74 4A 55 0C 77 CB F8 86 23 88 79>)
(   4,<2019-10-25 15:17:11.85 +0400>,<she>,<DPX200>,
      <abs ABSG = 5 
       data hash MD5: 64K
       6C 93 4E 4C E6 54 D6 77 C2 4E 57 78 E9 40 3B A0>)
(   5,<2019-10-25 15:17:36.37 +0400>,<she>,<DPX200>,
      <pk PHC0 = 129.3253 PHC1 = -325.2 
       data hash MD5: 64K
       E5 66 6C 6B 98 12 4C D1 DE BB B2 E8 77 0C D6 98>)
(   6,<2019-10-25 15:17:39.70 +0400>,<she>,<DPX200>,
      <abs ABSG = 5 
       data hash MD5: 64K
       8D EB 59 FF A0 D5 F9 FA CA 6E F0 5B 88 72 5B A0>)
$$ ##END=
$$ 
$$ hash MD5
$$ E8 CB BE 92 54 10 EC 9F 9B C6 60 A6 E0 61 A2 DD
##$RELAX= 
##$RELAX= 
##$RELAX= 
##$RELAX= 
##$RELAX= 
##$RELAX= 
##$RELAX= 
##$RELAX= 
$$ Bruker specific parameters
$$ --------------------------
##$DU= <F:/spectra>
##$EXPNO= 1
##$NAME= <P31>
##$PROCNO= 1
##$TYPE= <nmr>
##$USER= <she>
##$AMP= (0..31)
100 100 100 100 100 100 100 100 100 100 100 100 100 100 100 100 100 100 
100 100 100 100 100 100 100 100 100 100 100 100 100 100 
##$AQSEQ= 0
##$AQ_mod= 1
##$AUNM= <au_zg>
##$AUTOPOS= <>
##$BF1= 81.014009
##$BF2= 200.13
##$BF3= 200.13
##$BF4= 200.13
##$BF5= 200.13
##$BF6= 200.13
##$BF7= 200.13
##$BF8= 200.13
##$BYTORDA= 1
##$CFDGTYP= 0
##$CFRGTYP= 5
##$CHEMSTR= <none>
##$CNST= (0..31)
1 1 145 1 1 1 1 1 1 1 1 1 1 1 1 1 1 1 1 1 1 1 1 1 1 1 1 1 1 1 1 1 
##$CPDPRG= <waltz16>
##$CPDPRG1= <>
##$CPDPRG2= <waltz16>
##$CPDPRG3= <>
##$CPDPRG4= <mlev>
##$CPDPRG5= <mlev>
##$CPDPRG6= <mlev>
$$ [...]
##$SUBNAM3= <"">
##$SUBNAM4= <"">
##$SUBNAM5= <"">
##$SUBNAM6= <"">
##$SUBNAM7= <"">
##$SUBNAM8= <"">
##$SUBNAM9= <"">
##$SW= 369.568048894756
##$SWIBOX= (0..15)
0 1 3 0 0 0 0 0 0 0 0 0 0 0 0 0 
##$SW_h= 29940.119760479
##$TD= 32768
##$TD0= 1
##$TE= 0
##$TE2= 300
##$TE3= 300
##$TEG= 300
##$TL= (0..7)
0 120 53 12 22 120 120 120 
##$TP= (0..7)
150 150 150 150 150 150 150 150 
##$TP07= 0
##$TPNAME0= <>
##$TPNAME1= <>
##$TPNAME2= <>
##$TPNAME3= <>
##$TPNAME4= <>
##$TPNAME5= <>
##$TPNAME6= <>
##$TPNAME7= <>
##$TPOAL= (0..7)
0.5 0.5 0.5 0.5 0.5 0.5 0.5 0.5 
##$TPOFFS= (0..7)
0 0 0 0 0 0 0 0 
##$TUNHIN= 0
##$TUNHOUT= 0
##$TUNXOUT= 0
##$USERA1= <user>
##$USERA2= <user>
##$USERA3= <user>
##$USERA4= <user>
##$USERA5= <user>
##$V9= 5
##$VALIST= <valist>
##$VCLIST= <CCCCCCCCCCCCCCC>
##$VD= 0
##$VDLIST= <DDDDDDDDDDDDDDD>
##$VPLIST= <PPPPPPPPPPPPPPP>
##$VTLIST= <TTTTTTTTTTTTTTT>
##$WBST= 1024
##$WBSW= 4
##$XGAIN= (0..3)
0 0 0 0 
##$XL= 0
##$YL= 0
##$YMAX_a= 24523
##$YMIN_a= -32881
##$ZGOPTNS= <>
##$ZL1= 120
##$ZL2= 120
##$ZL3= 120
##$ZL4= 120
##$ABSF1= 182.463
##$ABSF2= -187.1042
##$ABSG= 5
##$ABSL= 3
##$ALPHA= 0
##$AQORDER= 0
##$ASSFAC= 0
##$ASSFACI= 0
##$ASSFACX= 0
##$ASSWID= 0
##$AUNMP= <proc_1d>
##$AZFE= 0.1
##$AZFW= 0.5
##$BCFW= 0
##$BC_mod= 2
##$BYTORDP= 0
##$COROFFS= 0
##$CY= -3
##$DATMOD= 1
##$DC= 0
##$DFILT= <>
##$DTYPP= 0
##$F1P= 0
##$F2P= 0
##$FCOR= 1
##$FTSIZE= 65536
##$FT_mod= 6
##$GAMMA= 0
##$GB= 0
##$INTBC= 1
##$INTSCL= 5.30512e-09
##$ISEN= 30
##$LB= 1
##$LEV0= 0
##$LPBIN= 0
##$MAXI= 10000
##$MC2= 0
##$MEAN= 0
##$ME_mod= 0
##$MI= 50
##$NCOEF= 0
##$NC_proc= -6
##$NLEV= 6
##$NOISF1= 182.463
##$NOISF2= 159.3651
##$NSP= 0
##$NTH_PI= 0
##$NZP= 0
##$OFFSET= 182.463
##$PC= 4
##$PHC0= -811.7884
##$PHC1= 212.8007
##$PH_mod= 1
##$PKNL= yes
##$PPARMOD= 0
##$PSCAL= 0
##$PSIGN= 0
##$REVERSE= no
##$SF= 81.0140089999434
##$SI= 65536
##$SIGF1= 159.3651
##$SIGF2= -187.1042
##$SINO= 113.3802
##$SIOLD= 16384
##$SREGLST= <1H.CDCl3>
##$SSB= 0
##$STSI= 65536
##$STSR= 0
##$SW_p= 29940.119760479
##$SYMM= 0
##$S_DEV= 0
##$TDeff= 32768
##$TDoff= 0
##$TI= <>
##$TILT= no
##$TM1= 0
##$TM2= 0
##$TOPLEV= 0
##$USERP1= <user>
##$USERP2= <user>
##$USERP3= <user>
##$USERP4= <user>
##$USERP5= <user>
##$WDW= 1
##$XDIM= 65536
##$YMAX_p= 318934087
##$YMIN_p= -33594196
$$ End of Bruker specific parameters
$$ ---------------------------------
##NTUPLES= NMR SPECTRUM
##VAR_NAME=  FREQUENCY,     SPECTRUM/REAL,   SPECTRUM/IMAG
##SYMBOL=    X,             R,               I
##VAR_TYPE=  INDEPENDENT,   DEPENDENT,       DEPENDENT
##VAR_FORM=  AFFN,          ASDF,            ASDF
##VAR_DIM=   65536,         65536,           65536
##UNITS=     HZ,            ARBITRARY UNITS, ARBITRARY UNITS
##FACTOR=    0.456856943014862, 1,           1
##FIRST=     14782.0589164792, 0,            0
##LAST=      -15158.0608439998, 0,           0
##MIN=       -15158.0608439998, -33594196,   0
##MAX=       14782.0589164792, 318934087,    0
$$ Real data points
##PAGE= N=1
##DATA TABLE= (X++(R..R)), XYDATA
$$ [...]
42080A667095m95893n45391p05227j486374j466738J004582L968527L439756n19792
$$ 1667095 1171202 625811 -79416 -1565790 -3032528 -2027946 1940581 5380337 4860545
42071D860545l107376j502132J370043J756707L44351q6471N52657M68206k92737
$$ 4860545 1753169 251037 1621080 3377787 3722138 3635667 4188324 4656530 4363793
42062D363793k21078N51547M45784p37484j617327j595268j340589j112650m76925
$$ 4363793 4142715 4694262 5140046 4402562 2785235 1189967 -150622 -1263272 -1740197
42053a740197L69474O26075K69428P3437K94743M89067N20756P19772J158955
$$ -1740197 -1370723 -744648 -475220 -401783 -107040 382027 902783 1622555 2781510
42044B781510J581462J759304J325582o7925j732451k093099q49660J64438m14682
$$ 2781510 4362972 6122276 7447858 7379933 5647482 3554383 2704723 2869161 2454479
42035B454479j277889o11652P09959M71023j028302j189912P40636K415116J974310
$$ 2454479 1176590 564938 1274897 1745920 717618 -472294 268342 2683458 4657768
42026D657768N68076J52286O84897R17830N29573m044o12610j295494j374045
$$ 4657768 5225844 5378130 6063027 6980857 7510430 7506386 6893776 5598282 4224237
42017D224237m24003O36934O89427J80213M07548J315948J469461L38445p99692
$$ 4224237 3800234 4437168 5126595 5306808 5714356 7030304 8499765 8838210 8038518
42008H038518p64573q6462J10516r8433R6808N33780K26247p48231q80675O23089
$$ 8038518 7273945 7187483 7297999 7199566 7296374 7830154 8056401 7308170 6427495 7050584
41998G050584K350712K301347M43994j288341j273943L64216K346229L375461
$$ 7050584 9401296 11702643 12146637 10858296 9584353 9948569 12294798 15670259
41990A5670259K860359J401493M72541P99622J333628Q41581M7450O09677K188650
$$ 15670259 18530618 19932111 20404652 21204274 22537902 23379483 23426933 24036610 26225260
41981B6225260K594378J193758n6474J68148O13990J33148k2687J259522K189920
$$ 26225260 28819638 30013396 29956922 30125070 30739060 30872208 30849521 32109043 34298963
41972C4298963P27582j492744j298539P05231P29310k134842m292464l207992
$$ 34298963 35026545 33533801 32235262 32940493 33669803 31534961 27242497 24034505
41964B4034505r84593m19370o91770J97878J210444L5726k359501k730825p51189
$$ 24034505 23049912 22630542 21938772 22136650 23347094 23382820 21023319 18292494 17541305
41955A7541305M07724q17897k080280j257363Q9657m05789j803388j453793M78667
$$ 17541305 17949029 17131132 15050852 13793489 13883146 13477357 11673969 10220176 10698843
41946A0698843J147745m23446j795652r48952P51184R86534R2524J03499J154206
$$ 10698843 11846588 11423142 9627490 8678538 9429722 10416256 10508780 10612279 11766485
41937A1766485J247209l61232j767871j240872K94768Q80475M10600K77088P79813
$$ 11766485 13013694 12652462 10884591 9643719 9938487 10818962 11229562 11506650 12286463
41928A2286463P15838l57530j115749m39638Q39301J248795R50784J332496K489583
$$ 12286463 13002301 12644771 11529022 11089384 11928685 13177480 14128264 15460760 17950343
41919A7950343K609583N53451k014670k370990l08164J462691R20496n54542k19775
$$ 17950343 20559926 21113377 19098707 16727717 16419553 17882244 18802740 18248198 18028423
41910A8028423K112079L849792L248058J515729O40474O30276K26452o50675q92434
$$ 18028423 20140502 23990294 27238352 28754081 29394555 30024831 30251283 29600608 28708174
41901B8708174l59832l24954j347735k120609j331330K18250M90954j068564k728582
$$ 28708174 28348342 28023388 26675653 24555044 23223714 23441964 23932918 22864354 20135772
41892B0135772k609151r42046L00276k23275j749987k464766j686633n60118m90615
$$ 20135772 17526621 16584575 16884851 16661576 14911589 12446823 10760190 10200072 9709457
41883I709457j315170j534307l62972J029623Q65430q40053k004450j015349J092696
$$ 9709457 8394287 6859980 6497008 7526631 8392061 7552008 5547558 4532209 5624905
41874E624905J871919N96505j011117j365052r62749r69728j164352p17706j14333
$$ 5624905 7496824 8093329 7082212 5717160 4754411 3784683 2620331 1902625 1788292
41865A788292m46540j172501o33676J009495J454793l34150k243198j799197N34614
$$ 1788292 1341752 169251 -464425 545070 1999863 1665713 -577485 -2376682 -1842068
41856a842068K279739K166648R85407j17692p47395r07222o71634k04771M42748
$$ -1842068 437671 2604319 3589726 3472034 2724639 1817417 1145783 941012 1383760
41847A383760J219504J462930L19950j625516k314558q34163J013709J050744
$$ 1383760 2603264 4066194 4386144 2760628 446070 -388093 625616 1676360
41839A676360l62269j260074j056934q10192j025532j050378n29259J25198O66060
$$ 1676360 1314091 54017 -1002917 -1813109 -2838641 -3889019 -4418278 -4293080 -3627020
41830c627020J085143J012837L95246K98467J446256K501092J737450l1238n07999
$$ -3627020 -2541877 -1529040 -1133794 -835327 610929 3112021 4849471 4818233 4310234
41821D310234L20432J69737j499789k350700j068716M15328K34276l72140M84306
$$ 4310234 4630666 4800403 3300614 949914 -118802 296526 530802 158662 642968
41812F42968J789070J151594j252071k859109k401492j112785k84637L25256J216616
$$ 642968 2432038 3583632 2331561 -527548 -2929040 -4041825 -4326462 -4001206 -2784590
41803b784590J896759J658642O80217k35203n01244q5387N32735O34177m7593
$$ -2784590 -887831 770811 1451028 1215825 714581 629194 1161929 1796106 1748513
41794A748513q18746o34038O34450J826013J601167q8264j732689j689635k5227
$$ 1748513 929767 295729 930179 2756192 4357359 4269095 2536406 846771 821544
41785H21544J376583R14741q58966k044980j721807o32166K39358P40331J113851
$$ 821544 2198127 3112868 2253902 208922 -1512885 -2145051 -1905693 -1165362 -51511
41776e1511J396954J459930J041209j15638j492699j722461m25680N46917n49045
$$ -51511 1345443 2805373 3846582 3730944 2238245 515784 90104 637021 87976
41767H7976k255523j471465J851556M215608L465986J477420O56714M09019q49849
$$ 87976 -2167547 -3639012 -1787456 2428152 5894138 7371558 8028272 8437291 7587442
41758G587442k338355k191527p59065m3883n74911j097722q93501l75675K43796
$$ 7587442 5249087 3057560 2298495 2254612 1679701 581979 -311522 -687197 -443401
41749d43401J000700J218481K91681q56872q22707P4529L74412m2419K7807P25326
$$ -443401 557299 1775780 2067461 1210589 387882 462411 836823 794404 822211 1547537
41739A547537P91782j30801p93045m82675j68441p08443j319736q16691N60078
$$ 1547537 2339319 2208518 1415473 932798 764357 55914 -1263822 -2080513 -1520435
41730a520435J460597J049445k93923j526197j796422j028276R5138Q10385Q93664
$$ -1520435 -59838 989607 695684 -830513 -2626935 -3655211 -3560073 -2749688 -1856024
41721a856024N78387K26934K19917O33257Q64341L12112m41493k25479O98063
$$ -1856024 -1277637 -1050703 -830786 -197529 666812 978924 537431 311952 1010015
41712A010015P28277l75732p89523K43299O89241r45323k541155j352525J320331
$$ 1010015 1738292 1362560 573037 816336 1505577 560254 -1980901 -3333426 -2013095
41703b013095J692145q07058k700580j609943P70078J713839J006655K34422L41564
$$ -2013095 -320950 -1128008 -3828588 -5438531 -4668453 -2954614 -1947959 -1713537 -1371973
41694a371973J090809J777132J672957O27917m62985o47462k66833k93825p29671
$$ -1371973 -281164 1495968 3168925 3796842 3333857 2686395 2419562 2125737 1396066
41685A396066r58952j112220j473322j237412J66485J233797K57273j515821j333339
$$ 1396066 437114 -675106 -2148428 -3385840 -3219355 -1985558 -1728285 -3244106 -4577445
41676d577445P49840J971361J238640K72385J68983J34013J13616J176320K473451
$$ -4577445 -3827605 -1856244 -617604 -345219 -176236 -42223 71393 1247713 3721164
41667C721164J504227j394889k600677p78124J021444P68185O93816K349239K765401
$$ 3721164 5225391 3830502 1229825 451701 1473145 2241330 2935146 5284385 8049786
41658H049786m58391l909805l059767M68968J535401m09710j309981K14696J116848
$$ 8049786 7591395 3681590 621823 1090791 2626192 2216482 906501 1121197 2238045
41649B238045j85155j280612m71989L38331n94504j689580q58524J080845J961142
$$ 2238045 2052890 772278 300289 638620 44116 -1645464 -2503988 -1423143 537999
41640E37999J387005M53876k33641o73591o64950j95887J32107m7981l01917k30262
$$ 537999 1925004 2378880 2145239 1471648 806698 610811 742918 694937 393020 162758
41630A62758r7328k34186n83950j023616j307036p41346R81432K664764K592653
$$ 162758 65430 -168756 -752706 -1776322 -3083358 -3824704 -2843272 -178508 2414145
41621B414145P57680j097877j732448j430518p66948J39155Q38980N06461p36158
$$ 2414145 3171825 2073948 341500 -1089018 -1855966 -1716811 -877831 -371370 -1107528
41612a107528j610397j364393p07358n91042q95044p73128K57382J766752K571871
$$ -1107528 -2717925 -4082318 -4789676 -5380718 -6275762 -7048890 -6791508 -5024756 -2452885
41603b452885J711825k26524j375905r24100k63154p08745j266876m18036R63569
$$ -2452885 -741060 -967584 -2343489 -3267589 -3530743 -4239488 -5506364 -5924400 -4960831
41594d960831Q21029o02391j104898j24775P19487P68513J126580J848474J316006
$$ -4960831 -4139802 -4742193 -5847091 -5971866 -5252379 -4483866 -3357286 -1508812 -192806
41585a92806n34279j222484M78920K268543J709574k17800j016608l93134J01029
$$ -192806 -727085 -1949569 -1470649 797894 2507468 2289668 1273060 879926 980955
41576I80955j34530m35733n09765n36627k69254M38254Q49953M35103j2339L65767
$$ 980955 846425 410692 -99073 -635700 -904954 -466700 383253 818356 806017 1171784
41566A171784R49630P11993k3512l30307l57884p27994j023234n55656q787m83791
$$ 1171784 2121414 2833407 2809895 2479588 2121704 1393710 370476 -185180 -193967 -677758
41556f77758j306363p44781J086928J971980P21114j050193j128184M03450J465092
$$ -677758 -1984121 -2728902 -1641974 330006 1051120 927 -1127257 -723807 741285
41547G41285O96712r79845j599774n38509P74913P17384m01896q62154n7394O54065
$$ 741285 1437997 458152 -1141622 -1680131 -905218 -187834 -589730 -1451884 -1509278 -855213
41537h55213L7359j208477j555008p26432K77383P08926P45613R13408J423928
$$ -855213 -817854 -2026331 -3581339 -4307771 -4030388 -3321462 -2575849 -1662441 -238513
41528b38513J865472J415242o6040j238328p31613N60359L39238j449278j942321
$$ -238513 1626959 3042201 2976161 1737833 1006220 1566579 1905817 456539 -1485782
41519a485782L94160K951926K490833j81641j623079p96109J72058j08351n74013
$$ -1485782 -1091622 1860304 4351137 4169496 2546417 1750308 1922366 1814015 1240002
41510A240002k84496n7664n37003p39080J81982J266852J175083K01769l50643
$$ 1240002 955506 897842 360839 -378241 -196259 1070593 2245676 2447445 2096802
41501B096802p8790L40718M27388L92479M72795M29793j44397j183399j898107
$$ 2096802 2018012 2358730 2786118 3178597 3651392 4081185 3936788 2753389 855282
41492H55282j454227j31181O61187R9882p91271m94868P23164J083474j03992
$$ 855282 -598945 -730126 -68939 30943 -760328 -1255196 -532032 551442 447450
41483D47450j323555q56330R53619K133666J426141l43671j269074n35957O85038
$$ 447450 -876105 -1732435 -778816 1354850 2780991 2437320 1168246 632289 1317327
41474A317327Q41487J53199J39907R59658Q35122r99267k479215j555519M64414
$$ 1317327 2158814 2312013 2451920 3411578 4246700 3247433 768218 -787301 -322887
41465c22887P07333r13672j766428p43941L60645K38460Q8146J030238J845889
$$ -322887 384446 -529226 -2295654 -3039595 -2678950 -2440490 -2352344 -1322106 523783
41456E23783J050550m90965r19822j86635L13326R4624j69390k68782o93935j354301
$$ 523783 1574333 1083368 163546 -23089 290237 384861 215471 -53311 -747246 -2101547
41446b101547j384775l79404J014770J786967J385486J40095p50638k40644J085579
$$ -2101547 -3486322 -3865726 -2850956 -1063989 321497 461592 -289046 -529690 555889
41437E55889J382406M4376j200302p18881N77502P04327l11936p00302N7313N25806
$$ 555889 1938295 1982671 782369 63488 640990 1345317 1033381 333079 390392 916198
41427I16198j72923j032889r92934n03971l63649k59864M58736J470284J957353
$$ 916198 743275 -289614 -1282548 -1786519 -2150168 -2410032 -1951296 -481012 1476341
41418A476341J720666R57212l36011j765584k087206o23691J285410J618504L39138
$$ 1476341 3197007 4154219 3818208 2052624 -34582 -658273 627137 2245641 2584779
41409B584779o32265k38041L46739k89393j672053k229523j378324J19664J324159
$$ 2584779 1952514 1714473 2061212 1771819 99766 -2129757 -3508081 -3388417 -2064258
41400b064258J763538J358021N50269J62514L49493J48849j028357k030885j393842
$$ -2064258 -300720 1057301 1607570 1770084 2119577 2268426 1240069 -790816 -2184658
41391b184658K20551O54435n58440j390945l58649J269985J461842L70787k02385
$$ -2184658 -1964107 -1309672 -1868112 -3259057 -3617706 -2347721 -885879 -515092 -717477
41382g17477L80862Q79716J84116j191821j908701j366153j75722O06285N70347
$$ -717477 -336615 543101 727217 -464604 -2373305 -3739458 -3915180 -3308895 -2738548
41373b738548K71190L24547M55935P7130m15518q345J185168J834277J374786
$$ -2738548 -2467358 -2142811 -1686876 -1609746 -2025264 -2033609 -848441 985836 2360622
41364B360622O83802L11291k99820j097079q75985L50881N50113j029513j927663
$$ 2360622 3044424 3355715 3055895 1958816 1082831 1433712 1983825 954312 -973351
41355i73351k60977J632750N77689k002037j987292Q38701K425715R06874r06491
$$ -973351 -1234328 398422 976111 -1025926 -3013218 -2174517 251198 1158072 251581
41346B51581n72718M88742L66198q0455L58724O11281l23170r59738R8089J421315
$$ 251581 -321137 167605 533803 453348 812072 1423353 1100183 140445 238534 1659849
41336A659849J217646L95698M42276L93356r66920j905884l82185J706196R86447
$$ 1659849 2877495 3273193 3715469 4108825 3141905 1236021 853836 2560032 3546479
41327C546479j654226k144971K17001J741393L98121j435668j548082j147457
$$ 3546479 1892253 -252718 -35717 1705676 2103797 668129 -879953 -2027410
41319b027410j573082j390914N70023K206568J223694q89501j085517N25338J307800
$$ -2027410 -3600492 -4991406 -4421383 -2214815 -991121 -1880622 -2966139 -2440801 -1133001
41310a133001N40301J00106R12388J548548P79355p25265j833273k260965j871623
$$ -1133001 -592700 -492594 419794 1968342 2747697 2022432 189159 -2071806 -3943429
41301c943429l47584J657323K434445J229018o15647j294380n70737M19424O54034
$$ -3943429 -4291013 -2633690 -199245 1029773 414126 -880254 -1450991 -1031567 -377533
41292c77533m1689j048236j248823l5115J500237J328202q27390k580891j781299
$$ -377533 -419222 -1467458 -2716281 -2751396 -1251159 77043 -750347 -3331238 -5112537
41283e112537N53039J687963R85551L81866J040400J575400M58074j461502k185177
$$ -5112537 -4559498 -2871535 -1885984 -1504118 -463718 1111682 1569756 108254 -2076923
41274b076923j264352J23948J078309J524059J335570M35159l36900Q3595J224171
$$ -2076923 -3341275 -3217327 -2139018 -614959 720611 1155770 818870 902465 2126636
41265B126636J322076k62277k007799k158103p89182O00376Q43805l4401j094535
$$ 2126636 3448712 3186435 1178636 -979467 -1768649 -1168273 -324468 -358869 -1453404
41256a453404j230110j92691R39821R72011K67727K19405R74745J079655j43773
$$ -1453404 -2683514 -2876205 -1936384 -964373 -696646 -477241 497504 1577159 1433386
41247A433386j361913j278042n46599m15718o29199j82331O78348Q38519K24568
$$ 1433386 71473 -1206569 -1753168 -2168886 -2798085 -2980416 -2302068 -1463549 -1238981
41238a238981j95689n4114J64872L08168O34253Q41961L76272l32837l04058K56245
$$ -1238981 -1434670 -1488784 -1323912 -1015744 -381491 460470 836742 503905 199847 456092
41228D56092P6932j016132j472100k18779J593866J912820K44400j892726k661746
$$ 456092 533024 -483108 -1955208 -2173987 -580121 1332699 1577099 -315627 -2977373
41219b977373j604637J82034J297747J400052J154484R23135K76037q14316j310246
$$ -2977373 -4582010 -4399976 -3102229 -1702177 -547693 375442 651479 -162837 -1473083
41210a473083n99139K39202j8232o36049l2493J446138J826413O11592m35697
$$ -1473083 -2072222 -1833020 -1851252 -2487301 -2519794 -1073656 752757 1364349 928652
41201I28652r8260O03866L73069l85607o59191n31531n48281m71741K5506K80457
$$ 928652 830392 1434258 1807327 1421720 762529 230998 -317283 -789024 -763518 -483061
41191d83061l81030j165848p03220Q19008J694899J006810j39809j23275J067400
$$ -483061 -864091 -2029939 -2733159 -1914151 -219252 787558 647749 524474 1591874
41182A591874J822179R85527n66338r67797R3526P98332k78261k030276k406641
$$ 1591874 3414053 4399580 3833242 2865445 2958971 3757303 3479042 1448766 -957875
41173i57875j397125p24411q70187m93175Q79652J731282J043763J723q1538J22944
$$ -957875 -2355000 -3079411 -3949598 -4442773 -3563121 -1831839 -788076 -786353 -867891 -744947
41163g44947m96221j240924p84431L88849P33566K46544K84198R76153Q55023
$$ -744947 -1241168 -2482092 -3266523 -2877674 -2144108 -1897564 -1613366 -637213 217810
41154B17810o04033j828073j282346M46878J531041J138384J13375k07416N63905
$$ 217810 -386223 -2214296 -3496642 -3049764 -1518723 -380339 -266964 -474380 89525
41145H9525J444680J045290q12169k611121k702085j159776M50914R81083O92201
$$ 89525 1534205 2579495 1767326 -843795 -3545880 -4705656 -4254742 -3273659 -2581458
41136b581458L77756K45444o851m39914o12106p0824J011739J831516J742887
$$ -2581458 -2203702 -1958258 -1965109 -2405023 -3017129 -3087953 -2076214 -244698 1498189
41127A498189R48755J21614m65798r05322r64242l01985O13696Q31121L72954
$$ 1498189 2446944 2568558 2102760 1197438 233196 -68789 544907 1376028 1748982
41118A748982K81127Q65407J140726N64313o684P1361j380r73907k051108k164348
$$ 1748982 2030109 2895516 4036242 4600555 4593871 4665232 4663852 3689945 1638837 -525511
41108e25511j581951r00324L10068K177529L084070J650693p31290j583082q20552
$$ -525511 -2107462 -3007786 -2697718 -520189 2563881 4214574 3483284 1900202 1079650
41099A079650j73387J55744J327091K618014J697606j246003k878328j474545
$$ 1079650 906263 1062007 2389098 5007112 6704718 5458715 2580387 1105842
41091A105842N86658O95003l47852o32343o06509j548236k429565j351176R44448
$$ 1105842 1692500 2387503 2039651 1407308 800799 -747437 -3177002 -4528178 -3583730
41082c583730J962166J354490J090715J790038J683462j80366k105060k180529
$$ -3583730 -1621564 -267074 823641 2613679 4297141 4116775 2011715 -168814
41074a68814p76275M85643Q94653P64591M67509L19438N90050Q39707Q3847j612611
$$ -168814 -945089 -459446 435207 1199798 1667307 1986745 2576795 3416502 3500349 1887738
41064A887738k590460j603371L66588J382840J078016O70769P69603N84581m19702
$$ 1887738 -702722 -2306093 -1939505 -556665 521351 1192120 1961723 2546304 2126602
41055B126602j332618j010658K23807R24012L16124q83538j422255q41357J93955
$$ 2126602 793984 -216674 7133 931145 1247269 363731 -1058524 -1899881 -1705926
41046a705926O17128p503r93143j146935q0418J243338J567674P85582q5366k31558
$$ -1705926 -1088798 -1096301 -2089444 -3236379 -3316797 -2073459 -505785 279797 194431 -37127
41036c7127K13887P13399R05766N14938n30113j547945j498019m53566J72996
$$ -37127 176760 890159 1795925 2310863 1780750 232805 -1265214 -1718780 -1545784
41027a545784l53275p61356L20944J856179J492768r61447k950175k499559n75162
$$ -1545784 -1899059 -2660415 -2339471 -483292 1009476 48029 -2902146 -5401705 -5976867
41018e976867O65610O31924K54775K26461N13240R66550J259930O82031q97692
$$ -5976867 -5311257 -4679333 -4424558 -4198097 -3684857 -2718307 -1458377 -776346 -1674038
41009a674038k208875j855571k28129R48847Q98223N02957O54547J043901J003047
$$ -1674038 -3882913 -5738484 -5966613 -5017766 -4119543 -3616586 -2962039 -1918138 -915091
41000i15091O01444L15775K61439K95113L68542L01959k80548j228852j533987
$$ -915091 -313647 2128 263567 558680 927222 1229181 948633 -280219 -1814206
40991a814206m35126J350521K210874J453515m5114j046554j186617q02802j71908
$$ -1814206 -2249332 -898811 1312063 2765578 2720464 1673910 487293 -315509 -487417
40982d87417N44844R71977Q01341L45896K51709O11071Q90532Q30343P78136Q41504
$$ -487417 57427 1029404 1830745 2176641 2428350 3039421 3929953 4760296 5538432 6379936
40972F379936L95163r59047k431725k811479j951347p79528k8448K71793J92103
$$ 6379936 6775099 5816052 3384327 572848 -1378499 -2158027 -2186475 -1914682 -1722579
40963a722579k62341o58939m09702K62397N07022K07989J76958O52363P18526
$$ -1722579 -1984920 -2643859 -3053561 -2791164 -2284142 -2076153 -1899195 -1246832 -528306
40954e28306j48838j003574p53037K97423J108560J298902R57277j5230j231943
$$ -528306 -677144 -1680718 -2433755 -2136332 -1027772 271130 1228407 1213177 -18766
40945a8766j420409j39777R30628J58632j278342r30586J000235J814726O12155
$$ -18766 -1439175 -1578952 -648324 -489692 -1768034 -2698620 -1698385 116341 728496
40936G28496l10588O62467J811969J027353p76441j403727r07819q87697j365854
$$ 728496 417908 1080375 2892344 3919697 3143256 1739529 831710 -55987 -1421841
40927a421841j022192K1132L07821j75854P3315J139094J264289N327p34792P5213
$$ -1421841 -2444033 -2422901 -2115080 -2290934 -2217619 -1078525 185764 191091 -543701 -468488
40917d68488P42888k15595j420981r06604O64039J319575J012337J062168J282074
$$ -468488 274400 58805 -1362176 -2268780 -1604741 -285166 727171 1789339 3071413
40908C071413L47409j313651j694024m61183M45483m3045p44907p27238q42814
$$ 3071413 3418822 2105171 411147 -50036 395447 352402 -392505 -1119743 -1962557
40899a962557j622643j817765n93141O88127O32511J32593N58965J124976L86953
$$ -1962557 -3585200 -5402965 -5996106 -5307979 -4675468 -4542875 -3983910 -2858934 -2471981
40890b471981p82734m13784J008816J108090l05072o86526J051512K615609J919382
$$ -2471981 -3254715 -3668499 -2659683 -1551593 -1856665 -2543191 -1491679 1123930 3043312
40881C043312K03067k34748M47617M86248m16593j058062j012896q76143o72049
$$ 3043312 3246379 3011631 3459248 3945496 3528903 2470841 1457945 581802 -90247
40872i0247k3312L12469q34131k620838k582900r4825K418915K704391J454081
$$ -90247 -113559 198910 -635221 -3256059 -5838959 -5933784 -3514869 -810478 643603
40863F43603O12186M35864N025m36878J57698J293214J135305o46384k173854
$$ 643603 1255789 1691653 1696678 1259800 1417498 2710712 3846017 3199633 1025779
40854A025779k121437j358251q88458l0807J717985K601250P77609k195300k731639
$$ 1025779 -1095658 -2453909 -3342367 -3373174 -1655189 946061 1723670 -471630 -3203269
40845c203269j73423K194489J824879J60072k12753N00755L72847o76452r35355
$$ -3203269 -3376692 -1182203 642676 802748 589995 1090750 1463597 787145 -148210
40836a48210J0728O71523K35906l22341j53161K50438L48115M71718P00638K66226
$$ -148210 -137482 534041 769947 447606 294445 544883 892998 1364716 2065354 2331580
40826B331580j001348j883997j457250m95387j48200k27758j0976J93423k33503
$$ 2331580 1330232 -553765 -2011015 -2506402 -2654602 -2882360 -2893336 -2699913 -2933416
40817b933416o03304K44915J696997J741170o2000j576815q67094J220366K306249
$$ -2933416 -3536720 -3291805 -1594808 146362 84362 -1492453 -2359547 -1139181 1167068
40808A167068J515804N0970q69940j266507j406712q74689N03804J608857J124154
$$ 1167068 2682872 2733842 1863902 597395 -809317 -1684006 -1180202 428655 1552809
40799A552809m84508j295192n05109M43537k4147j331188j608362k52409J513459
$$ 1552809 1068301 -226891 -732000 -288463 -312610 -1643798 -3252160 -3504569 -1991110
40790a991110K341876J904567M98066j272695k313688j719755L519J283771J297402
$$ -1991110 350766 2255333 2753399 1480704 -832984 -2552739 -2549220 -1265449 31953
40781C1953O05750o8133n71111o67848o807Q21366N74436o52096j161177k40438
$$ 31953 637703 569570 -1541 -669389 -676196 145170 719606 67510 -1093667 -1334105
40771a334105N32264j57262j008142j39851J642210J865587J98380j093243o60950
$$ -1334105 -801841 -959103 -1967245 -2107096 -464886 1400701 1599081 505838 -155112
40762a55112J19260l97987j635081j925099r77062O2214M26053M70046P18214
$$ -155112 -35852 -433839 -2068920 -3994019 -4971081 -4908867 -4482814 -4012768 -3294554
40753c294554J034570R98832O90498O97188J246848J600161Q00291r03032k011553
$$ -3294554 -2259984 -1261152 -570654 126534 1373382 2973543 3773834 2870802 859249
40744H59249j549788k84046M04781K91409J66764M07836O50704O25882L62659
$$ 859249 -690539 -974585 -569804 -278395 -111631 296205 946909 1572791 1935450
40735A935450k57887j188726j635438q94412K90907M50250m02910o28395N35060
$$ 1935450 1677563 488837 -1146601 -2041013 -1750106 -1299856 -1702766 -2331161 -1796101
40726a796101J687761J339658Q3480n17409l69840o39438j394017j161728O51397
$$ -1796101 -108340 1231318 1314798 797389 427549 -211889 -1605906 -2767634 -2116237
40717b116237K277175J637513q26041k631416k339540q57929M40998J353434J848225
$$ -2116237 160938 1798451 972410 -1659006 -3998546 -4856475 -4415477 -3062043 -1213818
40708a213818J046326j158061k578222j110504J761782K379444J06498j573442
$$ -1213818 -167492 -1325553 -3903775 -5014279 -3252497 -873053 -766555 -2339997
40700b339997j89092K163216K283846O13252q8608P49049J259901O41498J3538
$$ -2339997 -2529089 -365873 1917973 2531225 2442617 3191666 4451567 5093065 5106603
40691E106603q5785m34525j128378j187754n80391n17790j207991j289662j64020
$$ 5106603 5020818 4586293 3457915 2270161 1689770 1171980 -36011 -1325673 -1489693
40682a489693R01933P44919j53850p34977n92638K70318J478720J827866M24081
$$ -1489693 -587760 157159 3309 -731668 -1324306 -1053988 424732 2252598 2676679
40673B676679j520760j903051r12456p34022j689298j439242R13308K779111J928236
$$ 2676679 1155919 -747132 -1659588 -2393610 -4082908 -5522150 -4608842 -1829731 98505
40664I8505j14129p14291l6386J83800l3981L73364P64509k67130j885700j803144
$$ 98505 -15624 -729915 -766301 -582501 -616482 -243118 521391 254261 -1631439 -3434583
40654c434583J05770J561254J360148P38485Q57041J030392K29911j163046j891940
$$ -3434583 -3328813 -1767559 -407411 331074 1188115 2218507 2448418 1285372 -606568
40645f06568j254567L14323J486898J117253k23912m90278J036580K221466R83143
$$ -606568 -1861135 -1546812 -59914 1057339 833427 343149 1379729 3601195 4584338
40636D584338j293491j552994K94938J266858m3148j520346j124379R3224Q2488
$$ 4584338 3290847 1737853 2032791 3299649 3256501 1736155 611776 705000 787488
40627G87488r89380j411598o51834K67400N02114J78259k26112l59427r6676K59446
$$ 787488 -201892 -1613490 -2265324 -1997924 -1495810 -1317551 -1543663 -1903090 -1999766 -1740320
40617a740320K04882j90653k46835K90430Q03881P17633K19793j90455k04639
$$ -1740320 -1535438 -1726091 -1972926 -1682496 -878615 -160982 58811 -131644 -336283
40608c36283M00236J518748K197005J386698m64217j658319j472088r29653q58122
$$ -336283 63953 1582701 3779706 5166404 4702187 3043868 1571780 642127 -215995
40599b15995o18692K91668Q13447k4353j062408m06160J589288K506976J145255
$$ -215995 -834687 -543019 270428 246075 -816333 -1222493 366795 2873771 4019026
40590D019026q95555j405022k73500O81171N7423j563449k332090j206088P99079
$$ 4019026 3123471 1718449 1444949 2126120 2183543 620094 -1711996 -2918084 -2119005
40581b119005J685505Q27190l20022k01523Q40765J299472O63461k15585o65871
$$ -2119005 -433500 393690 73668 -127855 712910 2012382 2675843 2460258 1794387
40572A794387q91532j015743o54155N7986R7744r40064j769790r35303J021041
$$ 1794387 902855 -112888 -767043 -709057 -611313 -1551377 -3321167 -4256470 -3235429
40563c235429K085034J403731K23781p2237K58825J67408m81897j011627j157063
$$ -3235429 -1150395 253336 477117 404880 663705 831113 349216 -662411 -1819474
40554a819474j122720p46680K48361J276042J358467O85865M59984Q75877O34845
$$ -1819474 -2942194 -3688874 -3440513 -2164471 -806004 -120139 339845 1215722 1850567
40545A850567q48179k118101j701415l47569K21575M6199O73131K378768L401539
$$ 1850567 1002388 -1115713 -2817128 -3164697 -2943122 -2896923 -2223792 154976 3556515
40536C556515K370789J88003j189208r97955o6913M96450M00045Q7064o8389k63422
$$ 3556515 5927304 6115307 4926099 3928144 3861231 4357681 4757726 4844790 4776401 4512979
40526D512979p74910j183291q32262j52695l87787j439607j370454P54219K850482
$$ 4512979 3738069 2554778 1722516 1569821 1182034 -257573 -1628027 -873808 1976674
40517A976674K443992K90990q82550n94716q19294k030315k120093j90571J422844
$$ 1976674 4420666 4711656 3829106 3234390 2415096 384781 -1735312 -1925883 -503039
40508e03039O06496j295886j685521l94221R15612J586485J942615J534371j66891
$$ -503039 103457 -1192429 -2877950 -3272171 -2356559 -770074 1172541 2706912 2540021
40499B540021j938666k021442q51044l31202n98927k112J528132J813864Q5470
$$ 2540021 601355 -1420087 -2271131 -2602333 -3201260 -3203372 -1675240 138624 224094
40490B24094j215017L3892K230750K305118J45301j520187j134596M0834L90381
$$ 224094 -990923 -957031 1273719 3578837 3724138 2203951 1069355 1110189 1500570
40481A500570K6012k29953l19240m53146l21226J97260M14357j22000p80197j005490
$$ 1500570 1526582 1296629 977389 524243 203017 400277 814634 692634 -87563 -1093053
40471a093053j374876k201906k090680J84702K935864L086927N36260j506045
$$ -1093053 -2467929 -4669835 -6760515 -6575813 -3639949 -553022 -16762 -1522807
40463a522807j150241j53079l81600p21773L06415J289963L20281j077013Q915
$$ -1522807 -2673048 -2826127 -3207727 -3929500 -3623085 -2333122 -2012841 -3089854 -3080939
40454c080939K759551L355837Q14238j612542j540498m28462j94931j82585O02458
$$ -3080939 -321388 3034449 3848687 2236145 695647 267185 72254 -110331 492127
40445D92127J055094R6667r55832m96832O53232Q77793M89031N43669M61306o91104
$$ 492127 1547221 1643888 688056 191224 844456 1722249 2211280 2754949 3216255 2525151
40435B525151j825056j384791k75803m92366j540286j134702Q14783J850056Q41337
$$ 2525151 700095 -684696 -960499 -1452865 -2993151 -4127853 -3313070 -1463014 -621677
40426f21677m72220m51513K62430L87037j12876o62220j036251r52133r8254Q64248
$$ -621677 -1093897 -1545410 -1282980 -895943 -1008819 -1671039 -2707290 -3659423 -3757677 -2893429
40416b893429P19302l93310r08097j61125O83164N84858K9071j75485p4777J44028
$$ -2893429 -2174127 -2567437 -3475534 -3636659 -2953495 -2368637 -2339566 -2515051 -2589828 -2445800
40406b445800O51778J052140L89428j103477j702646n90126Q33953J077292N85727
$$ -2445800 -1794022 -741882 -352454 -1455931 -3158577 -3748703 -2914750 -1837458 -1251731
40397a251731M17404K86475m99295j282792j006173j28829J59541M8340O01432
$$ -1251731 -834327 -547852 -1047147 -2329939 -3336112 -3464941 -3305400 -3257060 -2655628
40388b655628J511211J304622j56467j216699q48650P6478M65704M41853L82192
$$ -2655628 -1144417 160205 3738 -1212961 -2061611 -1985133 -1519429 -1077576 -695384
40379f95384m6660q61042r80386K28696J530941J403702M10601L33552J221267
$$ -695384 -742044 -1603086 -2583472 -2354776 -823835 579867 990468 1324020 2545287
40370B545287J228479k82371j443997p19784O25519M83311q59520j410602p53290
$$ 2545287 3773766 3491395 2047398 1327614 1953133 2436444 1576924 166322 -586968
40361e86968m29421j078771j440352p59353r3375k15431j26801R33581J681216
$$ -586968 -1016389 -2095160 -3535512 -4294865 -4388240 -4603671 -4730472 -3796891 -2115675
40352b115675P93774n87247m50851Q56888J225858J76606n95974j10639O03408
$$ -2115675 -1321901 -1909148 -2359999 -1503111 -277253 -100647 -696621 -807260 -203852
40343b03852N38282J67865J68909K13673j31043m64200k76970K30053N58888M08360
$$ -203852 334430 502295 671204 884877 753834 289634 12664 242717 801605 1209965
40333A209965l96472j547508j868057n59404J139407J123091m94253j293130j71610
$$ 1209965 813493 -734015 -2602072 -3161476 -2022069 -898978 -1393231 -2686361 -2857971
40324b857971R22884P9025j568357j655471j20583J069063R95822N98463N84344
$$ -2857971 -1935087 -1856062 -3424419 -5079890 -5200473 -4131410 -3135588 -2537125 -1952781
40315a952781L92297l72001q85879k72810R38910J324814M02704o10066k59160
$$ -1952781 -1560484 -1932485 -2818364 -3091174 -2152264 -827450 -424746 -1034812 -1293972
40306a293972J077106J337449n09888k711520k828731j036098L07158J96254N5041
$$ -1293972 -216866 1120583 610695 -2100825 -4929556 -5965654 -5658496 -5462242 -5407201
40297e407201Q86195J575033J137266O15738J093200J510442M83702r78155q33557
$$ -5407201 -4521006 -2945973 -1808707 -1192969 -99769 1410673 1894375 916220 82663
40288H2663O86311J423546O34940j93014M5122N92849L50927o64329j785728k390610
$$ 82663 768974 2192520 2827460 2634446 2679568 3272417 3623344 2959015 1173287 -1217323
40278a217323j917360l65227J098618J197549K51186l58434k88818l37979n32060
$$ -1217323 -3134683 -3499910 -2401292 -1203743 -952557 -1310991 -1599809 -1937788 -2469848
40269b469848N2340J241235J464616K54457p54883l86597J79747n12557j625820
$$ -2469848 -2417508 -1176273 288343 542800 -212083 -598680 -418933 -931490 -2557310
40260b557310j330828K12640J104557O02353m0873K44362R08545J010082O29215
$$ -2557310 -3888138 -3675498 -2570941 -1968588 -2009461 -1765099 -856554 153528 782743
40251G82743L43371J55585k62002p58104q66351n44853j61814J40658N37976R82404
$$ 782743 1126114 1281699 1019697 261593 -604758 -1149611 -1311425 -1170767 -632791 349613
40241C49613J070528O10108n1386m67236n54384m13331n9907L16536K19042m67520
$$ 349613 1420141 2030249 1978863 1511627 957243 543912 484005 800541 1019583 552063
40231E52063r55592m93904L23378J66959r91100j570544n98359Q64059J331005
$$ 552063 -403529 -897433 -574055 -407096 -1398196 -2968740 -3567099 -2703040 -1372035
40222a372035R30311O70791N02912l12094j284429r78177N32639J218009q0825
$$ -1372035 -441724 229067 731979 419885 -864544 -1842721 -1310082 -92073 -172898
40213a72898j761921j586764K61025J639450J461829P06280L76426J2195r89585
$$ -172898 -1934819 -3521583 -3260558 -1621108 -159279 547001 923427 935622 -53963
40204e3963j715085p67483J340302K237036O24299j825304k358633m07986J972850
$$ -53963 -1769048 -2536531 -1196229 1040807 1665106 -160198 -2518831 -2926817 -953967
40195i53967K703144J682913J39857r64783j385736j235226q42604n78804m05128
$$ -953967 1749177 3432090 3571947 2607164 1221428 -13798 -856402 -1435206 -1840334
40186a840334J3715N42380O01843K73741M50985J254064J315114k56266k004828
$$ -1840334 -1826619 -1284239 -682396 -408655 42330 1296394 2611508 2355242 350414
40177C50414j737752L02342J469630J59112k144478k840161j222382J173184K514506
$$ 350414 -1387338 -1084996 384634 543746 -1600732 -4440893 -5663275 -4490091 -1975585
40168a975585K216088R48964j83266n31173l54380m00998r16400j249928o51184
$$ -1975585 240503 1189467 1006201 475028 120648 -280350 -1196750 -2446678 -3097862
40159c097862O61527J497557R07907o38610j542383p84045Q21066J518157P06231
$$ -3097862 -2436335 -938778 -30871 -669481 -2211864 -2995909 -2174843 -656686 49545
40150D9545m50008n96412L01423J303643J674266J281808M02288m06772o85073
$$ 49545 -400463 -996875 -695452 608191 2282457 3564265 3966553 3559781 2874708
40141B874708o12847o42860n40595K32007J043790M98187j087591j375132N71810
$$ 2874708 2261861 1619001 1078406 1310413 2354203 2852390 1764799 389667 961477
40132I61477K300919J319982j025393j521687m294O50753o75139j642028m06186
$$ 961477 3262396 4582378 3556985 2035298 2031004 2681757 2006618 364590 -41596
40123d1596J387710J194441o49444j596417m76828J182802J304440k37551j506368
$$ -41596 1346114 2540555 1891111 294694 -182134 1000668 2305108 2067557 561189
40114E61189p79394J201940J895172K57931j680858j627237k15725L92519N8185
$$ 561189 -218205 983735 2878907 3136838 1455980 -171257 -386982 5537 63722
40105F3722K98983R44621K13698j650064j979171J32700K147181J914091N03880
$$ 63722 362705 1307326 1521024 -129040 -2108211 -1975511 171670 2085761 2589641
40096B589641l34434q64424j563559j206907P93138K288150J321526o27295j051803
$$ 2589641 2255207 1390783 -172776 -1379683 -586545 1701605 3023131 2395836 1344033
40087A344033l82894n34423j004565N6544J817654J561830o90738j967856j036966
$$ 1344033 961139 426716 -577849 -521305 1296349 2858179 2167441 199585 -837381
40078h37381J40552K84776O79499J961078K261467M24460j574145j574186m94402
$$ -837381 -696829 -412053 267446 2228524 4489991 4914451 3340306 1766120 1271718
40069A271718m08313j091303r18978L7389L60154N0118M49998J532700J592360
$$ 1271718 863405 -227898 -1146876 -1109487 -749333 -699215 -249217 1283483 2875843
40060B875843P5385j238352p38534P93834J524471J090134N48646L59086k03713
$$ 2875843 2951228 1712876 974342 1768176 3292647 4382781 4931427 5290513 5086800
40051E086800j461357k314079j582987J86328J198009O28187m95627q67633m89187
$$ 5086800 3625443 1311364 -271623 -85295 1112714 1740901 1245274 377641 -111546
40042a11546j04242J85096P62877J339373J069646q3859j044003r91019l44978
$$ -111546 -215788 -30692 732185 2071558 3141204 3057345 2013342 1022323 677345
40033F77345n702j60558k93531m1877L85122N30865J79163m44536q46889o74076
$$ 677345 671643 511085 217554 175677 560799 1091664 1270827 826291 -20598 -694674
40023f94674L167P65527J115308P47212j63979r02832p82949Q2196Q60031R10933
$$ -694674 -691507 74020 1189328 1936540 1772561 869729 86780 168976 1029007 1939940
40013A939940K89032o00270j295482j287239m84824K88378J42568m85000l80147
$$ 1939940 2228972 1628702 333220 -954019 -1438843 -1150465 -1007897 -1492897 -1873044
40004a873044M12043N55548k25270n29471K15604N72402l13044q97056J82110
$$ -1873044 -1461001 -905453 -1130723 -1660194 -1444590 -872188 -1185232 -2082288 -1900178
39995a900178J525562J231791J41984J59821O61589k69834j882896j540440P07904
$$ -1900178 -374616 857175 999159 1158980 1820569 1550735 -332161 -1872601 -1164697
39986a164697J866245P03347o54506o07965k74190o46715p13787O9683L19162
$$ -1164697 701548 1404895 750389 142424 -131766 -778481 -1492268 -1422585 -1103423
39977a103423n49298q06879N27964J694933J237547M96364Q69658J137381O3163
$$ -1103423 -1652721 -2459600 -1931636 -236703 1000844 1497208 2366866 3504247 3567410
39968C567410p83200K53335J570515R31749n20449m12327M35645k90877j624261
$$ 3567410 2784210 3037545 4608060 5539809 5019360 4607033 5042678 4751801 3127540
39959C127540p25541J560597J349904j762359l506193j467198J425316J773471
$$ 3127540 2401999 3962596 5312500 3550141 43948 -1423250 2066 1775537
39951A775537L81869k14109J92394M12959M54680P20349M89552o33395j408105
$$ 1775537 2157406 1943297 2135691 2548650 3003330 3723679 4213231 3579836 2171731
39942B171731r68178l99134n25266j42001J439994K199796M11373j957339j885124
$$ 2171731 1203553 804419 279153 137152 1577146 3776942 4188315 2230976 345852
39933C45852K3927P53987j74641m67841N68266R71311j75529j228083j008049
$$ 345852 369779 1123766 949125 481284 1049550 2020861 1845332 617249 -390800
39924c90800m99953m99023j93797O88061Q04907k65179p31614M54804J507323
$$ -390800 -890753 -1389776 -1583573 -895512 -90605 -355784 -1087398 -632594 874729
39915H74729O78742p25003o14203K30545l76400j953979j902232J31231J562735
$$ 874729 1553471 828468 214265 444810 68410 -1885569 -3787801 -3656570 -2093835
39906b093835J043494M17015J343756K486717J848818M0095r09883p79236r25185
$$ -2093835 -1050341 -633326 710430 3197147 5045965 5086060 4176177 3396941 2471756
39897B471756j450250r88060N26954J110238l14381j903549j285528J040267K330431
$$ 2471756 1021506 33446 560400 1670638 1356257 -547292 -1832820 -792553 1537878
39888A537878J296324m38510q85762k82717j93748r02377j043290K14081J776092
$$ 1537878 2834202 2395692 1509930 1227213 1033465 131088 -912202 -698121 1077971
39879A077971J959335N79663r33742j243762l52914P63833J209452P19753l44577
$$ 1077971 3037306 3616969 2683227 1439465 1086551 1850384 3059836 3779589 3435012
39870C435012j199868j099428n5658R22045P82301j93940m62088Q61765K548263
$$ 3435012 2235144 1135716 1080058 2002103 2784404 2590464 2128376 2990141 5538404
39861E538404K597178R48702l44578j16217J19517j345578l246808k800079n8964
$$ 5538404 8135582 9084284 8739706 8623489 8743006 7397428 4150620 1350541 1291577
39852A291577J677001N60889j052494j90636K285215L118210J419301n67073j039378
$$ 1291577 2968578 3529467 2476973 2286337 4571552 7689762 9109063 8541990 7502612
39843G502612m35387M42746J575429K367314J523786n70964j416872J73913J946451
$$ 7502612 7067225 7509971 9085400 11452714 12976500 12405536 10988664 11162577 13109028
39834A3109028J242475j233741k647880k006225p80620j60439J30841L31554k0185
$$ 13109028 14351503 13117762 10469882 8463657 7683037 7522598 7653439 7984993 7964808
39825G964808q23798j087667m54373J43551q9033o75387o72990R3062R75384J160330
$$ 7964808 7141010 6053343 5598970 5742521 5653488 4978101 4305111 4398173 5373557 6533887
39815F533887K75343j110853j691113q01764N81646J016502M60668l8245j78465
$$ 6533887 6809230 5698377 4007264 3205500 3787146 4803648 5264316 5226071 5047606
39806E047606n71534j182245j141975l37291L04054M55217P79520J209935N69421
$$ 5047606 4476072 3293827 2151852 1814561 2118615 2573832 3353352 4563287 5132708
39797E132708j208149k170989j014658P11907O83698q96349j813346j080300J05898
$$ 5132708 3924559 1753570 738912 1450819 2134517 1238168 -575178 -1655478 -1549580
39788a549580N13743L63266L71964N50176M76026Q3585k11481J13791J168748
$$ -1549580 -1035837 -672571 -300607 249569 725595 809180 597699 711490 1880238
39779A880238K231908K168625P11496j028061j802149j528315q42141l3853P34089
$$ 1880238 4112146 6280771 6992267 5964206 4162057 2633742 1791601 1757748 2491837
39770B491837Q04262k12581j396741j423467l40768O68963J107778J453816J693490
$$ 2491837 3296099 3083518 1686777 263310 -77458 591505 1699283 3153099 4846589
39761D846589J078736k75815r81111l00142O38830M24507p15372j477696j281394
$$ 4846589 5925325 5649510 4668399 4368257 5007087 5431594 4716222 3238526 1957132
39752A957132n84222N3582K85611k20600j305881j884162r99318P21507J630093
$$ 1957132 1372910 1426492 1712103 1491503 185622 -1698540 -2697858 -1976351 -346258
39743c46258J154756L63661J95704J98127l45687r63448o82307L66391J142145
$$ -346258 808498 1172159 1367863 1565990 1220303 256855 -425452 -59061 1083084
39734A083084J254037J173382R38646j4672j383243j745709o17220M57780N5554
$$ 1083084 2337121 3510503 4449149 4434477 3051234 1305525 688305 1146085 1201639
39725A201639r02746o27411N84231Q22835k19539o64148M87343J722866J416337
$$ 1201639 298893 -328518 255713 1078548 859009 194861 682204 2405070 3821407
39716C821407J48679o06483o82078o71650m10684L54334P55280P2828n25525M52121
$$ 3821407 3970086 3363603 2681525 2009875 1599191 1953525 2708805 2781633 2256108 2708229
39706B708229J952484J374267j409421l347235k326844N2065J093462O59158M33083
$$ 2708229 4660713 6034980 4625559 1278324 -1048520 -996455 97007 756165 1189248
39697A189248P38344L11728j033836j685247p25493N36420N76110j9180L53887
$$ 1189248 1927592 2239320 1205484 -479763 -1205256 -668836 -92726 -111906 241981
39688B41981J570097J828257M91085q15633o66942M0126k92780j279786j211600
$$ 241981 1812078 3640335 4131420 3315787 2648845 2688971 2396191 1116405 -95195
39679i5195R2875J018829Q08162N54036R79898J044872j76637j690862j948840
$$ -95195 -2320 1016509 1824671 2378707 3358605 4403477 4226840 2535978 587138
39670E87138r39578K78604J137794J444603P51168p35931j525210o49679O81556
$$ 587138 -352440 -73836 1063958 2508561 3259729 2523798 998588 348909 1030465
39661A030465Q11604J80323L11598J018945Q30985j95689m97484J35964J56556
$$ 1030465 1842069 2022392 2333990 3352935 4183920 3988231 3490747 3626711 3783267
39652C783267q71329j384174o07410K7076n65900j165601l56711J020346J225462
$$ 3783267 2911938 1527764 920354 947430 381530 -784071 -1140782 -120436 1105026
39643A105026K57442n26911o21936o46281q95971r53492n05739L47874J269013
$$ 1105026 1362468 835557 213621 -432660 -1328631 -2282123 -2787862 -2439988 -1170975
39634a170975J566827O06631r90940j461156j01809J540003J713651P42953L0763
$$ -1170975 395852 1002483 11543 -1449613 -1551422 -11419 1702232 2445185 2475948
39625B475948k13473o10776p37150L63787J981123K103342L55918j227155j071016
$$ 2475948 2262475 1651699 914549 1278336 3259459 5362801 5718719 4491564 3420548
39616C420548j32560r5205p85308p69435K25158R93957Q17329M10712N83442R40990
$$ 3420548 3287988 3192783 2407475 1638040 1863198 2857155 3674484 4085196 4668638 5609628
39606E609628N51426o51015j762472j945955j097339K37211J095739O22778q58617
$$ 5609628 6161054 5510039 3747567 1801612 704273 941484 2037223 2660001 1801384
39597A801384j578343k12033K009947K457948O58374r29404m70491P07988O08736
$$ 1801384 223041 11008 2020955 4478903 5137277 4207873 3737382 4445370 5054106
39588E054106j18940L74650J566626J252508o10410j674557j008065k63810m32243
$$ 5054106 4935166 5309816 6876442 8128950 7518540 5843983 4835918 4572108 4139865
39579D139865l27340N49879M83614j358679k792732j778657L06308R33083K72529
$$ 4139865 3812525 4362404 4846018 3487339 694607 -1084050 -777742 155341 427870
39570D27870K18191Q94194Q97065J92943N9194N48801N24081r14O3036N76598
$$ 427870 646061 1540255 2437320 2630263 2689457 3238258 3762339 3761425 3824461 4401059
39560D401059L22119m87097k44579J174230J886154R38150l60960p88003q71187
$$ 4401059 4723178 4236081 3991502 5165732 7051886 7990036 7629076 6841073 5969886
39551E969886j255039j222070n5335J485023K155485J690055N53213o64286j075584
$$ 5969886 4714847 3492777 3437442 4922465 7077950 8768005 9321218 8656932 7581348
39542G581348q8623J203791P46056j534707l099504k207545l40198K42242j52182
$$ 7581348 7492725 8696516 9442572 7907865 4808361 2600816 2260618 2502860 2350678
39533B350678K94686J575853J895018P14402m37482m84595k43835o45818j034648
$$ 2350678 2645364 4221217 6116235 6830637 6393155 5908560 5664725 5018907 3984259
39524C984259l44710R42459J246361O0461j275021j150077N20092K343481K952320
$$ 3984259 3639549 4582008 5828369 5888830 4613809 3463732 3983824 6327305 9279625
39515I279625K113597N47517q53804j538109j495693j222978j142919q91813K33565
$$ 9279625 11393222 11940739 11086935 9548826 8053133 6830155 5687236 4795423 5028988
39506E028988J791839K060103K94278j626509j228762J171328K699152J702872
$$ 5028988 6820827 8880930 9175208 7548699 6319937 7491265 10190417 11893289
39498A1893289k79547r26593p3415P49923O78651K33340J84738O30761R94160
$$ 11893289 11613742 10687149 10613734 11363657 12042308 12275648 12460386 13091147 14085307
39489A4085307M96562r40222k047135j310844Q61396K140436J151837p37518j456736
$$ 14085307 14581869 13641647 11594512 10283668 11145064 13285500 14437337 13699819 12243083
39480A2243083q99381k37989L13648J203467J734585P93750p17354m99923J580307
$$ 12243083 11343702 11105713 11419361 12622828 14357413 15151163 14433809 13933886 15514193
39471A5514193K743638J169435j302301j859091n58013M09477K14328j8294L62966
$$ 15514193 18257831 19427266 18124965 16265874 15707861 16117338 16331666 16313372 16676338
39462A6676338P26793Q61686J417597K163944J746348M8191r61878M2415J658249
$$ 16676338 17403131 18264817 19682414 21846358 23592706 23640897 22679019 22721434 24379683
39453B4379683J830070P43591K6903J82113O72000J575210K924556L147101Q78129
$$ 24379683 26209753 26953344 26980247 27162360 27834360 29409570 32334126 35481227 36359356
39444C6359356j880582j463241K065203M289543K460214p94908j655966l11461
$$ 36359356 34478774 33015533 35080736 39370279 41830493 41035585 39379619 39068158
39436C9068158O24707P03436J401756K581576K591699J526252J295969K331063
$$ 39068158 39692865 40396301 41798057 44379633 46971332 48497584 49793553 52124616
39428E2124616K968563K515233K365313L359806M276402L879948K671698J748276
$$ 52124616 55093179 57608412 59973725 63333531 67609933 71489881 74161579 75909855
39420G5909855J475938J977043L397917N033352N649855N276568N248349O010809
$$ 75909855 77385793 79362836 82760753 87794105 93443960 98720528 103968877 109979686
39412A09979686O473215O056641N686933O103545O856008P627174Q779592R900234
$$ 109979686 116452901 122509542 128196475 134300020 141156028 148783202 157562794 167463028
39404A67463028R774619Q705842Q771951J0619312J2153354J1866397J1224389
$$ 167463028 177237647 185943489 194715440 205334752 217488106 229354503 240578892
39397B40578892J1810373J2250799J0568085P977915P367543Q782746R268237
$$ 240578892 252389265 264640064 275208149 283186064 290553607 299336353 308604590
39390C08604590P027406L298893L198k301043l764668m439475m795052n785554
$$ 308604590 315631996 318930889 318934087 316633044 312868376 308428901 303633849 297848295
39382B97848295p778693j0047998j1487263j1467078j0356409r581240j0366212
$$ 297848295 290069602 280021604 268534341 257067263 246710854 237129614 226763402
39375B26763402j1895958j1918412r952758q317188q698904r498749q529909o674933
$$ 226763402 214867444 202949032 192996274 184679086 175980182 166481433 157951524 151276591
39367A51276591o267113p089488o999683n836066n485753o179449n934981m131729
$$ 151276591 145009478 137919990 130920307 125084241 119598488 113419039 107484058 103352329
39359A03352329k637110k565187k690337k170207k249692l809118n404265n335703
$$ 103352329 100715219 98150032 95459695 93289488 91039796 87230678 81826413 76490710
39351G6490710l951439k517408j427448q30532j355361k738473l251974k049551
$$ 76490710 72539271 70021863 68594415 67763883 66408522 63670049 60418075 58368524
39343E8368524p39901j075463k348070k742529k150299j842440k196369k534710
$$ 58368524 57628623 56553160 54205090 51462561 49312262 47469822 45273453 42738743
39335D2738743k623311k646371k166552p70306N61214L67853j072596j945320
$$ 42738743 40115432 37469061 35302509 34532203 35093417 35461270 34388674 32443354
39327C2443354j413090n56563n27556r83037q80393J9779R98600J234728M29450
$$ 32443354 31030264 30473701 29946145 28963108 28082715 28102494 29101094 30335822 30765272
39318C0765272j089542k574066l300173l011715k019258r38632k38012J45521
$$ 30765272 29675730 27101664 23801491 20789776 18770518 17831886 17593874 17739395
39310A7739395N86116R35432L74616j238640k395261j521713O26949J621297N92939
$$ 17739395 18325511 19260943 19635559 18396919 16001658 14479945 15106894 16728191 17321130
39301A7321130p40089p73724j06285l6888m99032p07018o13606m30901J94872
$$ 17321130 16581041 15807317 15701032 15664144 15165112 14458094 13844488 13413587 13608459
39292A3608459J202170J392119J51513j107022q06515M35322R99571Q44284Q89079
$$ 13608459 14810629 16202748 16354261 15247239 14440724 14876046 15875617 16719901 17608980
39283A7608980O86646q64265k895554l245818j812486p13213q10161o95764K15893
$$ 17608980 18295626 17431361 14535807 11289989 9477503 8764290 7954129 7258365 7474258
39274G474258L80299q19752j379183L3507J379439L40454j633023j315388J204352
$$ 7474258 7854557 7034805 5655622 5689129 7068568 7409022 5775999 4460611 5664963
39265E664963K556892J147625p89928r02463J03222L43597j76991k13725K20004
$$ 5664963 8221855 9369480 8579552 7677089 7780311 8123908 7946917 7733192 7953196
39256G953196l0905j049534j485945o06024O15036R64407O23570N83299R44987
$$ 7953196 7922291 6872757 5386812 4780788 5395824 6360231 6983801 7567100 8512087
39247H512087P21290n87806j959905j961061o17977N30367L87715l85740m87566
$$ 8512087 9233377 8645571 6685666 4724605 4106628 4636995 5024710 4638970 4151404
39238D151404K13721Q05835Q68446P41008L19068j008645k711842k815466m21655
$$ 4151404 4365125 5170960 6039406 6780414 7099482 6090837 3378995 563529 141874
39229A41874K422167K872170Q60229j001465r56568P0171M78954K16511J18949
$$ 141874 2564041 5436211 6296440 5294975 4338407 4408578 4887532 5104043 5222992
39220E222992K32779k0314o00399q35773m62579M8886J45804k20229n43515k17930
$$ 5222992 5455771 5435457 4835058 3999285 3536706 3585592 3731396 3511167 2967652 2749722
39210B749722O14132Q15244l44615j648572j100392J106470K389010J301077m39570
$$ 2749722 3363854 4179098 3834483 2185911 1085519 2191989 4580999 5882076 5442506
39201E442506p13536q7601k51695q12229j68173J206811J163572m95554j491998
$$ 5442506 4728970 4641369 4389674 3577445 3409272 4616083 5779655 5284101 3792103
39192C792103o72119L27838q7445j129001j268012m39343N96094J535784K005267
$$ 3792103 3119984 3447822 3360377 2231376 963364 524021 1120115 2655899 4661166
39183D661166J232194m63035j207171R393J632498J651790L11033p50236j031592
$$ 4661166 5893360 5430325 4223154 4232547 5865045 7516835 7827868 7077632 6046040
39174F046040j187946j289310q37588j55554j65705q83275j384677j148392l80159
$$ 6046040 4858094 3568784 2731196 2575642 2409937 1526662 141985 -1006407 -1386566
39165a386566O98159J802403K172936J358792J43071m14925n23004j045034j704940
$$ -1386566 -688407 1113996 3286932 4645724 4788795 4373870 3850866 2805832 1100892
39156A100892j367639o9103P46193L60244j59151L28678J250985J117548l30812
$$ 1100892 -266747 -335850 410343 770587 611436 940114 2191099 3308647 2977835
39147B977835j582615j133008N81573J551840O91908o79540o75863L95402O11894
$$ 2977835 1395220 262212 843785 2395625 3087533 2407993 1732130 2127532 2739426
39138B739426l50173o27003O03065J508500N92576p28388m79463O36489P08978
$$ 2739426 2389253 1762250 2365315 3873815 4466391 3738003 3258540 3895029 4604007
39129D604007j9750L7328N55171j90031j879860k191009m99592J125710J108427
$$ 4604007 4584257 4621585 5176756 4986725 3106865 915856 416264 1541974 2650401
39120B650401J50583o37632j059656p94830N62700J834883J109207j014201j633050
$$ 2650401 2800984 2163352 1103696 308866 871566 2706449 3815656 2801455 1168405
39111A168405P0865J460564P62597k11575M15788J215959K12307j384654j267707
$$ 1168405 1239270 2699834 3462431 3250856 3666644 4882603 5094910 3710256 2442549
39102B442549p0943o2408j041043q87325M75003R75857Q1885n40512k27281k06203
$$ 2442549 2371606 2309198 1268155 380830 855833 1831690 1913575 1373063 1145782 939579
39092I39579p76765m75663R89809J591090J32148j600571j419465K10072J286588
$$ 939579 162814 -312849 676960 2268050 2400198 799627 -619838 -409766 876822
39083H76822J115856M49143k15734q88697j236900q50819p4842L99170M56231
$$ 876822 1992678 2441821 2226087 1337390 100490 -750329 -825171 -426001 30230
39074C0230L61450J51105n0580K73239J159540J588889P84139l97105m83944M77307
$$ 30230 391680 542785 492205 765444 1924984 3513873 4298012 3900907 3416963 3894270
39064C894270R63377R9089j325257k094290j885364j099564j93866M59275O60618
$$ 3894270 4857647 4956736 3631479 1537189 -348175 -1447739 -1641605 -1182330 -521712
39055e21712O61337Q82994J185603R65660J59296n05220n59922m42449o57678
$$ -521712 139625 1022619 2208222 3173882 3333178 2827958 2268036 1825587 1167909
39046A167909r22943p19236j52961L82989R07641J441911J374701K62557r82505
$$ 1167909 244966 -474270 -627231 -244242 663399 2105310 3480011 3742568 2760063
39037B760063q91497M74070J378261P08754o32188j169871p17843p3150K95386
$$ 2760063 1868566 2342636 3720897 4429651 3797463 2627592 1909749 1836599 2131985
39028B131985L57753k520o32030p37676Q2148Q31988K85010j082776j568747o66197
$$ 2131985 2489738 2487218 1855188 1117512 1199660 2031648 2316658 1233882 -334865 -1001062
39018a001062K56640N659q77970j181449o98330q3777L24364P20503J156172J335316
$$ -1001062 -744422 -738763 -1616733 -2798182 -3496512 -3580289 -3255925 -2535422 -1379250 -43934
39008d3934J071863N59718J37501o3962k17299n11799p59374n37644J15937N52641
$$ -43934 1027929 1587647 1725148 1661186 1443887 932088 172714 -364930 -248993 303648
38998C03648L93441P2282l547k02530p61438q07990M30503J855628J530709m77150
$$ 303648 697089 769371 765824 563294 -198144 -1006134 -575631 1279997 2810706 2333556
38988B333556j897684j292728J96866P49659J51945n92514p77953l03892N39510
$$ 2333556 435872 -856856 -659990 89669 241614 -350900 -1128853 -1432745 -893235
38979h93235Q97022r093j428270j478552K62576J903397J893640J059612P67220
$$ -893235 3787 -5306 -1433576 -2912128 -2649552 -746155 1147485 2207097 2974317
38970B974317O15517l13980j243509q65663J65109J64028o84321o79689L26841
$$ 2974317 3589834 3275854 2032345 1166682 1331791 1495819 811498 131809 458650
38961D58650O16294l81923j067863l89440M60321J52835o07886l35398R31481
$$ 458650 1074944 693021 -374842 -764282 -303961 -151126 -759012 -1094410 -162929
38952a62929J817625J455644K18199r09210j085085k68440M89702Q5362j025447
$$ -162929 1654696 3110340 3328539 2419329 1334244 1065804 1555506 1640868 615421
38943F15421j194064L1866J050070N14185o22472n72618N62102R92511o9461j307013
$$ 615421 -578643 -546777 503293 1017478 395006 -177612 384490 1377001 1307540 527
38933E27j161488K07358J345523J299889M25028l67208o34855n57370l90602j55959
$$ 527 -1160961 -953603 391920 1691809 2116837 1749629 1114774 557404 166802 10843
38923A0843J25372K90359L39034N22844Q18586P06571o8129r00659j091165q37789
$$ 10843 136215 426574 765608 1288452 2107038 2813609 2745480 1844821 753656 -84133
38913h4133p35788o62814j29286N32162N32513J36940M36775J346441J299337
$$ -84133 -819921 -1482735 -1612021 -1079859 -547346 -410406 26369 1372810 2672147
38904B672147l45132j917640j566124J80520J216737O44730m60187p58616j6J210809
$$ 2672147 2327015 409375 -1156749 -976229 240508 885238 425051 -333565 -333581 877228
38894H77228J981868J470643l75492k242211k471762r84053N28628O95773P3451
$$ 877228 2859096 4329739 3954247 1712036 -759726 -1743779 -1215151 -519378 -445927
38885d45927O7574Q19659J126144L91344m10088k59834K74255o666p98940o05292
$$ -445927 -378353 441306 1567450 1958794 1548706 1288872 1563127 1556461 757521 152229
38875A52229O32326R00285q64919k603346j749788Q83092K053491P15419o85507
$$ 152229 784555 1684840 819921 -1783425 -3533213 -2650121 -596630 118789 -566718
38866e66718o8198J416478J611206N76114j27528j00616j95581o79682j048599
$$ -566718 -634916 781562 2392768 2968882 2841354 2740738 2545157 1865475 816876
38857H16876j259095j571282j447248j53860J641914K348463J550134L06734n98964
$$ 816876 -442219 -2013501 -3460749 -3614609 -1972695 375768 1925902 2232636 1633672
38848A633672j254040j442242n94502P12706R49990K6748k25350J013600J874872
$$ 1633672 379632 -1062610 -1657112 -944406 5584 32332 -193018 820582 2695454
38839B695454O58320j117128p56799J322058J942906p3342k025667j235910J169826
$$ 2695454 3353774 2236646 1479847 2801905 4744811 4671469 2645802 1409892 2579718
38830B579718K045071N54057j186301j350908m78920n0969m11714q16232p31780
$$ 2579718 4624789 5178846 3992545 2641637 2162717 2111748 1700034 883802 152022
38821A52022l36719k2139R4976J95420M50685O65035L90071l53673p71119k49548
$$ 152022 -184697 -206836 -111860 83560 534245 1199280 1589351 1235678 464559 215011
38811B15011O23226P41545L1565n98247p90955j051502j362017r05954K50691
$$ 215011 838237 1579782 1611347 1013100 222145 -829357 -2191374 -3097328 -2846637
38802b846637O84863j76437p96059J24043J354802J087712R6234M97814J857188
$$ -2846637 -2161774 -2338211 -3134270 -3010227 -1655425 -567713 -471479 26335 1883523
38793A883523J413292j367786l303658j924513R06960J751075L48701o40526J92962
$$ 1883523 3296815 1929029 -1374629 -3299142 -2392182 -641107 -292406 -932932 -739970
38784g39970J410532J283844N4563q96550q75937k03420N64066J125026J389562
$$ -739970 670562 1954406 2008969 1112419 236482 33062 597128 1722154 3111716
38775C111716J264248N58997p09316j888289k039177j030776J40477M97960J40170
$$ 3111716 4375964 4934961 4225645 2337356 298179 -732597 -592120 -94160 46010
38766D6010k05986j65985K12082Q12637J278684R84117j29736j085615r30456
$$ 46010 -159976 -325961 -113879 698758 1977442 2961559 2831823 1746208 815752
38757H15752M6623P63149O56747k7158q01090j125386n43694N85214J004662J23221
$$ 815752 862375 1625524 2282271 2255113 1454023 328637 -215057 370157 1374819 1498040
38747A498040q42827l91513J000749J434845K59190j161749j447701o90483L11581
$$ 1498040 655213 263700 1264449 2699294 2958484 1796735 349034 -341449 -29868
38738b9868J073660J268229P02345j1106J79392J120260J249413j69654j663111
$$ -29868 1043792 2312021 3014366 3003260 3182652 4302912 5552325 5382671 3719560
38729C719560j523211l47243j62067j377753k179028j172212P40913J799319J640779
$$ 3719560 2196349 1849106 1687039 309286 -1869742 -3041954 -2301041 -501722 1139057
38720A139057J157117P88295K13051m11843k25490Q62050J521767O88240p92514
$$ 1139057 2296174 3084469 3297520 2885677 2660187 3522237 5044004 5732244 4939730
38711D939730j217364l31784N42545N26340Q7806k00814n09024q68259o49106
$$ 4939730 3722366 3390582 3933127 4459467 4547273 4346459 3837435 2969176 2320070
38702B320070L20741J092685Q78305J47953l39371o65998r89965o78040N57507
$$ 2320070 2640811 3733496 4611801 4759754 4420383 3754385 2764420 2086380 2643887
38693B643887J556906J182323J21366l30665m96779j404858k282408j365761Q78018
$$ 2643887 4200793 5383116 5504482 5173817 4677038 3272180 989772 -375989 502029
38684E02029J910355R65957J82670R54350J709509Q78445k78243N919P53813L1787
$$ 502029 2412384 3378341 3561011 4515361 6224870 7103315 6825072 6830991 7584804 7616591
38674G616591j286618o72789J528457J964608o75286l320535k691829L24197K343955
$$ 7616591 6329973 5657184 7185641 9150249 8474963 5154428 2462599 2786796 5130751
38665E130751K038951Q67350O7805p05995j615936j632392k64974J127751J037413
$$ 5130751 7169702 8037052 8104857 7398862 5782926 4150534 3885560 5013311 6050724
38656F050724j4057l35244L29987N47485l62738j108295l73028J121560J588431
$$ 6050724 6036667 5701423 6031410 6578895 6216157 5107862 4734834 5856394 7444825
38647G444825N95215o27697j036665q00217m25678O5074O78854R66200N87921
$$ 7444825 8040040 7412343 6375678 5575461 5149783 5214857 5893711 6859911 7447832
38638G447832m6736k14165K31180P29308O89057J05601m44357l88426J82078N22168
$$ 7447832 7401096 7186931 7418111 8147419 8836476 8942077 8497720 8109294 8291372 8813540
38628H813540P1281q23512j233924o10976P41074J985958K398378J922925J227009
$$ 8813540 8884821 8061309 6827385 6216409 6957483 8943441 11341819 13264744 14491753
38619A4491753R06348O69166o9356q23346m13936R31457J329278L7397j029849
$$ 14491753 15398101 16067267 15997911 15174565 14760629 15692086 17021364 17058761 16028912
38610A6028912j33210J369211J116814l10853l09408J337613K043516P18305n87318
$$ 16028912 15895702 17264913 18381727 18070874 17761466 19099079 21142595 21860900 21273582
38601B1273582k54526O11016Q38019J303446K458738K403275L9110k003093p29538
$$ 21273582 21019056 21630072 22468091 23771537 26230275 28633550 28672660 26669567 25940029
38592B5940029K331472K973130M33448j644132n50210K167344L516434K789973
$$ 25940029 28271501 31244631 31678079 30033947 29483737 31651081 35167515 37957488
38584C7957488J336598L46569P9749K56818L44879P0081p1578M90349J301034
$$ 37957488 39294086 39640655 39720404 39977222 40322101 40392182 40320604 40810953 42111987
38575D2111987J480510J226144J422912J878976J494159L01608k91038L27995
$$ 42111987 43592497 44818641 46241553 48120529 49614688 49916296 49625258 49953253
38567D9953253J129535J269009J187906J214583O50555p33948j654889j003975
$$ 49953253 51082788 52351797 53539703 54754286 55404841 54670893 53016004 52012029
38559E2012029M06233R87310M97238j21521l85797n73852p64636o69702l20834
$$ 52012029 52418262 53405572 53902810 53781289 53395492 52821640 52057004 51387302 51066468
38550E1066468j18976k52290o25668j192384j817466k001965j327788j70205M70449
$$ 51066468 50947492 50695202 50069534 48877150 47059684 45057719 43729931 43559726 44030175
38541D4030175m609j067729j504457p53780K21658q5184j649218k634737j878784
$$ 44030175 44025566 42957837 41453380 40699600 40921258 40836074 39186856 36552119 34673335
38532C4673335o77478p93365j559632r56562Q22852J347330j74374j544070j138424
$$ 34673335 33995857 33202492 31642860 30686298 31509150 32856480 32682106 31138036 29999612
38523B9999612m07200j143421k337545j967785m42714J86440m34402q29035m88255
$$ 29999612 29592412 28448991 26111446 24143661 23700947 23887387 23452985 22623950 22135695
38514B2135695n02498j357040k057750j730816n77380Q56446J949219J682311
$$ 22135695 21633197 20276157 18218407 16487591 15910211 16766657 18715876 20398187
38506B0398187k89716k270905k050376j3775J128952J42062j168318r77129r6406
$$ 20398187 20108471 17837566 15787190 15773415 16902367 17044429 15876111 14898982 14802576
38497A4802576k67696j310876j647362p96802K28729O10098M75070J42757k69609
$$ 14802576 14534880 13224004 11576642 10779840 11008569 11618667 12093737 12236494 11966885
38488A1966885m60078m2966P73075J172039O33220l82069q06996j16064Q70011
$$ 11966885 11506807 11463841 12236916 13408955 14042175 13660106 12853110 12737046 13607057
38479A3607057O80427r20826k227167j609543J16849O06696p45441j953081j338353
$$ 13607057 14287484 13366658 11139491 9529948 9646797 10253493 9508052 7554971 6216618
38470F216618J89392P07244m6892p89077p07983j43707L39242N22199L81552R9418
$$ 6216618 6406010 7113254 7066362 6277285 5569302 5425595 5764837 6287036 6668588 6768006
38460F768006O034O9019j04715m34634l30910P7303k26821j363442j840446p05427
$$ 6768006 6774040 6843059 6738344 6303710 5972800 6050103 5823282 4459840 2619394 1913967
38450A913967Q01498J121465P23201Q66173J109433K27296j092094r19094P15729
$$ 1913967 2715465 3836930 4560131 5426304 6535737 6763033 5670939 4751845 5467574
38441E467574J696295J060050L9903m71382j085474j880260j641586k47519M59536
$$ 5467574 7163869 8223919 8263822 7792440 6706966 4826706 3185120 2937601 3397137
38432C397137l94385r93504K38195J845527J525189l43746j515143j182682l76817
$$ 3397137 3002752 2009248 2247443 4092970 5618159 5274413 3759270 2576588 2199771
38423B199771J39755L30116j17352j213243j602738j47330J790513J787804o1080
$$ 2199771 2339526 2669642 2552290 1339047 -263691 -411021 1379492 3167296 3106216
38414C106216j204316l95271Q08766P79157k6002m38214l51531j65456J37073
$$ 3106216 1901900 1506629 2315395 3094552 3068550 2630336 2278805 2113349 2250422
38405B250422M66909L66232k4134R3005O72038N83533m52201j091946l96863P12823
$$ 2250422 2717331 3083563 3059429 3152434 3824472 4408005 3955804 2863858 2466995 3179818
38395C179818J011617O64800K80120l84331j402632j632460l71622R05396L59573
$$ 3179818 4191435 4856235 5136355 4752024 3349392 1716932 1345310 2250706 2610279
38386B610279j275583j583641j04270R70615J13807j344054j244085M32524J752195
$$ 2610279 1334696 -248945 -353215 617400 731207 -612847 -1856932 -1424408 327787
38377C27787J401129R1527n55385N8526R59798R24248N5241m26452K1189M63756
$$ 327787 1728916 1820443 1265058 1323584 2283382 3207630 3262871 2836419 2857608 3321364
38367C321364j4768p93377o28069M02872J029456P42016M05006O64815Q46078
$$ 3321364 3306596 2513219 1885150 2288022 3317478 4059494 4464500 5129315 5975393
38358E975393R0983j136206j545113p86266N8701n2882p01578n87734N96537J590183
$$ 5975393 6066376 4930170 3385057 2598791 2657492 2604610 1903032 1315298 1911835 3502018
38348C502018J237710J19559k85925L12996Q38377O20979J04929l76447j112220
$$ 3502018 4739728 4859287 4573362 4886358 5724735 6345714 6450643 6074196 4961976
38339D961976j818826j439638j2626P12976k64636j461897j122438O7035L22332
$$ 4961976 3143150 1703512 1690886 2403862 2139226 677329 -445109 -378074 -55742
38330e5742j90357J11928J197888J347594J27249q65689o54614j92616l42552
$$ -55742 -246099 -134171 1063717 2411311 2538560 1672871 1018257 825641 483089
38321D83089m44334J77214Q70037Q37925L78062K4885l58726p86732o34698J61705
$$ 483089 38755 215969 1086006 1923931 2301993 2326878 1968152 1181420 546722 708427
38311G08427N15083j93595q83106k40704J313136K124816J283582n81962j991757
$$ 708427 1223510 1029915 146809 -93895 1219241 3344057 4627639 4045677 2053920
38302B053920j738513l9673J261451O83845o38581k68497J689979K206540k14487
$$ 2053920 315407 275734 1537185 2221030 1582449 1313952 3003931 5210471 4995984
38293D995984k926049k744241k81899J483132J447952P46644N0383p71837r77294
$$ 4995984 2069935 -674306 -956205 526927 1974879 2721523 2771906 2000069 1022775
38284A022775K81755J757339J359443m05771r61671J85252P38036k87693q04912
$$ 1022775 1304530 3061869 4421312 4015541 3053870 3239122 3977158 3689465 2884553
38275B884553O02161J967650J053277j014620j629253o59849J1256j21630J12660
$$ 2884553 3486714 5454364 6507641 5493021 3863768 3203919 3215175 3093545 3206205
38266C206205Q61394P46295o81354k007870k021849j155763l18313L68290J022347
$$ 3206205 4067599 4813894 4132540 2124670 102821 -1052942 -1371255 -1002965 19382
38257A9382J306712J018068O07413M97726M51397O4935o05942j216498j428880
$$ 19382 1326094 2344162 2951575 3449301 3900698 3965633 3359691 2143193 714313
38248G14313r08585K98365J270564R96142o9152k79481Q42234J676834Q37306
$$ 714313 -194272 104093 1374657 2370799 2301647 2022166 2864400 4541234 5378540
38239E378540o90461j083256m95749n75298j544186j788974o34683M46185K65099
$$ 5378540 4688079 3604823 3109074 2533776 989590 -799384 -1434067 -987882 -722783
38230g22783j61172N35990J646874J527726L46375k15110K83345M79648l65451
$$ -722783 -883955 -347965 1298909 2826635 3173010 2957900 3241245 3720893 3355442
38221C355442j127872p10577K02046K58872o04993j301598j096367j65191R00879
$$ 3355442 2227570 1516993 1719039 1977911 1372918 71320 -1025047 -1190238 -289359
38212b89359J435693R59388j98143q76002l60474N93473O66820l27956j290262
$$ -289359 1146334 2105722 1907579 1031577 671103 1264576 1931396 1603440 313178
38203C13178j207801j15187J173023J749409J194428O216o97744l93742J75832
$$ 313178 -894623 -1009810 163213 1912622 3107050 3113266 2415522 2021780 2197612
38194B197612P9049m43554n13940k02741m27580j199480j233928J17079J576009
$$ 2197612 2276661 1833107 1319167 1116426 688846 -510634 -1744562 -1627483 -51474
38185e1474J473563q2016j508151j793258j243191m21429N15790J285620J361704
$$ -51474 1422089 1340073 -168078 -1961336 -3204527 -3625956 -3110166 -1824546 -462842
38176d62842Q57858O48242J021113J055029J09318r28841j008251p24889j163365
$$ -462842 395016 1043258 2064371 3119400 3228718 2299877 1291626 566737 -596628
38167e96628j488502N7962K624483K899724M771k332338p40141K662465L124745
$$ -596628 -2085130 -2027168 597315 3497039 3501810 1169472 429331 3091796 6216541
38158F216541Q1170k392339j742470N4453M26161k28046m88076n53191q37525
$$ 6216541 6297711 3905372 2162902 2217355 2643516 2415470 1927394 1374203 536678
38149E36678k90041J476125K301824M12657k227658k390919m54315K60220j344298
$$ 536678 246637 1722762 4024586 4437243 2209585 -181334 -635649 -375429 -1719727
38140a719727k719802j778969L61982J646382J787393J522122R63653N3323n90548
$$ -1719727 -4439529 -6218498 -5856516 -4210134 -2422741 -900619 63034 116357 -474191
38131d74191n06164k00774j67287R6524J108199K067123J563033n01340k412386
$$ -474191 -980355 -1181129 -1348416 -1251892 -143693 1923430 3486463 2985123 572737
38122E72737k271212m33K348988K570912P50952p68222k77129J187244J447627
$$ 572737 -1698475 -1698908 650080 3220992 3971944 3203722 2926593 4113837 5561464
38113E561464J52179j137109j326936p66280k7350P36175J141922P65986J67630
$$ 5561464 5713643 4576534 3249598 2483318 2455968 3192143 4334065 5100051 5267681
38104E267681L14982Q03712K03092j457712k218812r51275Q84249J230445L5671
$$ 5267681 5582663 6386375 6589467 5131755 2912943 1961668 2845917 4076362 4112033
38095D112033j160505j362874q42903l00129j18716j73668q647M87790O88670
$$ 4112033 2951528 1588654 745751 445622 326906 153238 144591 632381 1321051
38086A321051J81245k18378M36182J388339J055205k81663o15853N49643J231033
$$ 1321051 1502296 1283918 1720100 3108439 4163644 3881981 3266128 3815771 5046804
38077E046804J51929j155860q73714K36713K89044o88468j109764m68993J99412
$$ 5046804 5198733 4042873 3169159 3405872 3694916 3006448 1896684 1427691 1627103
38068A627103J78473j11954q9307K61004N81613M38332k87136r07065m83753P08892
$$ 1627103 1805576 1693622 1604315 1865319 2446932 2885264 2598128 1691063 1207310 1916202
38058A916202J182699K34477j064280j488274j143575o37859j9106N91082N57725
$$ 1916202 3098901 3333378 2269098 780824 -362751 -1000610 -1019716 -428634 129091
38049A29091j13603l95745R3240M00233R6779J70553R56106J067740j29275r47241
$$ 129091 15488 -380257 -287017 113216 209995 380548 1336654 2404394 2275119 1327878
38039A327878j15338Q62678K89907o79800j82156R04309O47117k45028K40126
$$ 1327878 1212540 2075218 2365125 1685325 1503169 2407478 3054595 2809567 3049693
38030C049693J450556J035915p19461j217946l1590O07805n0745l36393J83967
$$ 3049693 4500249 5536164 4816703 3598757 3567167 4174972 4124227 3787834 3971801
38021C971801j44911j389756j238535P81003J872869M85845j124867q94132k54936
$$ 3971801 3826890 2437134 1198599 1979602 3852471 4338316 3213449 2319317 2064381
38012B064381r40623j464269J10335K190000J814136o73413k255148j599773o413
$$ 2064381 1123758 -340511 -230176 1959824 3773960 3100547 845399 -754374 -760787
38003g60787J267484J994931J802791M70133q29127o99040K83162M21812m25667
$$ -760787 506697 2501628 4304419 4774552 3945425 3246385 3529547 3951359 3525692
37994C525692r58695q14085p43781o36580M07170J879332J925878J77829j355536
$$ 3525692 2566997 1752912 1009131 372551 779721 2659053 4584931 4762760 3407224
37985C407224j046951K19901O31363o0839p32142p94726p37101r42000r46065
$$ 3407224 2360273 2580174 3211537 3150698 2418556 1623830 886729 -55271 -1001336
37976a001336k67852N26174L60791n88562o07700J150576K724935J513070j765354
$$ -1001336 -1269188 -743014 -382223 -970785 -1578485 -427909 2297026 3810096 2044742
37967B044742l397499j570920J228319J926385Q72010K86655N19783L08758l81351
$$ 2044742 -1352757 -2923677 -1695358 231027 1103037 1389692 1909475 2218233 1836882
37958A836882m28310M1890k17267j180629j496818q08333p7992L73666J079373
$$ 1836882 1408572 1450462 1233195 52566 -1444252 -2252585 -2330577 -1956911 -877538
37949h77538J657552J043713k86619n68462L56403O46418m29458j293096q46244
$$ -877538 780014 1823727 1537108 968646 1325049 1971467 1542009 248913 -597331
37940e97331j56456j75540l8265Q15070R73261m94232j769986q51362J017368
$$ -597331 -753787 -929327 -967592 -152522 820739 326507 -1443479 -2294841 -1277473
37931a277473J115683m30863r24392N37128J780907J146351j49889l20776L10417
$$ -1277473 -161790 -592653 -1517045 -979917 800990 1947341 1797452 1476676 1787093
37922A787093L96361p5915j48767K00916J39720l39271k93390M79680R03014K72685
$$ 1787093 2183454 2107539 1958772 2159688 2299408 1960137 1666747 2146427 3049441 3322126
37912C322126n37287l20866O22117Q70685q2242j172058j337015q53078n70558
$$ 3322126 2784839 2463973 3086090 3956775 3874533 2702475 1365460 512382 -58176
37903e8176n41466k18972L94836P35039P02030Q09565J199570J326127Q70695
$$ -58176 -599642 -818614 -423778 311261 1013291 1822856 3022426 4348553 5219248
37894E219248K44328j37577l77200n04955j24210P45987J152116L81198p89526
$$ 5219248 5463576 5325999 4948799 4443844 4319634 5065621 6217737 6598935 5809409
37885E809409r75224r8832N86036L76428o4743n7050M2467k11807l46625N9145
$$ 5809409 4834185 4735353 5321389 5697817 5633074 5576024 5618491 5406684 5060059 5119204
37875E119204J79500q60652k005123j274717J051170K216870Q71971p10181K0789
$$ 5119204 5298704 4438052 2432929 1158212 2209382 4426252 5298223 4588042 4608831
37866D608831J875155J716026n40689j692545k33950J417808Q80345o13572n54403
$$ 4608831 6483986 8200012 7659323 5966778 5732828 7150636 8030981 7417409 6863006
37857F863006Q65010J485309P11264j10385k73853m28689q38528q66157k99319
$$ 6863006 7728016 9213325 9924589 9814204 9540351 9111662 8273134 7406977 7107658
37848G107658L84318J085368J962221K376278J520039J2987p22281n92184o76369
$$ 7107658 7491976 8577344 10539565 12915843 14435882 14448869 13726588 13134404 12458035
37839A2458035j074920q27818l311K39062r1325K77580J281357J248891o08l63863
$$ 12458035 11383115 10555297 10551986 10791048 10699723 10977303 12258660 13507551 13506943 13143080
37829A3143080R78249J727313m001k563491l286708k244239j156917k87931R63531
$$ 13143080 14121329 15848642 15844641 13281150 9994442 7750203 6593286 6305355 7268886
37820G268886J747209R13081m08822k05892J055066J257817K95839j31443o6436
$$ 7268886 9016095 9929176 9520354 9314462 10369528 11627345 11923184 11791741 11725305
37811A1725305j189553k906175k288640Q78679K611516M21325k552937j962661
$$ 11725305 10535752 7629577 5340937 6219616 8831132 9252457 6699520 4736859
37803D736859J439259L177792J451438j193150k184620j770174j099353j58532
$$ 4736859 6176118 9353910 10805348 9612198 7427578 5657404 4558051 4399519
37795D399519J232303K187376J817053N13307p04045j328536j278322n81040K12176
$$ 4399519 5631822 7819198 9636251 10149558 9445513 8116977 6838655 6257615 6469791
37786F469791J92411n90712q27368J85691J227672Q41470l71108o43916J12042
$$ 6469791 6662202 6071490 5244122 5429813 6657485 7498955 7127847 6483931 6595973
37777F595973J82796r73207j555178k70155J302009R31962p37287j069471M82983
$$ 6595973 6778769 5805562 4250384 3980229 5282238 6214200 5476913 4407442 4890425
37768D890425J496335K43053j874337k613089j844820p90418K28955J455920K124224
$$ 4890425 6386760 6629813 4755476 2142387 297567 -492851 -263896 1192024 3316248
37759C316248J279899k60036p22308l4139J86802o42307j251283p79226r909K78936
$$ 3316248 4596147 4336111 3613803 3579664 3766466 3124159 1872876 1093650 1083741 1362677
37749A362677M59532P26600L31174p61469j059288J90692J321987N43383j171818
$$ 1362677 1822209 2548809 2879983 2118514 1059226 1249918 2571905 3115288 1943470
37740A943470j420745Q1768J302247R92213N2911l41919k34059n8695J88457L75167
$$ 1943470 522725 604493 1906740 2898953 2951864 2609945 2375886 2317191 2505648 2880815
37730B880815P414q29459j258965q22143m1701N29800Q44553O67849m15898j781683
$$ 2880815 2888229 2058770 799805 -22338 -64039 465761 1310314 1978163 1562265 -219418
37720b19418j878386m37204O90392J00808q80101j08902J925505K570652R14713
$$ -219418 -2097804 -2535008 -1844616 -1743808 -2623909 -2732811 -807306 1763346 2678059
37711B678059p65886k13378J698050K303776P11657j380226k157013j629928q06757
$$ 2678059 1912173 1698795 3396845 5700621 6412278 5032052 2875039 1245111 438354
37702D38354m8922Q68727J618202J363610P6240j102692j288327r42967q84887
$$ 438354 389432 1258159 2876361 4239971 4316211 3213519 1925192 982225 97338
37693I7338q58005j26729Q80295Q77778k14583r10678l87648K45014j82092r23480
$$ 97338 -760667 -887396 -7101 870677 656094 -254584 -642232 -397218 -579310 -1502790
37683a502790n19099Q32316J583367J106951K02366m56331q90395q42491J91216
$$ -1502790 -2021889 -1189573 393794 1500745 1703111 1246780 356385 -486106 -294890
37674b94890J604677J822954M34114j050855j286000p98676p43698r85068n52891
$$ -294890 1309787 3132741 3566855 2516000 1230000 431324 -312374 -1297442 -1850333
37665a850333O37411J639178J745585J056897J0920r65981j511985j505372j010437
$$ -1850333 -1212922 426256 2171841 3228738 3239658 2273677 761692 -743680 -1754117
37656a754117L9858J505362K357410J484855m14024j133076L3239J075866L02704
$$ -1754117 -1714259 -208897 2148513 3633368 3219344 2086268 2119507 3195373 3498077
37647C498077r89425p34826L73825Q1688j475934j854117k82020J228860J247428
$$ 3498077 2508652 1773826 2147651 2229339 753405 -1100712 -1382732 -153872 1093556
37638A093556P39673O25644O0558j448927k402790j504153J98384J030562J053494
$$ 1093556 1833229 2458873 2519431 1070504 -1332286 -2836439 -2638055 -1607493 -553999
37629e53999J082592Q57339R07n78054j89023L0242q96761j484966K4661K231198
$$ -553999 528593 1385932 1386839 808785 619762 650004 -246757 -1731723 -1707062 524136
37619E24136K218786O9274j320415q11162k27497n98673m69226R13387J723399
$$ 524136 2742922 2812196 1491781 680619 453122 -145551 -614777 298610 2022009
37610B022009N88202r58611r99138j75320o7821l89622l2412M86691j436q65903
$$ 2022009 2610211 1651600 652462 477142 409321 19699 -12713 473978 472542 -393361
37600c93361n46293P15052J224480N76731l7869p8404j82992m52935j53862O52903
$$ -393361 -939654 -224602 999878 1576609 1538740 1460336 1277344 824409 670547 1323450
37590A323450R39026M57675O1308M1745k16624o83211n32115P2614j07678j092094
$$ 1323450 2262476 2720151 2781459 2823204 2606580 1923369 1391254 1463868 1356190 264096
37580B64096j225439R3231J158603O75634j36640J90901P04589k14707j660607
$$ 264096 -961343 -868112 290491 966125 829485 1020386 1724975 1510268 -150339
37571a50339j350475N21233J217578m51244k297530j909345J66500J608416J440612
$$ -150339 -1500814 -979581 237997 -213247 -2510777 -4420122 -4253622 -2645206 -1204594
37562a204594O35522K90560M69106O89985O31779K38879l32300p59350q38104
$$ -1204594 -569072 -278512 190594 880579 1512358 1751237 1418937 659587 -178517
37553a78517p39796p70389q91456p07371k8167O93800P53120J43881j90035M45864
$$ -178517 -918313 -1688702 -2580158 -3287529 -3315696 -2621896 -1868776 -1724895 -1914930 -1469066
37543a469066J211633N36461j493328k573560r27863K093046L414539J962910
$$ -1469066 -257433 279028 -1214300 -3787860 -4715723 -2622677 791862 2754772
37535B754772l54094j445566j367100j264360j258888n67374Q04053J650694J007688
$$ 2754772 2400678 955112 -411988 -1676348 -2935236 -3502610 -2698557 -1047863 -40175
37526d0175n94496j561091p97881J143068K443152J701680o56355k725296k851593
$$ -40175 -634671 -2195762 -2993643 -1850575 592577 2294257 1637902 -1087394 -3938987
37517c938987j013052J225984J935085M51140j742160k205605k16705K222375
$$ -3938987 -4952039 -3726055 -1790970 -1339830 -3081990 -5287595 -5504300 -3281925
37509c281925K771551J506839K28087k49774m64654m23649M91032J585782J132503
$$ -3281925 -510374 996465 1224552 974778 510124 86475 577507 2163289 3295792
37500C295792p02446j460313p3238J256331M82585j052637r77574K62961N46180
$$ 3295792 2593346 1133033 1059795 2316126 2798711 1746074 768500 1031461 1577641
37491A577641j64171r7119Q89883J089577R7133n99118m71242p22431j581324
$$ 1577641 1413470 1316351 2206234 3295811 3392944 2793826 2322584 1600153 18829
37482A8829j410643M14807K001827J644172J81005o75431p00142m82855L1545
$$ 18829 -1391814 -977007 1024820 2668992 2849997 2174566 1474424 991569 1023114
37473A023114Q06430Q63872k31981j156927o65126L59559L18164n42734p88300
$$ 1023114 1829544 2693416 2461435 1304508 639382 998941 1317105 774371 -13929
37464a3929l68472n71161j553566j761216j99948J992540K743390J154756j674172
$$ -13929 -382401 -953562 -2507128 -4268344 -4468292 -2475752 267638 1422394 -251778
37455b51778l435549k510859K95158K353110K196180J160071J076029J355156
$$ -251778 -3687327 -6198186 -5903028 -3549918 -1353738 -193667 882362 2237518
37447B237518J52865k123256k791785p79318J583258J725333J89597o15157J05053
$$ 2237518 2390383 267127 -2524658 -3303976 -1720718 4615 194212 -420945 -315892
37438c15892J003566J045765P06333N34776J03142q52738j423262p99007K00028
$$ -315892 687674 1733439 2439772 2974548 3077690 2224952 801690 2683 202711
37429B02711K61531j55038N58503K133533K122559l24444k403833j373579J186692
$$ 202711 464242 309204 867707 3001240 5123799 4799355 2395522 1021943 2208635
37420B208635J515921p31915k178310j067071L94865M0526j002889q20015J23042
$$ 2208635 3724556 2992641 814331 -252740 142125 182651 -820238 -1640253 -1517211
37411a517211M76069N42416R71711P61016q51897k043603p87253J563186K000302
$$ -1517211 -1041142 -498726 472985 1234001 382104 -1661499 -2448752 -885566 1114736
37402A114736L62143q84803p85281o31859p41515J53420J849303K184728N57333
$$ 1114736 1476879 592076 -193205 -825064 -1566579 -1413159 436144 2620872 3178205
37393C178205q54509n12496L69566L73753J12688M10556M43482n33332j394678
$$ 3178205 2323696 1811200 2180766 2554519 2667207 3077763 3521245 2987913 1593235
37384A593235r16579P9167J05620o21139q51878l98774j4454Q7083K36383M41923
$$ 1593235 676656 755823 861443 240304 -611574 -1010348 -1024802 -937719 -701336 -259413
37374b59413O02981R33263J277175Q39419m91225j475915j172388l32144j40959
$$ -259413 343568 1276831 2554006 3393425 2902200 1426285 253897 -78247 -219206
37365b19206m93472o11156n00952o27380q28183o28553o9794N69339J167016J260732
$$ -219206 -712678 -1323834 -1824786 -2452166 -3280349 -3908902 -3978696 -3409357 -2242341 -981609
37355i81609K04836j445305j968606q30112L63371L53760J30406Q69692J573241
$$ -981609 -776773 -2222078 -4190684 -5020796 -4657425 -4303665 -4173259 -3303567 -1730326
37346a730326Q00840m76171j69091J424831J870928L12988j249995q37229J030512
$$ -1730326 -929486 -1405657 -1574748 -149917 1721011 2033999 784004 -53225 977287
37337I77287K318568J856882K64823q91741p34815q9984l97081j464994j535739
$$ 977287 3295855 5152737 5417560 4525819 3791004 3701020 3303939 1838945 303206
37328C03206j43375Q05123K4727r04780j54056J202024J063512p4836k32124L75471
$$ 303206 159831 964954 989681 84901 -69155 1132869 2196381 2121545 1889421 2264892
37318B264892l2820j078924o33378J051035J218502p30842j955573p56027Q22658
$$ 2264892 2232072 1153148 519770 1570805 2789307 2058465 102892 -653135 169523
37309A69523O68537q1141M20635J363036R77619k38549n73424p9035n1049m33257
$$ 169523 838060 756919 1177554 2540590 3518209 3279660 2706236 2627201 2576152 2142895
37299B142895o7535R76082J393065P30378k31588r45290j408650j291643k94712
$$ 2142895 2075360 3051442 4444507 5174885 4943297 3998007 2589357 1297714 1003002
37290A003002P75640P68598n152j16676P55146J265335L60046j293249k216138
$$ 1003002 1778642 2547240 2542088 2425412 3180558 4445893 4805939 3512690 1296552
37281A296552j686342j45669J299835J627702P44555l04983m75644j4524j9119
$$ 1296552 -389790 -535459 764376 2392078 3136633 2831650 2356006 2341482 2322363
37272B322363q02086j487903j344718p11122k53758J6115M46151R16387R56429
$$ 2322363 1520277 32374 -1312344 -2023466 -2277224 -2261109 -1814958 -898571 57858
37263E7858N28070P8984k17136o49230j128120q18829O72808K148747J900558
$$ 57858 585928 664912 447776 -201454 -1329574 -2148403 -1475595 673152 2573710
37254B573710m919j598119j524060n99921k30611m00307k67175K03858M94793
$$ 2573710 2568791 970672 -553388 -1153309 -1383920 -1784227 -2051402 -1847544 -1352751
37245a352751O86862R79602P19241n28670j508962p24968R55061J168581m42058
$$ -1352751 -665889 313713 1032954 504284 -1004678 -1729646 -774585 393996 -48062
37236d8062j671777j014943N45677J564378J962136K035800J486213M12993l05787
$$ -48062 -1719839 -2734782 -2189105 -624727 1337409 3373209 4859422 5272415 4966628
37227D966628m88206r40017j587955j202109J76378O92009k32603n63069Q97179
$$ 4966628 4478422 3538405 1950450 748341 924719 1616728 1384125 821056 1718235
37218A718235K011838N58368j967409k510316j005872R5038j10746l23152N2545
$$ 1718235 3730073 4288441 2321032 -189284 -1195156 -1100118 -1210864 -1534016 -1481471
37209a481471K02477L6099M00168J006384N58095p60390j180901j50281Q57510
$$ -1481471 -1278994 -1242895 -842727 163657 721752 -38638 -1219539 -1369820 -512310
37200e12310P78509K21786j59846n74225q23152j23779J099860J159623l28562
$$ -512310 266199 487985 328139 -246086 -1069238 -1193017 -93157 1066466 737904
37191G37904j602235j331149k86317M26674R10123J179903L36868j454895k020340
$$ 737904 -864331 -2195480 -2481797 -2055123 -1145000 34903 371771 -1083124 -3103464
37182c103464j39935K040115J771687k40201j001228J73457Q90933l30807j811053
$$ -3103464 -3243399 -1203284 568403 328202 -673026 -499569 391364 60557 -1750496
37173a750496j404472M07405J473384R20530j70211n01634J12028R65184J209710
$$ -1750496 -3154968 -2747563 -1274179 -353649 -523860 -1025494 -913466 51718 1261428
37164A261428M40943q81239j642453j189471j71186K25525j93723m97622j01749
$$ 1261428 1702371 821132 -821321 -2010792 -2181978 -1956453 -2150176 -2647798 -2749547
37155b749547M03704L17402p565J70439O41667N69377k3741j76522M76499J130658
$$ -2749547 -2345843 -2028441 -2036006 -1865567 -1223900 -654523 -678264 -854786 -378287 752371
37145G52371J099342O92446L44543j37505p81911q59459j7872P30880K16658j181499
$$ 752371 1851713 2544159 2888702 2751197 1969286 1109827 1091955 1822835 2039493 857994
37135H57994k045849j767136q97685K1450R02935J459482J134092n5509j184462
$$ 857994 -1187855 -2954991 -3852676 -3831226 -2928291 -1468809 -334717 -390226 -1574688
37126a574688j156069L35623K320191K983452J328350j288656k263409r63010
$$ -1574688 -2730757 -2395134 -74943 2908509 4236859 2948203 684794 -278216
37118b78216L33469l42717j766841j381213R06417K627912K064542k1101j811463
$$ -278216 55253 -287464 -2054305 -3435518 -2529101 98811 2163353 2142252 330789
37109C30789k164138j052294M80246J027349N03258M61050J572204J963191m4792
$$ 330789 -1833349 -2885643 -2405397 -1378048 -874790 -413740 1158464 3121655 3076863
37100C076863k650954k615781o880J934781J569292N53613M19545M22954l07263
$$ 3076863 425909 -2189872 -2196752 -261971 1307321 1860934 2280479 2703433 2396170
37091B396170j121456j449156j724104j719526l19355K004489K941719J771413
$$ 2396170 1274714 -174442 -1898546 -3618072 -3937427 -1932938 1008781 2780194
37083B780194N24728M07931j23128j902577k618095m88419K085643J735029p48011
$$ 2780194 3304922 3712853 3589725 1687148 -930947 -1419366 666277 2401306 1653295
37074A653295j804946n08437P55969N03189j08685J08933O51924P02332K72083
$$ 1653295 -151651 -660088 95881 599070 490385 599318 1251242 1953574 2225657
37065B225657m23703j214321j455090o18218O04337R95364M47593j65620l63692
$$ 2225657 1801954 587633 -867457 -1485675 -881338 114026 561619 395999 32307
37056C2307k60567K6105J58420l97697j131795n30481J370886K120678L59442
$$ 32307 -228260 -202155 -43735 -441432 -1573227 -2103708 -732822 1387856 1747298
37047A747298j573271j017031O73269L44777j606719j890688P5797J238551J15330
$$ 1747298 174027 -843004 -169735 175042 -1431677 -3322365 -3246568 -2008017 -1892687
37038a892687q97974J94134J697196J205253n94241j270682k25743R87000J000492
$$ -1892687 -2790661 -2596527 -899331 305922 -288319 -1559001 -1784744 -797744 202748
37029B02748o0017j042481q73411K51105Q27638J19074l55235R14825K440790
$$ 202748 142731 -899750 -1773161 -1522056 -694418 -575344 -930579 -15754 2425036
37020B425036J590571r46875j777883j58400Q51040l89798j433481j94565J410300
$$ 2425036 4015607 3068732 1290849 1132449 1983489 1593691 160210 -34355 1375945
37011A375945R28237m58988l51903O34497M61969l00219L43105J737457J337092
$$ 1375945 2304182 1845194 1493291 2127788 2589757 2289538 2632643 4370100 5707192
37002E707192r14554k381716j941883j235521j298054r01248P71369K213924J707558
$$ 5707192 4792638 2410922 469039 -766482 -2064536 -2965784 -2194415 19509 1727067
36993A727067k37718j693315j552467k51424R40074R80824J05579k19893Q20101
$$ 1727067 1489349 -203966 -1756433 -2007857 -1067783 -86959 18620 -201273 618828
36984F18828J962293J503072j02314r08371n41653o80276k164172l452208k762753
$$ 618828 2581121 4084193 3981879 3073508 2531855 1851579 -312593 -3764801 -6527554
36975f527554m35132J664072K186673J202303j47193n25535L35944J146581O42663
$$ -6527554 -6962686 -5298614 -3111941 -1909638 -2056831 -2582366 -2246422 -1099841 -457178
36966d57178n11289o15298M15832R00583P6704q27931p73127l85573l49545k1582
$$ -457178 -968467 -1583765 -1167933 -267350 -190646 -1018577 -1791704 -2177277 -2526822 -2548404
36956b548404J035699J596354N01389j189046j539182n72609K1557l47539n68199
$$ -2548404 -1512705 83649 585038 -604008 -2143190 -2715799 -2694242 -3041781 -3609980
36947c609980l7023L77147J42083J99702J249180K112123J227623q34481j860512
$$ -3609980 -3647003 -3269856 -3127773 -2928071 -1678891 433232 1660855 826374 -1034138
36938a034138r50677M27302P63253N42366R35626J475442O92978j176787j973094
$$ -1034138 -1984815 -1557513 -794260 -251894 683732 2159174 2852152 1675365 -297729
36929b97729o71193R24555O92137q15852j413832n27972L93257M31488K65589
$$ -297729 -968922 -44367 647770 -168082 -1581914 -2109886 -1716629 -1285141 -1019552
36920a019552M28588L02277l92520o26595L13118J369256J138559m2117p25037
$$ -1019552 -590964 -288687 -681207 -1307802 -994684 374572 1513131 1471014 745977
36911G45977n24908k92730l44853N4049J177104J977442J357058l88801j952255
$$ 745977 221069 -71661 -416514 -362465 814639 2792081 4149139 3760338 1808083
36902A808083k420254j877891r68926l20561k18594m35861m10008J36822P78514
$$ 1808083 -612171 -2490062 -3458988 -3779549 -3998143 -4434004 -4844012 -4707190 -3928676
36893c928676Q17518J44273n57878n54183J49174Q76653J044611O84421K36355
$$ -3928676 -3111158 -2966885 -3524763 -4078946 -3929772 -3053119 -2008508 -1324087 -1087732
36884a087732L3926J07614L53740O70131Q99076Q28367M10497o9759k17821J6481
$$ -1087732 -1053806 -946192 -592452 77679 976755 1805122 2215619 2145860 1928039 1944520
36874A944520K31142M4907m05111o15418l23527K42770O76906O70941N4621r50337
$$ 1944520 2175662 2220569 1815458 1200040 876513 1119283 1796189 2467130 2521751 1571414
36864A571414j471837o94747Q43725J451047M04360q91405p89854K92416P47283
$$ 1571414 99577 -595170 248555 1699602 2103962 1212557 422703 715119 1462402
36855A462402L59821L03441P48834M78464p62877j535444j091202n57231o41904
$$ 1462402 1822223 2125664 2874498 3352962 2590085 1054641 -36561 -593792 -1235696
36846a235696j34052J679362K886885J449564j390207k565916j330808L46280
$$ -1235696 -1369748 309614 3196499 4646063 3255856 689940 -640868 -294588
36838b94588R99400Q85289K64356r78918j846154q90276J093738J454696m18206
$$ -294588 704812 1590101 1854457 875539 -970615 -1860891 -767153 687543 269337
36829B69337j914013j054973O99800J070575M04221M82598J298805J281378Q3030
$$ 269337 -1644676 -2699649 -1999849 -929274 -525053 -42455 1256350 2537728 2620758
36820B620758q95998o97744J2495J13042o14686j379961j091309N60256K291689
$$ 2620758 1724760 1027016 1039511 1152553 537867 -842094 -1933403 -1373147 918542
36811I18542K120329k97424k871087l341383j705963L10931J423157J512922R25533
$$ 918542 3038871 2741447 -129640 -3471023 -5176986 -4866055 -3442898 -1929976 -1004443
36802a004443J31516k99013k28488p8783R4508Q36041J916585J873608J05118
$$ -1004443 -872927 -1171940 -1400428 -1479211 -1384703 -548662 1367923 3241531 3346649
36793C346649j635956j409683K2422K89173r95757j672709k69092J876448K381253
$$ 3346649 1710693 301010 323432 612605 -383152 -2055861 -2324953 -448505 1932748
36784A932748O85093j479818k036972p20183O44208L28779q74463n72838J504069
$$ 1932748 2617841 1138023 -898949 -1619132 -974924 -646145 -1520608 -2093446 -589377
36775e89377K507947N34656k162226k268227k65490P16818L078j50265R16898
$$ -589377 1918570 2453226 291000 -1977227 -2242717 -1525899 -1522821 -1673086 -756188
36766g56188J036970n47840j309291L54521K079481J157546j190065j925720q09891
$$ -756188 280782 -267058 -1576349 -1221828 857653 2015199 825134 -1100586 -1910477
36757a910477L1325l9796K07613R34869Q53694j36078n32943Q8508K71838p31126
$$ -1910477 -1879152 -1918948 -1711335 -776466 77228 -58850 -591793 -503285 -231447 -962573
36747i62573j571755r84784K88814Q66432O96697N13907L74946l2424l53804l7314
$$ -962573 -2534328 -3519112 -3230298 -2363866 -1667169 -1153262 -778316 -810740 -1164544 -1201858
36737a201858N88638P19939K37682m18928j158086j994563k202626r85582R17452
$$ -1201858 -613220 106719 344401 -74527 -1232613 -3227176 -5429802 -6415384 -5497932
36728e497932J589715L89122j099959j292298o62400m51817l22082R31782K714304
$$ -5497932 -3908217 -3519095 -4619054 -5911352 -6573752 -7025569 -7347651 -6415869 -3701565
36719c701565K785538N60642j620894j530416J73025J416713J542372J105489
$$ -3701565 -916027 -355385 -1976279 -3506695 -3333670 -1916957 -374585 730904
36711G30904J36583j360996k045823o90470J389767J738461M86295J13071J244072
$$ 730904 867487 -493509 -2539332 -3229802 -1840035 -101574 384721 497792 1741864
36702A741864J587596L5468j136789l5501J444200N88991j580027j776018M33602
$$ 1741864 3329460 3364928 2228139 2192638 3636838 4225829 2645802 869784 1303386
36693A303386K033450J043427j086425k065142j524998l85428P53840J532355
$$ 1303386 3336836 4380263 3293838 1228696 -296302 -681730 72110 1604465
36685A604465J400868L36292p51845j092141r62786r78138j041232o54377M8790
$$ 1604465 3005333 3341625 2589780 1497639 534853 -443285 -1484517 -2138894 -2090104
$$ [...]
##END NTUPLES=NMR SPECTRUM
##END=
