##TITLE=31Pdec_SR19_rm3
 D2O, 24 sc
 20.10.2020
##JCAMPDX= 6.0         $$ Bruker NMR JCAMP-DX V2.0
##DATA TYPE= NMR SPECTRUM
##DATA CLASS= NTUPLES
##ORIGIN= UXNMR, Bruker Analytische Messtechnik GmbH
##OWNER= root
$$ XWIN-NMR		Version 3.5
$$ Tue Oct 20 11:36:33 2020 Russian Standard Time (UT+4h)  she@DPX200
##.OBSERVE FREQUENCY= 81.013821
##.OBSERVE NUCLEUS= ^31P
##.ACQUISITION MODE= SIMULTANEOUS
##.ACQUISITION SCHEME= undefined
##.AVERAGES= 24
##.DIGITISER RES= 17
##SPECTROMETER/DATA SYSTEM= spect
##.PULSE SEQUENCE= zgpg30
##.SOLVENT NAME= D2O
##.SHIFT REFERENCE= (INTERNAL, D2O, 0, 182.463)
##AUDIT TRAIL= $$ (NUMBER, WHEN, WHO, WHERE, WHAT)
$$ ##TITLE= Audit trail, XWIN-NMR		Version 3.5
$$ ##JCAMPDX= 5.01
$$ ##ORIGIN= Bruker BioSpin GmbH
$$ ##OWNER= she
$$ F:/spectra/data/she/nmr/P31/1/pdata/1/auditp.txt
$$ ##AUDIT TRAIL=  $$ (NUMBER, WHEN, WHO, WHERE, WHAT)
(   1,<2020-10-20 11:35:31.70 +0400>,<she>,<DPX200>,
      <created by zg, POWCHK disabled, PULCHK disabled
       configuration hash MD5:
       00 E9 B6 7A A2 85 ED C7 34 08 36 98 17 FE 4E 26
       data hash MD5: 32K
       A9 59 48 82 87 78 45 B3 E0 84 5C 7E DF 8F 2C 5C>)
(   2,<2020-10-20 11:35:35.15 +0400>,<she>,<DPX200>,
      <Start of raw data processing
       efp BC_mod = 2 LB = 1 FT_mod = 6 PKNL = 1 PHC0 = -2731.922 PHC1 = 37.40141 SI = 64K 
       data hash MD5: 64K
       49 E2 0D FA 18 3C C9 3D 2C CF F7 05 D3 2B A3 53>)
(   3,<2020-10-20 11:36:00.73 +0400>,<she>,<DPX200>,
      <pk PHC0 = -54.76364 PHC1 = 96.8 
       data hash MD5: 64K
       77 51 90 44 67 37 BF 97 A1 88 A4 D8 94 B7 AA 95>)
(   4,<2020-10-20 11:36:04.59 +0400>,<she>,<DPX200>,
      <abs ABSG = 5 
       data hash MD5: 64K
       DE 83 EB 73 90 CD A1 E4 91 3D 2D 79 D6 4A 09 24>)
$$ ##END=
$$ 
$$ hash MD5
$$ 00 0D 0E BF 9A 4B 3C 53 18 BA 10 48 41 65 9F 9F
##$RELAX= 
##$RELAX= 
##$RELAX= 
##$RELAX= 
##$RELAX= 
##$RELAX= 
##$RELAX= 
##$RELAX= 
$$ Bruker specific parameters
$$ --------------------------
##$DU= <F:/spectra>
##$EXPNO= 1
##$NAME= <P31>
##$PROCNO= 1
##$TYPE= <nmr>
##$USER= <she>
##$AMP= (0..31)
100 100 100 100 100 100 100 100 100 100 100 100 100 100 100 100 100 100 
100 100 100 100 100 100 100 100 100 100 100 100 100 100 
##$AQSEQ= 0
##$AQ_mod= 1
##$AUNM= <au_zg>
##$AUTOPOS= <>
##$BF1= 81.014009
##$BF2= 200.13
##$BF3= 200.13
##$BF4= 200.13
##$BF5= 200.13
##$BF6= 200.13
##$BF7= 200.13
##$BF8= 200.13
##$BYTORDA= 1
##$CFDGTYP= 0
##$CFRGTYP= 5
##$CHEMSTR= <none>
##$CNST= (0..31)
1 1 145 1 1 1 1 1 1 1 1 1 1 1 1 1 1 1 1 1 1 1 1 1 1 1 1 1 1 1 1 1 
##$CPDPRG= <waltz16>
##$CPDPRG1= <>
##$CPDPRG2= <waltz16>
##$CPDPRG3= <>
##$CPDPRG4= <mlev>
##$CPDPRG5= <mlev>
##$CPDPRG6= <mlev>
##$CPDPRG7= <mlev>
##$CPDPRG8= <mlev>
##$CPDPRGB= <>
##$CPDPRGT= <>
##$D= (0..31)
0 1 0 0 0 0 0 0 0 0 0 0.03 2e-05 3e-06 0 0 0 0 0 0 0 0 0 0 0 0 0 0 0 0 
0 0 
##$DATE= 1603179331
##$DBL= (0..7)
120 120 120 11 120 120 24 19 
##$DBP= (0..7)
150 150 150 150 150 150 150 150 
##$DBP07= 0
##$DBPNAM0= <>
##$DBPNAM1= <>
##$DBPNAM2= <>
$$ [...]
##$SUBNAM3= <"">
##$SUBNAM4= <"">
##$SUBNAM5= <"">
##$SUBNAM6= <"">
##$SUBNAM7= <"">
##$SUBNAM8= <"">
##$SUBNAM9= <"">
##$SW= 369.568048894756
##$SWIBOX= (0..15)
0 1 3 0 0 0 0 0 0 0 0 0 0 0 0 0 
##$SW_h= 29940.119760479
##$TD= 32768
##$TD0= 1
##$TE= 0
##$TE2= 300
##$TE3= 300
##$TEG= 300
##$TL= (0..7)
0 120 53 12 22 120 120 120 
##$TP= (0..7)
150 150 150 150 150 150 150 150 
##$TP07= 0
##$TPNAME0= <>
##$TPNAME1= <>
##$TPNAME2= <>
##$TPNAME3= <>
##$TPNAME4= <>
##$TPNAME5= <>
##$TPNAME6= <>
##$TPNAME7= <>
##$TPOAL= (0..7)
0.5 0.5 0.5 0.5 0.5 0.5 0.5 0.5 
##$TPOFFS= (0..7)
0 0 0 0 0 0 0 0 
##$TUNHIN= 0
##$TUNHOUT= 0
##$TUNXOUT= 0
##$USERA1= <user>
##$USERA2= <user>
##$USERA3= <user>
##$USERA4= <user>
##$USERA5= <user>
##$V9= 5
##$VALIST= <valist>
##$VCLIST= <CCCCCCCCCCCCCCC>
##$VD= 0
##$VDLIST= <DDDDDDDDDDDDDDD>
##$VPLIST= <PPPPPPPPPPPPPPP>
##$VTLIST= <TTTTTTTTTTTTTTT>
##$WBST= 1024
##$WBSW= 4
##$XGAIN= (0..3)
0 0 0 0 
##$XL= 0
##$YL= 0
##$YMAX_a= 6233
##$YMIN_a= -11514
##$ZGOPTNS= <>
##$ZL1= 120
##$ZL2= 120
##$ZL3= 120
##$ZL4= 120
##$ABSF1= 182.463
##$ABSF2= -187.1042
##$ABSG= 5
##$ABSL= 3
##$ALPHA= 0
##$AQORDER= 0
##$ASSFAC= 0
##$ASSFACI= 0
##$ASSFACX= 0
##$ASSWID= 0
##$AUNMP= <proc_1d>
##$AZFE= 0.1
##$AZFW= 0.5
##$BCFW= 0
##$BC_mod= 2
##$BYTORDP= 0
##$COROFFS= 0
##$CY= -3
##$DATMOD= 1
##$DC= 0
##$DFILT= <>
##$DTYPP= 0
##$F1P= 0
##$F2P= 0
##$FCOR= 1
##$FTSIZE= 65536
##$FT_mod= 6
##$GAMMA= 0
##$GB= 0
##$INTBC= 1
##$INTSCL= 5.30512e-09
##$ISEN= 30
##$LB= 1
##$LEV0= 0
##$LPBIN= 0
##$MAXI= 10000
##$MC2= 0
##$MEAN= 0
##$ME_mod= 0
##$MI= 50
##$NCOEF= 0
##$NC_proc= -8
##$NLEV= 6
##$NOISF1= 182.463
##$NOISF2= 159.3651
##$NSP= 0
##$NTH_PI= 0
##$NZP= 0
##$OFFSET= 182.463
##$PC= 4
##$PHC0= -2786.686
##$PHC1= 134.2014
##$PH_mod= 1
##$PKNL= yes
##$PPARMOD= 0
##$PSCAL= 0
##$PSIGN= 0
##$REVERSE= no
##$SF= 81.0140089999434
##$SI= 65536
##$SIGF1= 159.3651
##$SIGF2= -187.1042
##$SINO= 113.3802
##$SIOLD= 16384
##$SREGLST= <1H.CDCl3>
##$SSB= 0
##$STSI= 65536
##$STSR= 0
##$SW_p= 29940.119760479
##$SYMM= 0
##$S_DEV= 0
##$TDeff= 32768
##$TDoff= 0
##$TI= <>
##$TILT= no
##$TM1= 0
##$TM2= 0
##$TOPLEV= 0
##$USERP1= <user>
##$USERP2= <user>
##$USERP3= <user>
##$USERP4= <user>
##$USERP5= <user>
##$WDW= 1
##$XDIM= 65536
##$YMAX_p= 514448799
##$YMIN_p= -80050542
$$ End of Bruker specific parameters
$$ ---------------------------------
##NTUPLES= NMR SPECTRUM
##VAR_NAME=  FREQUENCY,     SPECTRUM/REAL,   SPECTRUM/IMAG
##SYMBOL=    X,             R,               I
##VAR_TYPE=  INDEPENDENT,   DEPENDENT,       DEPENDENT
##VAR_FORM=  AFFN,          ASDF,            ASDF
##VAR_DIM=   65536,         65536,           65536
##UNITS=     HZ,            ARBITRARY UNITS, ARBITRARY UNITS
##FACTOR=    0.456856943014862, 1,           1
##FIRST=     14782.0589164792, 0,            0
##LAST=      -15158.0608439998, 0,           0
##MIN=       -15158.0608439998, -80050542,   0
##MAX=       14782.0589164792, 514448799,    0
$$ Real data points
##PAGE= N=1
##DATA TABLE= (X++(R..R)), XYDATA
$$ [...]
$$ plain form
41516 5291041 323257 -802733 6355270 13576050 13789183 10630630 9841823 9724766 6147604
41507 6147604 642164 -2737820 -4038671 -5383274 -6216225 -5451375 -4597500 -4182088 -1165228
41498 -1165228 5159444 8979877 5495787 -1098215 -3441540 -1554327 -699852 -1389508
41490 -1389508 655257 5509766 7570678 3664574 -3440609 -10086670 -14767981 -15999211
41482 -15999211 -12854091 -8142864 -5823303 -5180263 -2962326 -575033 -2123805 -5316313
41474 -5316313 -2854796 5064195 8381277 1477540 -7924755 -9687698 -4504674 16091
41466 16091 770626 -496339 -3677091 -9087589 -12452487 -8930291 -1036184 4112752 4325270
41457 4325270 2600257 -573261 -7076849 -13279440 -11247281 -735721 7640329 5719579
$$ packed form
41516E291041m967784j125990P158003P220780K13133l158553p88807j17057l577162
41507F147604n505440l379984j300851j344603q32951P64850Q53875M15412L016860
41498a165228O324672L820433l484090o594002k343325J887213Q54475o89656
41490a389508K044765M854509K060912l906104p105183o646061m681311j231230
41482a5999211L145120M711227K319561O43040K217937K387293j548772l192508
41474e316313K461517P918991L317082o903737r402295j762943N183024M520765
41466A6091P54535j266965l180752n410498l364898L522196P894107N148936K12518
41457D325270j725013l173518o503588o202591K032159J0511560Q376050j920750
$$ plain form
41449 5719579 -1593481 -4020586 573287 6048699 7905489 7020891 5105133 2513574
41441 2513574 602312 1015284 1686469 -1861848 -9485356 -14607574 -12072146 -4937947
41433 -4937947 -291311 -31297 675050 5989434 13506270 16899105 13002345 5264284
41425 5264284 557375 2603005 8099257 9958440 5302148 -832459 -1643497 2642709
41417 2642709 5412249 3087322 -392471 -405085 1275932 91026 -3631238 -5515077
41409 -5515077 -4118530 -2004532 -370021 2349407 6388686 10175274 14210149 19693230
41401 19693230 22441316 15324773 -114802 -11506060 -10288659 -2502491 1475675 2358390
41393 2358390 8181815 18419058 22512442 15167930 4111173 -475341 2442142 6975334
$$ packed form
41449E719579p313060k427105M593873N475412J856790q84598j915758k591559
41441B513574j911262M12972O71185l548317p623508n122218K535428P134199
41433d937947M646636K60014P06347N314384P516836L392835l896760p738061
41425E264284m706909K045630N496252J859183m656292o134607q11038M286206
41417B642709K769540k324927l479793j2614J681017j184906l722264j883839
41409e515077J396547K113998J634511K719428M039279L786588M034875N483081
41401A9693230K748086p116543j5439575j1391258J217401P786168L978166Q82715
41393B358390N823425J0237243M093384p344512j1056757m586514K917483M533192
$$ plain form
41385 6975334 8578435 6436678 1832465 -2409766 -3796169 -3618569 -5347264 -8351915
41377 -8351915 -7845264 -3036822 179886 -1763864 -3758829 185861 7094712 9267479
41369 9267479 5685230 2489559 3077565 4232393 2700042 -284377 -3116496 -7740830
41361 -7740830 -16023948 -24731945 -27683251 -22734082 -14461087 -9117141 -7964212 -7104386
41353 -7104386 -3945041 -1259585 -2394986 -4564186 -1672565 6270832 12103733 11656539
41345 11656539 9411276 10665201 13294744 12318964 8429276 5915921 5026405 2840090
41337 2840090 -17131 276 2809632 4810386 5098567 5694553 5861977 2382187 -4144299
41328 -4144299 -9239385 -11321861 -12619201 -13046330 -10144737 -6247683 -7924522 -15433332
$$ packed form
41385F975334J603101k141757m604213m242231j386403J77600j728695l004651
41377h351915N06651M808442L216708j943750j994965L944690O908851K172767
41369I267479l582249l195671N88006J154828j532351k984419k832119m624334
41361g740830q283118q707997k951306M949169Q272995N343946J152929Q59826
41353g104386L159345K685456j135401k169200K891621P943397N832901m47194
41345A1656539k245263J253925K629543r75780l889688k513355q89516k186315
41337B840090k857221J7407K809356K000754K88181N95986J67424l479790o526486
41328d144299n095086k082476j297340m27129K901593L897054j676839p508810
$$ plain form
41320 -15433332 -20144110 -16580204 -10273325 -8593546 -9893602 -7969579 -2530240 1525415
41312 1525415 2135573 1156542 -293252 -1899735 -1498054 2136185 5242114 3075049 -2842555
41303 -2842555 -6101814 -3498293 2093307 5957674 5029606 -1328230 -9890569 -14161524
41295 -14161524 -10625411 -3502375 499012 729760 1681188 5015099 7486023 6321538
41287 6321538 2208110 -2788749 -6389351 -6018427 -1619857 2458358 2441267 384677 -35283
41278 -35283 -525343 -4788031 -10153106 -10283487 -5633236 -3006323 -4162051 -3538619 766043
41269 766043 2647532 -1711827 -7349436 -9046856 -8920683 -9967633 -8986295 -2750711 4404547
41260 4404547 6532007 5219090 5465203 6274226 3388026 -1269862 -1427198 3107127 5756761
$$ packed form
41320a5433332m710778L563906O306879J679779j300056J924023N439339M055655
41312A525415O10158r79031j449794j606483M01681L634239L105929k167065n917604
41303b842555l259259K603521N591600L864367r28068o357836q562339m270955
41295a4161524L536113P123036M001387K30748R51428L333911K470924j164485
41287F321538m113428m996859l600602L70924M398570M078215j7091k056590m19960
41278c5283m90060m262688n365075j30381M650251K626913j155728O23432M304662
41269G66043J881489m359359n637609j697420J26173j046950R81338O235584P155258
41260D404547K127460j312917K46113Q09023k886200m657888j57336M534325K649634
$$ plain form
41251 5756761 3249945 -624036 -2046964 -1244350 1705195 8205592 15466176 15647515
41243 15647515 5316129 -7973475 -13191780 -8235980 -1178775 80368 -3816333 -6279335
41235 -6279335 -3639451 600995 858438 -2765263 -4456297 -709964 4947824 7353326
41227 7353326 6752635 6913360 8385543 8199388 5600669 3612734 4329492 6234547 7084365
41218 7084365 6659754 5939798 5816520 6875555 8346277 7610759 3143847 -2736097 -6757946
41209 -6757946 -9230843 -12221184 -14399616 -12289026 -6268460 -413119 3791809 8309542
41201 8309542 12574978 12703434 8467488 4935806 4223766 1731699 -5046552 -9729617
41193 -9729617 -5366558 4319294 9100154 6020011 2340554 4732346 11385743 16261775
$$ packed form
41251E756761k506816l873981j422928Q02614K949545O500397P260584J81339
41243A5647515j0331386j3289604n218305M955800P057205J259143l896701k463002
41235f279335K639884M240446K57443l623701j691034L746333N657788K405502
41227G353326o00691J60725J472183j86155k598719j987935P16758J905055Q49818
41218G084365m24611p19956j23278J059035J470722p35518m466912n879944m021849
41209f757946k472897k990341k178432K110590O020566N855341M204928M517733
41201H309542M265436J28456m235946l531682p12040k492067o778251m683065
41193i729617M363059R685852M780860l080143l679457K391792O653397M876032
$$ plain form
41185 16261775 16690935 14587440 12849818 12455414 11823786 8284091 1168662 -6546348
41177 -6546348 -10757822 -10099309 -6482675 -2874078 -1771304 -4384878 -9253917 -12563541
41169 -12563541 -11702172 -7810818 -3623198 -381862 1591014 1536779 -106644 -857547 181261
41160 181261 -54033 -4156885 -9715459 -12961564 -14400701 -15916926 -14783213 -7350511
41152 -7350511 2259540 5009794 -233289 -4257075 -631859 5890878 8336163 8177603
41144 8177603 10899185 15885872 18005822 16482765 15079455 14731040 12755736 9305326
41136 9305326 8260926 10595980 12227012 10109519 5949838 2266634 -813014 -2871225
41128 -2871225 -1691280 2854839 7206463 9383476 12165774 17329489 20281891 15668562
$$ packed form
41185A6261775M29160k103495j737622l94404o31628l539695p115429p715010
41177f546348m211474O58513L616634L608597J102774k613574m869039l309624
41169a2563541Q61369L891354M187620L241336J972876n4235j643423p50903J038808
41160A81261k35294m102852n558574l246105j439137j516225J133713P432702
41152g350511R610051K750254n243083m023786L625216O522737K445285j58560
41144H177603K721582M986687K119950j523057j403310l48415j975304l450410
41136I305326j044400K335054J631032k117493m159681l683204l079648k058211
41128b871225J179945M546119M351624K177013K782298N163715K952402m613329
$$ plain form
41120 15668562 6303677 714653 2028371 4677249 3001511 -1914624 -5801505 -6951985
41112 -6951985 -5669971 -2114599 1600603 625628 -6572705 -13704322 -13515700 -7857565
41104 -7857565 -4980298 -6978760 -6957410 -959944 4348075 1350966 -6088242 -7166795
41096 -7166795 705035 8516627 8031622 1260791 -4625729 -6593281 -6386847 -5594873 -4406080
41087 -4406080 -3606053 -4070051 -4872402 -4788518 -5176219 -8458224 -13618592 -15919971 -12105375
41078 -12105375 -4217096 2581469 4738141 2380686 -1737371 -4195432 -2984550 678800
41070 678800 2791565 219854 -5684634 -10029140 -9337389 -4620848 1015728 6194077
41062 6194077 10660609 12040426 7176801 -1772312 -6292839 -612298 9653009 12510998
$$ packed form
41120A5668562r364885n589024J313718K648878j675738m916135l886881j150480
41112f951985J282014L555372L715202r74975p198333p131617J88622N658135
41104g857565K877267j998462K1350N997466N308019k997109p439208j078553
41096g166795P871830P811592m85005o770831n886520j967552K06434P91974J188793
41087d406080Q00027m63998q02351Q3884l87701l282005n160368k301379L814596
41078a2105375P888279O798565K156672k357455m118057k458061J210882L663350
41070F78800K112765k571711n904488m344506O91751M716541N636576N178349
41062F194077M466532J379817m863625q949113m520527N680541J0265307K857989
$$ plain form
41054 12510998 3651117 -8607676 -13833541 -11007146 -6772270 -5498361 -5570482 -4407505
41046 -4407505 -2386153 -575507 1895644 5723448 8596305 7388408 2852886 -558060
41038 -558060 -405302 600556 -764664 -2438489 285030 6643003 9820624 6556926
41030 6556926 2679139 4895214 10826686 13067247 10691644 9385817 10664827 9164065
41022 9164065 2559163 -3651416 -4966697 -4410464 -5343445 -4405745 1715823 7787480 6213365
41013 6213365 -1455314 -6790730 -6199288 -3286151 -1351571 -745939 -2257388 -5715567
41005 -5715567 -6405268 -718315 5580842 3447248 -5401738 -10182484 -7462656 -5105783
40997 -5105783 -7349655 -7562302 -1152257 5226427 4883366 1995480 2481339 2479234 -3554124
$$ packed form
41054A2510998q859881j2258793n225865K826395M234876J273909p2121J162977
41046d407505K021352J810646K471151L827804K872857j207897m535522l410946
41038e58060J52758J005858j365220j673825K723519O357973L177621l263698
41030F556926l877787K216075N931472K240561k375603j305827J279010j500762
41022I164065o604902o210579j315281N56233r32981R37700O121568O071657j574115
41013F213365p668679n335416N91442K913137J934580O05632j511449l458179
41005e715567o89701N686953O299157k133594q848986m780746K719828K356873
40997e105783k243872k12647O410045O378684l43061k887886M85859k105o033358
$$ plain form
40988 -3554124 -10105999 -7927904 348705 4113267 1704208 1108733 4635347 5597542
40980 5597542 1992522 1532150 8780744 16924212 17479252 10864793 3031520 -1637416
40972 -1637416 -319303 7943157 17188475 16865825 4988177 -7137948 -9271440 -5260466
40964 -5260466 -4667724 -7146338 -4606252 3981053 9919685 7361253 585748 -2965370
40956 -2965370 -903672 4427576 9270489 9853431 5104289 -539326 -1388605 1206532
40948 1206532 -154205 -7652751 -13556061 -10675966 -2688831 1597259 1000100 1976619
40940 1976619 6679562 8568768 2542739 -6551673 -10363228 -8307571 -6524853 -7084150
40932 -7084150 -5047313 1869504 6670590 1228015 -11505386 -19051239 -13727165 -1296923
$$ packed form
40988c554124o551875K178095Q276609L764562k409059n95475L526614R62195
40980E597542l605020m60372P248594Q143468N55040o614459p833273m668936
40972a637416J318113Q262460R245318l22650j1877648j2126125k133492M010974
40964e260466N92742k478614K540086Q587305N938632k558432o775505l551118
40956b965370K061698N331248M842913N82942m749142n643615q49279K595137
40948A206532j360737p498546n903310K880095P987135M286090n97159R76519
40940A976619M702943J889206o026029r094412l811555K055657J782718n59297
40932g084150K036837O916817M801086n442575j2733401p545853N324074J2430242
$$ plain form
40924 -1296923 6516260 5259833 689631 -137442 2907201 5080611 4641142 5026949 8522187
40915 8522187 11456092 9340068 4764269 4739631 9843418 12145080 6776138 -271755
40907 -271755 -977970 2907412 3864536 1179835 1022180 4782582 6353864 2875565 -5301
40898 -5301 2662743 7423439 8565613 6581955 5406731 5500095 4975545 4440630 5632172
40889 5632172 7581919 8689406 10401965 14313561 17594046 16113053 10943766 7289830
40881 7289830 7524801 9142339 9179833 7230107 4270791 1345862 -671244 -1789703 -2647232
40872 -2647232 -2624036 -344833 3016223 4452189 4580519 7495456 12671808 13288842 7191560
40863 7191560 2646388 5976258 9814295 3531890 -9194584 -14915536 -10324555 -5174853
$$ packed form
40924a296923P813183j256427m570202q27073L044643K173410m39469L85807L495238
40915H522187K933905k116024m575799k4638N103787K301662n368942p047893
40907b71755p06215L885382R57124k684701j57655L760402J571282l478299k880866
40898e301K668044M760696J142174j983658j175224R3364n24550n34915J191542
40889E632172J949747J107487J712559L911596L280485j480993n169287l653936
40881G289830K34971J617538L7494j949726k959316k924929k017106j118459q57529
40872b647232K3196K279203L361056J435966J28330K914937N176352O17034o097282
40863G191560m545172L329870L838037o282405j2726474n720952M590981N149702
$$ plain form
40855 -5174853 -5236442 -5356360 -2260211 -1589934 -6752378 -11828903 -12308295 -12882336 -16747924
40846 -16747924 -16650391 -6585412 5145710 6026042 -2516856 -8618074 -8338185 -8232712
40838 -8232712 -10488179 -8319313 834170 8355652 6284947 -1419978 -5332984 -2976340
40830 -2976340 871297 2404457 1512434 -1555596 -6546715 -10365365 -8584345 -1370440
40822 -1370440 4916715 4154232 -2592646 -8260875 -7643959 -2368525 2451661 4523291
40814 4523291 5189016 5098779 2576916 -2775330 -7832719 -9305218 -7431741 -4514881 -1627671
40805 -1627671 1127024 2696021 1894703 -634726 -3147176 -4771354 -5522193 -5602721 -5874691
40796 -5874691 -7212695 -7985360 -4622474 3000923 9031492 7520011 -577864 -8851413
$$ packed form
40855e174853o1589j19918L096149O70277n162444n076525m79392n74041l865588
40846a6747924R7533J0064979J1731122Q80332q542898o101218K79889J05473
40838h232712k255467K168866R153483P521482k070705p704925l913006K356644
40830b976340L847637J533160q92023l068030m991119l818650J781020P213905
40822a370440O287155p62483o746878n668229O16916N275434M820186K071630
40814D523291O65725r0237k521863n352246n057389j472499J873477K916860K887210
40805a627671K754695J568997q01318k529429k512450j624178p50839q0528k71970
40796e874691j338004p72665L362886P623397O030569j511481q097875q273549
$$ plain form
40788 -8851413 -12329289 -10515145 -5785626 -2146721 -3725229 -10507673 -16537233 -15948279
40780 -15948279 -9986324 -4827317 -3829709 -5692985 -8651791 -11624971 -12031029 -7850469
40772 -7850469 -2207718 -902098 -4451587 -7131098 -5018339 -593327 2071111 2503220
40764 2503220 2467805 3091139 5063535 8511546 11485947 11883507 11466339 13720105 16895016
40755 16895016 14525290 5073936 -4239015 -6621428 -4164282 -3238654 -5432880 -7429258
40747 -7429258 -6734606 -3175547 2690309 8466865 9688824 5043132 -200987 -160823 4152514
40738 4152514 7342623 7437552 6503057 5386443 3261425 1456278 2344833 4659731 4964147
40729 4964147 3717669 4688247 8051951 9605656 7923505 6717143 8030614 8403666
$$ packed form
40788h851413l477876J814144M729519L638905j578508o782444o029560N88954
40780a5948279N961955N159007R97608j863276k958806k973180m06058M180560
40772g850469N642751J305620l549489k679511K112759M425012K664438M32109
40764B503220l5415O23334J972396L448011K974401L97560m17168K253766L174911
40755A6895016k369726r451354r312951k382413K457146R25628k194226j996378
40747g429258O94652L559059N865856N776556J221959m645692n244119M0164M313337
40738D152514L190109R4929r34495j116614k125018j805147Q88555K314898L04416
40729D964147j246478R70578L363704J553705j682151j206362J313471L73052
$$ plain form
40721 8403666 4906079 408360 -1100931 -990991 -3439958 -8556311 -12218122 -11875016
40713 -11875016 -9154561 -6984832 -6611220 -7375297 -7807869 -7174837 -6695875 -8147353 -10746952
40704 -10746952 -11545062 -9894331 -8689577 -9382044 -9127818 -5934390 -3217395 -4535856
40696 -4535856 -6357329 -2277993 6238293 10051582 4628639 -4089865 -8871677 -10374060
40688 -10374060 -12604209 -14174588 -10885660 -4888709 -4008506 -10995148 -19111248 -20663862
40680 -20663862 -15755963 -9897842 -6299087 -3993772 -1633314 557898 2303416 4052124
40672 4052124 5973555 7888318 10085435 12429696 12692172 7938327 -1451235 -10608255
40664 -10608255 -14376249 -12179830 -7846253 -5044750 -3892712 -2000303 2162740 7536792
$$ packed form
40721H403666l497587m497719j509291J09940k448967n116353l661811L43106
40713a1875016K720455K169729L73612p64077m32572O33032M78962j451478k599599
40704a0746952p98110J650731J204754o92467K54226L193428K716995j318461
40696d535856j821473M079336Q516286L813289n422943q718504m781812j502383
40688a0374060k230149j570379L288928N996951Q80203o986642q116100j552614
40680b0663862M907899N858121L598755K305315K360458K191212J745518J748708
40672D052124J921431J914763K197117K344261K62476m753845r389562r157020
40664a0608255l767994K196419M333577K801503J152038J892409M163043N374052
$$ plain form
40656 7536792 11610250 12526288 10120098 5747340 1674407 159169 2238160 7085953
40648 7085953 12517239 15773443 14119931 6562159 -3483067 -8787281 -4757444 4474392
40640 4474392 9457990 6154404 425693 -160085 3946986 6274045 4052877 1113923
40632 1113923 1053388 2470959 3000835 3851228 6665025 8674883 5835504 23979 -1948398
40623 -1948398 2208236 6286779 4018687 -2087951 -4894270 -3508140 -4026434 -9043232
40615 -9043232 -12763860 -9831844 -3976079 -2770798 -6933814 -10515261 -9970189 -7143446
40607 -7143446 -4075195 -1151461 -554724 -4779818 -10337670 -9834179 -2785716 2673879
40599 2673879 2331474 2410501 8005823 12685707 8091139 -1751578 -5678291 -1577247 2932145
$$ packed form
40656G536792M073458R16038k406190m372758m072933j515238K078991M847793
40648G085953N431286L256204j653512p557772j0045226n304214M029837R231836
40640D474392M983598l303586n728711n85778M107071K327059k221168k938954
40632A113923o0535J417571N29876Q50393K813797K009858k839379n811525j972377
40623a948398M156634M078543k268092o106638k806319J386130n18294n016798
40615i043232l720628K932016N855765J205281m163016l581447N45072K826743
40607g143446L068251K923734N96737m225094n557852N03491P048463N459595
40599B673879l42405P9027N595322M679884m594568r842717l926713M101044M509392
$$ plain form
40590 2932145 4068227 5104954 5998853 1335494 -8510813 -14553706 -12198181 -8268158
40582 -8268158 -9596304 -12421089 -9670702 -2475942 2658226 3670668 3519371 4548067
40574 4548067 7783899 14052369 20327562 19042264 7240633 -6987545 -13351412 -11315121
40566 -11315121 -7080263 -2814222 2980880 7530782 6103846 1755431 3238545 11766322
40558 11766322 18259803 16121724 9260231 4625054 3822840 5527323 9416251 13242992
40550 13242992 11958175 5117669 454256 4354346 12435240 15593517 12699189 10612518
40542 10612518 12606334 13737597 9421049 3214156 2455854 8629930 15483007 16408767
40534 16408767 11395509 5854777 3893223 4512167 4639142 3879221 4244150 6030846 6672804
$$ packed form
40590B932145J136082J036727Q93899m663359r846307o042893K355525L930023
40582h268158j328146k824785K750387P194760N134168J012442j51297J028696
40574D548067L235832O268470O275193j285298j1801631j4228178o363867K036291
40566a1315121M234858M266041N795102M549902j426936m348415J483114Q527777
40558A1766322O493481k138079o861493m635177q02214J704483L888928L826741
40550A3242992j284817o840506m663413L900090Q080894L158277k894328k086671
40542A0612518J993816J131263m316548o206893p58302O174076O853077R25760
40534A6408767n013258n540732j961554O18944J26975p59921L64929J786696O41958
$$ plain form
40525 6672804 4317244 512169 -1753454 -1320287 814684 3369412 5968949 8916251
40517 8916251 12137552 14082541 12364720 6802972 1247131 356758 4460607 9489812
40509 9489812 12165741 13140492 14487424 16298875 16958644 15260186 11225507 6066146
40501 6066146 2133945 1685928 4810948 9291248 12727519 13871266 12119472 7397571
40493 7397571 891794 -5433575 -10253942 -12858243 -12437958 -9178409 -5279051 -2535422
40485 -2535422 370052 5288114 10126971 10991116 8839860 9188705 13655192 16599414
40477 16599414 13200082 6905724 4771168 7942343 10990606 9296524 3235589 -4172074
40469 -4172074 -9999970 -11743921 -8284376 -1657001 3962853 5774509 3903448 -126113
$$ packed form
40525F672804k355560l805075k265623M33167K134971K554728K599537K947302
40517H916251L221301J944989j717821n561748n555841q90373M103849N029205
40509I489812K675929R74751J346932J811451O59769j698458m034679n159361
40501F066146l932201m48017L125020M480300L436271J143747j751794m721901
40493G397571o505777o325369m820367k604301M20285L259549L899358K743629
40485b535422K905474M918062M838857Q64145k151256L48845M466487K944222
40477A6599414l399332o294358k134556L171175L048263j694082o060935p407663
40469d172074n827896j743951L459545O627375N619854J811656j871061m029561
$$ plain form
40461 -126113 -4699299 -7922248 -8152838 -5703436 -2964589 -1831561 -1408717 748867 4785576
40452 4785576 6804899 2501346 -7115347 -15379647 -16834053 -13089613 -9861372 -9464997
40444 -9464997 -9195697 -6642224 -3216635 -1750758 -3197870 -6323088 -8536349 -7269286
40436 -7269286 -3285416 -1904612 -6839488 -13103902 -11518101 -1414306 7128177 6390469
40428 6390469 372246 -3102441 -3819755 -6411072 -10361494 -10550546 -6294213 -2560744
40420 -2560744 -1861761 -1246347 1316352 3140747 1832299 -208906 607022 3594312 4932685
40411 4932685 3181760 1436301 3885347 10960669 18059559 19419096 13596882 4624864
40403 4624864 -2240989 -4506911 -2213041 3349353 9088970 11052740 8568386 5612288
$$ packed form
40461a26113m573186l222949k30590K449402K738847J133028M22844K157584M036709
40452D785576K019323m303553r616693q264300j454406L744440L228241L96375
40444i464997K69300K553473L425589J465877j447112l125218k213261J267063
40436g269286L983870J380804m934876o264414J585801J0103795Q542483p37708
40428F390469o018223l474687p17314k591317l950422j89052M256333L733469
40420b560744O98983O15414K562699J824395j308448k041205Q15928K987290J338373
40411D932685j750925j745459K449046P075322P098890J359537n822214q972018
40403D624864o865853k265922K293870N562394N739617J963770k484354k956098
$$ plain form
40395 5612288 5788136 8114167 10150733 12257085 15011323 15261046 9943450 2386451
40387 2386451 -679339 1813356 4269099 2869548 40483 -755222 -174581 -752255 -2716844
40378 -2716844 -4274983 -4124531 -2259671 310968 2046433 2321605 2204062 2547778 2524732
40369 2524732 1854333 2419225 4745227 5215241 920645 -4706897 -6017494 -3232175 -897932
40360 -897932 82666 2072751 3378000 -349189 -6559074 -6525246 1544716 8577046 8120262
40351 8120262 5762765 9147739 15563787 16890312 11816596 5449166 378919 -4273249
40343 -4273249 -7402649 -6882614 -4608907 -4089760 -4174706 -1258259 3617754 6222148 6501431
40334 6501431 7700283 8987397 6553955 2170349 2303433 6810694 6759428 -2602812 -13720382
$$ packed form
40395E612288J75848K326031K036566K106352K754238K49723n317596p556999
40387B386451l065790K492695K455743j399551k829065p95705N80641n77674j964589
40378b716844j558139J50452J864860K570639J735465K75172j17543L43716k3046
40369B524732o70399N64892K326002M70014m294596n627542j310597K785319K334243
40360h97932R80598J990085J305249l727189o209885L3828Q069962P032330m56784
40351H120262k357497L384974O416048J326525n073716o367430n070247m652168
40343d273249l129400N20035K273707N19147q4946K916447M876013K604394K79283
40334F501431J198852J287114k433442m383606J33084M507261n1266r362240j1117570
$$ plain form
40325 -13720382 -16516094 -10609237 -2480282 4310783 9539643 11016797 6786653 1132446
40317 1132446 743530 4437414 3625983 -5049493 -13779439 -13873566 -7288880 -3280598 -6467536
40308 -6467536 -13111407 -17856268 -19152374 -17637389 -13574600 -7954742 -3515863 -2473266
40300 -2473266 -4377481 -7351604 -10224046 -12633908 -14465952 -15907645 -16429512 -13288746
40292 -13288746 -3839597 9112897 17253764 15015384 6076655 -1163660 -2833568 -1338022
40284 -1338022 72352 353567 -662977 -2438313 -2861625 -846321 901132 -498519
40276 -498519 -3032345 -3225118 -3138271 -7235414 -12666552 -10982632 -1461542 5689179 3282593
40267 3282593 -3613035 -7506649 -9637648 -14052387 -17474242 -14508720 -8443429 -6968180
$$ packed form
40325a3720382k795712N906857Q128955O791065N228860J477154m230144n654207
40317A132446l88916L693884q11431q675476q729946r4127O584686M008282l186938
40308f467536o643871m744861j296106J514985M062789N619858M438879J042597
40300b473266j904215k974123k872442k409862j832044j441693n21867L140766
40292a3288746R449149J2952494Q140867k238380q938729p240315j669908J495546
40284a338022J410374K81215j016544j775336m23312K015304J747453j399651
40276d98519k533826j92773Q6847m097143n431138J683920R521090P150721k406586
40267C282593o895628l893614k130999m414739l421855K965522O065291J475249
$$ plain form
40259 -6968180 -9853475 -10761593 -9508164 -11689616 -16054159 -13810691 -3601476 3395256
40251 3395256 -1139485 -10592504 -13372780 -8341692 -2921409 -607155 1558104 5327439
40243 5327439 8537468 9821758 10167358 9336212 5659685 395015 -1911455 796103
40235 796103 4847799 5302433 1766954 -2030387 -3313214 -2916712 -2883803 -3189413 -2325014
40226 -2325014 -585806 -622416 -3748668 -7468396 -8386122 -6247867 -3315932 -1440707 -2084904
40217 -2084904 -6864605 -14072015 -16695024 -9622501 1761020 6622670 2911547 -646206
40209 -646206 1375443 3599700 1245110 412920 8192919 18390424 18247784 7328980
40201 7328980 -1561225 -1215465 1121558 -2448809 -7812321 -7236488 -3367215 -5421248
$$ packed form
40259f968180k885295r08118J253429k181452m364543K243468J0209215O996732
40251C395256m534741r453019k780276N031088N420283K314254K165259L769335
40243E327439L210029J284290L45600q31146l676527n264670k306470K707558
40235G96103M051696M54634l535479l797341j282827L96502L2909l05610Q64399
40226b325014J739208l6610l126252l719728r17726K138255K931935J875225o44197
40217b084904m779701p207410k623009P072523J1383521M861650l711123l557753
40209f46206K021649K224257k354590q32190P779999J0197505j42640j0918804
40201G328980q890205L45760K337023l570367n363512N75833L869273k054033
$$ plain form
40193 -5421248 -14304601 -20729135 -18691337 -13099618 -11064425 -11440811 -7888323 630102
40185 630102 7697691 7713466 2235122 -3362720 -6581393 -8552638 -9764441 -8572529 -4487770
40176 -4487770 -106007 1878895 1728772 1002311 -311323 -2474822 -3246153 8771 5545775
40167 5545775 8266885 6572015 4694310 6065500 7548037 3965524 -3346075 -7053998
40159 -7053998 -3417346 2482965 3283391 -1237257 -4260612 -972764 5346010 7695342
40151 7695342 4324245 826283 2676343 7925224 9891046 6350699 2400799 2811370
40143 2811370 5089834 3669005 -1245522 -3927638 -1931270 681639 563425 405184
40135 405184 3322179 5896965 2279376 -6443809 -12528481 -11346655 -6056496 -1593956
$$ packed form
40193e421248q883353o424534K037798N591719K035193l76386L552488Q518425
40185F30102P067589J5775n478344n597842l218673j971245j211803J191912M084759
40176d487770M381763J984902j50123p26461j313634k163499p71331L254924N537004
40167E545775K721110j694870j877705J371190J482537l582513p311599l707923
40159g053998L636652N900311Q00426m520648l023355L287848O318774K349332
40151G695342l371097l497962J850060N248881J965822l540347l949900M10571
40143B811370K278464j420829m914527k682116J996368K612909j18214j58241
40135D05184K916995K574786l617589q723185o084672J181826N290159M462540
$$ plain form
40127 -1593956 1385931 4498089 7362555 8185399 6162826 1118418 -6700182 -14184820
40119 -14184820 -15739205 -9672535 -2251448 -1397688 -7152050 -11944331 -9945397 -2819816
40111 -2819816 3664481 5338241 1533618 -5464322 -11662304 -14227005 -14011344 -13790966
40103 -13790966 -14310987 -14294153 -13649088 -13228041 -11563933 -6288767 98333 715587 -6603883
40094 -6603883 -14695008 -15309352 -8922101 -2239749 1194558 2637772 2377052 -911004
40086 -911004 -4551813 -2395626 5985217 11912555 8030347 -1241193 -4824162 1113392
40078 1113392 9565873 12745230 10577180 7775561 6917011 7291194 7668634 6930343 3632029
40069 3632029 -2006362 -6662630 -7204965 -4737768 -2828491 -2494417 -1927280 -736211 -951491
$$ packed form
40127a593956K979887L112158K864466Q22844k022573n044408p818600p484638
40119a4184820j554385O066670P421087Q53760n754362m792281J998934P125581
40111b819816O484297J673760l804623o997940o197982k564701K15661K20378
40103a3790966n20021J6834O45065M21047J664108N275166O387100O17254p319470
40094f603883q091125o14344O387251O682352L434307J443214k60720l288056
40086i11004l640809K156187Q380843N927338l882208r271540l582969N937554
40078A113392Q452481L179357k168050k801619q58550L74183L77440p38291l298314
40069C632029n638391m656268n42335K467197J909277L34074N67137J191069k15280
$$ plain form
40060 -951491 -3310773 -5771395 -6681461 -6593396 -6053583 -4699270 -3710035 -5631787 -9721694
40051 -9721694 -10798412 -5568309 2444363 7051805 6180269 1888031 -3644914 -8685655
40043 -8685655 -10751468 -8731845 -4921462 -1891843 886164 4387207 6775567 6768834 7328726
40034 7328726 10962685 14098543 12277300 8557815 9220467 12526383 10719250 3707888
40026 3707888 1054548 7290618 14269244 13118555 6162345 1064913 -166212 370247
40018 370247 2976777 7338753 7642063 -280712 -9598259 -9672380 -2095994 -397023 -11870891
40009 -11870891 -27517719 -33699566 -28025026 -19207382 -14866042 -14232173 -11883786 -5268033
40001 -5268033 2267650 5145846 1959964 -2614230 -3417070 -1307511 -1799750 -7420121
$$ packed form
40060i51491k359282k460622r10066Q8065N39813J354313R89235j921752m089907
40051i721694j076718N230103Q012672M607442q71536m292238n532945n040741
40043h685655k065813K019623L810383L029619K778007L501043K388360o733N59892
40034G328726L633959L135858j821243l719485O62652L305916j807133p011362
40026C707888k653340O236070O978626j150689o956210n097432j231125N36459
40018C70247K606530M361976L03310p922775r317547p4121P576386J698971j1473868
40009a1870891j5646828o181847N674540Q817644M341340O33869K348387O615753
40001e268033P535683K878196l185882m574194q02840K109559m92239n620371
$$ plain form
39993 -7420121 -14024587 -15677167 -11443104 -5991463 -4078456 -5520934 -6147250 -3566348
39985 -3566348 -579740 -1172397 -4115818 -3868509 1573538 7246598 7433185 2296686 -3833706
39976 -3833706 -7890022 -9255975 -8409418 -7367766 -8856110 -11859132 -10741456 -2555661
39968 -2555661 7258619 10677929 6599992 455593 -3422619 -4299618 -2036095 2702951
39960 2702951 6286812 5780365 4095519 5748492 8120474 3948554 -6439309 -12597461
39952 -12597461 -6981937 5045735 12360780 11293873 7404925 6517493 8364664 8988160
39944 8988160 6778011 5047200 8463628 16844245 23931639 23918071 17675938 10282955
39936 10282955 4441743 19620 -1640166 1863376 9126234 14960908 16027883 13144380
$$ packed form
39993g420121o604466j652580M234063N451641J913007j442478o26316K580902
39985c566348K986608n92657k943421K47309N442047N673060J86587n136499o130392
39976c833706m056316j365953Q46557J041652j488344l003022J117676Q185795
39968b555661R814280L419310m077937o144399l878212q76999K263523M739046
39960B702951L583861n06447j684846J652973K371982m171920j0387863o158152
39952a2597461N615524J2027672P315045j066907l888948q87432J847171O23496
39944H988160k210149j730811L416428Q380617P087394j3568o242133p392983
39936A0282955n841212m422123j659786L503542P262858N834674J066975k883503
$$ plain form
39928 13144380 8326016 3464218 1434353 3841548 7573458 8003762 5368436 3310258
39920 3310258 2065470 -802322 -3458749 -1128086 4669925 6002833 -34833 -7138650
39912 -7138650 -9957406 -10966771 -13250158 -13697494 -8820755 -1632800 2670470 3339155
39904 3339155 2081624 -542914 -2608081 -331814 5243190 6933215 1883543 -2898831
39896 -2898831 -1472294 1103158 -2740738 -10496483 -14179571 -12916989 -11826173 -11875066
39888 -11875066 -10180212 -7814673 -8024128 -8551047 -4973181 -288633 -1733038 -8655768
39880 -8655768 -12829502 -10660832 -5928810 -609707 6824486 13073734 10874862 1170568
39872 1170568 -5552393 -4032916 -1089155 -3142175 -6059140 -3692783 1273831 2342610
$$ packed form
39928A3144380m818364m861798k029865K407195L731910M30304k635326k058178
39920C310258j244788k867792k656427K330663N798011J332908o037666p103817
39912g138650k818756j009365k283387m47336M876739P187955M303270O68685
39904C339155j257531k624538k065167K276267N575004J690025n049672m782374
39896b898831J426537K575452l843896p755745l683088J262582J090816m8893
39888a1875066J694854K365539k09455n26919L577866M684548j444405o922730
39880h655768m173734K168670M732022N319103P434193O249248k198872r704294
39872A170568o722961J519477K943761k053020k916965K366357M966614J068779
$$ plain form
39864 2342610 -731490 -3856259 -5871424 -7230820 -5444007 1403286 9417446 13296623
39856 13296623 13664613 14518108 15743979 14029983 9580673 6064768 4563368 2954487
39848 2954487 1248715 2396951 6744430 9884233 8055756 3259201 1059263 4126510
39840 4126510 9165254 10612210 7201928 3526369 3719981 5407549 3413599 -1529758
39832 -1529758 -3045074 971732 4349252 1510369 -4436702 -6438282 -2604565 3574147
39824 3574147 8938493 12161233 12134683 9447382 7619657 8718754 9624834 6811580 2717719
39815 2717719 2469518 5877754 8074525 7226427 5899767 4736933 846135 -5802696
39807 -5802696 -9664325 -6388848 1155979 6621599 7493689 5830333 3541677 388010
$$ packed form
39864B342610l074100l124769k015165j359396J786813O847293Q014160L879177
39856A3296623L67990Q53495J225871j713996m449310l515905j501400j608881
39848B954487j705772J148236M347479L139803j828477m796555k199938L067247
39840D126510N038744J446956l410282l675559J93612J687568j993950m943357
39832a529758j515316M016806L377520k838883n947071k001580L833717O178712
39824C574147N364346L222740k6550k687301j827725J099097R06080k813254m093861
39815B717719k48201L408236K196771q48098j326660j162834l890798o648831
39807e802696l861629L275477P544827N465620Q72090j663356k288656l153667
$$ plain form
39799 388010 -3230597 -4238394 299007 8512365 13747689 10991465 2766988 -3514749
39791 -3514749 -4088883 -1960050 -967503 -599367 994691 2613446 2544381 2663944 5147387
39782 5147387 6797145 2163783 -7771680 -15169679 -14625836 -8723562 -3194391 -590812
39774 -590812 -387478 -1494418 -2155484 -245447 3640562 5406032 2172793 -3772869 -7933013
39765 -7933013 -9095209 -9466050 -10180465 -9480324 -6034380 -2156307 -1839158 -5441230 -7854301
39756 -7854301 -3863428 4658387 9332301 4635357 -5260886 -11419476 -10356778 -6109881
39748 -6109881 -3038191 -839671 2345033 5663613 6777819 5326619 3108806 1835323
39740 1835323 1797145 1721629 -500250 -5398988 -9981126 -10417589 -7252220 -5165375 -6257844
$$ packed form
39799C88010l618607j007797M537401Q213358N235324k756224q224477o281737
39791c514749n74134K128833R92547L68136J594058J618755o9065J19563K483443
39782E147387J649758m633362r935463p397999N43843N902274N529171K603579
39774e90812K03334j106940o61066J910037L886009J765470l233239n945662m160144
39765g933013j162196l70841p14415P00141L445944L878073L17149l602072k413071
39756g854301L990873Q521815M673914m696944r896243o158590J062698M246897
39748f109881L071690K198520L184704L318580J114206j451200k217813j273483
39740A835323l8178p5516k221879m898738m582138m36463L165369K086845j092469
$$ plain form
39731 -6257844 -6652567 -2328780 4140805 6222841 1784101 -4440610 -6591764 -3236813
39723 -3236813 2802295 7534579 8250386 5271991 2155129 2321907 4805320 5304005 2256336
39714 2256336 -600336 565177 4277055 6272401 5609628 4588906 3489018 35695
39706 35695 -5145030 -7463099 -5302102 -3558746 -6179375 -9022501 -6062870 -298630
39698 -298630 -951259 -9570583 -16572077 -14240196 -6404271 -988588 1015159 3190535
39690 3190535 4977737 2871823 -1660754 -2932682 88551 1976466 -793708 -4948244
39682 -4948244 -5781271 -3126440 242566 2815487 4708841 6246188 7918013 9870524
39674 9870524 10521232 7894908 2959956 -1113147 -3871615 -8540739 -16365310 -22986724
$$ packed form
39731f257844l94723M323787O469585K082036m438740o224711k151154L354951
39723c236813O039108M732284P15807k978395l116862J66778K483413M98685l047669
39714B256336k856672J165513L711878J995346o62773j020722j099888l453323
39706C5695n180725k318069K160997J743356k620629k843126K959631N764240
39698b98630o52629q619324p001494K331881P835925N415683K003747K175376
39690C190535J787202k105914m532577j271928L021233J887915k770174m154536
39682d948244q33027K654831L369006K572921J893354J537347J671825J952511
39674I870524O50708k626324m934952m073103k758468m669124p824571o621414
$$ plain form
39666 -22986724 -23107696 -16974030 -9744052 -5464342 -3817395 -2387763 -316607 886278
39658 886278 -187809 -2171959 -2099484 -64506 -711932 -7516987 -16933948 -21823103 -20333102
39649 -20333102 -17374599 -16697729 -15786231 -10655147 -2286591 4600814 7264540 6960000
39641 6960000 6355071 6713462 7048097 5196314 328380 -5633816 -10097139 -12531460 -13440348
39632 -13440348 -12100819 -8544377 -6653916 -10695987 -18372742 -21729561 -16240330 -5468779
39624 -5468779 3957468 8102573 6103121 -215394 -5792613 -6259011 -3839426 -4313336
39616 -4313336 -7069495 -4935497 3598313 9615647 6093914 -1687974 -4237264 -885704
39608 -885704 2024052 1544909 -438934 -2872558 -5596032 -6134664 -2809882 1092955 1988719
$$ packed form
39666b2986724j20972O133666P229978M279710J646947J429632K071156J202885
39658H86278j074087j984150P2475K034978o47426o805055r416961m889155J490001
39649b0333102K958503O76870R11498N131084Q368556O887405K663726l04540
39641F960000o04929L58391L34635j851783m867934n962196m463323k434321r08888
39632a3440348J339529L556442J890461m042071p676755l356819N489231J0771551
39624e468779R426247M145105j999452o318515n577219m66398K419585m73910
39616d313336k756159K133998Q533810O017334l521733p781888k549290L351560
39608h85704K909756m79143j983843k433624k723474n38632L324782L902837Q95764
$$ plain form
39599 1988719 2067409 4864997 8228537 8487044 8037496 10807048 13373537 9737469 2587216
39590 2587216 -163615 1352345 -69100 -4783894 -5131163 172277 2511580 -1848320
39582 -1848320 -4867864 -481542 5004593 3845600 -302012 715219 5928864 7576988
39574 7576988 3360511 -1746629 -3951120 -4185746 -4190255 -4199177 -4089626 -3681459 -2902019 -3042374
39564 -3042374 -5176250 -6698628 -4192076 -678198 -3202290 -10831967 -13347160 -6530669
39556 -6530669 -62272 -2972988 -9216556 -7299851 1801627 7261509 5163652 1605120
39548 1605120 910344 1414113 2657515 6745326 11569061 11529878 6358618 1311123 -2274685
39539 -2274685 -8168649 -15516608 -16911685 -9685295 -1503114 -283745 -4356383 -6705195
$$ packed form
39599A988719P8690K797588L363540K58507m49548K769552K566489l636068p150253
39590B587216k750831J515960j421445m714794l47269N303440K339303m359900
39582a848320l019544M386322N486135j158993m147612J017231N213645J648124
39574G576988m216477n107140k204491k34626m509q922J09551M08167P79440j40355
39564c042374k133876j522378K506552L513878k524092p629677k515193O816491
39556f530669O468397k910716o243568J916705R101478N459882k097857l558532
39548A605120o94776N03769J243402M087811M823735l9183n171260n047495l585808
39539b274685n893964p347959j395077P226390Q182181J219369m072638k348812
$$ plain form
39531 -6705195 -4135532 1467038 6820815 8858315 6088639 926754 -2217494 -2341301
39523 -2341301 -1812454 -707389 3623193 10254900 13723642 11634705 8141440 7364342
39515 7364342 7961861 6591235 2514477 -3075391 -8114568 -9186182 -5120805 -1442408
39507 -1442408 -4483969 -10320087 -8112196 3206031 11377370 8713728 3758184 7719767
39499 7719767 17715235 22734678 19976389 15447000 12666791 10255858 7781639 5431799
39491 5431799 472640 -8075307 -14247994 -12609415 -7395360 -5500951 -4480528 1672421
39483 1672421 8190410 4260161 -8418640 -15516060 -10628985 -2822278 128405 2701460
39475 2701460 9230438 12784581 6186159 -4691828 -8953734 -5899140 -2628278 -1529075
$$ packed form
39531f705195K569663N602570N353777K037500k769676n161885l144248j23807
39523b341301N28847J105065M330582O631707L468742k088937l493265p77098
39515G364342N97519j370626m076758n589868n039177j071614M065377L678397
39507a442408l041561n836118K207891J1318227Q171339k663642m955544L961583
39499G719767R995468N019443k758289m529389k780209k410933k474219k349840
39491E431799m959159q547947o172687J638579N214055J894409J020423O152949
39483A672421O517989l930249j2678801p097420M887075P806707K950683K573055
39475B701460O528978L554143o598422j0877987m261906L054594L270862J099203
$$ plain form
39467 -1529075 -105058 327316 -3766243 -9099645 -7896803 -10159 5658586 3809940
39459 3809940 -177891 1312256 8124982 14261596 16100334 15090812 13983637 13207931
39451 13207931 11074566 6773729 2765312 2900119 7210272 10329760 7269000 -347583
39443 -347583 -5976532 -5129190 1246582 8804527 12689937 9965222 2438370 -3737690
39435 -3737690 -4354485 -2253278 -3052053 -6913632 -8728841 -6189573 -2918284 -2361293 -2776298
39426 -2776298 -524412 4744367 10559757 14944641 17013351 16230771 13517290 11827622
39418 11827622 13338691 16666267 18555561 17675577 15180329 12275526 9214824 6530089
39410 6530089 5187694 4833375 3365485 -713331 -6492443 -12235961 -17628645 -22468305
$$ packed form
39467a529075J424017M32374m093559n333402J202842P886644N668745j848646
39459C809940l987831J490147O812726O136614J838738j009522j107175p75706
39451A3207931k133365m300837m008417J34807M310153L119488l060760p616583
39443c47583n628949Q47342O375772P557945L885410k724715p526852o176060
39435c737690o16795K101207p98775l861579j815209K539268L271289N56991m15005
39426b776298K251886N268779N815390M384884K068710p82580k713481j689668
39418A1827622J511069L327576J889294q79984k495248k904803l060702k684735
39410F530089j342395l54319j467890m078816n779112n743518n392684m839660
$$ plain form
39402 -22468305 -23823827 -18064207 -7442302 -1375693 -7003219 -19451027 -25854051 -19532433
39394 -19532433 -6276663 4109223 7764922 6466652 2921272 671689 4148949 12721026
39386 12721026 17477701 10844479 -1784488 -7414865 -2862930 1207887 -3399914 -9803287
39378 -9803287 -6097080 6886596 16039611 13318908 5222687 2672243 6803269 9323525
39370 9323525 4821400 -2307886 -4472342 -904737 2475319 2271285 2283088 7000374 13918864
39361 13918864 16485759 13371964 10206988 11494832 14820602 14967544 10971902 6799256
39353 6799256 6428187 9780635 12747129 11044248 5348172 1779295 4572088 9328199
39345 9328199 8245658 1993463 -148682 5694901 11083399 7792394 978838 1578648
$$ packed form
39402b2468305j355522N759620J0621905O066609n627526j2447808o403024O321618
39394a9532433J3255770J0385886L655699j298270l545380k249583L477260Q572077
39386A2721026M756675o633222j2628967n630377M551935M070817m607801o403373
39378i803287L706207J2983676R153015k720703q096221k550444M131026K520256
39370I323525m502125p129286k164456L567605L380056k04034J1803M717286O918490
39361A3918864K566895l113795l164976J287844L325770J46942l995642m172646
39353F799256l71069L352448K966494j702881n696076l568877K792793M756111
39345I328199j082541o252195k142145N843583N388498l291005o813556N99810
$$ plain form
39337 1578648 9512170 14541880 12941769 12385581 17505506 20889716 14952266 5156383
39329 5156383 2749914 8475640 12432136 8736956 1889410 -2114279 -3152178 -2823760
39321 -2823760 291796 6668887 11809325 11350206 7404152 5063817 4810911 3554878
39313 3554878 1748783 3369072 8337419 10887343 7848951 3802489 4553860 8897511
39305 8897511 10684453 6899355 135546 -5371320 -6917863 -4110477 23500 33937
39297 33937 -5967763 -12261881 -11749442 -5845084 -3326538 -8596557 -15975716 -17700439 -13364105
39288 -13364105 -8470430 -6840702 -7866495 -9323053 -9745770 -8832178 -7395293 -6055236
39280 -6055236 -3306915 2756829 9703490 11201667 4879421 -3219350 -5447202 -1417457
$$ packed form
39337A578648P933522N029710j600111n56188N119925L384210n937450r795883
39329E156383k406469N725726L956496l695180o847546m003689j037899L28418
39321b823760L115556O377091N140438m59119l946054k340335k52906j256033
39313C554878j806095J620289M968347K549924l038392m046462P51371M343651
39305H897511J786942l785098o763809n506866j546543K807386M133977J0437
39297C3937o001700o294118N12439N904358K518546n270019p379159j724723M336334
39288a3364105M893675J629728j025793j456558m22717R13592J436885J340057
39280f055236K748321O063744O946661J498177o322246q098771k227852M029745
$$ plain form
39272 -1417457 3691666 7352856 11199060 15278312 16303586 12822106 8061140 5854293
39264 5854293 6414967 7401221 6835115 3951913 -648158 -4728241 -6262970 -6272075 -7754445
39255 -7754445 -11124931 -12974061 -10384579 -4450026 1493216 5021819 4856016 362869
39247 362869 -6899977 -12491393 -12426700 -7354453 -2196876 -1444206 -5160053 -9337980 -9874709
39238 -9874709 -6351428 -1789358 1404325 4145664 8285933 12740789 14122534 10905194
39230 10905194 5018053 -492057 -3513422 -3105315 -147620 2366878 2163158 676549
39222 676549 630926 1210445 -645229 -4182699 -4760546 -1122558 1954590 661273 -2505765
39213 -2505765 -3433269 -2395629 -1739210 -1368018 -895966 -2806727 -8168914 -11959299 -8746085
$$ packed form
39272a417457N109123L661190L846204M079252J025274l481480m760966k206847
39264E854293N60674R86254n66106k883202m600071m080083j534729r105j482370
39255g754445l370486j849130K589482N934553N943242L528603j65803m493147
39247C62869p262846n591416O4693N072247N157577P52670l715847m177927n36729
39238i874709L523281M562070L193683K741339M140269M454856J381745l217340
39230A0905194n887141n510110l021365M08107K957695K514498k03720j486609
39222F76549m5623N79519j855674l537470n77847L637988L077148j293317l167038
39213b505765r27504J037640O56419L71192M72052j910761n362187l790385L213214
$$ plain form
39204 -8746085 -1408468 2092718 -222916 -3130894 -3888656 -5698657 -9795661 -11393579
39196 -11393579 -7272725 -1557122 588944 391685 1864572 4682933 5725535 4573671
39188 4573671 2248969 -2721665 -11053421 -17561113 -16016306 -8683977 -4406652 -6568936
39180 -6568936 -9499349 -8405200 -5945050 -5336320 -3278436 4294679 13359996 15464126
39172 15464126 9018558 1240720 -1142341 1734292 6261270 10311766 12946796 12863646
39164 12863646 9878136 6077178 3468210 1779048 -6464 -1464538 -1837945 -2140758
39156 -2140758 -3951481 -6175049 -4889776 2409826 12765798 19098951 16752824 8819617
39148 8819617 3712158 6697307 14999513 22040519 24392738 22497812 16968654 8403510
$$ packed form
39204h746085P337617L501186k315634k907978p57762j810001m097004j597918
39196a1393579M120854N715603K146066j97259J472887K818361J042602j151864
39188D573671k324702m970634q331756o507692J544807P332329M277325k162284
39180f568936k930413J094149K460150O08730K057884P573115R065317K104130
39172A5464126o445568p777838k383061K876633M526978M050496K635030q3150
39164A2863646k985510l800958k608968j689162j785512j458074l73407l02813
39156b140758j810723k223568J285273P299602J0355972O333153k346127p933207
39148H819617n107459K985149Q302206P041006K352219j894926n529158q565144
$$ plain form
39140 8403510 96149 -3889782 -4237224 -5685955 -9459553 -10900453 -7056455 -2071315
39132 -2071315 -1109719 -2538136 -1014777 4031143 8286811 9769079 10854620 12963409
39124 12963409 14003183 12325438 9500537 7612710 6573988 5582655 5169605 6498108
39116 6498108 9821780 14053210 16959006 16519223 13661762 12497487 15660360 20648889
39108 20648889 23234202 22756210 20889457 17478829 12381614 9639528 13592498 21219603
39100 21219603 24909115 23314597 22318788 23794100 21639907 12799981 4364414 3649879
39092 3649879 7459499 8325921 6552603 7993770 13056117 16499261 17057138 19065936
39084 19065936 23892098 26930630 24953316 20575822 17178502 14390988 11473920 11357421
$$ packed form
39140H403510q307361l985931l47442j448731l773598j440900L843998M985140
39132b071315R61596j428417J523359N045920M255668J482268J085541K108789
39124A2963409J039774j677745k824901j887827j038722r91333m13050J328503
39116F498108L323672M231430K905796m39783k857461j164275L162873M988529
39108B0648889K585313m77992j866753l410628n097215k742086L952970P627105
39100B1219603L689512j594518r95809J475312k154193q839926q435567p14535
39092C649879L809620Q66422j773318J441167N062347L443144N57877K008798
39084A9065936M826162L038532j977314m377494l397320k787514k917068j16499
$$ plain form
39076 11357421 17840982 30180878 42370046 47469762 43158550 34552714 30453472 34357457
39068 34357457 40365655 40871766 36493236 34080559 36350263 39322120 40175717 41439407
39060 41439407 45495393 50409448 54079637 57916991 62987738 66208945 64111269 57875811
39052 57875811 51583395 47778434 47416051 51476560 59294428 67372669 73196278 78573275
39044 78573275 86062303 93895809 98338809 100183551 104808662 115430294 129725563 144222859
39036 144222859 159214996 177319154 198623224 219626256 237565542 254705601 276856817
39029 276856817 307036859 341640237 374259814 402634407 429775390 458184945 485244157
39022 485244157 505256590 514448799 513143053 504461887 491639624 475268155 452657876
$$ packed form
39076A1357421O483561J2339896J2189168N099716m311212q605836m099242L903985
39068C4357457O008198N06111m378530k412677K269704K971857Q53597J263690
39060D1439407M055986M914055L670189L837354N070747L221207k097676o235458
39052E7875811o292416l804961l62383M060509P817868Q078241N823609N376997
39044G8573275P489028P833506M443000J844742M625111J0621632J4295269J4497296
39036A44222859J4992137J8104158K1304070K1003032J7939286J7140059K2151216
39029B76856817L0180042L4603378L2619577K8374593K7140983K8409555K7059212
39022D85244157K0012433R192209j305746q681166j2822263j6371469k2610279
$$ plain form
39015 452657876 421317788 383377620 344955951 311002797 282618631 259193955 240156846
39008 240156846 223850975 207645736 190547877 173520653 156677512 139242625 123112300
39001 123112300 112519464 108089384 104728116 97924814 88971622 81287532 74916447 68145938
38993 68145938 61887768 58609819 58459117 59240634 58518295 53922368 44747875 35872753
38985 35872753 35534237 44519845 51625666 46148460 32240456 24007691 27768495 36118699
38977 36118699 39050343 33780277 23104175 11518794 5198018 9023609 19800108 27179005
38969 27179005 24983944 18098097 15269737 18694695 23890181 26752156 27039637 26418954
38961 26418954 25805104 24072676 18698393 9358949 939989 -144173 6429023 13956871
$$ packed form
39015D52657876l1340088l7940168l8421669l3953154k8384166k3424676j9037109
39008B40156846j6305871j6205239j7097859j7027224j6843141j7434887j6130325
39001A23112300j0592836m430080l361268o803302q953192p684090o371085o770509
38993F8145938o258170l277949j50702P81517p22339m595927r174493q875122
38985C5872753l38516Q985608P105821n477206j3908004q232765L760804Q350204
38977C6118699K931644n270066j0676102j1585381o320776L825591J0776499P378897
38969B7179005k195061o885847k828360L424958N195486K861975K87481o20683
38961B6418954o13850j732428n374283r339444q418960j084162O573196P527848
$$ plain form
38953 13956871 16520462 14925216 14003631 16955430 22987707 27474347 24526305 13509182
38945 13509182 2749326 1343145 7267685 10624100 9444399 12810861 24360477 32891778
38937 32891778 27550422 14560610 8593264 12584478 17094350 16709922 15357644 15574215
38929 15574215 13952585 9833941 8799772 13256354 17127083 14717884 9170845 7441091
38921 7441091 11018996 15601288 16819099 13383624 7522198 4405906 7903864 15165394
38913 15165394 18908920 16445054 12337784 10898798 11212135 11630388 13391441 16330572
38905 16330572 16432562 12061685 8012996 8701268 11486275 11583917 9533795 8449303 7625914
38896 7625914 4773138 1333756 -559104 -3240059 -8726030 -11668706 -5361653 6571959
$$ packed form
38953A3956871K563591j595246r21585K951799O032277M486640k948042j1017123
38945A3509182j0759856j406181N924540L356415j179701L366462J1549616Q531301
38937C2891778n341356j2989812n967346L991214M509872l84428j352278K16571
38929A5574215j621630m118644j034169M456582L870729k409199n547039j729754
38921G441091L577905M582292J217811l435475n861426l116292L497958P261530
38913A5165394L743526k463866m107270j438986L13337M18253J761053K939131
38905A6330572J01990m370877m048689O88272K785007R7642k050122j084492q23389
38896G625914k852776l439382j892860k680955n485971k942676O307053J1933612
$$ plain form
38888 6571959 13202015 11093175 7336483 6566239 4401800 -2253897 -6917101 -2162503
38880 -2162503 8844936 16309802 16297081 13182602 11316957 10089531 7703108 5593134
38872 5593134 7146506 13215589 19809184 20867026 14499288 5946975 2123846 3655457
38864 3655457 5589361 5769887 7597447 12866841 16989978 14988931 8647766 3712003
38856 3712003 2414489 2422541 1286607 -1342905 -4286774 -4937913 -849308 6148769 9964231
38847 9964231 7489052 3262965 3436959 7659280 10836564 10381063 7235864 2069746
38839 2069746 -4343539 -8609248 -8060346 -5751003 -6845923 -10617874 -11343374 -6927682
38831 -6927682 -1330298 1721237 2315519 1546301 308553 940317 4507695 6453328 1387740
$$ packed form
38888F571959O630056k108840l756692p70244k164439o655697m663204M754598
38880b162503J1007439P464866j2721l114479j865645j227426k386423k109974
38872E593134J553372O069083O593595J057842o367738q552313l823129J531611
38864C655457J933904J80526J827560N269394M123137k001047o341165m935763
38856C712003j297514Q052j135934k629512k943869o51139M088605O998077L815462
38847I964231k475179m226087J73994M222321L177284m55501l145199n166118
38839B069746o413285m265709N48902K309343j094920l771951p25500M415692
38831f927682N597384L051535N94282p69218j237748O31764L567378J945633n065588
$$ plain form
38822 1387740 -7230355 -9540559 -3147130 3232180 3097356 1114234 3650257 7780516
38814 7780516 6952638 2234745 -169630 589549 -76492 -3321830 -5248175 -4046281 -2437144
38805 -2437144 -2191067 -1312910 2142984 7267234 12054391 14841584 13889910 8770740 2350314
38796 2350314 -1589862 -2850046 -4274842 -6879045 -8207072 -5547502 1347920 10111167
38788 10111167 16212061 15106802 7150635 -704444 -1600360 3523076 8211317 9406646
38780 9406646 9879517 12078906 14107875 12850852 7669394 -3980 -7976399 -13702031
38772 -13702031 -16149984 -17588244 -20805703 -24619785 -25276967 -22298763 -19289232 -18305976
38764 -18305976 -16969539 -12363772 -4890900 2918469 8965192 12055386 12076879 10481465
$$ packed form
38822A387740q618095k310204O393429O379310j34824j983122K536023M130259
38814G780516q27878m717893k404375P59179o66041l245338j926345J201894J609137
38805b437144K46077Q78157L455894N124250M787157K787193r51674n119170o420426
38796B350314l940176j260184j424796k604203j328027K659570O895422Q763247
38788A0111167O100894j105259p956167p855079q95916N123436M688241J195329
38780I406646M72871K199389K028969j257023n181458p673374p972419n725632
38772a3702031k447953j438260l217459l814082o57182K978204L009531R83256
38764a8305976J336437M605767P472872P809369O046723L090194K1493j595414
$$ plain form
38756 10481465 8965580 7864931 7524746 9701075 14465473 17312732 13741859 5925142
38748 5925142 243130 -1016373 -254056 2189121 8321027 15369612 16259604 10262211
38740 10262211 6132731 10160164 16909303 17025414 9612812 1485478 -2196786 -1197850
38732 -1197850 2855739 7368341 8605355 5573889 2839220 5488309 12527550 18543278
38724 18543278 20164407 17723634 12666958 6812703 2376722 -229281 -2582614 -4255922
38716 -4255922 -2661143 178512 -3574094 -16185169 -26797375 -23342947 -9099040 1298386
38708 1298386 1059652 -2488094 -1105894 3990217 7524752 8154855 7166549 5009056 2949880
38699 2949880 3573628 6392899 7296255 5335055 5414563 10559623 15933536 15384487 10854372
$$ packed form
38756A0481465j515885j100649l40185K176329M764398K847259l570873p816717
38748E925142n682012j259503P62317K443177O131906P048585Q89992n997393
38740A0262211m129480M027433O749139J16111p412602q127334l682264R98936
38732a197850M053589M512602J237014l031466k734669K649089P039241O015728
38724A8543278J621129k440773n056676n854255m435981k606003k353333j673308
38716d255922J594779K839655l752606j2611075j0612206L454428J4243907J0397426
38708A298386k38734l547746J382200N096111L534535O30103r88306k157493k059176
38699B949880O23748K819271R03356j961200P9508N145060N373913n49049m530115
$$ plain form
38690 10854372 9998597 15720185 22652646 24052692 18794186 10901539 4440131 105622
38682 105622 -3580441 -6580526 -6531098 -3033972 -857108 -5125675 -13635095 -18260103 -14922801
38673 -14922801 -7868563 -2549895 798523 3460154 3004652 -2981110 -10660824 -13082627
38665 -13082627 -8821394 -2851483 976954 3825314 7574207 10842333 11267475 9060771
38657 9060771 6271934 4207231 3251549 3939770 6393701 9163991 10016862 7950178 3805340
38648 3805340 -931725 -5326198 -9156327 -12567374 -15641766 -17774998 -17508539 -13946343
38640 -13946343 -8768114 -5582021 -5960438 -7104030 -5447296 -1921955 -747084 -2801774
38632 -2801774 -3713802 -3006 6242243 11061783 13649621 14648274 12880653 8208556
$$ packed form
38690A0854372q55775N721588O932461J400046n258506p892647o461408m334509
38682A05622l686063l000085M9428L497126K176864m268567q509420m625008L337302
38673a4922801P054238N318668L348418K661631m55502n985762p679714k421803
38665a3082627M261233N969911L828437K848360L748893L268126M25142k206704
38657I060771k788837k064703r55682O88221K453931K770290Q52871k066684m144838
38648C805340m737065m394473l830129l411047l074392k133232K66459L562196
38640a3946343N178229L186093l78417j143592J656734L525341J174871k054690
38632b801774r12028L710796O245249M819540K587838R98653j767621m672097
$$ plain form
38624 8208556 4880716 6568903 9842220 8635737 4216352 3756296 8603089 11474033
38616 11474033 7660021 1937358 330088 1093068 -824946 -4991025 -7060931 -6037591
38608 -6037591 -4133186 -1322514 4264100 11138573 14633308 12726511 8273198 5343569
38600 5343569 6006661 10075858 15050081 16872352 13790913 9216285 8151728 11326443
38592 11326443 15398655 17939204 18905220 17809035 13375331 6675408 1309804 -818916
38584 -818916 -1613348 -3573291 -6408354 -8060919 -7791415 -7006565 -7351867 -8587193 -8783233
38575 -8783233 -7173482 -6146798 -8371463 -11973769 -11903570 -7541716 -5102662 -9093504
38567 -9093504 -14601013 -13128324 -4655376 1670208 -560503 -7105959 -8803221 -1889074
$$ packed form
38624H208556l327840J688187L273317j206483m419385m60056M846793K870944
38616A1474033l814012n722663j607270P62980j918014m166079k069906J023340
38608f037591J904405K810672N586614O874473L494735j906797m453313k929629
38600E343569O63092M069197M974223J822271l081439m574628j064557L174715
38592A1326443M072212K540549R66016j096185m433704o699923n365604k128720
38584h18916p94432j959943k835063j652565K69504P84850l45302j235326j96040
38575h783233J609751J026684k224665l602306P0199M361854K439054l990842
38567i093504n507509J472689Q472948O325584k230711o545456j697262O914147
$$ plain form
38559 -1889074 9331596 17816239 19871986 17172810 14145287 13194313 12647191 9910436
38551 9910436 5462763 2077963 1069010 1418557 2092698 3224299 5389172 9251582
38543 9251582 15022010 20736286 22642086 19313432 13575023 8195962 2400291 -4186540
38535 -4186540 -7569053 -4578183 533848 1192164 -1161590 859805 8195933 12990687
38527 12990687 10581393 6199502 5988165 7807282 5743592 -1193827 -9645413 -17050145
38519 -17050145 -21625624 -20922661 -15248010 -9719134 -8588542 -10017727 -9963136 -7788622
38511 -7788622 -4146370 2362513 11009477 15463907 11222869 3534432 638749 1527133
38503 1527133 -1196066 -7564385 -9061522 -2304998 5674200 9127281 11682626 17547536
$$ packed form
38559a889074J1220670Q484643K055747k699176l027523r50974n47122k736755
38551I910436m447673l384800j008953L49547O74141J131601K164873L862410
38543I251582N770428N714276J905800l328654n738409n379061n795671o586831
38535d186540l382513K990870N112031O58316k353754K021395P336128M794754
38527A2990687k409294m381891k11337J819117k063690o937419q451586p404732
38519a7050145m575479P02963N674651N528876J130592j429185N4591K174514
38511g788622L642252O508883Q646964M454430m241038p688437k895683Q88384
38503A527133k723199o368319j497137O756524P979198L453081K555345N864910
$$ plain form
38495 17547536 22418544 20357353 14129720 10740722 10270132 7258673 1203792 -2592487
38487 -2592487 -2415917 -2460892 -4469923 -4446516 -453651 2955333 2139087 487272 1947734
38478 1947734 3151190 -1390872 -9091647 -11657522 -7024292 -1896291 -1401448 -2872670
38470 -2872670 -2438608 -1682404 -3463175 -5789315 -5173829 -3116111 -3661459 -6080290 -5588217
38461 -5588217 -1172079 2556290 2452770 1504121 4427063 11362990 17581793 17742330 10115374
38452 10115374 -1129349 -7893064 -5608966 806458 2017944 -3871184 -8754824 -5815376
38444 -5815376 1064112 3080397 -1394427 -5502891 -3806131 1125345 3070554 30512
38436 30512 -4227012 -5371668 -3357821 -1168884 532550 4843249 12780698 18614480
$$ packed form
38495A7547536M871008k061191o227633l388998m70590l011459o054881l796279
38487b592487J76570m4975k009031K3407L992865L408984q16246j651815J460462
38478A947734J203456m542062p700775k565875M633230N128001M94843j471222
38470b872670M34062P56204j780771k326140O15486K057718n45348k418831M92073
38461e588217M416138L728369j03520r48649K922942O935927O218803J60537p626956
38452A0115374j1244723o763715K284098O415424J211486n889128m883640K939448
38444e815376O879488K016285m474824m108464J696760M931476J945209l040042
38436C0512m257524j144656K013847K188937J701434M310699P937449N833782
$$ plain form
38428 18614480 15787351 7023758 2709569 7380956 13527444 12486628 6364625 3722817
38420 3722817 7169790 11700157 13378502 13102236 12285308 10981253 10617882 12770405 14362154
38411 14362154 9975547 687926 -5215052 -3268422 737472 -589507 -5663005 -7355289
38403 -7355289 -4131333 -1576221 -3298798 -5977593 -5089483 -1482241 497237 -822383
38395 -822383 -3082596 -4064932 -4492292 -5732426 -6476703 -3769682 2757592 9539539 12843517
38386 12843517 12645607 11620058 11248664 10377700 7247957 1910024 -3038860 -3733554 1628709
38377 1628709 9918196 15288958 15412175 13202054 10952698 6668708 -213639 -3758168
38369 -3758168 1177836 9008208 9229483 2303785 538732 10170844 21550744 22958449
$$ packed form
38428A8614480k827129q763593m314189M671387O146488j040816o122003k641808
38420C722817L446973M530367J678345k76266q16928j304055l63371K152523J591749
38411A4362154m386607r287621n902978J946630M005894j326979n073498j692284
38403g355289L223956K555112j722577k678795Q88110L607242J979478j319620
38395h22383k260213r82336m27360j240134p44277K707021O527274O781947L303978
38386A2843517j97910j025549l71394q70964l129743n337933m948884o94694N362263
38377A628709Q289487N370762J23217k210121k249356m283990o882347l544529
38369c758168M936004P830372K21275o925698j765053R632112J1379900J407705
$$ plain form
38361 22958449 16509805 12189744 11733393 8515383 975811 -4282775 -3475985 -629407
38353 -629407 701581 2674661 6543745 7964453 4127144 198882 2602759 9222987
38345 9222987 12175336 8463040 2574723 -532608 -234806 1558076 2639304 982433
38337 982433 -3027525 -4860351 -567025 6404355 7862975 1843049 -3807888 -1717157
38329 -1717157 5152777 8124628 4635589 399875 371241 2404198 1434622 -3255162 -7377204
38320 -7377204 -7071307 -3146372 194838 72732 -2244051 -3533725 -2919633 -2409708 -3272964
38311 -3272964 -4413057 -5198342 -6603260 -7211405 -1877792 10777920 22000783 20701326
38303 20701326 7849864 -3385978 -3800732 1518015 2082661 -4558017 -13049314 -19079769
$$ packed form
38361B2958449o448644m320061m56351l218010p539572n258586Q06790K846578
38353f29407J330988J973080L869084J420708l837309l928262K403877O620228
38345I222987K952349l712296n888317l107331K97802J792882J081228j656871
38337I82433m009958j832826M293326O971380J458620o019926n650937K090731
38329a717157O869934K971851l489039m235714k8634K032957r69576m689784m122042
38320g377204L05897L924935L341210j22106k316783j289674O14092N09925q63256
38311c272964j140093p85285j404918o08145N333613J2655712J1222863j299457
38303B0701326j2851462j1235842m14754N318747N64646o640678q491297o030455
$$ plain form
38295 -19079769 -21675421 -19628942 -12658894 -5393129 -3872305 -7520178 -9820929 -7614046
38287 -7614046 -4483567 -3746868 -3548325 -1451400 817927 691390 -696457 -916488 -504235
38278 -504235 -1083670 -1263409 1601015 6510774 9410202 8589789 6441315 5538205 5575827
38269 5575827 4780222 2207881 -1949567 -6348614 -8171412 -5250876 -128535 229586
38261 229586 -8144586 -19718765 -23876888 -16916787 -6559033 -2208237 -3554195 -2903653
38253 -2903653 2879219 8586299 9589513 8490980 9602140 11875957 12239459 12094827
38245 12094827 14414038 16781760 14138884 7638686 3860436 4667348 4623375 294509
38237 294509 -4258431 -4204747 -628132 3017945 6329908 9932209 12139344 11720944 10649807
$$ packed form
38295a9079769k595652K046479O970048P265765J520824l647873k300751K206883
38287g614046L130479P36699J98543K096925K269327j26537j387847k20031M12253
38278e04235n79435j79739K864424M909759K899428q20413k148474r03110L7622
38269E575827p95605k572341m157448m399047j822798K920536N122341L58121
38261B29586q374172j1574179m158123O960101J0357754M350796j345958O50542
38253b903653N782872N707080J003214j098533J111160K273817L63502j44632
38245A2094827K319211K367722k642876o500198l778250Q06912m3973m328866
38237B94509m552940N3684L576615L646077L311963L602301K207135m18400j071137
$$ plain form
38228 10649807 10432487 9193826 6216806 5583815 10563309 17509797 20313547 18178363
38220 18178363 13951877 7760522 -1376755 -9661840 -11431187 -7695411 -5129586 -5924165
38212 -5924165 -5000939 1060090 8245131 11092994 9923059 8860366 9708716 10700774 9564747
38203 9564747 5923563 1724856 -280716 115465 -475110 -4322668 -8216921 -7742653 -4695093
38194 -4695093 -4721590 -7628712 -6650023 760332 8060873 9291589 7690971 9200249 11798703
38185 11798703 8222988 -2239891 -10970896 -9779119 539042 12097777 17476747 14885973
38177 14885973 8214940 2903753 989130 437523 -520165 -521476 1974795 5120964 5659131
38168 5659131 3070404 -770671 -4864011 -9277774 -12875940 -13601560 -10904835 -5985382
$$ packed form
38228A0649807k17320j238661k977020o32991M979494O946488K803750k135184
38220A8178363m226486o191355r137277q285085j769347L735776K565825p94579
38212e924165R23226O061029P185041K847863j169935j062693Q48350R92058j136027
38203I564747l641184m198707k005572L96181n90575l847558l894253M74268L047560
38194d695093k6497k907122R78689P410355P300541J230716j600618J509278K598454
38185A1798703l575715j0462879q731005J191777J0318161J1558735N378970k590774
38177A4885973o671033n311187j914623n51607r57688j311K496271L146169N38167
38168E659131k588727l841075m093340m413763l598166p25620K696725M919453
$$ plain form
38160 -5985382 -175830 5170976 8306172 8862229 8973919 10168368 10296568 6605415 934728
38151 934728 -1935322 -1112191 -829056 -3887906 -7543194 -7862433 -5261169 -3152583 -3017904
38142 -3017904 -3475430 -3208588 -2298458 -889315 1282407 3515166 3793432 749016 -4610884
38133 -4610884 -9821984 -13308143 -15092399 -15243191 -12815053 -7422729 -1256932 2241115
38125 2241115 2219747 1545758 3236133 6827997 9195756 7990919 3391203 -2391360 -6176094
38116 -6176094 -5634805 -1741086 1344443 490297 -2708504 -3720411 27733 7168837
38108 7168837 14248135 18052621 17324524 14205201 12982036 15159985 16807730 13483812
38100 13483812 6767243 2323297 1859761 1331625 -1941626 -4829821 -3592945 -72639
$$ packed form
38160e985382N809552N346806L135196N56057J11690J194449J28200l691153n670687
38151I34728k870050Q23131K83135l058850l655288l19239K601264K108586J34679
38142c017904m57526K66842R10130J409143K171722K232759K78266l044416n359900
38133d610884n211100l486159j784256j50792K428138N392324O165797L498047
38125B241115k1368o73989J690375L591864K367759j204837m599716n782563l784734
38116f176094N41289L893719L085529q54146l198801j011907L748144P141104
38108G168837P079298L804486p28097l119323j223165K177949J647745l323918
38100A3483812o716569m443946m63536n28136l273251k888195J236876L520306
$$ plain form
38092 -72639 792006 -2312698 -6158563 -7710461 -6714081 -4027938 -350218 2916795 3780505
38083 3780505 1665225 -1759268 -4257228 -4762547 -3327712 -359996 3540035 7450918
38075 7450918 10377083 11811005 12123881 12183045 12226179 11442357 9359289 7182484 6471273
38066 6471273 6690356 5740265 3001847 -106298 -2841060 -5751807 -7641751 -5218130
38058 -5218130 1703084 7502221 7081053 3120422 2514369 6196139 7646085 2634106
38050 2634106 -4476138 -6986799 -4626014 -2166611 -1775672 -1381655 11646 9455 -2861367
38041 -2861367 -5811714 -5059225 -895575 2545586 2141442 -958842 -2963980 -1578769
38033 -1578769 1822658 4198881 4753611 5799156 8994958 12196911 12353796 10838074
$$ packed form
38092g2639Q64645l104704l845865j551898R96380K686143L677720L267013Q63710
38083C780505k115280l424493k497960n05319J434835K967716L900031L910883
38075G450918K926165J433922L12876N9164M3134p83822k083068k176805p11211
38066F471273K19083r50091k738418l108145k734762k910747j889944K423621
38058e218130O921214N799137m21168l960631o06053L681770J449946n011979
38050B634106p110244k510661K360785K459403L90939L94017J393301k191k870822
38041b861367k950347P52489M163650L441161m04144l100284k005138J385211
38033a578769L401427K376223N54730J045545L195802L201953J56885j515722
$$ plain form
38025 10838074 12299089 17050488 18362107 10747272 -1341749 -7663374 -4717933 375084
38017 375084 -314128 -6057162 -10427161 -10219468 -7258010 -3154934 2655589 8983283 11281505
38008 11281505 6682975 -1329415 -5873623 -3874840 1254370 3991988 2578232 215414
38000 215414 849395 4131482 5238464 477665 -7472996 -11615528 -8263245 -884070
37992 -884070 4544299 6081193 5905444 5551853 4306276 2427794 2688345 6702315 11471219
37983 11471219 12084407 7597463 2149894 -277702 -472511 -2047273 -6046367 -9674531
37975 -9674531 -10612088 -10315747 -11253979 -12243264 -9399458 -2058319 4942699 6581649 3550771
37966 3550771 791473 1251265 3548289 5455636 6891492 8528390 9546018 8403494
$$ packed form
38025A0838074J461015M751399J311619p614835j2089021o321625K945441N093017
38017C75084o89212n743034m369999K07693K961458M103076N810523O327694K298222
38008A1281505m598530q012390m544208J998783N129210K737618j413756k362818
38000B15414O33981L282087J106982m760799p950661m142532L352283P379175
37992h84070N428369J536894j75749l53591j245577j878482K60551M013970M768904
37983A1471219O13188m486944n447569k427596j94809j574762l999094l628164
37975i674531r37557K96341r38232r89285K843806P341139P001018J638950l030878
37966C550771k759298M59792K297024J907347J435856J636898J017628j142524
$$ plain form
37958 8403494 4991322 905338 -2015356 -3031054 -3033703 -3758572 -5428046 -5526766 -1908529
37949 -1908529 2975325 4034055 673664 -1814030 -563122 -937671 -9290413 -22496996
37941 -22496996 -30819874 -30424637 -26381862 -22507247 -15887256 -5195844 2525075 112947
37933 112947 -8666703 -13422016 -10543858 -5493201 -2634749 -205616 3470092 5788272
37925 5788272 5100005 4835207 8415884 13647708 15908973 14311267 11489089 9565156
37917 9565156 9150979 9962923 9712067 5206632 -2264366 -5889951 -2017874 3109190 1014844
37908 1014844 -6527684 -9447798 -3551265 4522153 8205360 9666179 13485255 17558564
37900 17558564 16354029 9963851 3719032 149797 -2861524 -5996534 -6296158 -2811802
$$ packed form
37958H403494l412172m085984k920694j015698k649p24869j669474r8720L618237
37949a908529M883854J058730l360391k487694J250908l74549q352742j3206583
37941b2496996q322878L95237M042775L874615O619991J0691412P720919k412128
37933A12947q779650m755313K878158N050657K858452K429133L675708K318180
37925E788272o88267k64798L580677N231824K261265j597706k822178j923933
37917I565156m14177Q11944k50856m505435p470998l625585L872077N127064k094346
37908A014844p542528k920114N896533Q073418L683207J460819L819076M073309
37900A7558564j204535o390178o244819l569235l011321l135010k99624L484356
$$ plain form
37892 -2811802 163318 -1335939 -5022815 -5532051 -2166138 347 -3102367 -9399849
37884 -9399849 -13402514 -12343949 -8210158 -4641823 -3426383 -3987202 -5000589 -5768261
37876 -5768261 -6264792 -6231949 -4637051 -890000 3024437 3095893 -2106471 -8110734 -8767284
37867 -8767284 -4444583 -2833569 -9390838 -19514143 -23517101 -18011792 -8814712 -3202181
37859 -3202181 -3139611 -6360951 -9948441 -11224668 -8563101 -3629999 -341421 351874 1939501
37850 1939501 6375026 9787566 7802737 2702681 562214 2310496 2721854 -1313506
37842 -1313506 -6398395 -8119232 -6563705 -3691854 1042884 8447176 15158368 16045899
37834 16045899 10991382 5757541 5330602 8947413 12605666 14184849 14498728 14684047
$$ packed form
37892b811802K975120j499257l686876n09236L365913K166485l102714o297482
37884i399849m002665J058565M133791L568335J215440n60819j013387p67672
37876e768261m96531L2843J594898L747051L914437P1456n202364o004263o56550
37867h767284M322701J611014o557269j0123305m002958N505309R197080N612531
37859c202181O2570l221340l587490j276227K661567M933102L288578O93295J587627
37850A939501M435525L412540j984829n100056k140467J748282M11358m035360
37842a313506n084889j720837J555527K871851M734738P404292O711192Q87531
37834A6045899n054517n233841m26939L616811L658253J579183L13879J85319
$$ plain form
37826 14684047 14383952 12455688 8666187 4528515 2295278 2674398 3964842 4443981
37818 4443981 5045378 7787967 11603187 12350357 8140939 2220996 -1377133 -2853153
37810 -2853153 -4623116 -6253345 -5325930 -2558746 -1443322 -2048701 51436 6168678
37802 6168678 9977519 4963582 -5787982 -12125927 -8986228 -1741880 1595765 -336267
37794 -336267 -3273644 -4901865 -7312451 -11803997 -14937830 -12548295 -6283751 -2496903
37786 -2496903 -3659434 -4310443 1395107 10498941 14342170 10350501 5325296 5571113
37778 5571113 9118876 10894897 10562684 10163481 7813018 442133 -8711889 -12135802
37770 -12135802 -8069795 -2851064 -2089072 -4588359 -6706592 -7926248 -9472017 -11133674
$$ packed form
37826A4684047l00095j928264l789501m137672k233237L79120J290444M79139
37818D443981O01397K742589L815220P47170m209418n919943l598129j476020
37810b853153j769963j630229R27415K767184J115424o05379K100137O117242
37802F168678L808841n013937j0751564o337945L139699P244348L337645j932032
37794c36267k937377j628221k410586m491546l133833K389535O264544L786848
37786b496903j162531o51009N705550R103834L843229l991669n025205K45817
37778E571113L547763J776021l32213l99203k350463p370885r154022l423913
37770a2135802M066007N218731P61992k499287k118233j219656j545769j661657
$$ plain form
37762 -11133674 -12286592 -13460651 -14771375 -15168645 -14782299 -15312279 -16641655 -16102371 -12748937
37753 -12748937 -9094952 -6642608 -3182544 2795521 8192890 9010269 5622886 1520105
37745 1520105 -1029131 -1538866 -91560 1596281 370917 -4055477 -7307123 -5880148
37737 -5880148 -2114403 -546248 -1906015 -4196765 -6916896 -10012554 -11243248 -9461819
37729 -9461819 -8337431 -11311561 -14382883 -10163781 909735 9347224 7814409 -1063664
37721 -1063664 -9257601 -11527629 -7967777 -2440618 -140401 -3604817 -9723368 -12901084
37713 -12901084 -11419218 -8199847 -5932588 -4922591 -5138434 -6156032 -5326792 -652402
37705 -652402 4538617 4981439 1857433 1745379 5910012 7451938 2411211 -2664124 436880
$$ packed form
37762a1133674j152918j174059j310724l97270L86346n29980j329376N39284L353434
37753a2748937L653985K452344L460064N978065N397369Q17379l387383m102781
37745A520105k549236n09735J447306J687841j225364m426394l251646J426975
37737e880148L765745J568155j359767k290750k720131l095658j230694J781429
37729i461819J124388k974130l071322M219102J1073516Q437489j532815q878073
37721a063664q193937k270028L559852N527159K300217l464416o118551l177716
37713a2901084J481866L219371K267259J009997k15843j017598Q29240M674390
37705f52402N191019M42822l124006j12054M164633J541926n040727n075335L101004
$$ plain form
37696 436880 9525384 14674335 10784685 2474755 -2650377 -1796285 1484776 1014522 -5940423
37687 -5940423 -14640709 -16653153 -9388187 493478 5342214 5394789 6288932 10088808 12808579
37678 12808579 10172978 2756813 -4487148 -6109601 -575638 7591237 11521656 9463855
37670 9463855 6667666 8152149 12286981 14293223 13402564 12450905 11927096 9132799 3434160
37661 3434160 -1753769 -3695764 -4191415 -6514924 -9830536 -9182610 -1912864 7383425
37653 7383425 10740033 5987763 -911923 -4411825 -6407931 -10560484 -13464776 -9075527
37645 -9075527 -551962 1648677 -4731244 -9495426 -5463706 666366 -428808 -6126639
37637 -6126639 -7190638 -2435847 1317610 1026133 161621 871884 1319000 483779 -974802
$$ packed form
37696D36880R088504N148951l889650q309930n125132Q54092L281061m70254o954945
37687e940423q700286k012444P264966R881665M848736N2575Q94143L799876K719771
37678A2808579k635601p416165p243961j622453N533963Q166875L930419k057801
37670I463855k796189J484483M134832K006242q90659r51659n23809k794297n698639
37661C434160n187929j941995m95651k323509l315612O47926P269746R296289
37653G383425L356608m752270o899686l499902j996106m152553k904292M389249
37645i075527Q523565K200639o379921m764182M031720O130072j095174n697831
37637f126639j063999M754791L753457k91477q64512P10263M47116q35221j458581
$$ plain form
37628 -974802 -3898394 -8464570 -10264696 -5354230 2078525 4369169 1604354 322792
37620 322792 1780968 500251 -4827352 -8274418 -6835032 -5038447 -6077031 -6208006
37612 -6208006 -2239292 2211704 2608225 102180 -2009385 -3495358 -4989908 -5237628
37604 -5237628 -4093342 -3782749 -4098466 -1331299 4684456 7752957 3675270 -3086795
37596 -3086795 -5096347 -385314 7811451 15201273 17524220 12969848 6760147 7359806
37588 7359806 14533548 18028515 12579236 6231209 7206261 10676044 7944450 2163381
37580 2163381 3398674 11679287 16708755 13553329 8078790 6309508 7737237 10253634
37572 10253634 13036216 12926260 6153049 -3970753 -8456930 -4497402 675972 618690
$$ packed form
37628i74802k923592m566176j800126M910466P432755K290644k764815j281562
37620C22792J458176j280717n327603l447066J439386J796585j038584j30975
37612f208006L968714M450996L96521k506045k111565j485973j494550k47720
37604e237628J144286L10593l15717K767167O015755L068501m077687o762065
37596c086795k009552M711033Q196765P389822K322947m554372o209701N99659
37588G359806P173742L494967n449279o348027R75052L469783k731594n781069
37580B163381J235293Q280613N029468l155426n474539j769282J427729K516397
37572A0253634K782582j09956o773211j0123802m486177L959528N173374n7282
$$ plain form
37564 618690 -2039995 -1876348 226612 -955568 -6927849 -13252768 -14249742 -8356601 -3003
37555 -3003 3913083 1220689 -3045286 -3857383 -3271381 -5887956 -10156971 -10778786 -7907074
37546 -7907074 -6186617 -5474285 -1390625 4346331 3892416 -3835960 -9745427 -8123985
37538 -8123985 -4506331 -4620532 -4445047 1245305 8035438 8610619 4884889 4070847 6487197
37529 6487197 6733491 4581831 5033588 8131926 7980105 3088804 -484594 1270947 4569775
37520 4569775 4990946 4650073 7863131 13351744 15387937 11549985 6077177 5079046 9545762
37511 9545762 13753316 11416945 3689496 -920319 3685770 13487089 19169926 17093352
37503 17093352 11828650 8521453 7025417 4685080 1541087 399238 2795879 6375970
$$ packed form
37564F18690k658685J63647K102960j182180n972281o324919r96974N893141Q353598
37555c003L916086k692394m265975q12097N86002k616575m269015o21815K871712
37546g907074J720457P12332M083660N736956m53915p728376n909467J621442
37538h123985L617654j14201J75485N690352O790133N75181l725730q14042K416350
37529F487197K46294k151660M51757L098338j51821m891301l573398J755541L298828
37520D569775M21171l40873L213058N488613K036193l837952n472808r98131M466716
37511I545762M207554k336371p727449m609815M606089R801319N682837k076574
37503A7093352n264702l307197j496036k340337l143993j141849K396641L580091
$$ plain form
37495 6375970 6615056 1567408 -5133150 -7514856 -4097677 511402 1722348 -136804
37487 -136804 -2542581 -4688243 -5639993 -2343715 5819453 13161581 13679694 9083060 5370472
37478 5370472 3214703 -1394705 -7435328 -7700413 429469 9712373 12109339 8238008
37470 8238008 4315301 3856977 6130472 9532124 12656488 14105816 14247198 15503127
37462 15503127 18804265 21611781 20947660 16101971 7500044 -3405080 -11572319 -10507876
37454 -10507876 -533095 8849709 9075987 2290089 -2907923 -2722778 -680546 -1028524
37446 -1028524 -4350772 -8441516 -9321363 -2970311 9212431 18003170 14908217 3010241
37438 3010241 -5861930 -5051940 982991 5103277 5761225 4594427 1550961 -3237451
$$ packed form
37495F375970K39086n047648o700558k381706L417179M609079J210946j859152
37487a36804k405777k145662r51750L296278Q163168P342128N18113m596634l712588
37478E370472k155769m609408o040623k65085Q129882R282904K396966l871331
37470H238008l922707m58324K273495L401652L124364J449328J41382J255929
37462A5503127L301138K807516o64121m845689q601927j0905124q167239J064443
37454a0507876R974781R382804K26278o785898n198012J85145K042232l47978
37446a028524l322248m090744q79847O351052J2182742Q790739l094953j1897976
37438C010241q872171Q09990O034931M120286O57948j166798l043466m788412
$$ plain form
37430 -3237451 -6448121 -5166356 -1614629 -253003 -1267749 -679186 3386683 7928923
37422 7928923 9165687 6864612 3589390 1437303 871480 1820293 4293824 7519714
37414 7519714 9457362 8455621 5552317 3837629 4681270 5816154 4558932 1660595
37406 1660595 -276125 -1280344 -3809398 -8049753 -10842730 -10375463 -8765695 -8200736
37398 -8200736 -7436415 -4641338 -1287399 -97513 -773661 -1066555 -1050073 -2794352 -5988947
37389 -5988947 -7392185 -5472452 -2858892 -2907455 -5715136 -8650336 -9386367 -7559263 -4799241
37380 -4799241 -3929913 -6720317 -11279686 -12707303 -7742174 1327467 8212186 8522665
37372 8522665 4327705 2500002 7380041 14853046 15748861 6671889 -4671798 -7848680
$$ packed form
37430c237451l210670J281765L551727J361626j014746N88563M065869M542240
37422G928923J236764k301075l275222k152087n65823R48813K473531L225890
37414G519714J937648j001741k903304j714688Q43641J134884j257222k898337
37406A660595j936720j004219k529054m240355k792977M67267J609768N64959
37398h200736P64321K795077L353939J189886o76148k92894J6482j744279l194595
37389e988947j403238J919733K613560m8563k807681k935200p36031J827104K760022
37380d799241Q69328k790404m559369j427617M965129R069641O884719L10479
37372H522665m194960j827703M880039P473005Q95815r076972j1343687l176882
$$ plain form
37364 -7848680 -1881490 4844451 6150628 4463523 4480486 5663185 4551156 1141638
37356 1141638 -1105884 22879 3855772 8345374 10633115 8203023 2527685 -622896
37348 -622896 1916021 5736722 5099035 1832742 2236565 6475106 8194150 5220822 3036689
37339 3036689 4835585 5269803 -886766 -9248214 -11186751 -5529541 997705 3130187
37331 3130187 1431043 -1528257 -4023647 -4297126 -1357078 2838961 5299324 5890448
37323 5890448 6239757 5892186 3667857 1844476 3837451 7811891 8265222 4918421 4075321
37314 4075321 8809695 13536079 12179743 7055924 4840228 7028798 9459113 9265231
37306 9265231 7488591 5859110 5178626 6117887 7841433 6835661 1278676 -4186338
$$ packed form
37364g848680N967190O725941J306177j687105J6963J182699j112029l409518
37356A141638k247522J128763L832893M489602K287741k430092n675338l150581
37348f22896K538917L820701o37687l266293M03823M238541J719044k973328k184133
37339C036689J798896M34218o156569q361448j938537N657210O527246K132482
37331C130187j699144k959300k495390k73479K940048M196039K460363N91124
37323E890448L49309l47571k224329j823381J992975L974440M53331l346801q43100
37314D075321M734374M726384j356336n123819k215696K188570K430315j93882
37306I265231j776640j629481o80484R39261J723546j005772n556985n465014
$$ plain form
37298 -4186338 -2946980 3957928 7736714 3092643 -4817817 -7447986 -3473419 1170851
37290 1170851 1765985 -486930 -1788823 -648473 1254179 1371264 -1263112 -4984481
37282 -4984481 -6512145 -3669854 2433176 8043262 9865643 7958924 5762262 6626901
37274 6626901 9734883 10471485 6318681 1373464 2190698 8905642 13819471 10708364
37266 10708364 2865076 -1071000 2386406 8753335 12642711 13722262 14554483 15744388
37258 15744388 15632158 13280064 9603653 6041988 3481607 2121656 1514389 1250886
37250 1250886 2052008 4888202 8173100 7794280 2124520 -4359797 -5422989 -637801
37242 -637801 4440560 5756037 4780673 3828153 1308565 -4945925 -12057030 -14208739 -10153214
$$ packed form
37298d186338J239358O904908L778786m644071p910460k630169L974567M644270
37290A170851N95134k252915j301893J140350J902652J17085k634376l721369
37282d984481j527664K842291O103030N610086J822381j906719k196662Q64639
37274F626901L107982P36602m152804m945217Q17234O714944M913829l111107
37266A0708364p843288l936076L457406O366929L889376J079551Q32221J189905
37258A5744388j12230k352094l676411l561665k560381j359951o07267k63503
37250A250886Q01122K836194L284898l78820n669760o484317j063192M785188
37242f37801N078361J315477r75364r52520k519588o254490p111105k151709M055525
$$ plain form
37233 -10153214 -4961728 -3497268 -5039248 -5743604 -4079706 -1736114 -439127 -339984
37225 -339984 -1775162 -6616200 -15965554 -26495796 -31127233 -25571510 -13882352 -5012501
37217 -5012501 -3287776 -5008054 -5533505 -5756731 -8158176 -10068488 -6815585 -405092
37209 -405092 1442017 -3977338 -10257842 -10647206 -5779936 86079 5370485 9431968
37201 9431968 8853185 1274969 -9000906 -14493581 -13039814 -8828023 -5744565 -3673266
37193 -3673266 -1023540 2859225 7920000 12958806 15166820 13036441 9316411 8019065
37185 8019065 8962291 8481543 5068650 858908 -2107138 -3424615 -2323080 1949967
37177 1949967 7444019 10807405 11443359 10802448 7958440 660256 -8840921 -14318821
$$ packed form
37233a0153214N191486J464460j541980p04356J663898K343592J296987R9143
37225c39984j435178m841038r349354j0530242m631437N555723J1689158Q869851
37217e012501J724725j720278n25451k23226k401445j910312L252903O410493
37209d05092J847109n419355o280504l89364M867270N866015N284406M061483
37201I431968n78783p578216j0275875n492675J453767M211791L083458K071299
37193c673266K649726L882765N060775N038806K208014k130379l720030j297346
37185H019065R43226m80748l412893m209742k966046j317477J101535M273047
37177A949967N494052L363386O35954o40911k844008p298184r501177n477900
$$ plain form
37169 -14318821 -13488184 -10619500 -9432586 -8193170 -4334479 548031 3275191 2923011
37161 2923011 -313448 -5993077 -10736930 -9385838 -2081526 4356474 5478112 4556833
37153 4556833 5028713 3749605 -2146022 -7378713 -5634972 -434298 264557 -2321702
37145 -2321702 191529 8246210 12002811 6477921 -672752 -944024 3503768 5923632
37137 5923632 6339760 9907852 17358842 23396385 23457728 17841010 10193978 5130965 5991976
37128 5991976 11838177 17467118 18591222 15972728 13011994 11311309 10596106 10808202
37120 10808202 11707585 12018972 11262239 10850848 11312105 10400296 6508832 2069434 465547
37111 465547 834158 -756049 -5318628 -9069648 -7968684 -2298624 3652340 5451478
$$ packed form
37169a4318821Q30637K868684J186914J239416L858691M882510K727160l52180
37161B923011l236459n679629m743853J351092P304312O438000J121638r21279
37153D556833M71880j279108n895627n232691J743741N200674O98855k586259
37145b321702K513231Q054681L756601n524890p150673k71272M447792K419864
37137E923632M16128L568092P450990O037543O1343n616718p647032n063013Q61011
37128E991976N846201N628941J124104k618494k960734j700685p15203K12096
37120A0808202Q99383L11387p56733m11391M61257r11809l891464m439398j603887
37111D65547L68611j590207m562579l751020J100964N670060N950964J799138
$$ plain form
37103 5451478 2177969 -3016620 -6178852 -6373150 -5437270 -4710566 -4336855 -5368746 -8859876
37094 -8859876 -12084895 -9843613 -1608430 6415745 8897677 7338739 5707451 4543139
37086 4543139 3451397 5041947 10621103 15157140 13000255 6601506 2945576 2752693
37078 2752693 546042 -4728065 -6867499 -1923477 6055188 11229587 12342095 10532424
37070 10532424 6333413 1873820 1119041 4446363 7008509 5510065 2581909 1537662
37062 1537662 1337314 505076 1675799 7422095 14666227 17985783 16327229 12504459
37054 12504459 8394890 4617755 2707249 3502160 5181296 6233775 7751066 9269551
37046 9269551 6144391 -3660573 -13449212 -14917780 -9263939 -4482702 -3293517 -1407314
$$ packed form
37103E451478l273509n194589l162232j94298R35880P26704L73711j031891l491130
37094h859876l225019K241282Q235183Q024175K481932j558938j631288j164312
37086D543139j091742J590550N579156M536037k156885o398749l655930j92883
37078B752693k206651n274107k139434M944022P978665N174399J112508j809671
37070A0532424m199011m459593p54779L327322K562146j498444k928156j044247
37062A537662k00348q32238J170723N746296P244132L319556j658554l822770
37054A2504459m109569l777135j910506P94911J679136J052479J517291J518485
37046I269551l125160r804964r788639j468568N653841M781237J189185J886203
$$ plain form
37038 -1407314 2691239 4549530 1798585 -2064674 -4275072 -6422164 -8858660 -8296204
37030 -8296204 -4559095 -3247767 -7006848 -9832683 -5563830 2582545 6798895 5371879
37022 5371879 2664149 1284685 360460 -227923 307811 609399 -997692 -2671562 -1760370
37013 -1760370 164472 258475 845619 6435782 14690126 17462005 12288361 6378465 6601269
37004 6601269 11143862 14326583 14633152 13867829 12379940 9842786 8234097 9558643
36996 9558643 11937758 11565896 7578442 2106491 -3166065 -7392042 -8674542 -5306950
36988 -5306950 1209088 7071665 9994552 9955902 6956872 1129222 -4972296 -7546424
36980 -7546424 -6205936 -4972458 -7047276 -10415181 -10579593 -6731822 -3132910 -4008360
$$ packed form
37038a407314M098553J858291k750945l863259k210398k147092k436496N62456
37030h296204L737109J311328l759081k825835M268853Q146375M216350j427016
37022E371879k707730j379464r24225n88383N35734L01588j607091j673870R11192
37013a760370J924842R4003N87144N590163Q254344K771879n173644n909896K22804
37004F601269M542593L182721L06569p65323j487889k537154j608689J324546
36996I558643K379115l71862l987454n471951n272556m225977j282500L367592
36988e306950O516038N862577K922887l8650k999030n827650o101518k574128
36980g546424J340488J233478k074818l367905j64412L847771L598912q75450
$$ plain form
36972 -4008360 -8381138 -11151967 -9180513 -4924618 -2932692 -3791199 -4018978 -2106596
36964 -2106596 -1333418 -4376509 -7922914 -6762068 -2311712 -2173968 -9610595 -17434531
36956 -17434531 -15856533 -4611714 6349781 8098548 1591148 -5395644 -7353393 -5029727
36948 -5029727 -2168577 -1354033 -3170039 -6735911 -9582559 -8676172 -3582493 1946931
36940 1946931 3252788 -418211 -5545166 -8417029 -8145223 -5882981 -2936770 -206467
36932 -206467 1776202 2869320 2885639 1560045 -168469 -65628 2199783 3057667 -458982
36923 -458982 -4843135 -3180526 5100154 12257218 12338716 9028259 9972446 16600677 23501275
36914 23501275 25424010 20984663 11648300 1362468 -4395480 -3597989 -761859 -1348777
$$ packed form
36972d008360m372778k770829J971454M255895J991926q58507k27779J912382
36964b106596P73178l043091l546405J160846M450356J37744p436627p823936
36956a7434531J577998J1244819J0961495J748767o507400o986792j957749K323666
36948e029727K861150Q14544j816006l565872k846648R06387N093679N529424
36940A946931J305857l670999n126955k871863K71806K262242K946211K730303
36932b06467J982669J093118J6319j325594j728514J02841K265411Q57884l516649
36923d58982m384153J662609Q280680P157064Q1498l310457R44187O628231O900598
36914B3501275J922735m439347r336363j0285832n757948P97491K836130n86918
$$ plain form
36906 -1348777 -4610968 -6153234 -5548230 -5757036 -6262633 -3589399 1043563 1709460 -2554139
36897 -2554139 -4625861 688970 8887934 12128568 9272776 5513480 5206521 8860561
36889 8860561 14428126 17871827 14879737 5693621 -3554403 -7223709 -5848454 -3048084
36881 -3048084 37639 3580179 5253574 2347232 -3713634 -9063238 -12491673 -15117899
36873 -15117899 -16306190 -14166261 -9597621 -5906823 -4480242 -4142847 -4427288 -5958170
36865 -5958170 -7647506 -6973113 -3563472 145400 2036694 1821469 -219553 -3412435
36857 -3412435 -5861463 -5985275 -4729583 -4067641 -3809301 -2067460 1862401 7115261 12382130
36848 12382130 15246831 12645596 5206854 -1124500 -1699382 851905 1684933 2002053
$$ packed form
36906a348777l262191j542266O05004k08806n05597K673234M632962O65897m263599
36897b554139k071722N314831Q198964L240634k855792l759296l06959L654040
36889H860561N567565L443701k992090r186116r248024l669306J375255K800370
36881c048084L085723L542540J673395k906342o060866n349604l428435k626226
36873a5117899j188291K139929M568640L690798J426581L37395k84441j530882
36865e958170j689336O74393L409641L708872J891294k15225k041022l192882
36857c412435k449028j23812J255692O61942K58340J741841L929861N252860N266869
36848A2382130K864701k601235p438742o331354n74882K551287Q33028L17120
$$ plain form
36840 2002053 6071577 12078619 13723164 10634163 8957538 10367452 9017896 2412310
36832 2412310 -3023751 -2135512 537617 -962380 -3222105 1011271 9876540 13398861
36824 13398861 7118948 -2108069 -5285674 -1407673 3514452 4434979 2011729 272043
36816 272043 1066086 2047228 870283 -515805 905345 2636900 -1526562 -12001166
36808 -12001166 -21038515 -22365236 -18257138 -13891107 -9917116 -5183480 -2090114 -3380557
36800 -3380557 -6810619 -8508287 -8699822 -8626726 -5181929 4454347 15182010 18605314
36792 18605314 14356449 9469651 6987395 3264414 -2492366 -4473569 566467 7098254
36784 7098254 8074943 3673803 -919393 -2301479 83462 5599393 10958252 10320702
$$ packed form
36840B002053M069524O007042J644545l089001j676625J409914j349556o605586
36832B412310n436061Q88239K673129j499997k259725M233376Q865269L522321
36824A3398861o279913r227017l177605L878001M922125R20527k423250j739686
36816B72043P94043R81142j176945j386088J421150J731555m163462j0474604
36808a2001166r037349j326721M108098M366031L973991M733636L093366j290443
36800c380557l430062j697668j91535P3096L444797R636276J0727663L423304
36792A8605314m248865m886798k482256l722981n756780j981203N040036O531787
36784G098254R76689m401140m593196j382086K384941N515931N358859o37550
$$ plain form
36776 10320702 1592439 -8921937 -12245227 -6705940 670205 2433540 -2003470 -7430630
36768 -7430630 -9287051 -7991437 -6919018 -6827432 -4232113 3254440 11832851 14795520
36760 14795520 10250782 2561375 -3413226 -6019243 -5041424 -694375 4346573 5707098
36752 5707098 2133773 -2910671 -5567442 -4882405 -1282325 4596803 10227724 11973044
36744 11973044 9507630 6429010 4833419 2715076 -1190485 -3638064 -1089208 4834698
36736 4834698 9127451 8963516 5419468 1625046 1089573 5568477 12282826 14964522
36728 14964522 9611139 -1871973 -14050232 -21638467 -21210776 -13749009 -6468935 -6978730
36720 -6978730 -13454098 -15787617 -9226815 -988797 815524 -1372578 -480895 2998422
$$ packed form
36776A0320702q728263j0514376l323290N539287P376145J763335m437010n427160
36768g430630j856421J295614J072419R1586K595319P486553Q578411K962669
36760A4795520m544738p689407n974601k606017R77819M347049N040948J360525
36752E707098l573325n044444k656771O85037L600080N879128N630921J745320
36744A1973044k465414l078620j595591k118343l905561k447579K548856N923906
36736D834698M292753j63935l544048l794422n35473M478904O714349K681696
36728A4964522n353383j1483112j2178259p588235M27691P461767P280074n09795
36720f978730o475368k333519O560802Q238018J804321k188102Q91683L479317
$$ plain form
36712 2998422 2866031 -1578973 -4617203 -3698662 -2364014 -3094591 -4018476 -4116860 -5835425
36703 -5835425 -10375684 -14841635 -16111690 -14374959 -11767039 -10389062 -11818977 -15150347
36695 -15150347 -15510545 -8494186 3355088 12092869 13007425 8563688 3765621 1229560
36687 1229560 1007012 1556403 497290 -2339462 -2947355 2094936 9714943 13766588 13580215
36678 13580215 13565055 14687285 13199428 9012159 8030464 12865056 17307855 14371468
36670 14371468 5425804 -2593025 -5387593 -3275973 1398367 5240799 5165853 1920515
36662 1920515 -267810 496339 1709654 1651810 1655309 966450 -4358955 -13211726 -16508662
36653 -16508662 -9045085 713422 470993 -9489175 -17921736 -18785277 -16841735 -16536075
$$ packed form
36712B998422j32391m445004l038230R18541J334648p30577r23885r8384j718565
36703e835425m540259m465951j270055J736731K607920J377977j429915l331370
36695a5150347l60198P016359J1849274Q737781R14556m443737m798067k536061
36687A229560k22548N49391j059113k836752o07893N042291P620007M051645j86373
36678A3580215j5160J122230j487857m187269r81695M834592M442799k936387
36670A4371468q945664q018829k794568K111620M674340L842432p4946l245338
36662A920515k188325P64149J213315n7844L499o88859n325405q852771l296936
36653a6508662P463577R758507k42429r960168q432561q63541J943542L05660
$$ plain form
36645 -16536075 -14079315 -4646585 8204071 15485045 13356454 7357334 6016789 11536440
36637 11536440 17546010 16749979 9959786 4735968 5035705 7014120 7196102 8846087
36629 8846087 14957185 19978667 16389984 6993345 2102375 4725323 6879522 2302511
36621 2302511 -4833761 -7372075 -5308389 -3959393 -5671529 -7519339 -5759667 -367471
36613 -367471 3949724 1427711 -7656843 -14564534 -11040008 -272190 6411973 4109531
36605 4109531 -758667 -1657412 -784140 -2706680 -5598100 -4826998 -1003880 1871229 3599611
36596 3599611 6993577 11419083 13025334 11138001 9216701 8909600 7706365 3805113
36588 3805113 -429861 -1905690 -1223336 -1405652 -3343682 -4610443 -3102698 -548988
$$ packed form
36645a6536075K456760R432730J2850656P280974k128591n999120j340545N519651
36637A1536440O009570p96031o790193n223818K99737J978415J81982J649985
36629H846087O111098N021482l588683r396639m890970K622948K154199m577011
36621B302511p136272k538314K063686J348996j712136j847810J759672N392196
36613c67471M317195k522013r084554o907691L524526J0767818O684163k302442
36605D109531m868198q98745Q73272j922540k891420P71102L823118K875109J728382
36596C599611L393966M425506J606251j887333j921300l07101j203235l901252
36588C805113m234974j475829O82354j82316j938030j266761J507745K553710
$$ plain form
36580 -548988 -925141 -5239763 -9653413 -10217417 -7897800 -6425950 -6396989 -4961366 -967534
36571 -967534 3414323 6357357 7679770 6200638 558760 -6251791 -8370729 -5181810
36563 -5181810 -2821833 -4933098 -7279391 -5254226 -1494053 -1178254 -4202847 -7331682
36555 -7331682 -10256833 -13848815 -15691210 -13276525 -9006588 -6429408 -4286809 -52183
36547 -52183 3752115 3397437 1219661 1683823 2693543 -910977 -6957243 -8167638 -4204069
36538 -4204069 -1960973 -3176625 -1562881 5425259 11321981 10862505 7338832 5663756
36530 5663756 5444102 5278996 7110672 11578237 14896219 14568589 12708883 10431352 5506448
36521 5506448 -892812 -2672021 1366002 3975728 1181293 -752697 2963250 5278472
$$ packed form
36580e48988l76153m314622m413650n64004K319617J471850K8961J435623L993832
36571i67534M381857K943034J322413j479132n641878o810551k118938L188919
36563e181810K359977k111265k346293K025165L760173L15799l024593l128835
36555g331682k925151l591982j842395K414685M269937K577180K142599M234626
36547e2183L804298l54678k177776M64162J009720l604520o046266j210395L963569
36538d204069K243096j215652J613744O988140N896722m59476l523673j675076
36530E663756k19654j65106J831676M467565L317982l27630j859706k277531m924904
36521E506448o399260j779209M038023K609726k794435j933990L715947K315222
$$ [...]
##END NTUPLES=NMR SPECTRUM
##END=
