##TITLE=31Pdec_SR19_rm2
 D2O, 24 sc
 2.10.2020
##JCAMPDX= 6.0         $$ Bruker NMR JCAMP-DX V2.0
##DATA TYPE= NMR SPECTRUM
##DATA CLASS= NTUPLES
##ORIGIN= UXNMR, Bruker Analytische Messtechnik GmbH
##OWNER= root
$$ XWIN-NMR		Version 3.5
$$ Fri Oct  2 12:56:36 2020 Russian Standard Time (UT+4h)  she@DPX200
##.OBSERVE FREQUENCY= 81.013821
##.OBSERVE NUCLEUS= ^31P
##.ACQUISITION MODE= SIMULTANEOUS
##.ACQUISITION SCHEME= undefined
##.AVERAGES= 24
##.DIGITISER RES= 17
##SPECTROMETER/DATA SYSTEM= spect
##.PULSE SEQUENCE= zgpg30
##.SOLVENT NAME= CDCl3
##.SHIFT REFERENCE= (INTERNAL, CDCl3, 0, 182.463)
##AUDIT TRAIL= $$ (NUMBER, WHEN, WHO, WHERE, WHAT)
$$ ##TITLE= Audit trail, XWIN-NMR		Version 3.5
$$ ##JCAMPDX= 5.01
$$ ##ORIGIN= Bruker BioSpin GmbH
$$ ##OWNER= she
$$ F:/spectra/data/she/nmr/P31/1/pdata/1/auditp.txt
$$ ##AUDIT TRAIL=  $$ (NUMBER, WHEN, WHO, WHERE, WHAT)
(   1,<2020-10-02 12:47:24.68 +0400>,<she>,<DPX200>,
      <created by zg, POWCHK disabled, PULCHK disabled
       configuration hash MD5:
       00 E9 B6 7A A2 85 ED C7 34 08 36 98 17 FE 4E 26
       data hash MD5: 32K
       49 83 6C 91 0A 38 06 A6 4B B2 22 71 DF 11 20 FB>)
(   2,<2020-10-02 12:55:43.98 +0400>,<she>,<DPX200>,
      <Start of raw data processing
       efp BC_mod = 2 LB = 1 FT_mod = 6 PKNL = 1 PHC0 = -2723.968 PHC1 = -31.39864 SI = 64K 
       data hash MD5: 64K
       2C A0 2F 90 64 95 3C E8 21 FA 9C FF AB 78 27 3D>)
(   3,<2020-10-02 12:56:06.04 +0400>,<she>,<DPX200>,
      <pk PHC0 = -80.87041 PHC1 = 192.8 
       data hash MD5: 64K
       FF D8 33 58 49 DF F2 41 70 5D 8F A3 54 94 18 27>)
$$ ##END=
$$ 
$$ hash MD5
$$ 11 FB FA DC 86 9D FF EF DD 9F 33 EE AB 7E FA 7E
##$RELAX= 
##$RELAX= 
##$RELAX= 
##$RELAX= 
##$RELAX= 
##$RELAX= 
##$RELAX= 
##$RELAX= 
$$ Bruker specific parameters
$$ --------------------------
##$DU= <F:/spectra>
##$EXPNO= 1
##$NAME= <P31>
##$PROCNO= 1
##$TYPE= <nmr>
##$USER= <she>
##$AMP= (0..31)
100 100 100 100 100 100 100 100 100 100 100 100 100 100 100 100 100 100 
100 100 100 100 100 100 100 100 100 100 100 100 100 100 
##$AQSEQ= 0
##$AQ_mod= 1
##$AUNM= <au_zg>
##$AUTOPOS= <>
##$BF1= 81.014009
##$BF2= 200.13
##$BF3= 200.13
##$BF4= 200.13
##$BF5= 200.13
##$BF6= 200.13
##$BF7= 200.13
##$BF8= 200.13
##$BYTORDA= 1
##$CFDGTYP= 0
##$CFRGTYP= 5
##$CHEMSTR= <none>
##$CNST= (0..31)
1 1 145 1 1 1 1 1 1 1 1 1 1 1 1 1 1 1 1 1 1 1 1 1 1 1 1 1 1 1 1 1 
##$CPDPRG= <waltz16>
##$CPDPRG1= <>
##$CPDPRG2= <waltz16>
##$CPDPRG3= <>
##$CPDPRG4= <mlev>
##$CPDPRG5= <mlev>
##$CPDPRG6= <mlev>
##$CPDPRG7= <mlev>
##$CPDPRG8= <mlev>
##$CPDPRGB= <>
##$CPDPRGT= <>
##$D= (0..31)
0 1 0 0 0 0 0 0 0 0 0 0.03 2e-05 3e-06 0 0 0 0 0 0 0 0 0 0 0 0 0 0 0 0 
0 0 
##$DATE= 1601628444
##$DBL= (0..7)
120 120 120 11 120 120 24 19 
##$DBP= (0..7)
150 150 150 150 150 150 150 150 
##$DBP07= 0
##$DBPNAM0= <>
##$DBPNAM1= <>
##$DBPNAM2= <>
##$DBPNAM3= <>
##$DBPNAM4= <>
##$DBPNAM5= <>
##$DBPNAM6= <>
##$DBPNAM7= <>
##$DBPOAL= (0..7)
0.5 0.5 0.5 0.5 0.5 0.5 0.5 0.5 
##$DBPOFFS= (0..7)
$$ [...]
##$SUBNAM2= <"">
##$SUBNAM3= <"">
##$SUBNAM4= <"">
##$SUBNAM5= <"">
##$SUBNAM6= <"">
##$SUBNAM7= <"">
##$SUBNAM8= <"">
##$SUBNAM9= <"">
##$SW= 369.568048894756
##$SWIBOX= (0..15)
0 1 3 0 0 0 0 0 0 0 0 0 0 0 0 0 
##$SW_h= 29940.119760479
##$TD= 32768
##$TD0= 1
##$TE= 0
##$TE2= 300
##$TE3= 300
##$TEG= 300
##$TL= (0..7)
0 120 53 12 22 120 120 120 
##$TP= (0..7)
150 150 150 150 150 150 150 150 
##$TP07= 0
##$TPNAME0= <>
##$TPNAME1= <>
##$TPNAME2= <>
##$TPNAME3= <>
##$TPNAME4= <>
##$TPNAME5= <>
##$TPNAME6= <>
##$TPNAME7= <>
##$TPOAL= (0..7)
0.5 0.5 0.5 0.5 0.5 0.5 0.5 0.5 
##$TPOFFS= (0..7)
0 0 0 0 0 0 0 0 
##$TUNHIN= 0
##$TUNHOUT= 0
##$TUNXOUT= 0
##$USERA1= <user>
##$USERA2= <user>
##$USERA3= <user>
##$USERA4= <user>
##$USERA5= <user>
##$V9= 5
##$VALIST= <valist>
##$VCLIST= <CCCCCCCCCCCCCCC>
##$VD= 0
##$VDLIST= <DDDDDDDDDDDDDDD>
##$VPLIST= <PPPPPPPPPPPPPPP>
##$VTLIST= <TTTTTTTTTTTTTTT>
##$WBST= 1024
##$WBSW= 4
##$XGAIN= (0..3)
0 0 0 0 
##$XL= 0
##$YL= 0
##$YMAX_a= 6886
##$YMIN_a= -7090
##$ZGOPTNS= <>
##$ZL1= 120
##$ZL2= 120
##$ZL3= 120
##$ZL4= 120
##$ABSF1= 0
##$ABSF2= 0
##$ABSG= 0
##$ABSL= 0
##$ALPHA= 0
##$AQORDER= 0
##$ASSFAC= 0
##$ASSFACI= 0
##$ASSFACX= 0
##$ASSWID= 0
##$AUNMP= <proc_1d>
##$AZFE= 0.1
##$AZFW= 0.5
##$BCFW= 0
##$BC_mod= 2
##$BYTORDP= 0
##$COROFFS= 0
##$CY= -3
##$DATMOD= 1
##$DC= 0
##$DFILT= <>
##$DTYPP= 0
##$F1P= 0
##$F2P= 0
##$FCOR= 1
##$FTSIZE= 65536
##$FT_mod= 6
##$GAMMA= 0
##$GB= 0
##$INTBC= 1
##$INTSCL= 5.30512e-09
##$ISEN= 30
##$LB= 1
##$LEV0= 0
##$LPBIN= 0
##$MAXI= 10000
##$MC2= 0
##$MEAN= 0
##$ME_mod= 0
##$MI= 50
##$NCOEF= 0
##$NC_proc= -7
##$NLEV= 6
##$NOISF1= 182.463
##$NOISF2= 159.3651
##$NSP= 0
##$NTH_PI= 0
##$NZP= 0
##$OFFSET= 182.463
##$PC= 4
##$PHC0= -2804.838
##$PHC1= 161.4014
##$PH_mod= 1
##$PKNL= yes
##$PPARMOD= 0
##$PSCAL= 0
##$PSIGN= 0
##$REVERSE= no
##$SF= 81.0140089999434
##$SI= 65536
##$SIGF1= 159.3651
##$SIGF2= -187.1042
##$SINO= 113.3802
##$SIOLD= 16384
##$SREGLST= <1H.CDCl3>
##$SSB= 0
##$STSI= 65536
##$STSR= 0
##$SW_p= 29940.119760479
##$SYMM= 0
##$S_DEV= 0
##$TDeff= 32768
##$TDoff= 0
##$TI= <>
##$TILT= no
##$TM1= 0
##$TM2= 0
##$TOPLEV= 0
##$USERP1= <user>
##$USERP2= <user>
##$USERP3= <user>
##$USERP4= <user>
##$USERP5= <user>
##$WDW= 1
##$XDIM= 65536
##$YMAX_p= 297339575
##$YMIN_p= -54806281
$$ End of Bruker specific parameters
$$ ---------------------------------
##NTUPLES= NMR SPECTRUM
##VAR_NAME=  FREQUENCY,     SPECTRUM/REAL,   SPECTRUM/IMAG
##SYMBOL=    X,             R,               I
##VAR_TYPE=  INDEPENDENT,   DEPENDENT,       DEPENDENT
##VAR_FORM=  AFFN,          ASDF,            ASDF
##VAR_DIM=   65536,         65536,           65536
##UNITS=     HZ,            ARBITRARY UNITS, ARBITRARY UNITS
##FACTOR=    0.456856943014862, 1,           1
##FIRST=     14782.0589164792, 0,            0
##LAST=      -15158.0608439998, 0,           0
##MIN=       -15158.0608439998, -54806281,   0
##MAX=       14782.0589164792, 297339575,    0
$$ Real data points
##PAGE= N=1
##DATA TABLE= (X++(R..R)), XYDATA
$$ [...]
41652F77670m84672o69743Q72785N55237p79902Q6912K280447J674741k003339
41643B210136m071856k174551L9859j004990l139597k406971M35993J668857Q58377
41634g584743P47412J835429J755236J35190m39906P08327P53128j554131k940684
41625f584742m40665L622055M603607J838905r98021j056212P09315J599878L67071
41616C661191j861011k869790j614533M65617J016994k40358j401793j443979
41608d287662j351375j431572q4122K979353M729411K729345p16179j422609Q09972
41599A954562K496049J979926J002801N82344q50025l759122n180881k575657
41591d350003J900837L631908J314769j780679k334833p96077J49867m28254q82855
$$ y = [677670, 192998, -476745, 396040, 951277, 171375, 258287, 2538734, 4213475, 2210136, -1861720, -4036271, -3996412, -5001402, -8140999, -10547970, -10111977, -8443120, -7584743, -6837331, -5001902, -3246666, -3111476, -3551382, -2843055, -2089927, -3644058, -6584742, -7025407, -3403352, 1200255, 3039160, 2041139, 984927, 1694242, 3294120, 3661191, 1800180, -1069610, -2684143, -2218526, -1201532, -1441890, -2843683, -4287662, -5639037, -7070609, -7154731, -4175378, 554033, 3283378, 2567199, 1144590, 1954562, 4450611, 6430537, 7433338, 8015682, 7165657, 3406535, -1774346, -4350003, -2449166, 1182742, 2497511, 716832, -1618001, -2414078, -2264211, -2692465, -3575320]
41582c575320N771J040650P74862K35098J262777K803704J907689j138503k206826
41573A109902L92495K584914O64622k347758j142629K983475L430751j501425
41565F174347n592636l804301O78743J836164n87216k077859o96379J013051Q78100
41556b177986O360J08177O01462k19811k378071l774141k476472Q74044L236539
41547f199899K236029j059105l277234k646371n61812R33625J678312K590355
41539f306100L605860L556221J589011j777308m512512m237801q01576K557702
41531f326503K485323r4391j186751M90376J950657J054809k94171n2041K54816
41522a717876j227326k555358j015233J665961J521467j163416k073255L46367
$$ y = [-3575320, -3569549, -2528899, -1754037, -1518939, -256162, 2547542, 4455231, 3316728, 1109902, 1502397, 4087311, 4751933, 2404175, 1261546, 4245021, 7675772, 6174347, 581711, -3222590, -2543847, -707683, -1294899, -3372758, -4069137, -3056086, -2177986, -2171626, -2063449, -1461987, -1681798, -4059869, -7834010, -10310482, -9436438, -6199899, -3963870, -5022975, -8300209, -10946580, -11508392, -10574767, -8896455, -6306100, -2700240, 855981, 2444992, 667684, -3844828, -8082629, -8884205, -6326503, -3841180, -3935571, -5122322, -4631946, -2681289, -1626480, -1920651, -1972692, -1717876, -2945202, -5500560, -6515793, -4849832, -3328365, -4491781, -6565036, -6218669]
41514f218669K670107K068161J56681n36012o01945j693768k832448j765240J131140
41505g621993L030999K518282J092289N39041N77788O594r53374q52984N46912
41496a116446J355190o6692k550577l325512j653655L15195P18936K82847M29689
41487e611025P66191J84362o75691j25122J874234L565148L797420K966023J643782
41478H385322j40097k080482l319076l248290j910760O9593J281127K44965k379448
41469c097146l443956j060138K262607K624089K35561r96457N97770K129760P64844
41460A6934k164450l371049j887122O97703K731340L403470K311162M960j641931
41451A01017j226841L23946R51461J63210p47683r26134r06410j105888q39145
$$ y = [-6218669, -3548562, -1480401, -1323720, -1859732, -2461677, -4155445, -6987893, -8753133, -7621993, -4590994, -2072712, -980423, -441382, 136406, 143000, -810374, -1663358, -1116446, 238744, 172052, -2378525, -5704037, -7357692, -7042497, -6323561, -6040714, -5611025, -4844834, -4660472, -5336163, -5461285, -3587051, -21903, 3775517, 6741540, 8385322, 8245225, 6164743, 2845667, -402623, -2313383, -2243790, -962663, -717698, -3097146, -6541102, -7601240, -5338633, -2714544, -2478983, -3475440, -2877670, -747910, 16934, -2147516, -5518565, -7405687, -6707984, -3976644, -573174, 1737988, 1742948, 101017, -1125824, -801878, 149583, 312793, -434890, -1361024, -2267434, -3373322, -4212467]
41442d212467K35703P47005p26296k842611k291643J661676N112459L950670n98012
41433A036484l376113k010238O34362J224487Q8807q39729j268666j553886r40769
41424g005261O98240J506573N76660K0624J312668K112962L15519j343773O00652
41415a205136L734177K939290r83173k243832L47987J464407j615763m531004
41407b093047l300735l95861L88692N9387J004238J651368m64705l299606k953170
41398i403439J80069K359305K167845J203595L30716q00661j258755M19189L169162
41389a632974M095493K144337j094730l612500m064977j922374J204668J900120
41381b982937p91465k996151q73265L634340N308841K806216l69841j477652j389173
$$ y = [-4212467, -3976764, -3229759, -3956055, -6798666, -9090309, -7428633, -2316174, 1634496, 1036484, -2339629, -4349867, -3715505, -2491018, -2402211, -3241940, -4510606, -6064492, -7005261, -6307021, -4800448, -4223788, -4203164, -2890496, -777534, -462015, -1805788, -1205136, 2529041, 5468331, 4485158, 2241326, 2589313, 4053720, 2437957, -2093047, -5393782, -5789643, -5400951, -5341564, -4337326, -2685958, -3150663, -6450269, -9403439, -9223370, -6864065, -4696220, -3492625, -3161909, -3962570, -5221325, -4802136, -1632974, 2462519, 4606856, 3512126, -100374, -4165351, -6087725, -4883057, -2982937, -3774402, -6770553, -7643818, -4009478, 1299363, 4105579, 3735738, 2258086, 868913]
41372H68913j653795k023432j721228r07010k38567l15747j320900k109494q25450
41363a0246710K194305L953222K998415J625947J561585P36454k013644k741340
41355a931766J561993N704216K398381n649632q006363j661494M447494K959921
41347a77250j671413j498930K665362L998869Q37215j952447j409804k3458l25942
41338D42202q72380N68846K906247L094907M82143k020073j481553J097016J674726
41329E892081j475540m909880m316638l73805K420232K010017N66352J60565L07589
41320B80973L40884O20883N18241j221280l199910k392795M49197R50818j627235
41311e280224k404931J003148L736690J416933k200513j128157K848421K856459
$$ y = [868913, -784882, -2808314, -4529542, -5436552, -5675119, -5990866, -7311766, -9421260, -10246710, -8052405, -4099183, -1100768, 525179, 2086764, 2823218, 809574, -1931766, -369773, 5334443, 7732824, 2083192, -5923171, -7584665, -3137171, -177250, -1848663, -3347593, -682231, 3316638, 4153853, 2201406, 791602, 768144, 442202, -430178, 138668, 3044915, 6139822, 6621965, 4601892, 3120339, 4217355, 5892081, 4416541, -493339, -4809977, -5183782, -2763550, -753533, -187181, -26616, 280973, 621857, 1242740, 1760981, 539701, -2660209, -5053004, -4603807, -3652989, -5280224, -7685155, -6682007, -2945317, -1528384, -3728897, -4857054, -2008633, 847826]
41303H47826k099858n671322l668119R32774L503163L305651J982003N56295k43060
41294e54647L14931J411794J126400o64981j996776j857731j176598n04404O33691
41285c268321J641337R24028j135984j939551m67756J072994O01143r44598j351647
41276d868355j07730J505912K017285P86055j330418k105248k77261K181327K025750
41267a72683q73894l183907k452861K79930K487960K571057J47110l440755m689401
41258i327444j188350M010454M866267N48332k726475m01155L736792L255828
41250B774249j522474m453872k384005J645856L748176L493457K192382M69882
41242E963651j086682j459443p50769l52272o76208n62303K92250L86720r59591
$$ y = [847826, -1252032, -6923354, -10591473, -9658699, -6155536, -2849885, -867882, -311587, -554647, -239716, 1172078, 2298478, 1633497, -363279, -2221010, -3397608, -3902012, -3268321, -1626984, -702956, -1838940, -3778491, -4246247, -3173253, -2572110, -3516708, -4868355, -4976085, -3470173, -1452888, -666833, -1997251, -4102499, -4379760, -2198433, -172683, -1046577, -4230484, -6683345, -6403415, -3915455, -1344398, -1197288, -4638043, -9327444, -10515794, -6505340, -1639073, -1090741, -3817216, -4218371, -481579, 2774249, 1251775, -3202097, -5586102, -3940246, -192070, 3301387, 5493769, 5963651, 4876969, 3417526, 2666757, 2314485, 1638277, 1075974, 1368224, 1754944, 795353]
41233G95353j993907j096088N91005Q56960l43431j139502n34040P61837J881307
41224b20506K547673K372475R42604j166876k674781l121468l051526k558236
41216f930641r98764J311722K469095J187490j098966j597087M95749K959259
41208b202143L096353P77769j391560q90916J893176L994950L253687P92013p32743
41199H590586p84126j171188k576731l135066j652885j36033r36614k789619k352611
41190f944287Q98872L987717M581543L206799J025532j821600m602469n212126
41182d880019k787004M28399J460832n2776j960693k085792J33554L333821M854274
41173a555404K976002p73228k952314k376929j122502p36418K2654K182714L878040
$$ y = [795353, -1198554, -2294642, -1703637, -846677, -1190108, -2329610, -2863650, -2101813, -220506, 2327167, 4699642, 5642246, 4475370, 1800589, -1320879, -4372405, -6930641, -7929405, -6617683, -4148588, -2961098, -4060064, -5657151, -5161402, -2202143, 894210, 1671979, 280419, -610497, 1282679, 5277629, 8531316, 9323329, 8590586, 7806460, 6635272, 4058541, 923475, -729410, -865443, -1802057, -4591676, -6944287, -6045415, -2057698, 2523845, 5730644, 6756176, 4934576, 332107, -4880019, -7667023, -7238624, -5777792, -5830568, -7791261, -9877053, -9743499, -6409678, -1555404, 1420598, 647370, -2304944, -4681873, -5804375, -6540793, -6518139, -4335425, -457385]
41164d57385L095473J190157Q92474K020498J888666o72745m019901n886096m996620
41155f945479j418393K687375L795981Q94713k395117k154309M56682J255365
41147c823182m01362r92738J086520K852936J567879j021707j454492N47198K194911
41138E55963J622447m0489m15601J200886K879153K249439k89611j708611m87675
41129E565901J029097J31940k121846k901710k299116k566696l424556k178778
41121h765764J195765L155435K000927N52096J511598L207636K419784o26612
41113D650865k600377j440642J385343K649773O64458k798713m097346k035608
41105c622247M34679M52463m35675Q45322L187190K758748l88547k151986j224493
$$ y = [-457385, 2638088, 3828245, 4720719, 6741217, 8629883, 7957138, 3937237, -1948859, -6945479, -8363872, -5676497, -1880516, -985803, -3380920, -5535229, -5078547, -3823182, -4224544, -5217282, -4130762, -1277826, 290053, -731654, -2186146, -1638948, 555963, 2178410, 2137921, 1722320, 2923206, 5802359, 8051798, 7762187, 6053576, 5565901, 6594998, 6726938, 4605092, 1703382, -595734, -3162430, -6586986, -8765764, -7569999, -4414564, -2413637, -1861541, -349943, 2857693, 5277477, 4650865, 2050488, 609846, 1995189, 4644962, 5309420, 2510707, -1586639, -3622247, -3187568, -2735105, -3170780, -2325458, 861732, 3620480, 3231933, 1079947, -144546]
41096a44546q17957k251550k378381J70805J614447n74700k757138r58474K512921
41087e584573L125141J397430Q96329J584236O70134j496383j698829O09664K546048
41078B049197K220959K69680k209079l793519k268543K040135M104196P1997n965550
41069c480527o372074n07455M696817M717259K117214L33460j170528l215869
41061b881703l684280j359754R25789M14352j226228p90005J577598L265876L132908
41052f25447K032277R35267O01102J576278K717725J521682k107501m343769k170983
41043A36631J902996K705643q13496m446146m295734r91740K182601L285128K693164
41034B359047J475268L71934o73N38103Q75258n49890l103600l608359n37459
$$ y = [-144546, -962503, -3214053, -5592434, -5421629, -3807182, -4381882, -7139020, -8097494, -5584573, -2459432, -1062002, -165673, 1418563, 2088697, 592314, -1106515, -496851, 2049197, 4270156, 4539836, 2330757, -1462762, -3731305, -1691170, 2413026, 2485023, -3480527, -9852601, -10360056, -5663239, -945980, 1171234, 1504694, 334166, -2881703, -6565983, -7925737, -6999948, -6585596, -7811824, -8601829, -7024231, -3758355, -625447, 1406830, 2342097, 2943199, 4519477, 7237202, 8758884, 6651383, 2307614, 136631, 2039627, 4745270, 3931774, -514372, -4810106, -5801846, -3619245, -334117, 2359047, 3834315, 4206249, 4205576, 4743679, 5618937, 5069047, 1965447, -1642912, -2180371]
41025b180371K637600J371618l034601m456008p86879K805333J880280o74088
41017b437116r9093K293841K167207J09974N7000J545326N87054k285397k207826
41008b69030J074417J880740j725647m045567r14724L522385L524887P2155k177634
40999I41982k028354j186479l8576J492221J717907r4815j384913k52584J176458
40990C42847P99390M34661J733191K105245l94646j975484J100993M869910K790239
40981A1806346l505301o016646k282510J771859J387711j336790k617738j899122
40973b692191M3955K623368L501594K43458m548555m952242l24286L243574K210183
40964f51142M44932J594147K585240l26661l986630l005331J188430K444822m96328
$$ y = [-2180371, 457229, 1828847, -1205754, -5661762, -6448641, -3643308, -1763028, -2437116, -2536209, -242368, 1924839, 2034813, 2091813, 3637139, 4224193, 1938796, -269030, 805387, 2686127, 960480, -3085087, -3999811, -477426, 3047461, 3119616, 941982, -1086372, -2272851, -2311427, -819206, 898701, 803886, -581027, -833611, 342847, 1142237, 1576898, 3310089, 5415334, 5020688, 3045204, 4146197, 9016107, 11806346, 8301045, 2284399, 1889, 1773748, 3161459, 1824669, -793069, -2692191, -2648236, -24868, 3476726, 3720184, -828371, -5780613, -6104899, -2861325, -651142, -206210, 1387937, 3973177, 3646516, -340114, -3345445, -2157015, 287807, -208521]
40955b08521k747330j507407J96451p23658k618501k355779j49779J386531J144144
40946g583849K69887j3236M24632J294287K440272L550590L976297L206819J476588
40937I042287k99300j368090j760979j787718j281023j04971Q31334K56150j569852
40928A957838k811680k320555q17456N98503J758230K485679J835272l47181k122523
40919B16127j374761J357213L394015L136485J501765J13568o29826j176585j547015
40910D990986j414674j096377j405453k207998k005140J03906K494066K508367
40902A967683J41310j425970l8065K207265J802134j084152k771834j214227J449527
40893A033671K163086P42445p73616j095182o19304j83074p0306l1952L19982
$$ y = [-208521, -2955851, -4463258, -4266807, -4990465, -7608966, -9964745, -10114524, -8727993, -7583849, -7313962, -7327198, -6902566, -5608279, -3168007, 382583, 4358880, 7565699, 9042287, 8742987, 7374897, 5613918, 3826200, 2545177, 2440206, 3271540, 3527690, 1957838, -853842, -3174397, -3991853, -3393350, -1635120, 850559, 2685831, 2338650, 216127, -1158634, 198579, 3592594, 6729079, 8230844, 8344412, 7714586, 6538001, 4990986, 3576312, 2479935, 1074482, -1133516, -3138656, -3034750, -540684, 1967683, 2108993, 683023, 644958, 2852223, 4654357, 3570205, 798371, -415856, 1033671, 3196757, 3939202, 3165586, 2070404, 1451100, 1268026, 1197720, 1165768, 1485750]
40884A485750R93385J393455J010800J93478m02541q59557j587326k149450j650149
40875a572155j42099J506818K869431L708111K896339m02372m363998n474463
40867i74388k676844J094549K372785Q20021j286320j982181j234832m35967p00667
40858e003844j243324n0725K848522M135866J424630k487179k847992J54123J723776
40849a346147o4819j645140k62510J609015Q79993r16592n54466J405227J753558
40840H58119l73061k768127l264268j246805K431450N016267L419216j455438
40832B617353m304973k043011J726248K042838k98518j042787M37689J215732
40824C50571N64917N49498J353917Q84927q43264j378265k41591M56461J50117
$$ y = [1485750, 2479135, 3872590, 4883390, 5076868, 4674327, 3814770, 2227444, 77994, -1572155, -1714254, -207436, 2661995, 6370106, 9266445, 8864073, 4500075, -974388, -3651232, -2556683, -183898, 636123, -650197, -2632378, -3867210, -4303177, -5003844, -6247168, -6297893, -3449371, 686495, 2111125, -376054, -3224046, -3069923, -1346147, -1410966, -3056106, -3318616, -1709601, -829608, -1746200, -2300666, -895439, 858119, 485058, -2283069, -5547337, -6794142, -4362692, 653575, 4072791, 2617353, -1687620, -3730631, -2004383, 38455, -260063, -1302850, -865161, 350571, 915488, 1464986, 2818903, 3703830, 2860566, 1482301, 1240710, 1697171, 1847288]
40815A847288M43877J209975L59808j763664k090582M565J425326M81915q83909
40806A034599j347889k222768l435756k169038J854343M161361J945621j237198
40798a416725r98870J151661J022243j077221j325297R28481K279713P60400j762906
40789d38521k871057k102699J1293K645144M102839K952853K14497j416521q41410
40780B256418L78499L01033j265999k823338k485640K74596L398227L705028N98640
40771D337464k782016l197827q44300J823526L118853K515072o7792l250490m085910
40762b433420j411375J835835J980745o99441k821755k379609j98523J979106
40754d148437K661080J061695j400908j539224J304146L303021J422047j573952
$$ y = [1847288, 2291165, 3501140, 3860948, 2097284, 6702, 11267, 1436593, 1918508, 1034599, -313290, -2536058, -5971814, -8140852, -6286509, -2125148, -179527, -1416725, -2415595, -1263934, -241691, -1318912, -2644209, -1715728, 563985, 1324385, -438521, -3309578, -5412277, -5400984, -2755840, 1346999, 4299852, 4514349, 3097828, 2256418, 2634917, 2935950, 1669951, -1153387, -3639027, -3364431, 33796, 3738824, 4337464, 1555448, -1642379, -2486679, -663153, 2455700, 4970772, 4902980, 1652490, -2433420, -3844795, -2008960, -28215, -727656, -3549411, -5929020, -6127543, -4148437, -1487357, -425662, -1826570, -3365794, -2061648, 1241373, 2663420, 1089468]
40746A089468j276706J257679J503913q05437j725447n15024p18967k985451l261698
40737g437670k91670J405455n57177j521344K397934O691602M867977j035362
40729D519745l302940j81576K431709R86831q95404M39143K560980J562758j275694
40720F845552j742000N27743J726730k00015k879144l335925j748746r8803R35290
40711C0682J867882K311014J233422p50031j493258m49819K28737r68665k285789
40702b75825j471319L18340K80822j188345j007021J026219J172165k134860m843434
40693h123258k894152J515135L012112P91796p80509J027669L773503L974983
40685B297279J744596k70577n91909P1245M19363o8172q39831p49231O25637J938816
$$ y = [1089468, -187238, 1070441, 2574354, 1768917, 43470, -471554, -1190521, -4175972, -7437670, -7729340, -6323885, -6881062, -8402406, -6004472, 687130, 5555107, 4519745, 1216805, 1035229, 3466938, 4453769, 3558365, 3997508, 6558488, 8121246, 6845552, 5103552, 5631295, 7358025, 7158010, 4278866, 942941, -805805, -904608, 30682, 1898564, 4209578, 5443000, 4692969, 3199711, 2749892, 2978629, 2009964, -275825, -1747144, -1428804, -1147982, -2336327, -3343348, -2317129, -1144964, -3279824, -8123258, -11017410, -9502275, -6490163, -5698367, -6478876, -5451207, -1677704, 2297279, 4041875, 3771298, 3179389, 3250634, 3669997, 3601825, 2761994, 2012763, 2638400, 4577216]
40675D577216J244452j426095l533686k661086Q05630L984273M220359J533938
40667H745001j328540j601436L37359J263420o45981l046318k628070o5498R57698
40658A987635n24694j383999J84031J331951p95504l870534l550318k41259J647431
40649e215260Q63082R51974L549799M809841J601149k593374k488591P61627J552204
40640C792451r04531j437253J912407L783152o8508n324429n164989l62389K594247
40631a179842J644388R53702K585464K977021j20415k831999j074961K666817
40623E620175K891169r16001m152808l942699k136470j392265j497315o01447
40615f127661J806202M203220M618561K641193J06463p07925J64162M78541r16538
$$ y = [4577216, 5821668, 4395573, 861887, -1799199, -993569, 2990704, 7211063, 8745001, 7416461, 5815025, 6152384, 7415804, 6769823, 3723505, 1095435, 1029937, 1987635, 1462941, 78942, 262973, 1594924, 799420, -3071114, -6621432, -6862691, -5215260, -4352178, -3400204, 149595, 4959436, 6560585, 3967211, 1478620, 2240247, 3792451, 2887920, 1450667, 3363074, 7146226, 7077718, 1753289, -3411700, -3774089, -1179842, 464546, 1418248, 4003712, 6980733, 6860318, 4028319, 2953358, 5620175, 8511344, 7595343, 3442535, -500164, -2636634, -4028899, -5526214, -6127661, -4321459, -118239, 4500322, 7141515, 7247978, 6540053, 6704215, 7182756, 6266218]
40606F266218k434056k348521j345937j028465j376525j396684j064540r44799
40598e673309r41811q51943r20570o63207J015047L117050K510743j224123l719700
40589g351823j690062J898001K515872J254350K061875L841171J980872k593025
40581A917231l230210J850218N680887K736897k862362m063120j201333N9626
40573H87834j769235k636697k97250K318114J932889o02546k050739q48115J616227
40564a449518K718667J289085r66952j377607N290L04824j624697k856171o75513
40555d632592K904614L833526J767126j52322m09796m90668j255102j472913p02893
40546f11020n05058j489176j771492k8608K006752J993918L55581q12229j051927
$$ y = [6266218, 3832162, 1483641, 137704, -890761, -2267286, -3663970, -4728510, -5673309, -6615120, -7467063, -8387633, -9050840, -8035793, -4918743, -2408000, -3632123, -7351823, -9041885, -7143884, -4628012, -3373662, -1311787, 2529384, 4510256, 1917231, -1312979, 537239, 6218126, 8955023, 6092661, 2029541, 828208, 887834, -881401, -3518098, -3815348, -1497234, 435655, -166891, -2217630, -3065745, -1449518, 1269149, 2558234, 1591282, 213675, 218965, 523789, -1100908, -3957079, -4632592, -1727978, 2105548, 3872674, 3720352, 3310556, 2819888, 1564786, 91873, -611020, -1116078, -2605254, -4376746, -4405354, -2398602, -404684, -49103, -861332, -1913259]
40537a913259j494848k033475j081733J329758K524731Q08565j442631o20884
40529c923776K762002M272803J697000j695865j741881R81294K672033J875374
40521F898984L46682q19009k268345l473479k452637M98340K071448N44310j693352
40512c47058j960064j001467q44571j247683n98195J299364L223858L906695K295298
40503D726177j453172m337291k914326J333781K851217K33607j099105K117073
40495A457961M518446L00024o355703o526151K0472M713635L080927l01192r22151
40486a3732n77964j603888j743726R37015L273001J828137j305001j952538j40197
40477a298893J190022J277592J356412J310611L55471l65558O08553J950655J274088
$$ y = [-1913259, -3408107, -5441582, -6523315, -5193557, -2668826, -1860261, -3302892, -3923776, -1161774, 3111029, 4808029, 3112164, 1370283, 2351577, 5023610, 6898984, 7245666, 6426657, 4158312, 684833, -1767804, -1269464, 801984, 1346294, -347058, -2307122, -3308589, -4153160, -5400843, -5999038, -4699674, -1475816, 2430879, 4726177, 3273005, -1064286, -3978612, -2644831, 206386, 439993, -659112, 1457961, 5976407, 6276431, -79272, -6605423, -6584951, -1871316, 1209611, 908419, -13732, -591696, -2195584, -3939310, -3002295, 270706, 2098843, 793842, -1158696, -1298893, -108871, 1168721, 2525133, 3835744, 4191215, 3825657, 4434210, 6384865, 7658953]
40468G658953r48868k181753j705889q50772j47681P96128J161964k60356k219640
40459A302086j951387N91302K105454M44441k335354k650750K16171L570879M525194
40450E818036K895675R09968L55775M86746o02031k815329l775739k229529j21367
40441I22205j6014j709421k971470k735192j791077q69387Q8179Q00227N56779
40432g725171l03939k64322J212612K405337J397410r49967j511974J052881M037071
40423f50062L967637J379778o5540P51915Q32009j515397l213134j384101J328036
40414A431141P45055j783095j597434J240426K140594O3834j048083Q1205k42460
40405A031183l039644l516925O70655M321329K766979n33649k36385K010919J585612
$$ y = [7658953, 6710085, 4528332, 2822443, 1971671, 1823990, 2620118, 3782082, 3521726, 1302086, -649301, -57999, 2047455, 2491896, 156542, -2494208, -2278037, 1292842, 5818036, 8713711, 9623679, 9979454, 10466200, 9864169, 7048840, 3273101, 1043572, 922205, 906191, -803230, -3774700, -6509892, -8300969, -9170356, -9082177, -8281950, -7725171, -8029110, -8293432, -7080820, -4675483, -3278073, -4228040, -5740014, -4687133, -650062, 3317575, 4697353, 4631813, 5383728, 6215737, 4700340, 1487206, 103105, 1431141, 2176196, 393101, -1204333, 36093, 2176687, 2240521, 1192438, 1273643, 1031183, -2008461, -5525386, -4854731, -533402, 2233577, 1699928, 1463543, 3474462, 5060074]
40396E060074l53523L43460K256055P46839k767485k281639K269293M175110P84481
40387A0232665k545465j597637O17595J43772j611707j747447j145305j764741
40379E81730k478122j526942q5193J90794M70436K166203L438614J844700j268193
40370C334027k429865j015429M69815M39161j15400J2179K67134o37312k487695
40361b163385l025302l72011L714696M679518Q90242l359180l375086p09818j69812
40352c890138j718861j033408K117645K707143p57085k898717q8168L602033L257029
40343A297473O74595J29678J118861Q56103K83991J653413K935032O96922l445379
40334F200689n048105l840417k829336k078064M42933L033500K045716q89152
$$ y = [5060074, 4706551, 5050011, 7306066, 8052905, 5285420, 3003781, 5273074, 9448184, 10232665, 7687200, 6089563, 6707158, 6850930, 5239223, 3491776, 2346471, 581730, -1896392, -3423334, -3508527, -3317733, -2847297, -681094, 2757520, 4602220, 3334027, 904162, -111267, 358548, 797709, 682309, 694488, 961622, 324310, -2163385, -5188687, -5560698, -1846002, 2833516, 3723758, 364578, -3010508, -3720326, -3890138, -5608999, -6642407, -4524762, -1817619, -2574704, -5473421, -5561589, -1959556, 1297473, 1972068, 2101746, 3220607, 4076710, 4360701, 6014114, 8949146, 9646068, 6200689, 1152584, -2687833, -5517169, -7595233, -7152300, -4118800, -2073084, -2962236]
40326b962236m03105L336593M066147k60876l710070j842305J562836J328927
40318A115911j107019j393913L11095Q42649p3386m51061m35014j362617k046169
40309d599524n01696J758079J540698o42861j302417K57379J206566M42387K52389
40300a589000J781250K882423K087819J076015J105440L51941k458006m649944
40292E87938l278953j25610Q21856m44395n11165J195112J418330q38659k001825
40283c177371K1867J797752k2968k580242j158851K622923K786213j438455m108821
40274e257953j781143J545456J306657q89154j198103n8625o8063l68258J569069
40265e200117M276055L751943L7724k584564k033203n14556J60217P35876J168884
$$ y = [-2962236, -3365341, -28748, 4037399, 3776523, 66453, -1775852, -213016, 1115911, 8892, -1385021, -1073926, -231277, -304663, -755724, -1190738, -2553355, -4599524, -5101220, -3343141, -1802443, -2445304, -3747721, -3490342, -2283776, -1841389, -1589000, 192250, 3074673, 5162492, 6238507, 7343947, 7695888, 5237882, 587938, -2691015, -2816625, -1994769, -2439164, -2950329, -1755217, -336887, -1175546, -3177371, -3155504, -1357752, -1380720, -3960962, -5119813, -2496890, 289323, -1149132, -5257953, -7039096, -5493640, -4186983, -5076137, -6274240, -6332865, -6400928, -6769186, -5200117, -924062, 2827881, 2865605, 281041, -1752162, -2266718, -2106501, -1370625, -201741]
40256b01741j81800k472588k035653J620985L752781J264360k256245k051479
40248b561380O45293J362393k98260j142755o60630j389515l185634k513319J300871
40239h442936L877698K203404o34832k75465K241557K452423m03743k285560m62121
40230a729575K669603L097420K89059k732634l140632q56592J874791K528263
40222A999703N56466j756823j570429Q13018J935822j338k127770j008764J696641
40213E36526J242044k775833n199256k886284O18815Q82778n22082O51611L426208
40204d025473K722251j794694l844373L50615N814972N412620k86945m100587
40196B48386k040968K246773L417417J234484n87169k14466N04065j52295q69379
$$ y = [-201741, -383541, -2856129, -4891782, -3270797, 481984, 1746344, -509901, -2561380, -1916087, -553694, -851954, -1994709, -2655339, -4044854, -7230488, -9743807, -8442936, -4565238, -2361834, -2996666, -3272131, -1030574, 1421849, 1018106, -1267454, -1729575, 940028, 4037448, 4326507, 1593873, -1546759, -2403351, -528560, 1999703, 2556169, 799346, -771083, 41935, 1977757, 1976419, -151351, -1160115, 536526, 1778570, -997263, -6196519, -9082803, -8463988, -7581210, -8103292, -7451681, -4025473, -1303222, -3097916, -6942289, -6591674, -776702, 4635918, 4348973, 248386, -1792582, 454191, 3871608, 5106092, 4518923, 4304457, 4808522, 4656227, 3786848]
40187C786848K61964K029853J449884j354086k631061o50050J031124j271090
40179B653386n057133m549281O85879M463282K402344k277158l582010l81437
40171e642128L529616M892186L517381O47059k151763k839180m61621K694291
40163D185841K703728j254250n184865m562220K66816M246880L462380k91756
40155C572554k082373m35168J038995n74103k982860k546888k07087M43922m76824
40146d249832K88356K579071K530952k37836j242521Q54633J204305k526617m801626
40137e601115j174771L160251J270539l511535k560666L552264N615265P36399
40129A486631l411903j531435J664868R19921r98182j0248J144029j398477m218135
$$ y = [3786848, 4048812, 6078665, 7528549, 6174463, 3543402, 2893352, 3924476, 2653386, -2403747, -6953028, -6267149, -1803867, 598477, -1678681, -5260691, -5642128, -2112512, 2779674, 6297055, 6944114, 4792351, 1953171, 1491550, 4185841, 6889569, 5635319, 450454, -4111766, -3844950, 401930, 3864310, 3572554, 1490181, 1055013, 2094008, 1519905, -1462955, -4009843, -4216930, -3773008, -4249832, -3961476, -1382405, 1148547, 910711, -331810, 522823, 1727128, -799489, -5601115, -6775886, -3615635, -2345096, -5856631, -8417297, -4865033, 750232, 1486631, -1925272, -3456707, -1791839, -871918, -1870100, -1880348, -736319, -2134796, -6352931]
40120f352931j769437L571998M566359L82593k744910j565476N84687P68720N04631
40111b053766J230136J297522k56305j446029j114064j086475k305222k387549
40103h121752M02934L742543M430453K630182O15153n79399j102489r22526n41949
40094E53150j083232j883551m66439L004562M196809N83697l827130l756921n06247
40085c185302K69562k513892m022069j336066K534223L898109L072664J727213
40077D44442k90195k631455k582004Q87971L942486K702197p05527j161927J520619
40068B126607K279466j436710n831664o019316j934942K617180M426483K860495
40060i12401n90027l142943k593481K82168K349044J962014O86291L93641O03201
$$ y = [-6352931, -8122368, -4550370, 15989, 398582, -2346328, -3911804, -3327117, -2558397, -2053766, -823630, 473892, 217587, -1228442, -2342506, -3428981, -5734203, -8121752, -7718818, -3976275, 454178, 3084360, 3699513, 3120114, 2017625, 1095099, 553150, -530082, -2413633, -2880072, 124490, 4321299, 4904996, 1077866, -2679055, -3185302, -2915740, -5429632, -9451701, -10787767, -8253544, -4355435, -1282771, 444442, 154247, -2477208, -5059212, -4171241, -228755, 2473442, 1767915, 605988, 2126607, 4406073, 2969363, -2862301, -8881617, -10816559, -8199379, -3772896, -912401, -1502428, -4645371, -7238852, -6956684, -4607640, -2645626, -1959335, -1565694, -962493]
40051i62493M0629r92866j468920j329662p68223N90604K171398K022199m0674
40042g38008j003764Q29603K071376j042808n706059n399331L51913M546649K617918
40033c472511j382571j546023J379691K625533J431041J124696K459197K249040
40025D868093p59085l176753j939049J237961K574610J282774l26880n36625J06556
40016C331602M22878K16815l2059j82258o09127j474245k118466j629173j45043
40007b219076J043588J122802O87035L91144k07373j270085j408766K87555K015827
39998D42651J573893J13911L29115J248111q33025n268253n900543j7549N961295
39989b350394M625770j607658l875139J72958L536201J001288l394706l337759
$$ y = [-962493, -921864, -1914730, -3383650, -4713312, -5481535, -4890931, -2719533, -697334, -738008, -1741772, -912169, 1159207, 116399, -5589660, -10988991, -10637078, -6090429, -3472511, -4855082, -6401105, -5021414, -2395881, -964840, 159856, 2619053, 4868093, 4109008, 932255, -1006794, 231167, 2805777, 4088551, 3761671, 3225046, 3331602, 3754480, 3971295, 3939236, 3756978, 3147851, 1673606, -444860, -2074033, -2219076, -1175488, -52686, 634349, 1025493, 818120, -451965, -1860731, -1573176, 442651, 2016544, 2130455, 2459570, 3707681, 2874656, -2393597, -8294140, -8311689, -2350394, 2275376, 667718, -3207421, -3034463, 501738, 1503026, -1891680, -5229439]
39981e229439M48248K622359J662111N21166M48690l42206j747570p29399L074791
39972G28751N004424J636661l543681m370627l53388K998909J950423j090092
39964B961380k039366p44934K19031K04661Q01395K205837K445926P79834p63521
39955F070243n07635K84469l44403j768793j785708J0470J828537K141085Q11540
39946F739805j645862m010266m098696q91815L149084M222361J878379o70411
39938D672579j147094n24898j93649K32033R25362M14025j898949l920337l568268
39929e009196j519279M41995J826581K447235J387117q05545j337507P00591J908547
39920D0539m08017l241217k069212J920242L662627K039646N43758N74477k17874
$$ y = [-5229439, -4781191, -2158832, -496721, 24445, 473135, 130929, -1616641, -2346040, 728751, 5733175, 7369836, 3826155, -544472, -897860, 2101049, 4051472, 2961380, 922014, 177080, 396111, 600772, 1402167, 3608004, 6053930, 6833764, 6070243, 5562608, 5847077, 5502674, 3733881, 1948173, 1958643, 3787180, 5928265, 6739805, 5093943, 1083677, -3015019, -3906834, -757750, 3464611, 5342990, 4672579, 3525485, 3000587, 2806938, 3038971, 3964333, 4378358, 2479409, -1440928, -5009196, -6528475, -6086480, -4259899, -1812664, -425547, -1231092, -2568599, -1868008, 40539, -367478, -3608695, -5677907, -3757665, -95038, 1944608, 2488366, 3062843, 2844969]
39911B844969k310075k756117q54885k989j590589k080002Q60947L914150L361513
39902A386922P93138l14773k43174j073210k035980j231053K64598K37262o30187
39893b846457n30936k75563j104878j006719J931656M480318K239891k578302
39885C09010l582434j75654J492291j419372m034027j969883J895471K669353
39877d815245Q81665K84149J401107J737803N79743l56414j65439L82467O03755
39868E33591L04723p60181k027178j881679m2752J201805O3234j877730j944711
39859f430878j27512J612339K405215K423921J092049j847084m339651l949470
39851i161071j289281J073810K477153L981756M900801L130544p12237l045741
$$ y = [2844969, 534894, -2221223, -3076108, -3079097, -4669686, -6749688, -5888741, -1974591, 1386922, 2180060, 1865287, 1622113, 548903, -1487077, -2718130, -2453532, -2216270, -2846457, -3377393, -3652956, -4757834, -5764553, -3832897, 647421, 2887312, 309010, -3273424, -3449078, -1956787, -3376159, -7410186, -9380069, -7484598, -4815245, -3933580, -3649431, -2248324, -510521, 69222, -287192, -452631, -70164, 533591, 838314, 78133, -1949045, -3830724, -3873476, -2671671, -2608437, -4486167, -6430878, -6558390, -4946051, -2540836, -116915, 975134, -871950, -5211601, -9161071, -10450352, -9376542, -6899389, -2917633, 1983168, 5113712, 4401475, 1355734]
39843A355734k234505n05798K69367J210579K822543K348856j798401n567285
39835b098910l665822K585444O266426L955050l94973j912126j121112j169825
39827B444152j909707o94416K213445L114687K42271l456368m196360j871141
39819d113437P96310K075622K462532K819774K908283J923244k67473k626859
39811E977996l642161k771829j073949J49162R79295K121663K929082J980329
39803F649588k15657j218255j75629P27796l75937k219876k638611j825009j315753
39794b607343j310691j289535j827235l121169k976479N19549M959626N724361
39786a928916K282797q69201k90617K269776K959090P34182k073842k554990J40194
$$ y = [1355734, -878771, -1384569, -1115202, 95377, 2917920, 5266776, 3468375, -2098910, -5764732, -3179288, 3087138, 7042188, 6647215, 4735089, 3613977, 2444152, 534445, -159971, 2053474, 5168161, 5410432, 1954064, -2242296, -4113437, -3317127, -1241505, 1221027, 4040801, 6949084, 8872328, 8604855, 5977996, 2335835, -435994, -1509943, -1360781, -381486, 1740177, 4669259, 6649588, 6433931, 5215676, 5040047, 5767843, 5391906, 3172030, 533419, -1291590, -2607343, -3918034, -5207569, -7034804, -10155973, -13132452, -12612903, -7653277, -1928916, 353881, -515320, -805937, 1463839, 4422929, 5157111, 3083269, 528279, 668473]
39777F68473L662050M030296P0754m236836m320256j283824j15862j813520j931013
39768e269738J713415M741536K699365j995868l619002j187834J210101Q37979
39760h70046q43409j454966o43627N61671J167609P36022j64958k75338O51404
39751a135638J339820J089687Q69319J105107L92672j708561k699385n80328K445243
39742A117936K744212N20595q76813j33575Q19826M99444l97297j122301j874401
39733A297626k236129j178212P67534J548229M50220r06183r06683L16301J694358
39724H47061K214720J092736j393045l243224k523482K25890K713438L521445
39716C455539K563199M7327k828543l337476l38263K822398J878736k200354m235689
$$ y = [668473, 4330523, 8360819, 8431573, 4194737, -125519, -1409343, -1525205, -3338725, -5269738, -3556323, 1185213, 3884578, 1888710, -1730292, -2918126, -1708025, -870046, -1713455, -3168421, -3812048, -3250377, -2082768, -1346746, -1511704, -1787042, -1135638, 204182, 1293869, 2163188, 3268295, 3660967, 1952406, -746979, -1327307, 1117936, 3862148, 4382743, 3505930, 3372355, 4192181, 4691625, 4294328, 3172027, 1297626, -938503, -2116715, -1349181, 199048, 649268, -256915, -1163598, -847297, 847061, 3061781, 4154517, 2761472, -481752, -3005234, -2779344, -65906, 3455539, 6018738, 6066065, 3237522, -99954, -438217, 2384181, 4262917, 2062563, -2173126]
39707b173126k090500J012035K046844J886157J957837J260207q59749k260863
39699G78842j119836J057174K039981J992555J464996r01259n263980p620608
39691g572135m279222J985896M728308K514423L75417J844386L914729K224041
39683E735843k030425l742057j027753K531872K834244q32k654304k763843q34332
39674a951587J201962K028909J586307O15261j03955m66056j031374j925634k114198
39665b160365p30291J107441J319500l1731n05555R34092J859636j19973l362162
39656a689408m086723j454729J668188K673712J605216k79035j903501k028393
39648e494673J63838L332773M643672L003038K43819j480870k105394k854003
$$ y = [-2173126, -4263626, -3251591, -1204747, 681410, 2639247, 3899454, 3039705, 778842, -340994, 716180, 2756161, 4748716, 6213712, 5312453, 48473, -7572135, -11851357, -9865461, -5137153, -2622730, -2247313, -402927, 3511802, 5735843, 3705418, -36639, -1064392, 1467480, 4301724, 4300892, 1646588, -1117255, -1951587, -749625, 1279284, 2865591, 3480852, 3376897, 2910841, 1879467, -46167, -2160365, -2890656, -1783215, -463715, -495446, -1001001, -66909, 1792727, 1672754, -1689408, -5776131, -7230860, -5562672, -2888960, -1283744, -1562779, -3466280, -5494673, -5330835, -1998062, 2645610, 5648648, 5892467, 4411597, 2306203, -547800]
39640e47800m188163n139769m144867p43131K979680L749841J218105p47767J003993
39631f559878M215518M403865J396630j089026j522084j672659j751196M26453
39623b152377M274926N449940K172246j811618k968233k506915k550560k074482
39615b167073m0042J320770J97793j203645o17087J36161q64125j089210J859485
39606b466973M343108J540129l978227n250325j466059J384403M26830n43236
39598f010350J206878K720224J222551r65848r24693j28851j128300k606825j674943
39589h290157J146280K738146J760769m72097k175782j989166P14757M194883
39581b372367M677403Q38883l390233l165013J027568M088878K811319q73306
$$ y = [-547800, -4735963, -9875732, -14020599, -14763730, -11784050, -8034209, -6816104, -7563871, -6559878, -2344360, 2059505, 3456135, 2367109, 845025, -827634, -2578830, -2152377, 2122549, 7572489, 9744735, 7933117, 4964884, 2457969, -92591, -2167073, -2207115, -886345, -688552, -1892197, -2509284, -2373123, -3237248, -4326458, -2466973, 1876135, 3416264, -561963, -5812288, -7278347, -5893944, -5467114, -6010350, -4803472, -2083248, -860697, -1826545, -2751238, -2880089, -4008389, -6615214, -8290157, -7143877, -4405731, -2644962, -3117059, -5292841, -7282007, -6567250, -2372367, 2305036, 3143919, -246314, -3411327, -2383759, 1705119, 4516438, 3643132]
39573C643132l202436k873252j360728m75046n01576k88015J104302K819984K923806
39564A790171J102699m27745K07353J724470J336017j253056l314911k689023
39556a524025k43673J764054K276895J476695m19735k889409m340428l379527
39548g279153q38361J031407J578160K185604L154649K494954m73358k560727
39540g06825p43049K670503K760389m88049j855926R33881L328962Q34073m104052
39531B629907n778699l005975P88470L227305M397553L858986Q02326k926704
39523C993169l984484k124953l35661j93247l77102k818P3303j61863N70383J859092
39513f84181J460306q10543k149021r14596J152289J960786J483489J81448j914809
$$ y = [3643132, 440696, -2432556, -3793284, -4268330, -4769906, -5057921, -3953619, -1133635, 1790171, 2892870, 2465125, 2672478, 4396948, 5732965, 4479909, 1164998, -1524025, -1767698, -3644, 2273251, 3749946, 3330211, 440802, -3899626, -7279153, -8117514, -7086107, -5507947, -3322343, -167694, 2327260, 1853902, -706825, -1449874, 1220629, 3981018, 3492969, 1637043, 2570924, 5899886, 6733959, 2629907, -3148792, -6154767, -5366297, -2138992, 2258561, 6117547, 6919873, 3993169, 8685, -2116268, -2451929, -2645176, -3022278, -3025096, -2951793, -3113656, -2543273, -684181, 776125, -34418, -2183439, -3098035, -1945746, 15040, 1498529, 1679977, -234832]
39504b34832l494614k625966l54918j18333k122803k324608Q55277L120919Q94706
39495f405172k570453j961060K091927M446392L047013N08504q70243j369900
39487c082992j454411q45877n6617J02609L24794J494362K280338R51669j178837
39478a464962j382288j3508J10038j427657k057683p10260P15520R56437J043833
39469d230530J525968J304818K89617Q3007Q57466O79151p01527o76430J724140
39460H55680L375054J650708j290149j874994o01089o71966k492283l176585j299340
39451e524964J065366J550592L42111q44341q29771N55010K590661L762413K908318
39442E575395N83967j678393l265367m252820l684997m06820L929975N279724
$$ y = [-234832, -3729446, -6355412, -6710330, -6828663, -8951466, -11276074, -10420797, -7299878, -6405172, -8975625, -10936685, -8844758, -4398366, -1351353, -842849, -1713092, -3082992, -4537403, -5383280, -5439897, -5337288, -5012494, -3518132, -1237794, -286125, -1464962, -2847250, -2860758, -2750720, -4178377, -6236060, -6946320, -6230800, -5274363, -4230530, -2704562, -1399744, -1110127, -1027120, -169654, 509497, -192030, -868460, 855680, 4230734, 5881442, 4591293, 2716299, 2115210, 1443244, -1049039, -4225624, -5524964, -4459598, -2909006, -2566895, -3411236, -4241007, -3685997, -1095336, 2667077, 5575395, 6159362, 4480969, 1215602, -3037218, -6722215, -7129035, -3199060, 2080664]
39434B080664K172020j823545k706592j331416j198997k211404o61577M087820
39426a593027P075611M229625j686289m839375l966906k422404j743371J96605
39418d749531L977604N975566L296918j577374l884385k517159k79609M75031
39410G17061j81963j387109k489651k516436q28362J391616J969014M15203j432225
39401d342852j635684p7373J803945K352502J024721q18985r37849J128018L157554
39392A653997L012615J316298K9957n42350j475363k755843l152540k156615l26595
39383d396439J673409K728152J271885j944513k614432J996265P630966P270987
39375A3616280Q88118l986277k678111P99686Q94793j512628k428178j951159
$$ y = [2080664, 4252684, 2429139, -277453, -1608869, -2807866, -5019270, -5680847, -1593027, 5482584, 9712209, 8025920, 3186545, -780361, -3202765, -4946136, -4749531, -771927, 5203639, 8500557, 6923183, 3038798, 521639, 242030, 717061, 535098, -852011, -3341662, -5858098, -6686460, -5294844, -3325830, -2910627, -4342852, -5978536, -6055909, -4251964, -1899462, -874741, -1693726, -2631575, -1503557, 1653997, 4666612, 5982910, 6012867, 5470517, 3995154, 1239311, -1913229, -4069844, -4396439, -2723030, 5122, 1277007, -667506, -3281938, -1285673, 6345293, 13616280, 14504398, 10518121, 7840010, 8639696, 9534489, 8021861, 5593683, 3642524]
39367C642524k724823l694972j466531K826146L901483M44672k365532n04225
39359E8742L015812K951443n22447k659098j236811P81969n5508k962994m203576
39350d832468j967358J476847K626268P86999j588923k210185j195934K70171
39342f634583J818520L235726L448820K013292N56593O91936J396986P93999l70612
39333F950677k7188R83643k62623l357599m113937j019274J940061J444510K7633
39324B565903J390136L604304J887646l318375o179952l545209J224592L493388
39316A122433K692521R16655o52601j783872j763127r6236K291336L848591L776895
39307A0352595K251490K99428n44650R3459L10555j598444l886721l267032p2636
$$ y = [3642524, 917701, -2777271, -4243802, -1417656, 2483827, 2928499, 562967, 58742, 3074554, 6025997, 5503550, 2844452, 1607641, 2389610, 2334102, -628892, -4832468, -6799826, -5322979, -2696711, -1909712, -3498635, -5708820, -6904754, -6634583, -4816063, -1580337, 1868483, 3881775, 4438368, 5130304, 6527290, 7321289, 6950677, 6923489, 7907132, 7644509, 4286910, 172973, -846301, 1093760, 2538270, 2565903, 3956039, 7560343, 9447989, 6129614, -50338, -3595547, -2370955, 1122433, 3814954, 4731609, 4079008, 2295136, 532009, 435773, 2727109, 6575700, 10352595, 12604085, 12903513, 12358863, 12452322, 12762877, 11164433, 7277712, 4010680, 3938044]
39298C938044J825906Q72947k12004K58665j28954k945133m819417k276390K204859
39289a281477L504644J374753o8301O58407P53350j426674l627243l311870o77838
39280d102249K698723N325947N454084K263660k026012m014358l470076l021970
39272h92251l480445k954364j013740K11784J40525R61303L169480L859955J668336
39263A670583l84075K57767J493186N26667j089752k85550J975213K156395j98651
39254F121783k202758k257132j404825n07647N99421J237966K29605j631373k008642
39245a823602k76560J719782K293480J459234n5712j459642j641952j09661J815321
39236A920688K313874J422478O15441M87422M80657M17528N05080K10971j033519
$$ y = [3938044, 5763950, 6636897, 6424893, 6683558, 6554604, 3609471, -1209946, -3486336, -1281477, 2223167, 3597920, 3529619, 4188026, 4941376, 3514702, -112541, -3424411, -4102249, -1403526, 3922421, 9376505, 11640165, 9614153, 5599795, 2129719, -892251, -4372696, -7327060, -8340800, -8129016, -7988491, -7027188, -3857708, 2247, 1670583, 1286508, 1544275, 3037461, 3564128, 2474376, 2188826, 4164039, 6320434, 6121783, 3919025, 1661893, 257068, -250579, 348842, 1586808, 1816413, 185040, -1823602, -2100162, -380380, 1913100, 3372334, 3316622, 1856980, 215028, 105367, 1920688, 4234562, 5657040, 6272481, 6759903, 7240560, 7658088, 8163168, 8374139, 7340620]
39227G340620k305904k134807p01256N70939J247923J955033K569651K209737
39219A0751936R32054j86539o22558p79891j061845j617735k378430k446236p04167
39210A886589J853288K252118l06221k566725j797759J10657K00009l37078J299881
39201B594759L592391K454579j746824m216760l085675j608883k026986k263898
39193f307297n61511J218762J397060J582906L160778M071019K199968o82636
39185F079049j450100r7035J049419R77526L73384l78324j443970k644890l618404
39176a153345l849103k097616K145268O136699N812536J518835j413675K41878
39168G341477L208956K960936J57949j582869j649354k048020k825236k219856
$$ y = [7340620, 5034716, 2899909, 2198653, 2769592, 4017515, 5972548, 8542199, 10751936, 11683990, 11497451, 10874893, 10095002, 9033157, 7415422, 5036992, 2590756, 1886589, 3739877, 5991995, 5685774, 3119049, 1321290, 1431947, 1631956, 1294878, 2594759, 6187150, 8641729, 6894905, 2678145, -407530, -2016413, -4043399, -6307297, -6868808, -5650046, -4252986, -2670080, 490698, 4561717, 6761685, 6079049, 4628949, 4531914, 5581333, 6558859, 6932243, 6553919, 5109949, 2465059, -1153345, -5002448, -7100064, -4954796, 1181903, 6994439, 8513274, 7099599, 7341477, 10550433, 13511369, 13669318, 12086449, 10437095, 8389075, 5563839, 3343983]
39160C343983o25829l18365j292378j086889Q22927J860207N02954j330947j405974
39151D69689k86222L48929P01205K089277M016158M097217J280603k224907l214775
39142G277174j148233J540594K697183K604741K319154J469022o85003l038595
39134A3036037l494597j665917R16915K805184L236125J672654j109658k405583
39126A2991160o09394K033609K542460J836545K549446L465012J178520l026312
39118B2961046l828407l16171K244426R88727l48007J233304K610634P95300r56761
39109B5384091J292476M886364M742946J486408m59951l08366n53100j085195
39101C5385673N28096L893015N993274N773799M307905J867476q24610m10186
$$ y = [3343983, 2718154, 2399789, 1107411, 20522, 843449, 2703656, 3206610, 1875663, 469689, 183467, 532396, 1233601, 3322878, 7339036, 11436253, 12716856, 10491949, 7277174, 6128941, 7669535, 10366718, 12971459, 15290613, 16759635, 16074632, 13036037, 9541440, 7875523, 8792438, 11597622, 14833747, 16506401, 15396743, 12991160, 12381766, 14415375, 16957835, 18794380, 21343826, 24808838, 25987358, 22961046, 19132639, 18816468, 21060894, 22049621, 21701614, 22934918, 25545552, 26340852, 25384091, 26676567, 31562931, 36305877, 37792285, 37332334, 37023968, 36470868, 35385673, 35913769, 39806784, 45800058, 51573857, 55881762, 57749238, 56924628, 56514442]
39093E6514442M919465J0760265J1496633Q524065P675160R736276J0145384P760071
39085A27531761O900023R636027J2481590J2627921J1957321J2814023J4602050
39078B08550716J6454544J8744338K0151815J7637436J1201836M598890k51006
39071B97088569n285159j1183326j4961348j5087909j4743461j7042096k0327994
39064A98457276k0933833j7971111j3323438r386490q249900j0334114j2648542
39057A05609848j1373803p073359m072760m134509m788030m604279n276358p026835
39049E7259915o979667m225315j777873j334196r75864k89548k163696o403514
39041C3110242p438382k700236K104065J180970k686803l327751q04920M82447
$$ y = [56514442, 61433907, 72194172, 83690805, 92214870, 99890030, 109626306, 119771690, 127531761, 134431784, 144067811, 156549401, 169177322, 181134643, 193948666, 208550716, 225005260, 243749598, 263901413, 281538849, 292740685, 297339575, 297088569, 291803410, 280620084, 265658736, 250570827, 235827366, 218785270, 198457276, 177523443, 159552332, 146228894, 136842404, 128592504, 118258390, 105609848, 94236045, 87162686, 83089926, 78955417, 74167387, 69563108, 64286750, 57259915, 50280248, 46054933, 44277060, 42942864, 41967000, 41677452, 39513756, 33110242, 25671860, 22971624, 25075689, 26256659, 23569856, 20242105, 19437185, 19919632]
39033A9919632P823O31372J950535P97337k469781m087814l043450j984935k150562
39024I570157k065984j235944q25922o64562M91367J779923J048800j262190k527052
39015D308593j971565j013931j28114J164504J776737K29557k000008j897218
39007D68555N45578K528838K718637J945513L91435k095530l488080j558041J840541
38998C297446K636600O42795m97235M27553O46938j105330k190234o78393J663492
38989D843632K730166K852865K529154Q20297k058310l640206k746017j463689
38981C867892j693755k207332j103726R87247K122586J763885O98331k45909k52904
38972C936315J103894K612822K277315J84289j354267j166952n76530o65053o03196
$$ y = [19919632, 19927455, 20558827, 22509362, 23306699, 20836918, 16749104, 13705654, 11720719, 9570157, 7504173, 6268229, 5442307, 4777745, 5269112, 7049035, 8097835, 6835645, 4308593, 2337028, 1323097, 1194983, 2359487, 4136224, 4365781, 2365773, 468555, 1014133, 3542971, 6261608, 8207121, 8598556, 6503026, 3014946, 1456905, 3297446, 5934046, 6576841, 6079606, 6507159, 7154097, 6048767, 3858533, 3180140, 4843632, 7573798, 10426663, 12955817, 13776114, 11717804, 8077598, 5331581, 3867892, 2174137, -33195, -1136921, -149674, 1972912, 3736797, 4435128, 4189219, 3936315, 5040209, 7653031, 9930346, 10114635, 8760368, 7593416, 7016886, 6351833, 5748637]
38963E748637J90441N50569l62932j425995j336273m39436K62604M12598o5374
38954C534839r99417j308133k22121Q28121M1350j161509K34256L315381L572759
38945G835526N5773k384255n31345J920024K88160l572603m391666j617343O80209
38936a717520O83308M40425R01821L78896j208383j083108J618086L589182K249095
38927E851802j41421j80100J148651K84010k608249l215170K78607L707360K427588
38918G553078k073461m304384k389065K06019P45428Q81869K365978K939904J23719
38909F049085l485425l235300L93632K330025O28253j068440J49199K123417J743026
38900E627472l32641j763289k362693k882486k356849R0435K404365J796682j041564
$$ y = [5748637, 5939078, 6489647, 6126715, 4700720, 3364447, 2925011, 3187615, 3600213, 3534839, 2535422, 1227289, 1005168, 1833289, 1874639, 713130, 947386, 4262767, 7835526, 7891299, 5507044, 4975699, 6895723, 7183883, 3611280, -780386, -2397729, -1717520, -1034212, -593787, 308034, 686930, -521453, -1604561, 13525, 3602707, 5851802, 5710381, 5530281, 6678932, 6962942, 4354693, 1139523, 1418130, 5125490, 7553078, 5479617, 1175233, -1213832, -1007813, -262385, 619484, 2985462, 5925366, 6049085, 2563660, -671640, -278008, 2052017, 2680270, 1611830, 1761029, 3884446, 5627472, 5294831, 3531542, 1168849, -1713637, -4070486, -3980051, -1575686, 220996, -820568]
38891h20568k707733j615793N85329J766842J368617j29303j909569k922690k598414
38882h983282j387168J32168J888374L239476K701520K82861j323023L1240K570241
38873h47593K801878M08721j611399j431002l41734J06551L25431J044521J558565
38864B013939J047538K08477J05059L49626j51460j254330j799086j520881j302084
38855b303202j321606l82696K052905M227136L902275J454856l47052J77374J756535
38846I216525K177734P47796j831153m430232n422228l445403L11084K307566
38838c68311R43998j034252m95337J614037K466656K065172K150778J949858n91867
38829H700732m055516m708151k371452m89719j93844O71257K152991J559598n51907
$$ y = [-820568, -3528301, -5144094, -4558765, -2791923, -1423306, -1552609, -3462178, -6384868, -8983282, -10370450, -10238282, -8349908, -5110432, -2408912, -2126051, -3449074, -3417834, -847593, 1954285, 2363006, 751607, -679395, -1021129, -914578, -589147, 455374, 2013939, 3061477, 3269954, 3375013, 3724639, 3573179, 2318849, 519763, -1001118, -2303202, -3624808, -4007504, -1954599, 2272537, 6174812, 7629668, 7282616, 7459990, 9216525, 11394259, 12142055, 10310902, 5880670, 458442, -2986961, -2675877, -368311, 575687, -458565, -953902, 660135, 3126791, 5191963, 7342741, 9292599, 8700732, 4645216, -62935, -2434387, -2924106, -3117950, -2446693, -293702, 1265896, 713989]
38820G13989L945L183615L057500k419561o502859l538304K151885L394990J034880
38811A080080N39776J939390J221061j018240p57817J064164k67837m117798m822423
38802e139644j554983L76371o95840j58584L352568M267729L410l186338J15819
38793b619492N330257M922591k02084l308943k573163k112808l820778m753838
38785i138258k757403N11762K872068M036016M166567L103102J457776J92985
38777D444615p28665j388917p33047J307941K131182M4795k070375o54900K251994
38768D604623J563322k372919l526795L40832L653173J452391k995045l402812
38760f83230J90176K461775J308454j77083L6563K3129j376212j563361J311513
$$ y = [713989, 717934, 3901549, 6959049, 4539488, -1963371, -5501675, -3349790, 45200, 1080080, 1619856, 3559246, 4780307, 3762067, 3004250, 4068414, 3800577, -317221, -5139644, -6694627, -6318256, -7014096, -7172680, -3820112, 447617, 451027, -2735311, -2619492, 2710765, 7633356, 7431272, 4122329, 1549166, -563642, -4384420, -9138258, -11895661, -11383899, -8511831, -4475815, -309248, 2793854, 4251630, 4444615, 3715950, 2327033, 1593986, 2901927, 5033109, 5077904, 3007529, 2352629, 4604623, 6167945, 3795026, 268231, 609063, 4262236, 5714627, 2719582, -683230, -493054, 1968721, 3277175, 3100092, 3136655, 3159784, 1783572, 220211, 1531724]
38751A531724M196790K993731j393086m414332m221404k993052k180563m07219
38743f887411K750716M450217K447472j107331k450490j240325p5732n1817J71608
38734a993093J136445J434401L81580o10607k90336P33422J490375K115539K746651
38725G144377K487253P31009j570085l018344l214309k329576m81415J478289
38717A227199J866209K42608j432218j210676Q4991J69919j176629j757790j92602
38708b178989K183793L213162K449117R95666l26052j573436k615788k486174
38700c38701m91767K225738L110967Q56824k688348m182436k464512K72419J265186
38691b434630K36513r35822q26417J93729Q81477N38040m55384r81501j97160
$$ y = [1531724, 5728514, 8722245, 7329159, 2914827, -1306577, -4299629, -6480192, -6887411, -4136695, 313522, 2760994, 1653663, -796827, -2037152, -2112884, -2164701, -1993093, -856648, 577753, 959333, 348726, 58390, 791812, 2282187, 4397726, 7144377, 9631630, 10362639, 8792554, 5774210, 2559901, 230325, -251090, 1227199, 3093408, 3336016, 1903798, 693122, 778113, 948032, -228597, -1986387, -2178989, 4804, 3217966, 5667083, 6662749, 6336697, 4763261, 2147473, -338701, -830468, 1395270, 4506237, 5363061, 2674713, -1507723, -3972235, -3699816, -2434630, -2198117, -3133939, -3960356, -3766627, -2885150, -2347110, -2802494, -3783995, -3981155]
38682c981155J385834K185009J484242N87360J064914K230626J864754l48788
38674F472796j872764q40969J080068J224764J56474O34641K605657K557087r85344
38665A1032410m515316m416448k065748q87504o00490J302662L705216K738118
38657F292900j358196l612862j957471k73796j448933k552639n77933J708630
38649c780300N24095k007440j266794K082403L509991K120586R34261P69679k43190
38640B643291j586746q06056J031297M69550j482175l05441L280907K926849k608655
38631C562821n844276j817644L890647L859344k15495j770375p2310O23921l05855
38622A910778L25014K226527J376946k509781m459349j644841K552285L638591
$$ y = [-3981155, -2595321, -410312, 1073930, 1661290, 2726204, 4956830, 6821584, 6472796, 4600032, 3759063, 4839131, 6063895, 6220369, 6855010, 9460667, 12017754, 11032410, 6517094, 2100646, 34898, -852606, -1453096, -150434, 3554782, 6292900, 4934704, 1321842, -635629, -909425, -2358358, -4910997, -5488930, -3780300, -3256205, -5263645, -6530439, -4448036, -938045, 1182541, 2116802, 2886481, 2643291, 1056545, 250489, 1281786, 1751336, 269161, -36280, 3244627, 6171476, 3562821, -2281455, -4099099, -208452, 3650892, 3435397, 1665022, 1592712, 2216633, 1910778, 2235792, 4462319, 5839265, 3329484, -1129865, -2774706, -222421, 3416170]
38614C416170J387918j498266l020162k638367q55732O11113O3900j875437k673579
38605g082442j037684J671438L252062K675126O04236r32611j25473K210971L095515
38596D331138J526377J14239O65075Q58536j502097l620659j620835K470566K942566
38587F164906j018047m307255l697176j414466m5440R60415K026031J501554p08778
38578e38256j760265n59140P7888j399549j868991J289463M965237M315437k14025
38569D307799l762570l571954j180807R18780J648997R01175n66236j049962J70777
38560b184001J317192M76997j181783p85971J919138L812711K384562j042615
38552D716230k829641j208596J621735K000615n31057k302512m84697K542634
$$ y = [3416170, 4804088, 3305822, 285660, -2352707, -3208439, -2597326, -2533426, -4408863, -7082442, -8120126, -6448688, -3196626, -521500, 82736, -849875, -975348, 1235623, 4331138, 5857515, 5971754, 6636829, 7495365, 5993268, 2372609, 751774, 3222340, 6164906, 5146859, 839604, -2857572, -4272038, -4317478, -3357063, -1331032, 170522, -538256, -2298521, -2857661, -2779773, -4179322, -6048313, -4758850, 206387, 4521824, 4307799, 545229, -3026725, -4207532, -3288752, -1639755, -738580, -1304816, -2354778, -2184001, -866809, -389812, -1571595, -2357566, -438428, 3374283, 5758845, 4716230, 1886589, 677993, 2299728, 4300343, 3769286, 1466774, 982077, 3524711]
38544C524711K482515l34874j681023n49404n48142k817339k999561J434275N679053
38535D190211M204080p32132k705313q50956K5019k039695l632067k341675k57967
38526d140495L06311K10266Q53420J586895J440155P73578J0631r22476j282364
38517a164079k03094R99010J97439j624783j318528J126959K256008J032723M99463
38508A801118J827152J626962j820278m359985k247157J272749Q60064k293814
38500c333189k603157O92095K610449P11540j544884r95021P65673J259152J194046
38491a243296J884702J992272P3687j980812j409007Q93029J462171o19796k470947
38482a417997j512897J230620K619894J030456k065528l665509k229104P45339
$$ y = [3524711, 6007226, 5672352, 3991329, 3441925, 2893783, 76444, -2923117, -1488842, 4190211, 8394291, 7662159, 4956846, 4105890, 4130909, 2091214, -1540853, -3882528, -4140495, -3834184, -3623918, -2770498, -1183603, 256552, 1030130, 1040761, 118285, -1164079, -1367173, -368163, -170724, -1795507, -3114035, -1987076, 268932, 1301655, 1801118, 3628270, 5255232, 3434954, -925031, -3172188, -1899439, -1039375, -3333189, -5936346, -5244251, -2633802, -1922262, -3467146, -4462167, -3696494, -2437342, -1243296, 641406, 2633678, 2707365, 726553, -682454, 210575, 1672746, 1052950, -1417997, -2930894, -1700274, 919620, 1950076, -115452, -3780961, -6010065, -5264726]
38474e264726K415217J827026N81025J50315M3732n39259q77346j96373L17096
38465a543293p82694k157755j016610K279486L689956R44710k655331k180286
38457c421817K225964N197076K965574j919732m033359j776984J410884K167912
38449B815518J091641M57398J66944j495931l841765l660809l0398L433292L097336
38440B033226K17456j191972k39244J19099j829635l767872k819966L43772K505255
38431d629881J824207o05513k402434k010579L44887K933957L934341K920654
38423B309639P52915j619643l244536k597037R52484M744603M429353n02024m864729
38414C61025l728657J186701L733372J269984k564640l337349j293460J46760
$$ y = [-5264726, -2849509, -1022483, -441458, -291143, -247411, -786670, -1664016, -1860389, -1543293, -2325987, -4483742, -5500352, -3220866, 469090, 1413800, -1241531, -3421817, -1195853, 4001223, 6966797, 5047065, 1013706, -763278, 647606, 2815518, 3907159, 4364557, 4531501, 3035570, -806195, -4467004, -4497402, -1064110, 2033226, 2250682, 1058710, 819466, 938565, -891070, -4658942, -7478908, -7135136, -4629881, -2805674, -3411187, -5813621, -7824200, -7479313, -4545356, -611015, 2309639, 3062554, 1442911, -1801625, -4398662, -3446178, 1298425, 5727778, 5225754, 361025, -3367632, -2180931, 1552441, 2822425, 257785, -3079564, -4373024, -4226264]
38406d226264m88018j304603m16812J189054J154753o72303j689040r8263K258130
38397d293366K171161m33456k370873j727220j44928L36343K86089R62558J514967
38388c698725N90538p14796k54750J623654K555380J707093M06501l76775p48978
38379A089142m83020N63249R84797m82494k169793j454370P45006J100277m21505
38370e28711l36739J927226K204833j494874m799318l257449Q76621K406576R10765
38361b091070n3888M73802K32584j086066j118997M12318Q51932m89677p97188
38352c666250J261566K749714R48353k296240l275076j403882Q73430J602895
38344c205490N98092j431579k931304j866876J807989M971373M725391K164699
$$ y = [-4226264, -4714282, -6018885, -6435697, -5246643, -4091890, -4764193, -6453233, -6551496, -4293366, -2122205, -2555661, -4926534, -6653754, -6798682, -6462339, -6176250, -5213692, -3698725, -3108187, -3822983, -4077733, -2454079, 101301, 1808394, 2214895, 1838120, 1089142, 606122, 1169371, 2154168, 1671674, -498119, -1952489, -1207483, -107206, -528711, -865450, 1061776, 3266609, 1771735, -3027583, -6285032, -5408411, -3001835, -2091070, -2144958, -1671156, -1438572, -2524638, -3643635, -3231317, -2379385, -2869062, -3666250, -2404684, 345030, 1293383, -1002857, -4277933, -5681815, -4808385, -3205490, -2607398, -4038977, -6970281, -8837157, -7029168, -2057795, 2667596, 4832295]
38336D832295N84570P31003N07952r00923j706428r25150k03353q47902j509793
38327E62271o99056M65474K91840m04162O5174Q60015M7817j302967k22297K740359
38317B404468L201581n15460m208390l560973m7710J851596Q68852q91783j977127
38308b874946k189734q32636J774494K448083q15539m090566j999548L520324
38300e060068N001415P78670k178377O29165L998170J680343l310344l595713
38292b056739R07676L479790J340328j157215m99903J103486P07369n08218j17674
38283C198900J247647J299094k78543j841704k164447j318842j73383J41948p30948
38274f20278j526958p58241R71404J617801P30814K6303O68003J805609K227970
$$ y = [4832295, 5416865, 6147868, 6655820, 5754897, 4048469, 3123319, 2919966, 2072064, 562271, -136785, 328689, 620529, 216367, 281541, 1141556, 1189373, -113594, -335891, 2404468, 5606049, 5090589, 882199, -2678774, -2726484, -874888, -6036, -897819, -2874946, -5064680, -5897316, -4122822, -1674739, -2490278, -6580844, -8580392, -5060068, -58653, 720017, -1458360, -829195, 3168975, 4849318, 1538974, -2056739, -1149063, 2330727, 3671055, 2513840, 2013937, 3117423, 3824792, 3316574, 3198900, 4446547, 5745641, 5467098, 3625394, 1460947, 142105, -31278, 110670, -620278, -2147236, -2905477, -1934073, -316272, 414542, 440845, 1108848, 2914457, 5142427]
38265E142427J789210Q43295j36952k34102Q89423J661932L23761k050285k652919
38256E575790j223272m12158j258414j431097N47781K271934J003993j839935
38248C234622k502377j57325K155628J798683j29049m07963K024850M282529K863822
38239A3163420j284997l039949Q9453L702482K262303k599999m214555q65527
38231G212631J959823N56607j666457r63584R3077k279369n387630l743814J600687
38222b618029L874581O61580k701878j245835K889962M356000J947615r08178
38214F255818j362067j58622L16905p75130k182567k642929k470807k339576j377687
38205f736662J527891M681268M693941J594274l54233J103532K462119O4029l621083
$$ y = [5142427, 6931637, 7774932, 7637980, 7403878, 8293301, 9955233, 10278994, 8228709, 5575790, 4352518, 3940360, 2681946, 1250849, 1798630, 4070564, 5074557, 3234622, 732245, 574920, 2730548, 4529231, 4400182, 3992219, 6017069, 10299598, 13163420, 11878423, 8838474, 8927927, 12630409, 14892712, 12292713, 8078158, 7212631, 9172454, 9729061, 8062604, 7099020, 7192097, 4912728, -474902, -4218716, -2618029, 1256552, 1918132, -783746, -2029581, 860381, 5216381, 7163996, 6255818, 4893751, 4735129, 5052034, 4276904, 2094337, -548592, -3019399, -5358975, -6736662, -5208771, -527503, 4166438, 5760712, 5406479, 6510011, 8972130, 9036159, 5415076]
38196E415076l728699q26865K64646j475921k079802J38065J670973j5140k166148
38187b803815j261342J778207L710455L489191K010350k57642k721760l657461
38179B86183k333023p29850r32116k063442j814702J71924K311165L348133K909682
38170A153954R45749j614672k679012j221359J067875J805272P69856n08673j020913
38161a301923q65735n36600p35059j832307k657353j362618J510404K814364J078636
38152c888191j140193j079388K64380M08403m61812n68160l0220N2117O32326
38143e810738L118409N561478M397177p0623l649717m029236l007617k432661
38135e923528j612080O5951J325626J419601J475370J865253J055328j135664
$$ y = [5415076, 1686377, 859512, 1124158, -351763, -2431565, -2293500, -622527, -637667, -2803815, -4065157, -2286950, 1423505, 4912696, 6923046, 6665404, 3943644, 286183, -2046840, -2776690, -3708806, -5772248, -7586950, -7415026, -5103861, -1755728, 1153954, 2099703, 485031, -2193981, -3415340, -2347465, -542193, 227663, -281010, -1301923, -2167658, -2704258, -3439317, -5271624, -7928977, -9291595, -7781191, -4966827, -3888191, -5028384, -6107772, -5843392, -5434989, -5896801, -6464961, -6495181, -6443064, -5810738, -2692329, 2869149, 7266326, 7195703, 3545986, -483250, -3490867, -5923528, -7535608, -7469657, -6144031, -4724430, -3249060, -1383807, -328479, -1464143]
38127a464143j934157L99296L323454L427887J361866N58476K045685L188465
38119A0906829J429657k598387n801175n543015k201501P82320M26338j965906
38111d564840k327930L07542K205105P44059j208541K16084L314827K830717k140898
38102f23875o239390m552949J578228O475157O000138R28346m063593m469958
38094d967896k68649L896097L931187R17596j104379q35807n77318j901874l476604
38085d387647l557028k091575J89002K544700L692474K672054N25509r47513j826245
38076c186269k847891k288774J885431O706592O139032n0657m489169k230438
38068c62143K201650K020954j753132l019000n99923Q75636p60209k266812j143981
$$ y = [-1464143, -3398300, -2999004, 324450, 3752337, 5114203, 5672679, 7718364, 10906829, 12336486, 9738099, 3936924, -1606091, -3807592, -3025272, -2598934, -4564840, -6892770, -6585228, -4380123, -3636064, -4844605, -4628521, -1313694, 1517023, -623875, -6863265, -11416214, -9837986, -3362829, 2637309, 3565655, -497938, -4967896, -5236545, -1340448, 2590739, 3508335, 2403956, 1568149, 990831, -911043, -4387647, -7944675, -10036250, -9847248, -7302548, -3610074, -938020, -412511, -1360024, -3186269, -6034160, -8322934, -6437503, 269089, 6408121, 6357464, 1868295, -362143, 1839507, 3860461, 2107329, -911671, -1511594, -635958, -1396167, -3662979, -4806960]
38059d806960M82730O0j545357j592241K42475K342796L128992J884437q16047
38050f79115k991821l106681j905488p11924J068560L988079N367653K254622
38042C283885k860201m198828j067370J255815K98198J7170K791935M023992k49581
38033C295015n432883m525695J172800M462983L297475K061657K463992R70847
38025G766191l229164m984615j271968L229684K944331n06383j687912K24025
38017B484189J374097m6354j771619j874097j200138q56386l62031P69932J822320
38008C39913K086426J661302N53930j405425l243224l117190q37668J194585P51425
37999b015926j298163k028600j77822K260558K525236M99493j233783q46245K88492
$$ y = [-4806960, -4324230, -4324170, -5869527, -7461768, -7219293, -4876497, -1747505, 136932, -679115, -3670936, -6777617, -8683105, -9395029, -8326469, -4338390, 1029263, 3283885, 423684, -3775144, -4842514, -3586699, -3288501, -3271331, -479396, 3544596, 3295015, -2137868, -6663563, -5490763, -1027780, 2269695, 4331352, 6795344, 7766191, 4537027, -447588, -1719556, 1510128, 4454459, 3948076, 2260164, 2484189, 3858286, 3811932, 2040313, 166216, -1033922, -1890308, -2252339, -1482407, 339913, 2426339, 4087641, 4641571, 3236146, -7078, -3124268, -3961936, -2767351, -2015926, -3314089, -5342689, -5520511, -3259953, -734717, -235224, -1469007, -2315252, -2026760]
37990b026760k45745j913122j519164J871366M620392L171761n79119j602242
37982A777367R94704K491853n57800n122396n846789k360009P84701P53135l63997
37973g449231L36588K162549K425056P21650o81376k43839J059678J578199J103014
37964A012288N03045K29964Q606l98585p51890n91424K73865J363507J627226
37955C276602M30677j443622k386408j818732p75902k48736J19362P91690P38660
37946a316409j264924m005142m445299j575968K021484L491058L076680K691866
37938a326654K484689J127987j044975j885938q31815P0057l36107j58548K226362
37929C25058M596282L453885o14216l179122j883985N73908M99148j855467l072410
$$ y = [-2026760, -2272505, -4185627, -5704791, -3833425, 786967, 3958728, 3379609, 1777367, 2772071, 5263924, 4706124, -416272, -6263061, -8623070, -7838369, -7085234, -7449231, -7112643, -4950094, -2525038, -1803388, -2484764, -2728603, -1668925, -90726, 1012288, 1515333, 1745297, 1753903, 1355318, 603428, 12004, 285869, 1649376, 3276602, 3707279, 2263657, -122751, -1941483, -2717385, -2966121, -2846759, -2055069, -1316409, -2581333, -6586475, -11031774, -12607742, -10586258, -7095200, -4018520, -1326654, 1158035, 2286022, 1241047, -644891, -1476706, -1406649, -1742756, -1901304, 325058, 4921340, 8375225, 7761009, 4581887, 2697902, 3271810, 3770958, 1915491, -1156919]
37920a156919j116120K498198M584541L246162o26601l967792m054865j155228
37912a748624J654244J745019m88066k583456k682152p89093J619935K583192
37904f89001J222794r83185j553060k39290N64538m24137j115188P26985L697044
37895A207500M576319K809427O09293n96533j116444r77786k169K24982k243617
37886D490972n798372o054408j830359K639182L302882J489598J072670K445962
37878A758127K470001j59984k479507j171693K722426M670052K285761j277883
37870H817300j156125K419592L870464O0939m749948m843527j387158j87088k448007
37861C96442l496063j022592J419660J095160O23522K582446M348183K394570
$$ y = [-1156919, -2273039, 225159, 4809700, 8055862, 7429261, 3461469, -593396, -1748624, -94380, 1650639, 1162573, -1420883, -4103035, -4892128, -3272193, -689001, 533793, -449392, -2002452, -2241742, -1677204, -2101341, -3216529, -2489544, 1207500, 5783819, 8593246, 9202539, 8606006, 7489562, 6511776, 6509607, 6734589, 4490972, -1307400, -7361808, -9192167, -6552985, -3250103, -1760505, -687835, 1758127, 4228128, 4068144, 1588637, 416944, 3139370, 7809422, 10095183, 8817300, 7661175, 10080767, 13951231, 14012170, 9262222, 4418695, 3031537, 2844449, 396442, -3099621, -4122213, -2702553, -1607393, -983871, 1598575, 5946758, 8341328]
37853H341328j910105m834946n487846m647971j678203L008052N375236K589071
37845G54616j847903k598541k6137J665291J584119J847583J969788j99100k956602
37836A93114k598962l59847r13256l868510l740571O23606L699492K335947K85060
37827d343927Q99223J884545R49965N14930K339076K984002k20586l351593j648079
37818G556K552980L345011M9945k941837l122803j591308N55354K730331L021984
37809D607213L69543k429177k004672L76510R00014p07432j400384j54405J165937
37800G23147J579265J582809P14592j456841k772642j141191J185846O00951j557016
37791e41080j011768J710115J716745j581579k806546N00569L605216K308000
$$ y = [8341328, 6431223, 1596277, -3891569, -8539540, -10217743, -7209691, -1834455, 754616, -1093287, -3691828, -3717965, -2052674, -468555, 1379028, 3348816, 3149716, 193114, -2405848, -2765695, -3678951, -7547461, -11288032, -10664426, -6964934, -4628987, -4343927, -3444704, -1560159, -610194, -95264, 2243812, 5227814, 5007228, 1655635, 7556, 2560536, 5905547, 5955492, 3013655, -109148, -1700456, -1145102, 1585229, 4607213, 4976756, 2547579, 542907, 919417, 1819431, 1111999, -288385, -442790, 723147, 2302412, 3885221, 4599813, 3142972, 370330, -770861, 414985, 1015936, -541080, -1552848, 157267, 1874012, 292433, -2514113, -2013544, 1591672, 3899672]
37783C899672o17856p56690Q21214M98286j263727j242606P22536J879483J346731
37774E287043P23895O50504K87820k15217J14409O94936j6012j637673k062324
37765C827381n88678J195515J635332M17932j881385l973138m119465j999919
37757e486425K91995Q33036M77547Q39638J013531o89900k674030j552380K211382
37748d735606M158443K330630j9621p6403M0642k429107n155074l569905J907292
37739g548709N764458M547498O14230j825526j409816N38902K216555K160908
37731E058500R8120j836582q74553K168570K912419n73142m354662l889236l93259
37722a683825J588442J228917J431438K363741M56907m598500p021926k718271
$$ y = [3899672, 3281816, 2525126, 3346340, 3844626, 2580899, 1338293, 2060829, 3940312, 5287043, 6010938, 6661442, 6949262, 6734045, 6848454, 7543390, 7527378, 5889705, 3827381, 3238703, 4434218, 6069550, 6487482, 4606097, 632959, -3486506, -5486425, -5194430, -4361394, -3883847, -3044209, -2030678, -2720578, -5394608, -6946988, -4735606, -577163, 1753467, 1733846, 1657443, 1698085, -731022, -5886096, -9456001, -7548709, -1784251, 2763247, 3377477, 1551951, 142135, 681037, 2897592, 5058500, 5156620, 3320038, 2445485, 4614055, 7526474, 6953332, 2598670, -1290566, -1683825, -95383, 1133534, 2564972, 4928713, 5385620, 787120, -6234806, -8953077]
37714h953077L747925M626827m37719m260761k288257J950725L002007R49596
37706a662734k88128M76041O76396j104515k802176k359320q52200l73426o48369
37697h938431l2195J251056J560597J110989J699978K781011J328677k824384
37689b062702n112336k519924J512024K368777J514326L134440N646018L533242
37681H013865k515317n042280j456536J383675j652349n253716k411610L709052
37673e225216M646961R6717k181320J006839M128373K571467r07707k067493j599262
37664D69359k169343l358407l121714j420155M67504J991133K591381J306829
37656c243413r69072j352881Q91509K601854J337571p38067l04384J895249K446997
$$ y = [-8953077, -5205152, -578325, -1016044, -5276805, -7565062, -5614337, -2612330, -1662734, -1950862, -1474821, -798425, -1902940, -4705116, -7064436, -7916636, -8290062, -8938431, -8970626, -7719570, -6158973, -5047984, -3348006, -566995, 761682, -2062702, -7175038, -9694962, -8182938, -5814161, -4299835, -1165395, 4480623, 8013865, 5498548, 456268, -1000268, 383407, -1268942, -6522658, -8934268, -5225216, -578255, -481538, -2662858, -1656019, 2472354, 5043821, 4136114, 2068621, 469359, -1699984, -5058391, -8180105, -9600260, -9132756, -7141623, -4550242, -3243413, -4212485, -5565366, -4673857, -2072003, -734432, -1472499, -1776883, 118366, 2565363]
37647B565363N64467j246167j349162q30079r07330j002393l46628K65237k52900
37638b539592j123014m49676J716240K610374L39983k784468k767594L24178K025765
37629b647804j08237k874595k362760M32028K022520J833274J366235K77927k095876
37620d157288l151813l47835L089500J874019k337878k429041K939105O703259
37612B182028M173851m91931j930022j187551j306324j123586J157266K927778
37604D401509J402023q56680j99382J615194Q30295j371207j305829K08885n23094
37595D201714l075678l627827j709550m10485n10815p4280N51641q56135k944271
37586h455686j601571K982445N584635L619564N57864J7435R84556R77479J31428
$$ y = [2565363, 3129830, 1883663, 534501, -295578, -1202908, -2205301, -2551929, -2286692, -2539592, -3662606, -4112282, -2396042, 214332, 554315, -2230153, -4997747, -4673569, -2647804, -2756041, -5630636, -7993396, -7561368, -5538848, -3705574, -2339339, -2061412, -4157288, -7309101, -7656936, -4567436, -2693417, -5031295, -7460336, -4521231, 2182028, 6355879, 5863948, 3933926, 2746375, 1440051, 316465, 1473731, 4401509, 5803532, 4946852, 4747470, 6362664, 7192959, 5821752, 4515923, 4724808, 4201714, 1126036, -2501791, -4211341, -4621826, -5132641, -5206921, -4655280, -5511415, -8455686, -10057257, -7074812, -1490177, 2129387, 2687251, 2704686, 3689242, 4666721, 4798149]
37577D798149j09914M41679J178192J602148J059049l57222q93882K87455O71738
37568H677392j891348m392707k511263J682188J981918j930797l628564m92639
37560b505820K139978L46224j922648l16713K154868P02190k652401k561755P10781
37551c905296K282625P68853n56645J03920J045639R94500O38895K20597o89026
37542I04062j187230j72424R96415L18502j051442m45207J490823J586922m64860
37533A975561j711642j197287j285445k745766k774974J75751L217165L129564
37525a217073Q99330l70984Q7659Q82771J359443J717876J413137j1445j201732
37516C558982n52563Q46465L02672k225083l390994r77069K811375M113424K151156
$$ y = [4798149, 4688235, 5129914, 6308106, 7910254, 8969303, 8612081, 7718199, 8005654, 8677392, 6786044, 2393337, -117926, 1564262, 3546180, 1615383, -2013181, -2505820, -365842, -19618, -1942266, -2258979, -104111, 598079, -2054322, -4616077, -3905296, -1622671, -853818, -1410463, -1306543, -260904, 733596, 1372491, 1593088, 904062, -283168, -455592, 540823, 859325, -192117, -637324, 853499, 2440421, 1975561, 263919, -933368, -2218813, -4964579, -7739553, -7563802, -4346637, -1217073, -317743, -688727, -601068, 281703, 1641146, 3359022, 4772159, 4760714, 3558982, 3006419, 3852884, 4155556, 1930473, -1460521, -2437590, 373785, 4487209, 6638365]
37507F638365o12413k188948k702631k442755q25773J678979K719902R63456j565564
37498A662618k005297n08620N14066J57432m18198o70503j111286j073291Q99780
37489b553299L783602M231242J262258j961627k597679j690725j402122j387300
37481b315650n31079K6817j181806k555238j370984J625645K880716J195043p22997
37472b949533k97740J732224K868647J842888n35056k329752k123742n90924O6102
37463b316886p69888q26152J502890L803364K693275p52704k223330o97844K66772
37454F79497j264871k280252j01909K529158J360280k501016l876924j141043
37446f597080J567707O26749k076177k463877j20128J907606J902270J167927
$$ y = [6638365, 6025952, 3837004, 1134373, -1308382, -2134155, -455176, 2264726, 3228182, 1662618, -342679, -851299, -337233, -179801, -597999, -1268502, -2379788, -3453079, -2553299, 1230303, 5461545, 6723803, 4762176, 2164497, 473772, -928350, -2315650, -2846729, -2819912, -4001718, -6556956, -7927940, -6302295, -3421579, -2226536, -2949533, -3247273, -1515049, 1353598, 3196486, 2661430, 331678, -1792064, -2382988, -2316886, -3086774, -3912926, -2410036, 1393328, 4086603, 3333899, 1110569, 412725, 679497, -585374, -2865626, -2967535, -438377, 921903, -1579113, -5456037, -6597080, -5029373, -4402624, -6478801, -8942678, -9062806, -7155200, -5252930, -4085003]
37438d085003J065403J044163L54318m82661j017835j747242k312928q92013K650267
37429e423531M969451L351406M1678r09154P4181p72713l535600l902783o49137
37420f756202J409143j187973m626868l280198K120004O042109N640778K525667
37412A886460j141752l993841m107889o75086L403729M323380K352790O70409
37404B718200K36129k62168m03762J265613K976413J422171j967189j969420J993334
37395F009321M033145P64160l324092l011502k07176q7209k742464l779362j542282
37386c887461R71552J017809p32955k118322k020813p91026K92653K38251j61597
37377g191909P42399K306212J699706j317982k585396P90231N449988N969436
$$ y = [-4085003, -3019600, -1975437, -1621119, -2103780, -3121615, -4868857, -7181785, -8073798, -5423531, -454080, 2897326, 2939004, 2029850, 2104031, 1331318, -2204282, -6107065, -6756202, -5347059, -6535032, -11161900, -14442098, -12322094, -6279985, -639207, 1886460, 744708, -3249133, -7357022, -8032108, -4628379, -304999, 2047791, 2718200, 2954329, 2692161, 2288399, 3554012, 6530425, 7952596, 5985407, 4015987, 6009321, 10042466, 10806626, 7482534, 4471032, 4263856, 4176647, 1434183, -2345179, -3887461, -2915909, -1898100, -2631055, -4749377, -6770190, -7561216, -7268563, -7030312, -7191909, -6449510, -4143298, -2443592, -3761574, -6346970, -5556739, -106751, 5862685]
37369E862685K178227j570569l079351l823555m239561k302097K034003M937413
37361b805L397863o81482l068929k232142j49100P66607J38895n47096Q0450J417996
37351h79743J449487k70207j383625k3577J898417J172884j689605k993499j368419
37342d087887N70433P21292K55643M77345K28249j295984j966679L7136K440191
37333b620261J736354j285218k415770k31983J969525J192920j174888j812973
37325d642294j1521K010827K264411R16881m60569m95310Q36429K013784J453008
37316C885646k85654p28922J126681K805930J461906j768597k953784r91736P72800
37307C324270k36301j762989l85575K771913L500765R06163j506176j575179j455144
$$ y = [5862685, 8040912, 6470343, 3390992, -432563, -4672124, -6974221, -4940218, -2805, 3395058, 2713576, -355353, -2587495, -2736595, -1969988, -1831093, -2378189, -2297739, -879743, 569744, 299537, -1084088, -1107665, 790752, 1963636, 274031, -2719468, -4087887, -3517454, -2796162, -2540519, -2063174, -1834925, -3130909, -5097588, -5060452, -2620261, -883907, -2169125, -4584895, -4816878, -2847353, -1654433, -2829321, -4642294, -4653815, -2642988, -378577, 538304, 77735, -417575, 418854, 2432638, 3885646, 3599992, 2871070, 3997751, 6803681, 8265587, 6496990, 3543206, 2551470, 3324270, 3087969, 1324980, 939405, 3711318, 7212083, 8118246, 6612070, 5036891, 3581747]
37298C581747l155080m549083k764858P51245K011576K61602j328592n34751J347023
37289d379171K235005K029568J692669J426049R01604K05941k78506l00013K58324
37280C791470J209920J949438K088703J775487P65732j713681m947263o035468
37272a115662l366916M22387J694196R89833J504063L048374K059891j806884
37264C429282m036836k186940K12917k17055j021929J300141M350616L195412
37256E025608j318979l477564j368556J016032Q29052M8177N65242O80847q43850
37247A156009j503141P49951L271398K513830k81524j209785m4032j68101k489031
37238A995574l640372j382553J576133J340282j520824k546796P57712N489986
$$ y = [3581747, 426667, -4122416, -6887274, -6136029, -4124453, -3862851, -5191443, -5726194, -4379171, -2144166, -114598, 1578071, 3004120, 3905724, 4111665, 3833159, 3533146, 3791470, 5001390, 6950828, 9039531, 10815018, 11580750, 9867069, 4919806, -1115662, -4482578, -4060191, -2365995, -1376162, 127901, 3176275, 5236166, 3429282, -607554, -2794494, -2581577, -2798632, -3820561, -2520420, 1830196, 5025608, 3706629, 229065, -1139491, -123459, 705593, 753770, 1319012, 1999859, 1156009, -347132, 402819, 3674217, 6188047, 5906523, 4696738, 4652706, 4484605, 1995574, -1644798, -3027351, -1451218, -110936, -1631760, -4178556, -3420844, 2069142]
37230B069142O486898K246834l192170m704381j857306R18977R3095k643782l136159
37221c718852o91569J012999q62794m264192m700041q00603M037761N569625L245661
37212a172005L18806j11955J683083L076480K552814J094354J33776n44526j940322
37203E090505l680726m111494k588826n36840L30428J27063L51680J599900K644738
37194g73572K119903L62267j195717j928862k087545j257368J288729M147005
37186F74840M056840L74120k849139j962477Q40016Q12682j800657k329197J74500
37177b008472J016876j945418l821736l30726M662646M531077k80304l553670
37169a729727k598525l82899P87268J750990K412454R00057k005145k708442o42831
$$ y = [2069142, 8556040, 10802874, 7610704, 2906323, 1049017, 1967994, 2061089, -582693, -3718852, -4410421, -3397422, -4260216, -8524408, -13224449, -14025052, -9987291, -4417666, -1172005, -853199, -965154, 717929, 3794409, 6347223, 7441577, 7575353, 7030827, 5090505, 1409779, -2701715, -5290541, -5827381, -5496953, -5369890, -5018210, -3418310, -773572, 1346331, 1708598, 512881, -1415981, -3503526, -4760894, -3472165, 674840, 4731680, 5105800, 2256661, 294184, 1134200, 1946882, 146225, -2182972, -2008472, -991596, -2937014, -6758750, -7089476, -2426830, 2104247, 1823943, -1729727, -4328252, -4711151, -3923883, -2172893, 239561, 1139618, -865527, -3573969, -4216800]
37160d216800M99175q06851j094649J922551M898062L980203P46002o70554M07063
37151E664202J569082J471319L92176j455939l302421l327177j328671R7477o51076
37142h71028j629650r52461L3213N4060R39541L500870L883801q39514o198694
37133b079862n504125M6588K807744j32538l563818k805666J83955J428978Q38468
37124h780276P41695J797251K804258K623075J012385q77604q83866J309573K720276
37115B466767J322041m4112J689726L260105n22114o704874o492408J079726O084699
37106B139556J884778n270284o129284j429002J631258R71195K68868J035257
37098d897658J305495Q35002J236081J641459j35089k619645k201163O28513J762365
$$ y = [-4216800, -3717625, -4524476, -5619125, -3696574, 1201488, 5181691, 5927693, 5257139, 5664202, 7233284, 8704603, 9096779, 7640840, 4338419, 1011242, -317429, -219952, -871028, -2500678, -3453139, -3419926, -3365866, -2426325, 1074545, 4958346, 4118832, -2079862, -7583987, -7537399, -4729655, -4862193, -8426011, -11231677, -11047722, -9618744, -8780276, -8038581, -6241330, -3437072, -813997, 198388, -679216, -1563082, -253509, 2466767, 3788808, 3744696, 5434422, 8694527, 8172413, 1467539, -5024869, -3945143, 2139556, 4024334, -1245950, -7375234, -8804236, -7172978, -6201783, -5932915, -4897658, -3592163, -2757161, -1521080, 120379, -14710, -2634355, -4835518, -4207005, -2444640]
37089b444640K89052l30391J462129K788388J395964j012503k145700k245687
37081b243388k215624j688285n19188L44578O79868J303600J811213O61288j662303
37072c528241k417229o29300J385373J707879J236216J018009Q7560j996002l012862
37063f148597j067211K036530K952193J225944o79694r98294j74719P98416J588927
37054d66505K004079J755260J041944M13697j52216j280342l008256m069405k917887
37045f679631L31046L280948L320184O19052j745498j369756O19427J444572O29956
37036D50300K44300J289699J905072J17290k971616m161541k026687J275081K507566
37027a370536J197454K2455R73257K345578J223736j741960k745793m37165J916032
$$ y = [-2444640, -2155588, -2485979, -1023850, 1764538, 3160502, 2147999, 2299, -2243388, -4459012, -6147297, -6666485, -6321907, -5642039, -4338439, -2527226, -1865938, -3528241, -5945470, -6574770, -5189397, -3481518, -2245302, -1227293, -1139733, -3135735, -6148597, -7215808, -5179278, -2227085, -1001141, -1680835, -2679129, -2853848, -2055432, -466505, 1537574, 3292834, 4334778, 4748475, 4596259, 3315917, 307661, -3761744, -6679631, -6348585, -3067637, 252547, 871599, -873899, -2243655, -1624228, -179656, 450300, 694600, 1984299, 3889371, 4006661, 1035045, -3126496, -5153183, -3878102, -1370536, -173082, -150627, 822630, 3168208, 4391944, 2649984, -95809, -532974, 1383058]
37018A383058J389665m34690p45635k79148j387751l219425k811890j19886J933298
37009d292404K095783J745286J316745k67468k134540j461462J794690L770888
37001B567518K071486p76507j237022M03360J276138J36734j664518k221683p82458
36992b26952J503771J998916o81139m062150m174650r65738J401444N59628q89551
36983e536421M8724K050885K004957M473j238549o68085L32574Q13087J269895
36974i18460J766741J257051n41204k002906j350466Q47539J890843K46923j954554
36965g58493j268271K066684L775117J457753j791469k138525p12228q23665j791216
36956a984313n73551J800123J365987j374704j554055J549055K650671n87512
$$ y = [1383058, 2772723, 2338033, 1592398, 1313250, -74501, -3293926, -6105816, -6225702, -4292404, -2196621, -451335, 865410, 597942, -1536598, -2998060, -1203370, 2567518, 4639004, 3862497, 2625475, 3028835, 4304973, 4441707, 2777189, 555506, -226952, 1276819, 3275735, 2594596, -1467554, -5642204, -6607942, -5206498, -4646870, -5536421, -5487697, -3436812, -1431855, -1427382, -2665931, -3334016, -3001442, -2188355, -918460, 848281, 2105332, 1564128, -438778, -1789244, -941705, 949138, 1196061, -758493, -2026764, 39920, 3815037, 5272790, 3481321, 1342796, 630568, -193097, -1984313, -2557864, -757741, 608246, -766458, -2320513, -771458, 1879213, 1291701]
36948A291701l144368q04828K904266K523998j095180l214704k397131o70985
36940d607231O64124J280552M81798q43674R0927L043699L303687r86929m408718
36931a981765k039785K605876L266740P24112J88222J990139K205402M29218n34400
36922F853759j240628m178278o682741l400834L904450P008650L021180j848231
36914C437327k176776K6705J023543J121310J543034J091747o94676j602864q00890
36905B968460o84267k328525l254265j850489J00687J144006K105176K774136
36897I74919J369292j100367j103133J065266R08102k208078k991835P48395L614313
36888A276874J281243k599237l038140j380502q49825j0099K983909M541533J112922
$$ y = [1291701, -1852667, -2657495, 246771, 2770769, 1675589, -1539115, -3936246, -4607231, -3943107, -2662555, -2180757, -3024431, -2933504, 110195, 3413882, 2426953, -1981765, -4021550, -1415674, 1851066, 2575178, 2763400, 4753539, 6958941, 7388159, 6853759, 5613131, 1434853, -5247888, -8648722, -4744272, 2264378, 5285558, 3437327, 1260551, 1287256, 2310799, 3432109, 4975143, 6066890, 5372214, 3769350, 2968460, 2284193, -44332, -3298597, -5149086, -5048399, -3904393, -1799217, 974919, 2344211, 1243844, 140711, 1205977, 2114079, -93999, -3085834, -2337439, 1276874, 2558117, -41120, -3079260, -4459762, -5309587, -5319686, -2335777, 2205756, 3318678]
36879C318678l401082k985237Q36266J987855n4144p49837O16064L35919j950086
36870b045604k289791L22830K282798J730675O40575j86343k370016n092847m655557
36861a1663280n88133K782092K688470J365152J354908J685639Q48784j65513
36853a691881j02175K62565L3144q0749M57601O85308j34297j248333j621039
36844c439856r09892O99852K079444J512276n30239o94221K332979M463939J782577
36835G296859k854634l985621k207942k187472l481726j287645L606630M365694
36827g35857m21798l432324l61083L126579J206281k633249k188000J360683K815207
36818a263561J791606J258022R40067r37036k268218k18488K602136J744486j348153
$$ y = [3318678, -82404, -3067641, -2231375, -243520, -297664, -1047501, -431437, -95518, -2045604, -4335395, -4012565, -1729767, 908, 641483, 455140, -1914876, -7007723, -11663280, -12251413, -9469321, -6780851, -5415699, -4060791, -2375152, -1526368, -1691881, -1794056, -1531491, -1498347, -1579096, -1121495, -436187, -570484, -1818817, -3439856, -4349748, -3649896, -1570452, -58176, -588415, -1282636, 1050343, 5514282, 7296859, 4442225, 456604, -1751338, -3938810, -7420536, -8708181, -5101551, -735857, -1157655, -4589979, -4951062, -1824483, -618202, -3251451, -5439451, -4078768, -1263561, 528045, 1786067, 2726134, 1789098, -479120, -697608, 1904528, 3649014, 2300861]
36809B300861j927610m06883r60420k853662j122383L875276N523524J265059
36801E693762l326542l406141j361291j119110j662457m32793J282648R58578
36793c373346k70258L57372K345725K883343J331412l82443r27528o16161r4961
36784A253155L5652q16436k068650j906496J35339J912788J559818J52960k70064
36775a1934J18876j81894j135250j412149p89866k26896J2227M13232O84509j3046
36765b542191j311897j681123m52287J344831K333178K054186Q01309r43425k596209
36756b993628l407222k596026J44334L760610N746991M224727M99151j807066
36748C571871j033290L44719q84903m013824m893570j060386M959687Q027859
$$ y = [2300861, 373251, -33632, -994052, -3847714, -4970097, -1094821, 4428703, 5693762, 2367220, -1038921, -2400212, -3519322, -5181779, -5614572, -4331924, -3373346, -3643604, -3286232, -940507, 1942836, 3274248, 2891805, 1964277, 1348116, 1253155, 1288807, 472371, -1596279, -3502775, -3367436, -1454648, 105170, 258130, -11934, 106942, -74952, -1210202, -2622351, -3412217, -3639113, -3626886, -3213654, -2529145, -2542191, -3854088, -5535211, -5987498, -4642667, -2309489, -255303, 546006, -397419, -2993628, -6400850, -8996876, -8852542, -5091932, 655059, 4879786, 5378937, 3571871, 2538581, 2883300, 1998397, -2015427, -6908997, -7969383, -3009696, 5018163]
36740E018163N573100j3558m117978m678431l558113l070915k684803p53331J719474
36731f566392J911361k47188j471318n6557J651744J443752Q65482J931060K793156
36722B255100M49548l642104m747209j509089K248787K935368J172248o44633
36714a481984j797023k563886k323897m45042K011405L101101K064692j96733
36706a631367k084386k277343o02486J590463K641244K297171J367170J218k063972
36697g62288l653333k807324M1062J764529O55186j126988p95167J141746K173870
36688c368707J614220Q15282L75453m39762j581033j689026j89187J618956K211393
36679f32411J625480J097261J469790K250329K095978M34001j407150j544288
$$ y = [5018163, 10591263, 10577705, 6459727, 1781296, -1776817, -4847732, -7532535, -8285866, -6566392, -4655031, -4902219, -6373537, -6430094, -4778350, -3334598, -2469116, -538056, 2255100, 2704648, -937456, -5684665, -7193754, -4944967, -2009599, -837351, -1481984, -3279007, -5842893, -8166790, -8611832, -6600427, -3499326, -1434634, -1631367, -3715753, -5993096, -6595582, -5005119, -2363875, -66704, 1300466, 1301684, -762288, -4415621, -7222945, -7181883, -5417354, -4762168, -5889156, -6684323, -5542577, -3368707, -1754487, -939205, -563752, -1003514, -2584547, -4273573, -4462760, -2843804, -632411, 993069, 2090330, 3560120, 5810449, 7906427, 8340428, 6933278, 5388990]
36671E388990k65464J6642j612866k731428j091720J572797J802844m38295j886096
36662G55404j101464k59730j075864k000808j076503Q59514J806147J589600J179218
36653F75514N25198p36572j588564r72163q4150r78298l189966m024983k270871
36644a2644855M55640K340208L391393M263153M730450M110943K110146j031272
36636G725806m074655m687052j719833K326953L455414J312537m39284J59426
36628D059312M51306j979230m696326m035594j008214N08513J8795K91533J641246
36619d748659J363655o21821p16006K107899L856960J900820p06108o33046K26954
36610B030648j071351k637196j297942R50068J44701k034456o94904L128897L216882
$$ y = [5388990, 5123526, 5140168, 3527302, 795874, -295846, 1276951, 3079795, 2641500, 755404, -346060, -605790, -1681654, -3682462, -4758965, -3899451, -2093304, -503704, 675514, 1200712, 464140, -1124424, -2096587, -2180737, -3159035, -6349001, -10373984, -12644855, -12189215, -9849007, -6457614, -2194461, 2535989, 6646932, 8757078, 7725806, 3651151, -1035901, -2755734, -428781, 3026633, 4339170, 3899886, 4059312, 4510618, 2531388, -2164938, -6200532, -7208746, -6700233, -6681438, -6389905, -4748659, -3385004, -4006825, -4722831, -2614932, 1242028, 3142848, 2436740, 1803694, 2030648, 959297, -1677899, -2975841, -2025773, -1881072, -3915528, -4610432, -1481535, 1735347]
36601A735347j350635m075964j566760J238972l0459k035405n25878J875762R93823
36592c741197q80074M70434K626426O99579k664953o15652N438131O395453l3548
36583G694599m806153j327492M502801L790880k121026m873464j635045K519626
36575C744726K995817M52627k250459l086906j046978K777219M590574J944800
36567A0121420k087789k439676P00929K233141j25205k782202k180191J51684
36559C592111O93322p84166j722454r37921K31643L76758k53095n56231j03039
36550E36928M44928K77923l11109j48368R46124J403067P4977j725199j956793
36541d57522r65389q44283j945248k316971r34539P50754J304497J407816K297668
$$ y = [1735347, 384712, -3691252, -5258012, -4019040, -4049499, -6084904, -6610782, -4735020, -3741197, -4621271, -4150837, -1524411, -824832, -3489785, -4105437, 1332694, 7728147, 7694599, 2888446, 1560954, 6063755, 9854635, 7733609, 2860145, 1225100, 3744726, 6740543, 7193170, 4942711, 1855805, 808827, 3586046, 8176620, 10121420, 8033631, 5593955, 6294884, 8528025, 8402820, 5620618, 3440427, 3592111, 4285433, 3501267, 1778813, 840892, 1072535, 1449293, 1196198, 639967, 536928, 981856, 1259779, 948670, 800302, 1746426, 3149493, 3224470, 1499271, -457522, -1422911, -2267194, -4212442, -6529413, -7463952, -6713198, -5408701, -4000885, -1703217]
36532a703217L566002L760417K303324l5615j895132k183424j053739r9854m44230
36523B214532q58412M46335K364054J889666q98008k025442N13195L146801J817024
36514H609745j748990k646916l69117N69020k210536n270153m458262n48361K558640
36505e514930L126249K402795J393065k30849j997415k067036P9615K099097J500279
36496G90870r56841k261028j356101n07212j713170l360157k269951J513751M213189
36487e906650L184623L67436n99429O88452J544428P18239O9318R67402J604466
36478B638285L66k065084j230517J803777K441438q76174l477119j086137L098963
36469A247798K448179l019479n961343k288390K777656K485123j738612l201317
$$ y = [-1703217, 1862785, 5623202, 7926526, 7890911, 5995779, 3812355, 2758616, 2658762, 2214532, 1356120, 1802455, 4166509, 6056175, 5158167, 3132725, 3645920, 6792721, 8609745, 6860755, 4213839, 3844722, 4413742, 2203206, -3066947, -7525209, -8073570, -5514930, -2388681, 14114, 1407179, 1176330, -821085, -2888121, -2808506, -709409, 790870, -165971, -2426999, -3783100, -4290312, -6003482, -9363639, -11633590, -10119839, -5906650, -2722027, -2354591, -2954020, -2265568, -721140, -2901, 66417, 1033819, 2638285, 2638651, 573567, -656950, 1146827, 3588265, 2712091, -765028, -1851165, 1247798, 3695977, 676498, -5284845, -7573235, -4795579, -2310456, -4049068, -7250385]
$$ [...]
##END NTUPLES=NMR SPECTRUM
##END=
