##TITLE=31Pdec_SR19_rm
 , 24 sc
 2.10.2020
##JCAMPDX= 6.0         $$ Bruker NMR JCAMP-DX V2.0
##DATA TYPE= NMR SPECTRUM
##DATA CLASS= NTUPLES
##ORIGIN= UXNMR, Bruker Analytische Messtechnik GmbH
##OWNER= root
$$ XWIN-NMR		Version 3.5
$$ Fri Oct  2 10:42:53 2020 Russian Standard Time (UT+4h)  she@DPX200
##.OBSERVE FREQUENCY= 81.013821
##.OBSERVE NUCLEUS= ^31P
##.ACQUISITION MODE= SIMULTANEOUS
##.ACQUISITION SCHEME= undefined
##.AVERAGES= 24
##.DIGITISER RES= 17
##SPECTROMETER/DATA SYSTEM= spect
##.PULSE SEQUENCE= zgpg30
##.SOLVENT NAME= CDCl3
##.SHIFT REFERENCE= (INTERNAL, CDCl3, 0, 182.463)
##AUDIT TRAIL= $$ (NUMBER, WHEN, WHO, WHERE, WHAT)
$$ ##TITLE= Audit trail, XWIN-NMR		Version 3.5
$$ ##JCAMPDX= 5.01
$$ ##ORIGIN= Bruker BioSpin GmbH
$$ ##OWNER= she
$$ F:/spectra/data/she/nmr/P31/1/pdata/1/auditp.txt
$$ ##AUDIT TRAIL=  $$ (NUMBER, WHEN, WHO, WHERE, WHAT)
(   1,<2020-10-02 10:41:11.70 +0400>,<she>,<DPX200>,
      <created by zg, POWCHK disabled, PULCHK disabled
       configuration hash MD5:
       00 E9 B6 7A A2 85 ED C7 34 08 36 98 17 FE 4E 26
       data hash MD5: 32K
       A9 FF 10 F7 2A EE AA 89 64 2D 83 4F 7A 71 EF 6C>)
(   2,<2020-10-02 10:41:59.01 +0400>,<she>,<DPX200>,
      <Start of raw data processing
       efp BC_mod = 2 LB = 1 FT_mod = 6 PKNL = 1 PHC0 = -2731.379 PHC1 = 68.00137 SI = 64K 
       data hash MD5: 64K
       92 98 57 C2 06 FA B8 BB C6 5C 58 32 B7 17 CD 1C>)
(   3,<2020-10-02 10:42:29.09 +0400>,<she>,<DPX200>,
      <pk PHC0 = 7.410862 PHC1 = -99.40002 
       data hash MD5: 64K
       E2 49 3D FC AD CB 21 34 34 E2 48 33 CD 1F CF 54>)
(   4,<2020-10-02 10:42:32.76 +0400>,<she>,<DPX200>,
      <abs ABSG = 5 
       data hash MD5: 64K
       BA 6B 2E 71 DD BA 87 C2 4D 17 34 31 E0 D5 10 6F>)
$$ ##END=
$$ 
$$ hash MD5
$$ D1 19 A3 7E 5A D9 6D 3F 2D F6 5A 12 31 85 A8 7A
##$RELAX= 
##$RELAX= 
##$RELAX= 
##$RELAX= 
##$RELAX= 
##$RELAX= 
##$RELAX= 
##$RELAX= 
$$ Bruker specific parameters
$$ --------------------------
##$DU= <F:/spectra>
##$EXPNO= 1
##$NAME= <P31>
##$PROCNO= 1
##$TYPE= <nmr>
##$USER= <she>
##$AMP= (0..31)
100 100 100 100 100 100 100 100 100 100 100 100 100 100 100 100 100 100 
100 100 100 100 100 100 100 100 100 100 100 100 100 100 
##$AQSEQ= 0
##$AQ_mod= 1
##$AUNM= <au_zg>
##$AUTOPOS= <>
##$BF1= 81.014009
##$BF2= 200.13
##$BF3= 200.13
##$BF4= 200.13
##$BF5= 200.13
##$BF6= 200.13
##$BF7= 200.13
##$BF8= 200.13
##$BYTORDA= 1
##$CFDGTYP= 0
##$CFRGTYP= 5
##$CHEMSTR= <none>
##$CNST= (0..31)
1 1 145 1 1 1 1 1 1 1 1 1 1 1 1 1 1 1 1 1 1 1 1 1 1 1 1 1 1 1 1 1 
##$CPDPRG= <waltz16>
##$CPDPRG1= <>
##$CPDPRG2= <waltz16>
##$CPDPRG3= <>
##$CPDPRG4= <mlev>
##$CPDPRG5= <mlev>
##$CPDPRG6= <mlev>
##$CPDPRG7= <mlev>
##$CPDPRG8= <mlev>
##$CPDPRGB= <>
##$CPDPRGT= <>
##$D= (0..31)
0 1 0 0 0 0 0 0 0 0 0 0.03 2e-05 3e-06 0 0 0 0 0 0 0 0 0 0 0 0 0 0 0 0 
0 0 
##$DATE= 1601620871
##$DBL= (0..7)
120 120 120 11 120 120 24 19 
##$DBP= (0..7)
150 150 150 150 150 150 150 150 
##$DBP07= 0
##$DBPNAM0= <>
##$DBPNAM1= <>
##$DBPNAM2= <>
$$ [...]
##$SUBNAM3= <"">
##$SUBNAM4= <"">
##$SUBNAM5= <"">
##$SUBNAM6= <"">
##$SUBNAM7= <"">
##$SUBNAM8= <"">
##$SUBNAM9= <"">
##$SW= 369.568048894756
##$SWIBOX= (0..15)
0 1 3 0 0 0 0 0 0 0 0 0 0 0 0 0 
##$SW_h= 29940.119760479
##$TD= 32768
##$TD0= 1
##$TE= 0
##$TE2= 300
##$TE3= 300
##$TEG= 300
##$TL= (0..7)
0 120 53 12 22 120 120 120 
##$TP= (0..7)
150 150 150 150 150 150 150 150 
##$TP07= 0
##$TPNAME0= <>
##$TPNAME1= <>
##$TPNAME2= <>
##$TPNAME3= <>
##$TPNAME4= <>
##$TPNAME5= <>
##$TPNAME6= <>
##$TPNAME7= <>
##$TPOAL= (0..7)
0.5 0.5 0.5 0.5 0.5 0.5 0.5 0.5 
##$TPOFFS= (0..7)
0 0 0 0 0 0 0 0 
##$TUNHIN= 0
##$TUNHOUT= 0
##$TUNXOUT= 0
##$USERA1= <user>
##$USERA2= <user>
##$USERA3= <user>
##$USERA4= <user>
##$USERA5= <user>
##$V9= 5
##$VALIST= <valist>
##$VCLIST= <CCCCCCCCCCCCCCC>
##$VD= 0
##$VDLIST= <DDDDDDDDDDDDDDD>
##$VPLIST= <PPPPPPPPPPPPPPP>
##$VTLIST= <TTTTTTTTTTTTTTT>
##$WBST= 1024
##$WBSW= 4
##$XGAIN= (0..3)
0 0 0 0 
##$XL= 0
##$YL= 0
##$YMAX_a= 32081
##$YMIN_a= -28308
##$ZGOPTNS= <>
##$ZL1= 120
##$ZL2= 120
##$ZL3= 120
##$ZL4= 120
##$ABSF1= 182.463
##$ABSF2= -187.1042
##$ABSG= 5
##$ABSL= 3
##$ALPHA= 0
##$AQORDER= 0
##$ASSFAC= 0
##$ASSFACI= 0
##$ASSFACX= 0
##$ASSWID= 0
##$AUNMP= <proc_1d>
##$AZFE= 0.1
##$AZFW= 0.5
##$BCFW= 0
##$BC_mod= 2
##$BYTORDP= 0
##$COROFFS= 0
##$CY= -3
##$DATMOD= 1
##$DC= 0
##$DFILT= <>
##$DTYPP= 0
##$F1P= 0
##$F2P= 0
##$FCOR= 1
##$FTSIZE= 65536
##$FT_mod= 6
##$GAMMA= 0
##$GB= 0
##$INTBC= 1
##$INTSCL= 5.30512e-09
##$ISEN= 30
##$LB= 1
##$LEV0= 0
##$LPBIN= 0
##$MAXI= 10000
##$MC2= 0
##$MEAN= 0
##$ME_mod= 0
##$MI= 50
##$NCOEF= 0
##$NC_proc= -10
##$NLEV= 6
##$NOISF1= 182.463
##$NOISF2= 159.3651
##$NSP= 0
##$NTH_PI= 0
##$NZP= 0
##$OFFSET= 182.463
##$PC= 4
##$PHC0= -2723.968
##$PHC1= -31.39864
##$PH_mod= 1
##$PKNL= yes
##$PPARMOD= 0
##$PSCAL= 0
##$PSIGN= 0
##$REVERSE= no
##$SF= 81.0140089999434
##$SI= 65536
##$SIGF1= 159.3651
##$SIGF2= -187.1042
##$SINO= 113.3802
##$SIOLD= 16384
##$SREGLST= <1H.CDCl3>
##$SSB= 0
##$STSI= 65536
##$STSR= 0
##$SW_p= 29940.119760479
##$SYMM= 0
##$S_DEV= 0
##$TDeff= 32768
##$TDoff= 0
##$TI= <>
##$TILT= no
##$TM1= 0
##$TM2= 0
##$TOPLEV= 0
##$USERP1= <user>
##$USERP2= <user>
##$USERP3= <user>
##$USERP4= <user>
##$USERP5= <user>
##$WDW= 1
##$XDIM= 65536
##$YMAX_p= 405580089
##$YMIN_p= -218294401
$$ End of Bruker specific parameters
$$ ---------------------------------
##NTUPLES= NMR SPECTRUM
##VAR_NAME=  FREQUENCY,     SPECTRUM/REAL,   SPECTRUM/IMAG
##SYMBOL=    X,             R,               I
##VAR_TYPE=  INDEPENDENT,   DEPENDENT,       DEPENDENT
##VAR_FORM=  AFFN,          ASDF,            ASDF
##VAR_DIM=   65536,         65536,           65536
##UNITS=     HZ,            ARBITRARY UNITS, ARBITRARY UNITS
##FACTOR=    0.456856943014862, 1,           1
##FIRST=     14782.0589164792, 0,            0
##LAST=      -15158.0608439998, 0,           0
##MIN=       -15158.0608439998, -218294401,  0
##MAX=       14782.0589164792, 405580089,    0
$$ Real data points
##PAGE= N=1
##DATA TABLE= (X++(R..R)), XYDATA
$$ [...]
42625D130742p139544O919812M575931j1284303j5394170J566623J9367750J8564075
$$ 4130742 -3008802 3911010 8486941 -2797362 -18191532 -16624909 2742841 21306916
42617B1306916N137625n159283r687757j1685659n096493J3503723K7295425J6566793
$$ 21306916 26444541 21285258 11597501 -88158 -5184651 8319072 35614497 52181290
42609E2181290r139989j9316367n234773Q030788q63757k1214350l0407794k3363767
$$ 52181290 43041301 23724934 18490161 26520949 25657192 4442842 -25964952 -49328719
42601d9328719q416631Q439818J9210863J1338073j0154790j3860201J8977898
$$ -49328719 -57745350 -49305532 -30094669 -18756596 -28911386 -42771587 -23793689
42594b3793689N8237212N7326067J5846680k1536516k7597550j9733768j8798155
$$ -23793689 34443523 91769590 107616270 86079754 58482204 38748436 19950281
42587A9950281j6444637n19555J6455256J7506214R220024O503018N690917l830324
$$ 19950281 3505644 2986089 19441345 36947559 46167583 52670601 58361518 54531194
42579E4531194j4118551r164004P037906J5444293J0103157J410104m113714p762672
$$ 54531194 40412643 31248639 38286545 53730838 63833995 65244099 61130385 53367713
42571E3367713o634883J875682O365746o251876k4988175k3624913J348935K3138180
$$ 53367713 46732830 48608512 54974258 48722382 23734207 109294 1458229 24596409
42563B4596409K1447641O631932k372330m948261r226183j0711646Q08852J9533423
$$ 24596409 46044050 52675982 50303652 45355391 36129208 25417562 26226414 45759837
42555D5759837K5735287R949887j5587984l1131598k8651121j6098093o546555
$$ 45759837 71495124 81445011 65857027 34725429 6074308 -10023785 -16570340
42548a6570340m150333r70526J0289294K2821749K2444772Q079371m536240l695334
$$ -16570340 -20720673 -21691199 -11401905 11419844 33864616 41943987 37407747 33712413
42540C3712413L903385O789520O656547J1089207J5614057Q369188q600974j7808213
$$ 33712413 37615798 44405318 51061865 62151072 77765129 86134317 77533343 59725130
42532E9725130r727672M708345J0959492R382908Q533916Q959961M834710l635001
$$ 59725130 49997458 54705803 65665295 75048203 83582119 92542080 97376790 93741789
42524I3741789j1140885j7445106k4309045k4149243o902348J9398506L1009021
$$ 93741789 82600904 65155798 40846753 16697510 9795162 29193668 60202689
42517F0202689J8751836R12416m930093p661170k2810996l9060072k9254641P407556
$$ 60202689 78954525 79866941 74936848 67275678 44464682 5404610 -23850031 -16442475
42509a6442475L8620149L9622760K0176502K872246o594715j5062953k2646621
$$ -16442475 22177674 61800434 81976936 84849182 78254467 63191514 40544893
42502D0544893k2886189j4090890M19451J6128247K3934020J4047694p427203
$$ 40544893 17658704 3567814 3987265 20115512 44049532 58097226 50670023
42495E0670023j8527501r952956Q2915n339488j3320912l721344J1993570M797531
$$ 50670023 32142522 22189566 22272481 16932993 3612081 -109263 11884307 16681838
42487A6681838k1815415k8884596J882928L7837055L8764075R426269j2804777
$$ 16681838 -5133577 -34018173 -32135245 5701810 44465885 53892154 41087377
42480D1087377r087185N806061J3543374J3315389R823509M20303j5391971k6473335
$$ 41087377 32000192 37806253 51349627 64665016 74488525 74908828 59516857 33043522
42472C3043522k2903770j1704444o697180n693681O730456L0407487M0068801
$$ 33043522 10139752 -1564692 -8261872 -13955553 -7225097 23182390 63251191
42465F3251191J7291112j9458493l4741101k0740666j369106P073414J3809736
$$ 63251191 80542303 61083810 26342709 5602043 4232937 11306351 25116087
42458B5116087K4379277K0917320p593027l5269281k7770949P925057K9918855
$$ 25116087 49495364 70412684 62819657 27550376 -220573 7704484 37623339
42451C7623339J6345057j1004726k1242267j0080052O303360J4472931J1021007
$$ 37623339 53968396 42963670 21721403 11641351 17944711 32417642 43438649
42444D3438649m595q122223m361044O429539J0294259L602452l563126n270172
$$ 43438649 43434054 35311831 30950787 37380326 47674585 51277037 47713911 42443739
42436D2443739o852169j0322462q055920J928512Q399771L459589m850400m648659
$$ 42443739 35591570 25269108 17213188 19141700 27541471 31001060 26150660 21502001
42428B1502001N237129J8606074K7608024K0263672j0581765m6171361m8732412
$$ 21502001 26739130 45345204 72953228 93216900 82635135 36463774 -12268638
42421a2268638o867993M0218686M4643271P106375k8565220l1850748j3292346
$$ -12268638 -19136631 21082055 65725326 72831701 44266481 12415733 -876613
42414h76613L115138J0219708J1788527O332231p028853j6076084n480435K0462304
$$ -876613 2238525 12458233 24246760 30578991 23550138 7474054 1993619 22455923
42406B2455923L6707408K4806810m023481k0722708j2568193L540213O484434
$$ 22455923 59163331 83970141 79946660 59223952 46655759 50195972 56680406
42399E6680406p76124j175449M950808j020409k2318359l3800199j5572668J6397507
$$ 56680406 55904282 54728833 59679641 58659232 36340873 2540674 -13031994 3365513
42391C365513L0386222J9143411J861362o920668r837815r714855j367749J3052344
$$ 3365513 33751735 52895146 54756508 47835840 37998025 28283170 26915421 39967765
42383C9967765J6799831j554341k8519006l7060785j7374982R999710J5446340
$$ 39967765 56767596 55213255 26694249 -10366536 -27741518 -17741808 -2295468
42376b295468n889881k6541812j8918319Q734640K1549912N103848j4307590p738181
$$ -2295468 -8185349 -34727161 -53645480 -44910840 -23360928 -18257080 -32564670 -40302851
42368d0302851J4498169J9323755m06657j8767004j7304675p538511n780594p129248
$$ -40302851 -25804682 -6480927 -6887584 -25654588 -42959263 -50497774 -56278368 -63407616
42360f3407616J754265J8320858K7776322K3678925J2809426L961970R91662L074579
$$ -63407616 -61653351 -43332493 -15556171 8122754 20932180 24894150 25885812 28960391
42352B8960391M479226j824359j4039723k0252278j3886877l960105j030840L17886
$$ 28960391 33439617 31615258 17575535 -2676743 -16563620 -20523725 -21554565 -21236679
42344b1236679J1633986K6445135K3067319l301673k6177540j8147942J1846131
$$ -21236679 -9602693 16842442 39909761 36608088 10430548 -7717394 4128737
42337D128737K6924727Q537159k0041849k4576859l896402J1691715L724827j0578242
$$ 4128737 31053464 39590623 19548774 -5028085 -8924487 2767228 6492055 -4086187
42329d086187o625682R935114J2735624k950748j0760334N877955K4322029J3801315
$$ -4086187 -10711869 -776755 11958869 9008121 -1752213 4125742 28447771 42249086
42321D2249086j6130408k4726530K374827L1975991L0945942J0730136K866504
$$ 42249086 26118678 1392148 3766975 35742966 66688908 77419044 80285548
42314H0285548Q267249J975099j8205935k3576505k610975J5485126L940711k0494788
$$ 80285548 88552797 90527896 72321961 48745456 46134481 61619607 65560318 45065530
42306D5065530k4774771r311574p78684n631100k924271J6952174L5005616L1078108
$$ 45065530 20290759 10979185 10200501 4569401 1645130 18597304 53602920 84681028
42298H4681028P070204k1967512m0587968l4539055k115854L1183069L2450953
$$ 84681028 91751232 69783720 29195752 -5343303 -7459157 23723912 56174865
42291E6174865L220355k0625135j7438136k610424O188539J5440992K9632503
$$ 56174865 59395220 38770085 21331949 18721525 24910064 40351056 69983559
42284F9983559K9739498N344923j6986724j0251818P330581l88900k7847684l5446063
$$ 69983559 99723057 105067980 88081256 77829438 85160019 84771119 56923435 21477372
42276B1477372j2127213R998656P559989m711282p083675m451079o925371p850688
$$ 21477372 9350159 19348815 26908804 22197522 15113847 10662768 3737397 -4113291
42268d113291m97275L766443n904842j7764111j3401746M281732J6771319J6668201
$$ -4113291 -4610566 -844123 -6748965 -24513076 -37914822 -33633090 -16861771 -193570
42260a93570J1701233N783062o202481k1642620k3237323J14610L1469048L8844779
$$ -193570 11507663 17290725 11088244 -10554376 -33791699 -33677089 -2208041 36636738
42252C6636738J4330016j1670440p594854J6038778K0632638m627036k6895353
$$ 36636738 50966754 39296314 31701460 47740238 68372876 63745840 36850487
42245C6850487j8356852O104509J7699152J5171170J2237474N768481j1032617
$$ 36850487 18493635 24598144 42297296 57468466 69705940 75474421 64441804
42238F4441804k0660461m353359J7564664R310673k1273854l0764271q544008
$$ 64441804 43781343 39427984 56992648 66303321 45029467 14265196 5721188
42231E721188Q596363o08724j0145522M014198K4278393K5241288J2557088L116694
$$ 5721188 14317551 13708827 3563305 7577503 31855896 57097184 69654272 72770966
42223G2770966l074863p673658j317650J0200511M71683k9722379l5943276K944792
$$ 72770966 69696103 62022445 60704795 70905306 71376989 41654610 5711334 8656126
42215H656126L7849045J6341120l3379157m1453754n82545K9672550J7193781
$$ 8656126 46505171 62846291 29467134 -11986620 -12569165 17103385 34297166
42208C4297166n340460n398461L390619k46207o912559k134662M958958L614064
$$ 34297166 28956706 23558245 26948864 26702657 19790098 17655436 22614394 26228458
42200B6228458L947037J4092518J9136092O067950j0370283r428241L914762R584231
$$ 26228458 30175495 44268013 63404105 69472055 59101772 49673531 53588293 63172524
42192F3172524J922692r703641j8701870k3293116k0203895j0162125j374166
$$ 63172524 65095216 55391575 36689705 13396589 -6807306 -16969431 -18343597
42185a8343597K119496M930718O673270M32901o944599M483129L2194792M1390193
$$ -18343597 -16224101 -11293383 -4620113 -4187212 -11131811 -6648682 25546110 66936303
42177F6936303J4256526j4478585m363301K6002397K3140312j8464719m4796210
$$ 66936303 81192829 66714244 62350943 88353340 111493652 93028933 48232723
42170D8232723k3034883J0838300R519568j6368860k2077173O17597J7516583
$$ 48232723 25197840 36036140 45555708 29186848 7109675 7727272 25243855
42163B5243855R438403m168829m463079j554840q465233j3306918J051191K5749338
$$ 25243855 34682258 30513429 26050350 24495510 16030277 2723359 3774550 29523888
42155B9523888L5724180K2244703j042791j7106914j6165831K923315K5195185
$$ 29523888 65248068 87492771 86449980 69343066 53177235 56100550 81295735
42148H1295735K3712624q477288l9395104l4403915l268263J6534324J5839429
$$ 81295735 105008359 96531071 57135967 22732052 19463789 35998113 51837542
42141E1837542J7398347K5632648J6681306j1728151k6054877j2880702m370067
$$ 51837542 69235889 94868537 111549843 99821692 73766815 60886113 56516046
42134E6516046j8402665j8327492K4201133O5436715M5344026j8698375n5911408
$$ 56516046 38113381 19785889 43987022 109423737 154767763 136069388 80157980
42127H0157980m4855377k6734889k1505250k322261L5014690M7085970J4893900
$$ 80157980 35302603 8567714 -12937536 -15259797 19754893 66840863 81734763
42120H1734763j8488730j6106325l85044j057313j471281J6644106K2603667j0712001
$$ 81734763 63246033 47139708 46754664 45697351 44226070 60870176 83473843 72761842
42112G2761842m2031186j7500673L3794414L5144023j6147815m1083857k889265
$$ 72761842 30730656 13229983 47024397 82168420 66020605 24936748 22047483
42105B2047483L7722367K1582933k0508557k5994316J337022R549386j2393629
$$ 22047483 59769850 81352783 60844226 34849910 36186932 45736318 33342689
42098C3342689k3541431k546964K2093933K1998278Q230134M086165Q178983N018570
$$ 33342689 9801258 7254294 29348227 51346505 59576639 63662804 71841787 76860357
42090G6860357o650860j5841837j7914167j4141000j850961J7363589K5859003
$$ 76860357 70209497 54367660 36453493 22312493 20461532 37825121 63684124
42083F3684124O894934k6051140l7119629j2737259J8553204K3206319N704636
$$ 63684124 70579058 44527918 7408289 -5328970 13224234 36430553 42135189
42076D2135189k896927R343789K2639111J8157465K590867o651254m889702K88263
$$ 42135189 39238262 48582051 71221162 89378627 91969494 85318240 80428538 80716801
42068H0716801J306680n719782j8988884k5512206j0179016K0032368L4473669
$$ 80716801 82023481 76303699 57314815 31802609 21623593 41655961 76129630
42061G6129630J5866966j2475226j4995042P713377K0369803K326560k5845507
$$ 76129630 91996596 79521370 64526328 72239705 92609508 94936068 69090561
42054F9090561l1756807j0674525J4845395K4036007J5273665j08502j0649750
$$ 69090561 37333754 26659229 41504624 65540631 80814296 80705794 70056044
42047G0056044j1479256n040027K172893N081461L277430n81862m429844q224004
$$ 70056044 58576788 53536761 55709654 60791115 64068545 63486683 59056839 50832835
42039E0832835j1898280j2711254p163709K626081Q123084N155623K146607Q903783
$$ 50832835 38934555 26223301 19059592 21685673 29808757 34964380 37110987 46014770
42031D6014770J9004369J5533379l797863k0859423k1689943j2972539o061265
$$ 46014770 65019139 80552518 76754655 55895232 34205289 21232750 15171485
42024A5171485J12032P403206M843622j3858794k9483229j7595281J3523201K9160224
$$ 15171485 15283517 22686723 27530345 13671551 -15811678 -33406959 -19883758 9276466
42016I276466J5335270k931997M71802J6004168J5328829o227670k2248065j0312174
$$ 9276466 24611736 21679739 22151541 38155709 53484538 47256868 25008803 14696629
42008A4696629J8080464K9855470J0013970j8387730k0262655P899058L2264099
$$ 14696629 32777093 62632563 72646533 54258803 33996148 41895206 74159305
42001G4159305K4572602k355263j5362283p234734j732827j3708017k6196136
$$ 74159305 98731907 96376644 81014361 73779627 72046800 58338783 32142647
41994C2142647j6417532J0554535K7768697K0232637J485679m405019Q368464
$$ 32142647 15725115 26279650 54048347 74280984 75766663 71361644 79730108
41987G9730108K0691061J2151772j2198862k7257005k0695605o772218k67121
$$ 79730108 100421169 112572941 100374079 73117074 52421469 45649251 45382130
41980D5382130O334759K2604546L2145641J2154219k4529614l7751132j4916444
$$ 45382130 51716889 74321435 106467076 118621295 94091681 56340549 41424105
41973D1424105J1185756J0300377o087850j0628099k351147Q32167l076503N1756
$$ 41424105 52609861 62910238 56822388 46194289 43843142 44675309 41598806 41650562
41965D1650562J0988584J2672358j355053j3615283o630832J1896659J8551502
$$ 41650562 52639146 65311504 63956451 50341168 43710336 55606995 74158497
41958G4158497M337428j4234274j6415365l562805L487869o370722j8072609j1126639
$$ 74158497 78495925 64261651 47846286 44283481 47771350 41400628 23328019 12201380
41950A2201380J0772377K3838327J5180414l999857j6697727j8444615j4565307
$$ 12201380 22973757 46812084 61992498 57992641 41294914 22850299 8284992
41943H284992j0274223o989091j221853J1483366K3862280J6749437j2808159
$$ 8284992 -1989231 -8978322 -10200175 1283191 25145471 41894908 29086749
41936B9086749l3561856j5641592K2144729L3413983J2173126q3632J5910330
$$ 29086749 -4475107 -20116699 2028030 35442013 47615139 47531507 63441837
41929F3441837K5237133n00788l3122443l4059124j5434991j1469658j6421599
$$ 63441837 88678970 88178182 55055739 20996615 5561624 -5908034 -22329633
41922b2329633j563797K3678309K2496518l544157j3982467K254465J1063945
$$ -22329633 -23893430 -215121 22281397 18737240 4754773 7009238 18073183
41915A8073183l157981r770704J1132766L1008674K2000446M271998P941826J8852961
$$ 18073183 14915202 5144498 16277264 47285938 69286384 73558382 81500208 100353169
41907A00353169M424588k5603458k8337633O778274L9325940L1414151n992042
$$ 100353169 104777757 79174299 50836666 57614940 96940880 128355031 122362989
41900A22362989l0668413j9328943Q505547J4303518j2952825l9174729k6178821
$$ 122362989 91694576 72365633 80871180 95174698 82221873 43047144 16868323
41893A6868323J4084912L1311941O864488k1182479j9094780o564625j3181315
$$ 16868323 30953235 62265176 69129664 47947185 28852405 22287780 9106465
41886I106465j9847530Q091507N0130658N0657292N770907k7852586j9950219
$$ 9106465 -10741065 -2649558 47481100 98138392 103909299 76056713 56106494
41879E6106494n906620j7587806k9158699q730046K0277857J7548829m428308
$$ 56106494 50199874 32612068 3453369 -5276677 15001180 32550009 28121701
41872B8121701j804192K6030368L6775100J5832139m882206m821772l369383j4889040
$$ 28121701 26317509 52347877 89122977 104955116 100072910 95251138 91881755 76992715
41864G6992715j8561439J846271K2912506J6767534m303577j0339338j403838
$$ 76992715 58431276 60277547 83190053 99957587 95654010 85314672 83910834
41857H3910834O22497n637431k395543R792624J0903571j582585p511463j113841
$$ 83910834 84533331 78895900 76500357 86292981 97196552 95613967 88102504 86988663
41849H6988663j517641j5875230k2337144o518221J1542694Q554414n294556n635776
$$ 86988663 85471022 69595792 47258648 40740427 52283121 60837535 55542979 49907203
41841D9907203O429727J1244844O086263N044081Q994770M669501o658423q027888
$$ 49907203 56336930 67581774 73668037 78712118 87706888 92376389 85717966 77690078
41833G7690078J317968O04634j6618557k7692314j6611030p01727j373248q252708
$$ 77690078 79008046 79612680 62994123 35301809 18690779 17989052 16615804 8363096
41825H363096J382703K0711774K1434598J99637j3444284j490401J6657072J5809657
$$ 8363096 9745799 30457573 51892171 52091808 38647524 37157123 53814195 69623852
41817F9623852J293999m870030M87315K261997l232454k541740Q572419J3996299
$$ 69623852 70917851 66047821 66535136 68797133 65564679 63022939 71595358 85591657
41809H5591657K442634j1880881q689372P441530J2970075J00306j1835436m659753
$$ 85591657 88034291 76153410 67464038 74905568 87875643 87975949 76140513 71480760
41801G1480760J3218647J9611152P544359j0493060k2313297k6911890k5900382
$$ 71480760 84699407 104310559 111854918 101361858 79048561 52136671 26236289
41794B6236289j7201823k823504O543346L704632k394042M425914K5295867M0487443
$$ 26236289 9034466 6210962 12754308 16458940 14064898 18490812 43786679 84274122
41786H4274122L0513486l64991k6852069k8399155q238303J3339648J9618279
$$ 84274122 114787608 114422617 87570548 59171393 50933090 64272738 83891017
41779H3891017R462573n748123j2674306p435501p10927o459635k0985771k2205916
$$ 83891017 93353590 87605467 74931161 67495660 66784733 60325098 39339327 17133411
41771A7133411K72445K4660096K4305030P962069P260139K4812665K6709139k824897
$$ 17133411 17405856 42065952 66370982 74333051 81593190 106405855 133114994 130290097
41763A30290097l2023305k8653791p793876k104775p921974J65546J6273203J0050134
$$ 130290097 98266792 69613001 61819125 59714350 51792376 51957922 68231125 78281259
41755G8281259j6935009k7322809p199892J3311998J1723333M950975J0225081
$$ 78281259 61346250 34023441 26823549 40135547 51858880 56809855 67034936
41748F7034936J2652064j487416j2457054n46186J4812727M825901j9852171k6390773
$$ 67034936 79687000 78199584 65742530 65196344 80009071 84834972 64982801 38592028
41740C8592028j1182945K177861N614610J0791909J7147977J1869219n75842l110203
$$ 38592028 27409083 29586944 35201554 45993463 63141440 75010659 74434817 71324614
41732G1324614Q95909o289566j7939134q251461J8602964K4903163k662225k9298722
$$ 71324614 72220523 65930957 47991823 39740362 58343326 83246489 80584264 51285542
41724E1285542k4374934k446190R949558J4801449K1524460J5885418j3211600
$$ 51285542 26910608 24464418 34413976 49215425 70739885 86625303 73413703
41717G3413703l7606505k1856894J9285326L5648514J1580157j7060644k0231538
$$ 73413703 35807198 13950304 33235630 68884144 80464301 63403657 43172119
41710D3172119j0802473j0309685j0281606P209448L0612575K9691680l40037
$$ 43172119 32369646 22059961 11778355 18987803 49600378 79292058 78952021
41703G8952021k9748636l2309078j4550874j3725K122159J318535O458321J6109757
$$ 78952021 49203385 16894307 2343433 2329708 4451867 5770402 12228723 28338480
41695B8338480K6175894L3418854K9226339N311460k6226448l4068307m819241
$$ 28338480 54514374 87933228 117159567 122471027 96244579 62176272 57357031
41688E7357031L1954879L6101306Q101771j5036358j2850229l378541o695627
$$ 57357031 89311910 125413216 133514987 118478629 105628400 102249859 95554232
41681I5554232j4277237r757626J512545L344411m562108r035934m090567M803425
$$ 95554232 81276995 71519369 73031914 76376325 71814217 62778283 58687716 63491141
41673F3491141R927725N570911p299940j4672611l050652J4519387Q333081k0970830
$$ 63491141 73418866 78989777 71689837 57017226 53966574 68485961 76819042 55848212
41665E5848212l3021546n302113K8572010K7546492M013100k061543J0801355
$$ 55848212 22826666 17524553 46096563 73643055 77656155 75594612 86395967
41658H6395967J1305113m212594o822784J0034209J8627344P113845k775949N77669
$$ 86395967 97701080 93488486 86665702 96699911 115327255 122441100 119665151 120242820
41650A20242820l87128j3213456j7956497o586548j07725o106032R902K6088877
$$ 120242820 119855692 106642236 88685739 82099191 81991466 75885434 75895336 101984213
41642A01984213L6813734R043652k4499035k5761746j1003164j4746895k4617818
$$ 101984213 138797947 147841599 123342564 97580818 86577654 71830759 47212941
41635D7212941o170451K7791355L1884295M173739j1056199J143342N228336j7172153
$$ 47212941 41042490 68833845 100718140 104891879 93835680 94979022 100207358 83035205
41627H3035205l1722522r285344K3055846K2194419p726862k5533070j1084289
$$ 83035205 51312683 42027339 65083185 87277604 79550742 54017672 42933383
41620D2933383J5469659K6436902J7245461L697567j02908K457125k058748j3411229
$$ 42933383 58403042 84839944 102085405 105782972 105680064 108137189 106078441 92667212
41612I2667212j3396887L428405J0968216j2341852m1830129l5220114K748983
$$ 92667212 79270325 82698730 93666946 81325094 39494965 4274851 7023834
41605G023834K4399291J0548483n096965N145095K2404540K0514344P000605j737902
$$ 7023834 31423125 41971608 36874643 42019738 64424278 84938622 91939227 90201325
41597I0201325j1611557k6789445k5859768L103614L0039475K2665484l085261
$$ 90201325 78589768 51800323 25940555 29044169 59083644 81749128 78663867
41590G8663867j0282605J190300N096146N79360P965744K2225387J7090335o388203
$$ 78663867 68381262 69571562 74667708 75247068 83212812 105438199 122528534 116140331
41582A16140331j9315978j4590607j4308800k2917545j6590859R739677K6264275
$$ 116140331 96824353 82233746 67924946 45007401 28416542 38156219 64420494
41575F4420494J5764099M78959K583945J1142194R404424M448591O239942M204037
$$ 64420494 80184593 80663552 83247497 94389691 103794115 108242706 114482648 118686685
41567A18686685j0433817k2208818j6223184m747584m423685o459363M366426
$$ 118686685 108252868 86044050 69820866 65073282 60649597 54190234 58556660
41560E8556660J8533722J7434207O047831K188650M832957Q92551o585189n630017
$$ 58556660 77090382 94524589 100572420 102761070 107594027 108486578 101901389 96271372
41552I6271372k487789j1474403k3351976j5973492M743847Q050876j2460291
$$ 96271372 93783583 82309180 58957204 42983712 47727559 55778435 43318144
41545D3318144k5713850j0946895J1071864J2968329K641795N880269K2380884
$$ 43318144 17604294 6657399 17729263 30697592 33339387 39219656 61600540
41538F1600540K6311414P075297j4517529j6551139n300068k384628j1411859
$$ 61600540 87911954 94987251 80469722 63918583 58618515 56233887 44822028
41531D4822028j3000497M771165K4926026K2761906J325521j1895221m501172
$$ 44822028 31821531 36592696 61518722 84280628 85606149 73710928 69209756
41524F9209756M355196l917471j7342762j2551376Q718712K2918343J8491180
$$ 69209756 73564952 69647481 52304719 39753343 48472055 71390398 89881578
41517H9881578O612439K1752j007805q00204j306752m248429q532863p032827
$$ 89881578 96494017 96515769 95507964 94707760 93401008 89152579 80619716 73586889
41509G3586889K714027R424234L700684l779071K128524J3315231R119411q122615
$$ 73586889 76300916 85725150 89425834 85646763 87775287 101090518 110209929 102087314
41501A02087314j4065191p47599J2089104R525117J08675n305112q331636q183150
$$ 102087314 88022123 87274524 99363628 108888745 108997420 103692308 95360672 87177522
41493H7177522J877635J3063809M351136j9521419k4412862J79088J7590516L10318
$$ 87177522 89055157 102118966 106470102 86948683 62535821 62714909 80305425 80615743
41485H0615743k2991984j3847383J0719545O828987k0040691k1777832J2844309
$$ 80615743 57623759 43776376 54495921 61324908 41284217 19506385 32350694
41478C2350694L9643248K9698361Q905380P219711J1886020j24452j7319700j5326370
$$ 32350694 71993942 101692303 110597683 117817394 129703414 129578962 112259262 96932892
41470I6932892M6325N504181P99163L536540J2344365P664607j2070701k4463014
$$ 96932892 96979217 102483398 103282561 106819101 119163466 126828073 114757372 90294358
41462I0294358j8232228r330432j2175278j5011846M67630K6537608L4609872
$$ 90294358 72062130 62731698 50556420 35544574 36012204 62549812 97159684
41455I7159684J2824862j5485874j9218382J168828J5035648M488555j0106470
$$ 97159684 109984546 94498672 75280290 76449118 91484766 95973321 85866851
41448H5866851j483397K0542970K1642545l751389k2849352j6307308o563672
$$ 85866851 84383454 104926424 126568969 122817580 99968228 83660920 77097248
41441G7097248j4016793j6761876J0522010M0489543K4381776k6291439m2062940
$$ 77097248 63080455 46318579 56840589 97330132 121711908 95420469 53357529
41434E3357529O381271N9802139N0625008m256166l2772686r355278K0609317
$$ 53357529 59738800 119540939 170165947 165909781 133137095 123781817 144391134
41427A44391134J6116073n833450q584616P115432J2978901J454506o946042q20714
$$ 144391134 160507207 154673757 146089141 153204573 166183474 167637980 160691938 159871224
41419A59871224M493981o801226k6182219l4091694k6515437j5357335q478158
$$ 159871224 164365205 157563979 131381760 97290066 70774629 55417294 46939136
41412D6939136k823076L764165O689255M076810K177935N638035R688700Q211739
$$ 46939136 44116060 47880225 54569480 58646290 60824225 66462260 76150960 84362699
41404H4362699L193682q66542n550001j2043030j1653283L818967K3770352K6369205
$$ 84362699 87556381 86689839 81139838 69096808 57443525 61262492 85032844 111402049
41396A11402049Q648094n566933K842827K0586278J9413662n360111k9223752
$$ 111402049 120050143 114483210 117326037 137912315 157325977 151965866 122742114
41389A22742114l0352819j2635205O102504J5330971J3940613K419526j4807665
$$ 122742114 92389295 79754090 85856594 101187565 115128178 117547704 102740039
41382A02740039k4516870j5558204M687368J5584417Q146129m690119p358845
$$ 102740039 78223169 62664965 67352333 82936750 91082879 86392760 79033915
41375G9033915j671036P01844k511211m596769m577906o811096p199322L392544
$$ 79033915 77362879 78064723 75553512 70956743 66378837 59567741 52368419 55760963
41367E5760963J8881819J9324077R69643j3130613o470083M279530l490919j8874281
$$ 55760963 74642782 93966859 94936502 81805889 75335806 79615336 76124417 57250136
41359E7250136j3267841J1428298K2707374P467306j0347993j1175192o624605
$$ 57250136 43982295 55410593 78117967 85585273 75237280 64062088 57437483
41352E7437483q450771k392763K0862528L5377200J5433731j6757872j8492746
$$ 57437483 48986712 46593949 67456477 102833677 118267408 101509536 83016790
41345H3016790P338598J6549547m769404j7764020N110843L3679345K5616089
$$ 83016790 90355388 106904935 102135531 84371511 89482354 123161699 148777788
41338A48777788r943542k8489710j4839248K384700k058685j7943707k1224878
$$ 148777788 138834246 110344536 95505288 97889988 95831303 77887596 56662718
41331E6662718p315088P626546Q317435m233071j4485764p578840J3391376K7223358
$$ 56662718 49347630 56974176 65291611 61058540 46572776 38993936 52385312 79608670
41323G9608670J7793174n518098j9097547j4869119p713885j1062342j6364520
$$ 79608670 97401844 91883746 72786199 57917080 50203195 39140853 22776333
41316B2776333n531064K1092927L9770210K9952117r1024k1830617j9813448o563106
$$ 22776333 17245269 38338196 78108406 108060523 107969499 86138882 66325434 59762328
41308E9762328J52555K583424J1902608K1003398J0834769j5332835k7772795
$$ 59762328 59914883 62498307 74400915 95404313 106239082 90906247 63133452
41301F3133452r765244J9393822L3769436L3171262K8544802J5068852j3300544
$$ 63133452 53368208 72762030 106531466 139702728 168247530 183316382 170015838
41294A70015838l5627572k3438630J3079084K9497928M975013k9932954l4703938
$$ 170015838 134388266 110949636 124028720 153526648 158501661 128568707 93864769
41287I3864769p965138J8255554J8719980l810370k7856993l3004913j6435078
$$ 93864769 85899631 104155185 122875165 119064795 91207802 58202889 41767811
41280D1767811M761874J3576921J4152297K0407902K6630761J2163418j9633105
$$ 41767811 46529685 60106606 74258903 94666805 121297566 133460984 113827879
41273A13827879l3832352j0932108K1764199K7723358J1347204L521320J0635861
$$ 113827879 79995527 69063419 90827618 118550976 129898180 133419500 144055361
41266A44055361J0369458n988637j9757687j7706544r532788l692854O839681
$$ 144055361 154424819 148436182 128678495 110971951 101439163 97746309 104585990
41259A04585990K0856182J7267600j0936419l2000632j3719869K5197261L4511203
$$ 104585990 125442172 142709772 131773353 99772721 86052852 111250113 145761316
41252A45761316J867513k9661835k2319441P929949K2691960J6789502J4095279
$$ 145761316 147628829 117966994 95647553 103577502 126269462 143058964 157154243
41245A57154243K0848094J6711904o405625k6772845k5243145j2528518r060501
$$ 157154243 178002337 194714241 188308616 161535771 136292626 123764108 114703607
41238A14703607j4488020j3986115l288715Q478977J2577622M613893j4898378
$$ 114703607 100215587 86229472 82940757 91419734 103997356 108611249 93712871
41231I3712871l1243935k0962762J5544789M1346999K6520732q012622j8798790
$$ 93712871 62468936 41506174 57050963 98397962 124918694 116906072 98107282
41224I8107282k134758P213498m172773j0857644K225856J3993228P244501k185022
$$ 98107282 95972524 103186022 99013249 88155605 90381461 104374689 111619190 109434168
41216A09434168J606406N479395k992621p665408L496698O852043j7932068m1065948
$$ 109434168 111040574 116519969 113527348 105861940 109358638 116210681 98278613 57212665
41208E7212665j9782024L1370789N4273391K7741396r908721k1505155j1998319
$$ 57212665 37430641 68801430 123074821 150816217 140907496 119402341 107404022
41201A07404022J48300J2854133K5053956K3481322M551971j3572805j6658294
$$ 107404022 107552322 120406455 145460411 168941733 173493704 159920899 143262605
41194A43262605j1958463q025709O18239J4605143J7607137N39405j9612836k1750428
$$ 143262605 131304142 123278433 123896672 138501815 156108952 156648357 137035521 115285093
41186A15285093p339194P796602J3382903N319408j5748436l3919599k5538602
$$ 115285093 107945899 115742501 129125404 134444812 118696376 84776777 59238175
41179E9238175P308329K9586214J6731439j3114558k8472102k5983350j9868386
$$ 59238175 66546504 96132718 112864157 99749599 71277497 45294147 25425761
41172B5425761j0105508Q748932K1105486P068193j9434282k1908172P644291
$$ 25425761 15320253 24069185 45174671 52242864 32808582 10900410 18544701
41165A8544701L7061645L7881593J6246888n689692j6329391j4444860k563864
$$ 18544701 55606346 93487939 109734827 104045135 87715744 73270884 70707020
41158G0707020Q808024N401172j2337810k5723312j9861841k84088J6276034J8472922
$$ 70707020 79515044 84916216 72578406 46855094 26993253 26709165 42985199 61458121
41150F1458121O113250j0118400j4196172j636646J0435321M632703p868244q45500
$$ 61458121 67571371 57452971 43256799 41620153 52055474 56688177 48819933 47974433
41142D7974433K3210444K9387965J497420k8524093k2701379J0464817L0950958
$$ 47974433 71184877 100572842 102070262 73546169 50844790 61309607 92260565
41135I2260565K2874607O712548m68914o557372j8320629k0467795K34562K5932379
$$ 92260565 115135172 121847720 121378806 114821434 96500805 76033010 76267572 102199951
41127A02199951K6219131Q65498j8635970j3456827j503223m985785j3205066
$$ 102199951 128419082 129284580 110648610 97191783 95688560 90702775 77497709
41120G7497709j031874K5266525L0988584N495231j8040898j0479998J1141204
$$ 77497709 76465835 101732360 132720944 138216175 120175277 109695279 120836483
41113A20836483J3006126l534001j0357071j602362J268388p909899q877768N063996
$$ 120836483 133842609 130308608 119951537 118349175 119617563 111707664 102829896 107893892
41105A07893892J0213959p376890k4423071j6292941L512916P387530j265567
$$ 107893892 118107851 110730961 86307890 70014949 73527865 80915395 79649828
41098G9649828J162690J3788002J2234913p384788j9070587p904422Q959600J3253403
$$ 79649828 80812518 94600520 106835433 99450645 80380058 72475636 81435236 94688639
41090I4688639J1019037J1651389N901669j2951600k4653496o636390K6400222
$$ 94688639 105707676 117359065 123260734 110309134 85655638 79019248 105419470
41083A05419470L6582041J5117833p375652p786283o84518q517741k4717268k7091068
$$ 105419470 142001511 157119344 149743692 141957409 141272891 132755150 108037882 80946814
41075H0946814j3016021J465824R049658J4768014J6790443P706761m918194l885992
$$ 80946814 67930793 69396617 78446275 93214289 110004732 117711493 112793299 108907307
41067A08907307P283532M797406j4994678k2283120J183420K8038158K3005531
$$ 108907307 116190839 120988245 105993567 83710447 84893867 112932025 135937556
41060A35937556k739081q013692J5044022K9582654J0151954k1661013l1112594
$$ 135937556 133198475 125184783 140228805 169811459 179963413 158302400 127189806
41053A27189806j5843525K2766J729954m043730n519244o11824K413859o182586
$$ 127189806 111346281 111369047 113099001 109055271 103536027 102924203 105338062 99155476
41045I9155476k3600339k9605100p461537K8413234M1893335J9226636j2278028
$$ 99155476 75555137 45950037 38488500 66901734 108795069 128021705 115743677
41038A15743677j9898103m336043J0965900J5163074J5516116J5599506Q742995
$$ 115743677 95845574 91509531 102475431 117638505 133154621 148754127 157497122
41031A57497122o320572j8628204j7897564o118335N965194R820518O913325O736530
$$ 157497122 151176550 132548346 114650782 108532447 114497641 124318159 131231484 137968014
41023A37968014J3594435J7182968N846634j2500693j8557663j1757343j0636161
$$ 137968014 151562449 168745417 174592051 162091358 143533695 131776352 121140191
41016A21140191j7604643j1212266J2104602K0116381m557387k5453603l416273
$$ 121140191 103535548 92323282 104427884 124544265 119986878 94533275 91117002
41009I1117002L5322697L2254885j2084802l6063402j1176241J8400216J0359054
$$ 91117002 126439699 158694584 146609782 110546380 99370139 117770355 128129409
41002A28129409j3771315j4331792J486923K437723r799134j1834472o156599
$$ 128129409 114358094 100026302 101513225 103950948 94151814 82317342 76160743
40995G6160743j1314007j7099837L223945L9463745M9376764K2221425m788632
$$ 76160743 64846736 47746899 50970844 90434589 139811353 162032778 157244146
40988A57244146m547268M864220L08294p386837N89084J4452188J3817813K137530
$$ 157244146 152696878 157561098 157869392 150482555 151071639 165523827 179341640 181479170
40980A81479170m755978q572836j8351184k2889122n237868K0964684K2326575
$$ 181479170 176723192 168150356 149799172 126910050 121672182 142636866 164963441
40973A64963441m960740k6798086k0176054k870770k07458o269090M79845J8675505
$$ 164963441 160002701 133204615 113028561 110157791 109950333 103681243 104161088 122836593
40965A22836593K5757821J2514983o035550j4978013j6202689j5960117j1495052
$$ 122836593 148594414 161109397 155073847 140095834 123893145 107933028 96437976
40958I6437976N9989R750566O327003n646088q675884M666215K0211143J9283751
$$ 96437976 96497965 106248531 112575534 106929446 98253562 102919777 123130920 142414671
40950A42414671K560019j0950830q521800J053609J938524n181408m224356J1189660
$$ 142414671 144974690 134023860 125502060 126555669 128494193 123312785 119088429 130278089
40942A30278089K4438825J5523456j0927702k7439175j5470065J1807173K4131272
$$ 130278089 154716914 170240370 159312668 131873493 116403428 128210601 152341873
40935A52341873Q491403j7837307k9088990j8509497J020289J7228359K7733055
$$ 152341873 160833276 142995969 113906979 95397482 96417771 113646130 141379185
40928A41379185L0034349J7529558o433212k3052667j9919197r412885r200364
$$ 141379185 171413534 188943092 182509880 159457213 139538016 130125131 120924767
40921A20924767j2131893K035127K7413624L2583311Q132899j3937127n051998
$$ 120924767 108792874 110828001 138241625 170824936 178957835 165020708 159968710
40914A59968710J9015300K4458188P834585q448762j4647368j7386861j4222445
$$ 159968710 178984010 203442198 211276783 202828021 188180653 170793792 156571347
40907A56571347K168813J7504741P902411j9232763l0312984j7470416r387199
$$ 156571347 158740160 176244901 184147312 164914549 134601565 117131149 107743950
40900A07743950j8959793j8935813Q701863L5359223K8917307M743063k898190
$$ 107743950 88784157 69848344 78550207 113909430 142826737 147569800 144671610
40893A44671610K842346m592141k0499083j4610701J2954241K6848846J2750929
$$ 144671610 147513956 142921815 122422732 107812031 120766272 147615118 160366047
40886A60366047k712834Q01470Q010082K060312o064723k999894J558179j358368
$$ 160366047 157653213 158454683 166464765 168525077 162460354 159460460 161018639 159660271
40878A59660271L016952K4207455L6405273J1492496l0519893m0192839o107764
$$ 159660271 162677223 186884678 223289951 234782447 204262554 164069715 157961951
40871A57961951K8819212K4741899q117012l1528732k7929335j1032970N67640
$$ 157961951 186781163 211523062 203406050 171877318 143947983 132915013 133482653
40864A33482653L384225L801966M424512J271110p352341j4299414j0973215k22606
$$ 133482653 136866878 140668844 145093356 146364466 139012125 124712711 113739496 113516890
40856A13516890O152886N008185O551244J5078903J7189745K299869j4844424
$$ 113516890 119669776 124677961 131229205 146308108 163497853 165797722 150953298
40849A50953298j0954249J0475053K1801858J1420999m51560M476325J2767257
$$ 150953298 139999049 150474102 172275960 183696959 183245399 187721724 200488981
40842B00488981O71828k6441876l6926186j3715440K4070687M3810171L2491667
$$ 200488981 201160809 174718933 137792747 124077307 148147994 191958165 224449832
40835B24449832L095391k3086419l3932158l0402999j9531505o381749N936180
$$ 224449832 227545223 204458804 170526646 140123647 120592142 114210393 120146573
40828A20146573J0832287J536014j5341329j9172757j86322K1556316J8812505
$$ 120146573 130978860 132514874 117173545 98000788 97814466 119370782 138183287
40821A38183287l642143j3494819K066477J8484959J4960998P434378J7131055
$$ 138183287 134541144 121046325 123112802 141597761 156558759 163993137 181124192
40814A81124192K8500405J3434232j5254444j7065714R632735J9850798n890619
$$ 181124192 209624597 223058829 207804385 190738671 200371406 220222204 214331585
40807B14331585k6593222n872889K6594523J9571448k0261231m1218067k5963582
$$ 214331585 187738363 181865474 208459997 228031445 207770214 166552147 140588565
40800A40588565p860587q216183o567683J2776048K7160493J2899337j4165613
$$ 140588565 132727978 124511795 117944112 130720160 157880653 170779990 156614377
40793A56614377k2096320o636503J2621531K4491330L1241471L1662490K0939342
$$ 156614377 134518057 127881554 140503085 164994415 196235886 227898376 248837718
40786B48837718L263426j1235103j9062175k2265990k0182833j1461152J250255
$$ 248837718 252101144 240866041 221803866 199537876 179355043 167893891 169144146
40779A69144146J4488084K3892218J8953632o442491l3353372k9211673Q046990
$$ 169144146 183632230 207524448 226478080 220035589 186682217 157470544 165517534
40772A65517534L9179098L3947401J0081868m35116r74339j3289599k7715704
$$ 165517534 204696632 238644033 248725901 248290785 247316446 234026847 206311143
40765B06311143j2607776K8279613M8820949K1928801k4052970m5827494l6938547
$$ 206311143 193703367 221982980 270803929 292732730 268679760 222852266 185913719
40758A85913719k1250323j3927801r770443j016935J0711674J8187229J5182464
$$ 185913719 164663396 150735595 140965152 139948217 150659891 168847120 184029584
40751A84029584J968754j1121640j0822352L899767J8794978K0222875R723483
$$ 184029584 185998338 174876698 164054346 167954113 186749091 206971966 216695449
40744B16695449j61951r42235L581207L355986l608637n801721N640363J7645271
$$ 216695449 216533498 215591263 219172470 222528456 218919819 213118098 218758461 236403732
40736B36403732Q022778j8502817k8545735p103481J6795259J3177867k949897
$$ 236403732 244426510 225923693 197377958 190274477 207069736 220247603 217297706
40729B17297706o72531J0865158j340913l0497074l2243993L501424L1141195
$$ 217297706 216625175 227490333 226149420 195652346 163408353 166909777 198050972
40722A98050972J7515418j1098917j5528728j167967K625131o845757r927324
$$ 198050972 215566390 204467473 188938745 187770778 190395909 183550152 173622828
40715A73622828k321811K737004j56335n498927j0305313j2022302m678460P139805
$$ 173622828 171301017 174038021 173881686 168382759 158077446 146055144 141376684 148516489
40707A48516489O803011n517786l856696K2620773M3222853K7885832n962833
$$ 148516489 155319500 149801714 145945018 168565791 211788644 239674476 233711643
40700B33711643k0815386j3932631q573660p314744M255998J7998074J1362796
$$ 233711643 212896257 198963626 190389966 183075222 187331220 205329294 216692090
40693B16692090q914375j3740448j408567J783913q300894p232065R120393J5354508
$$ 216692090 207777715 194037267 192628700 194412613 186111719 178879654 188000047 203354555
40685B03354555O371005R261188K9154941L1021704j09209k6366632j6676538
$$ 203354555 209725560 218986748 248141689 279163393 279054184 252687552 236011014
40678B36011014J799644r050392l4008497l2318303m548805J4857965J5362780
$$ 236011014 237810658 228760266 194751769 162433466 157884661 172742626 188105406
40671A88105406J5174178J8138918R740340o905199j0965974q81895L527462k561541
$$ 188105406 203279584 221418502 231158842 224253643 213287669 212405774 215933236 213371695
40663B13371695l324957N289219R939950R286038J6073054K5595579J6415744
$$ 213371695 210046738 215335957 225275907 234561945 250634999 276230578 292646322
40656B92646322r444194k1633550r057822J664988p768184j6146389j544605J7611702
$$ 292646322 283202128 261568578 252510756 254175744 246407560 230261171 228716566 246328268
40648B46328268J1160033j2805665j9361178J512127K4008913K4382121N999845
$$ 246328268 257488301 244682636 225321458 226833585 250842498 275224619 281224464
40641B81224464j3312751k0085017j0783645O207612J3702159K701857j4681853
$$ 281224464 267911713 247826696 237043051 243250663 256952822 259654679 244972826
40634B44972826j9025556o869705R349188J8980669J9620150J2133485K111213
$$ 244972826 225947270 219077565 228426753 247407422 267027572 279161057 281272270
40627B81272270O25673R796523J3392472k425979k4093714k5174513m273296J1538321
$$ 281272270 281897943 291694466 305086938 302660959 278567245 253392732 249119436 260657757
40619B60657757L992893j4285254k1146858j2402581L92188P253813O347318J961786
$$ 260657757 264650650 250365396 229218538 216815957 217208145 224461958 230809276 232771062
40611B32771062J762409Q337433J1136182k334638k4787432l2400319j5133070
$$ 232771062 234533471 242870904 254007086 251672448 226885016 194484697 179351627
40604A79351627J0100073K3270108K3206409J6860014L812250j3543387j9483994
$$ 179351627 189451700 212721808 235928217 252788231 256600481 243057094 223573100
40597B23573100m932965J1909561P183314j1663159j4073978Q651855L0293568
$$ 223573100 218640135 230549696 237733010 226069851 211995873 220647728 250941296
40590B50941296K7080618O677585r853728j6321664j8180732j5789537p061184
$$ 250941296 278021914 284699499 274845771 258524107 240343375 224553838 217492654
40583B17492654J856555K848846k886305j0286372j8694921k3221956r656185
$$ 217492654 219349209 222198055 219311750 209025378 190330457 167108501 157452316
40576A57452316K3788869M9101186L7158846Q73842j6710851j62110K0537877
$$ 157452316 181241185 230342371 267501217 268375059 251664208 251502098 272039975
40569B72039975J8770739P692565Q915119J2556870j606072k2271822k1757134
$$ 272039975 290810714 298503279 307418398 319975268 318369196 296097374 274340240
40562B74340240l857821Q00218j3657640j9190995l265916R554594O94250j1469049
$$ 274340240 270482419 271282637 257624997 238434002 235168086 244722680 245416930 233947881
40554B33947881n623123O792334O738457L177471J1815638J8792016K527573k1626227
$$ 233947881 228324758 235117092 241855549 245033020 256848658 275640674 278168247 256542020
40546B56542020j8874753P882845J9105698j21191j8828557j0403430J1297338
$$ 256542020 237667267 245550112 264655810 264534619 245706062 235302632 246599970
40539B46599970K1806256K0980012J8100245Q145480j3558586l1959944l0475183
$$ 246599970 268406226 289386238 307486483 315631963 302073377 270113433 239638250
40532B39638250j5303542k704646M978280J2583003J4830094N857876m327528
$$ 239638250 224334708 221630062 226608342 239191345 254021439 259879315 255551787
40525B55551787k849825M269968J885598q742621j1339447K556953K5715238M4707858
$$ 255551787 252701962 256971930 258857528 250114907 238775460 241332413 267047651 311755509
40517C11755509M6176365K3125019j1717129k9163424j5263803R942373J9457529
$$ 311755509 357931874 381056893 369339764 340176340 324912537 334854910 354312439
40510C54312439J2303243K883154o930742k1760348l1525099k3540262p983539
$$ 354312439 366615682 369498836 362568094 340807746 309282647 285742385 277758846
40503B77758846m351192q581282j342177J5589052K0567691P783865p335263j7243843
$$ 277758846 273407654 264826372 263484195 279073247 299640938 307424803 300089540 282845697
40495B82845697k6416202k6991966m779591K6246028L1356597O365636j3334950
$$ 282845697 256429495 229437529 224657938 250903966 282260563 288626199 275291249
40488B75291249p086749L941001Q96147L60518J6545609K4429153k708756m1721285
$$ 275291249 268204500 272145501 273041648 273402166 289947775 314376928 311668172 269946887
40480B69946887m5214495q365427K5484441K3987439J174545r571941L738808
$$ 269946887 224732392 216366965 241851406 265838845 267013390 257441449 261180257
40473B61180257K3811425K5148051R34743k6471640k7826637l141061J7881316
$$ 261180257 284991682 310139733 311074476 284602836 256776199 253635138 271516454
40466B71516454J7210407J0008757J2547408J2718776m642911k3332833j7093978
$$ 271516454 288726861 298735618 311283026 324001802 319358891 296026058 278932080
40459B78932080O550839J5727911K787043p306522J591237J5000793J4009651
$$ 278932080 285482919 301210830 303997873 296691351 298282588 313283381 327293032
40452C27293032M31118j3403256k2638478k7549381k4829506j0997077R691222
$$ 327293032 327724150 314320894 291682416 264133035 239303529 228306452 237997674
40445B37997674K5162513K3540085M911751j3731640j3959715N73268Q370714
$$ 237997674 263160187 286700272 291612023 277880383 263920668 264493936 272864650
40438B72864650K213585r57859Q600006J4453192L283078q953867l807793O477517
$$ 272864650 275078235 274120376 282720382 297173574 300456652 291502785 287694992 294172509
40430B94172509J380034r046899j453348J6635019J6988149r27235r497321j40989
$$ 294172509 295552543 286505644 285052296 301687315 318675464 317748229 308250908 308109919
40422C08109919O292698k59803m773937m94100k223994j5691194k5162226k3180269
$$ 308109919 314402617 314142814 309368877 308874777 306650783 290959589 265797363 242617094
40414B42617094k2319555k4973079j2668209J8261500L9915606L1548125R521092
$$ 242617094 220297539 195324460 182656251 200917751 240833357 272381482 281902574
40407B81902574j521984l159557o814937n729997R937624K6170357K0747833k219466
$$ 281902574 280380590 277221033 270406096 264676099 274613723 300784080 321531913 319312447
40399C19312447j6223235p509131R832788J2035099r627728l7652947l9793788
$$ 319312447 303089212 295580081 305412869 317447968 307820240 270167293 230373505
40392B30373505l492701M0878547N0288996K4056654K357836M838841N901834
$$ 230373505 226880804 267759351 318048347 342105001 344462837 349301678 355203512
40385C55203512j2986428k5542908o664106J6885264N343968k5279305k3030472
$$ 355203512 342217084 316674176 310010070 326895334 332239302 306959997 283929525
40378B83929525J7326650M1139424J3024545l2730123m2070162j1974303J5446879
$$ 283929525 301256175 342395599 355420144 322690021 280619859 268645556 284092435
40371B84092435J3908652L29661J956112J7576131K3244083Q075416j1811851
$$ 284092435 298001087 298330748 300286860 317862991 341107074 349182490 337370639
40364C37370639j9179249k0360779k9310954l7679704k4359161P419309K9025559
$$ 337370639 318191390 297830611 268519657 230839953 206480792 213900101 242925660
40357B42925660K6668217J5731552P766503n741621k3067133k0072635P977024
$$ 242925660 269593877 285325429 293091932 287350311 264283178 244210543 252187567
40350B52187567K4658184M332814k2514806j4863798J1762904J1210978j5269232
$$ 252187567 276845751 281178565 258663759 243799961 255562865 266773843 251504611
40343B51504611k1004524P092484K5851061N963199k2437287j8781664R192824
$$ 251504611 230500087 237592571 263443632 269406831 246969544 228187880 237380704
40336B37380704K4876886J6874717M576805L149855P923961Q446983R04670j1095883
$$ 237380704 262257590 279132307 283709112 286858967 294782928 303229911 304134581 293038698
40328B93038698j8401146j3008789J195834J0387108P466895o05636m626992l005742
$$ 293038698 274637552 261628763 262824597 273211705 280678600 280072964 275445972 272440230
40320B72440230K507085J0300026J5029108J0863772J687783k437143j298489
$$ 272440230 274947315 285247341 300276449 311140221 312828004 310390861 309092372
40313C09092372n160107j6270039k2565632j5283600j512124P164135Q907949
$$ 309092372 303932265 287662226 265096594 249812994 248300870 255465005 264372954
40306B64372954Q111812O011393K000790j099282L48047M599872M489955n218336
$$ 264372954 272484766 278496159 280496949 279397667 279745714 284345586 288835541 283617205
40298B83617205j8969856k0978982k270231K2600173K8169316J1129944n044503
$$ 283617205 264647349 243668367 241398136 263998309 292167625 303297569 298253066
40291B98253066n635169m242801j2981772j6743657j063540J5606026R607800
$$ 298253066 292617897 288375096 275393324 258649667 257586127 273192153 282799953
40284B82799953m253768M818630K7519166K4501244q680512l2118360k4435877
$$ 282799953 278546185 283364815 310883981 335385225 326704713 294586353 270150476
40277B70150476j0311791j0287513p356410J1665257K1456759l76223k7182911
$$ 270150476 259838685 249551172 242194762 253860019 275316778 274940555 247757644
40270B47757644j8566138J6262725L0544184Q139007j7574648j5644823K889884
$$ 247757644 229191506 245454231 275998415 284137422 266562774 250917951 253807835
40263B53807835Q857642k728014j0603520K99468J8602083K2149429O965397r088709
$$ 253807835 262665477 259937463 249333943 249633411 268235494 290384923 297350320 288261611
40255B88261611j2346855j0077421j2656823j3201408j801761J2044056J4005427
$$ 288261611 275914756 265837335 253180512 239979104 238177343 250221399 264226826
40248B64226826J2042015K0748275K6473621M152752l2384718l8807659p333558
$$ 264226826 276268841 297017116 323490737 327643489 295258771 256451112 249117554
40241B49117554J7511673O938826j1114420m945465P747636l289395k3317833
$$ 249117554 266629227 273568053 262453633 257508168 265255804 261966409 238648576
40234B38648576j6615865J1775528K3572391P808371p578855l961380M577439
$$ 238648576 222032711 233808239 257380630 265189001 257610146 253648766 258226205
40227B58226205K143951l391008L433930K1180335L2260755K1523688o752954
$$ 258226205 260370156 256979148 260413078 281593413 313854168 335377856 328624902
40220C28624902k8424941k4166304o010043k785094j6174241j7269812L614422
$$ 328624902 300199961 276033657 270023614 267238520 251064279 233794467 237408889
40213B37408889J7018113M582033n968186J1828734L2853639J9715572j2438263
$$ 237408889 254427002 259009035 253040849 264869583 297723222 317438794 305000531
40206C05000531j9478230p48168M678559j2379892j9219332k563302R402305o49604
$$ 305000531 285522301 284774133 289452692 277072800 257853468 255290166 264692471 264042867
40198B64042867r429256N495830K9982309L8297643K5914668K425659k2527928
$$ 264042867 254613611 260109441 290091750 328389393 354304061 356729720 334201792
40191C34201792l4701375k3053851k211361L05972j2496323q722956J6776559
$$ 334201792 299500417 276446566 274235205 274541177 262044854 253321898 270098457
40184B70098457K6487021K0512k7309383j5886513J7776762K7722167N852480
$$ 270098457 296585478 296605990 269296607 253410094 271186856 298909023 304761503
40177C04761503j4401742j1870649p00986r7029q118902j0988865k090514J2337071
$$ 304761503 290359761 278489112 277788126 277691097 269572195 258583330 256492816 268829887
40169B68829887J8433150P958328q241492q706397R144770K0138807L680480k6745264
$$ 268829887 287263037 295221365 286979873 278273476 287418246 307557053 311237533 284492269
40161B84492269m1028723k9941654r557530M402551J0019558J0793538R182832
$$ 284492269 243463546 213521892 203964362 208366913 218386471 229180009 238362841
40154B38362841Q324819R452032Q389691K402135k729719m21001N683324O413366
$$ 238362841 246687660 256139692 264529383 266931518 264201799 263780798 269464122 275877488
40146B75877488l86470q809887j2715161q865980K733539J5510171J8623774Q972103
$$ 275877488 275491018 266681131 253965970 245099990 247833529 263343700 281967474 290939577
40138B90939577m002316j0852479j3308775j7070456k0400230j7568379q417049
$$ 290939577 286937261 276084782 262776007 245705551 225305321 207736942 199319893
40131A99319893K627752J2609596J9143844J8547539J1052000L354448M83293
$$ 199319893 201947645 214557241 233701085 252248624 263300624 266655072 267138365
40124B67138365l62906l336932o981177q704083j0068659j1738238q985492P79193
$$ 267138365 266775459 263438527 256457350 247753267 237684608 225946370 216960878 217740071
40116B17740071J0179157Q501987n606202k2210335k8490575j6685473J1234861
$$ 217740071 227919228 236421215 230815013 208604678 180114103 163428630 174663491
40109A74663491M1255276N2538349L2523259r094945m3257304m4634778j7047156
$$ 174663491 215918767 268457116 300980375 291885430 248628126 203993348 186946192
40102A86946192Q005111O653595p616294m512444J5519480K0010227j923145j6597225
$$ 186946192 194951303 201604898 193988604 189476160 204995640 225005867 223082722 206485497
40094B06485497J402567K3524508J0142382k3307972k8228365J058492K2633239
$$ 206485497 207888064 231412572 241554954 218246982 190018617 191077109 213710348
40087B13710348J6190989N676862O233751N33779j6242715j7930386L013127J4400535
$$ 213710348 229901337 235578199 241811950 242345729 226103014 208172628 211185755 225586290
40079B25586290N62258o690023J2775277K4210793j571010k7780432p925581L1335831
$$ 225586290 226148548 219458525 232233802 256444595 254873585 227093153 219167572 250503403
40071B50503403K8743974j1289589k7073362j490162J5843177l127379k1978639
$$ 250503403 279247377 267957788 240884426 239394264 255237441 252110062 230131423
40064B30131423q421936J2468569P211110j0357509j0877596r16303j190249o45707
$$ 230131423 221709487 234178056 241389166 231031657 220154061 219237758 218047509 217401802
40056B17401802K2219316M7724272L2242511k2790982o0835007m2024738N884621
$$ 217401802 239621118 287345390 319587901 296796919 235961912 193937174 199821795
40049A99821795K7450395R037779j5649139j8465132p129015O06544O872511J9895476
$$ 199821795 227272190 236309969 220660830 202195698 195066683 195673227 202545738 222441214
40041B22441214K7035601Q763207k3920406l4664883j1418701J5687238J9732799
$$ 222441214 249476815 258240022 234319616 199654733 188236032 203923270 223656069
40034B23656069J3671135J8854734K1374642m842025m4282354n0531677j2989700
$$ 223656069 237327204 256181938 277556580 272714555 228432201 177900524 164910824
40027A64910824K4636028K4739895K934844m555229M848036N329891j1314896
$$ 164910824 189546852 214286747 217221591 212666362 217514398 222844289 211529393
40020B11529393k3593842j4788518K106396L229119j3073147k3220572p987370
$$ 211529393 187935551 173147033 175253429 178482548 165409401 142188829 134201459
40013A34201459K2321833L7904604K3158890o411589k3393384j8179863m389078
$$ 134201459 156523292 194427896 217586786 211175197 187781813 169601950 165212872
40006A65212872O76397n308063r017672L316997K7681306M0527001K3369883j1034342
$$ 165212872 165889269 160581206 151563534 154880531 182561837 223088838 246458721 235424379
39998B35424379k9575769j8848735L38163M490924l056906m629350M943402J6596400
$$ 235424379 205848610 186999875 187338038 191828962 188772056 184142706 189086108 205682508
39990B05682508J9550636N564980k3768645m4652754k7900670J7731888M4796373
$$ 205682508 225233144 230798124 207029479 162376725 134476055 152207943 197004316
39983A97004316K9921362Q079366J5076020K7480736L953666l8313754m5054470
$$ 197004316 226925678 235005044 250081064 277561800 281515466 243201712 198147242
39976A98147242j2171083R489390k92839k667747K5378129M5720924K1710203
$$ 198147242 185976159 195465549 195172710 192504963 217883092 263604016 285314219
39969B85314219j9470593k7739004k511449J6166375Q825249q356374j7838684
$$ 285314219 265843626 238104622 235593173 251759548 260584797 252228423 234389739
39962B34389739j7535201r098401M563537J3040935Q963172P29884j76311K535597
$$ 234389739 216854538 207756137 212319674 225360609 234323781 235053665 234877354 237412951
39954B37412951j137481q536567r506356m022458j198242o119321j7373051k9713757
$$ 237412951 236275470 227738903 218232547 214210089 213011847 206892526 189519475 159805718
39946A59805718l1090760r453151K6176533M4615708K7409178n629745k1005142
$$ 159805718 128714958 119261807 145438340 190054048 217463226 211833481 190828339
39939A90828339j2578286j783946l698956j0656338q825107K972765J4094958
$$ 190828339 178250053 176466107 172767151 162110813 153285706 156258471 170353429
39932A70353429J4519244M338936o973853j0920259p820661j380236Q643799K0098439
$$ 170353429 184872673 189211609 182237756 171317497 163496836 162116600 170760399 190858838
39924A90858838K2383141J0545292j666601n33798L350951p451396k2463519j6404747
$$ 190858838 213241979 223787271 222120670 221586872 224937823 217486427 195022908 178618161
39916A78618161N140635Q970599j1747216k4264744q930607J1785962J4214975
$$ 178618161 183758796 192729395 180982179 156717435 147786828 159572790 173787765
39909A73787765Q165502R177608R208632l16085o803929l614269q467046k6929463
$$ 173787765 181953267 191130875 200339507 200023422 193219493 189605224 181138178 154208715
39901A54208715k8968138M856457M2763924M4259575J7936063j114501o870507
$$ 154208715 125240577 130097034 172860958 217120533 235056596 233942095 227071588
39894B27071588j3757114j5438890R03366J6115760L043145k3113623k5756807
$$ 227071588 213314474 197875584 198778950 214894710 217937855 194824232 169067425
39887A69067425p904232l340159j4702877j2367837P522624J6639134Q353985
$$ 169067425 161163193 157823034 143120157 130752320 138274944 154914078 163268063
39880A63268063O245453J3563575O786271j1638878q608428J7200262K3650886
$$ 163268063 169513516 183077091 189863362 178224484 169616056 186816318 210467204
39873B10467204k645142j7938395M031428K1770084p157842n2121791n2695961
$$ 210467204 207822062 189883667 193915095 215685179 208527337 156405546 103709585
39866A03709585p571676K9825816K8310210O210034r908042j3411202n891921
$$ 103709585 96137909 125963725 154273935 160483969 150575927 137164725 131272804
39859A31272804R764544K1926758J9299896P942900J388788j764945j1695113
$$ 131272804 141037348 162964106 182264002 190206902 191595690 189830745 178135632
39852A78135632k3697590k0773048O77389K3158484K6556377N654671k6104633
$$ 178135632 154438042 133664994 134342383 157500867 184057244 189711915 163607282
39845A63607282m3292657k8636056M481990K1346233P830788j1373625r252801
$$ 163607282 120314625 91678569 96160559 117506792 125337580 113963955 104711154
39838A04711154N805229Q175284l434380p533907L755949J4614843J2086694K453955
$$ 104711154 110516383 118691667 115257287 107723380 111479329 126094172 138180866 140634821
39830A40634821k707775j661419J411222N262167J0988371J6528919J5012000
$$ 140634821 137927046 136265627 137676849 142939016 153927387 170456306 185468306
39823A85468306J403674j5497911j3841261J4916577M3477598L3806893j0873374
$$ 185468306 186871980 171374069 157532808 172449385 215926983 249733876 238860502
39816B38860502m2965552l0707195J993269J3318378o37347j1735287n546682
$$ 238860502 195894950 165187755 167181024 180499402 179862055 168126768 162580086
39809A62580086N922271R558159N210773k395225p751351m785027K857777L59412
$$ 162580086 168502357 178060516 183271289 180876064 173124713 168339686 171197463 171556875
39801A71556875j5021806k2293855o861424J2419565J0309262m401801n147808
$$ 171556875 156535069 134241214 127379790 139799355 150108617 145706816 140559008
39794A40559008N795664J703243k0222482l0796359j4785078P300149J3509583
$$ 140559008 146354672 148057915 127835433 97039074 82253996 89554145 103063728
39787A03063728Q626774N787715M702882K453028N078701J3699611J6499014P915499
$$ 103063728 111690502 117478217 122181099 124634127 129712828 143412439 159911453 167826952
39779A67826952l31008O3280j342143j4438615k9137828l0482339k0222987q389614
$$ 167826952 167495944 167559224 166217081 151778466 122640638 92158299 71935312 63545698
39771F3545698L879897J6548021J8004060P50046j7993081j3779651Q891260J9808302
$$ 63545698 67425595 83973616 101977676 102727722 84734641 70954990 79846250 99654552
39763I9654552N969039r506889j945827J7931932J9440055l040296k1517192j4990405
$$ 99654552 105623591 96116702 94170875 112102807 131542862 128502566 106985374 91994969
39755I1994969O12425j614997j6262718j3036452J2941284K6817516M373605k7285171
$$ 91994969 92607394 90992397 74729679 61693227 74634511 101452027 105825632 78540461
39747G8540461k4944232R489819L3775444K5763696N862055m193446j0941507
$$ 78540461 53596229 63086048 96861492 122625188 128487243 124293797 113352290
39740A13352290k3254940k6339839n513506K2943810L0202987J4148350k002408
$$ 113352290 90097350 63757511 58244005 81187815 111390802 125539152 123536744
39733A23536744l866511J980617O284525P399835L209954r285200k3040886k4052764
$$ 123536744 119670233 121650850 127935375 135335210 138545164 129259964 106219078 82166314
39725H2166314r888721N736645J0624236P064443L917946M186392M493289J085010
$$ 82166314 72277593 78014238 88638474 95702917 99620863 103807255 108300544 109385554
39717A09385554o422158j3297417j1926933p39767J1010406J4139422J2422060
$$ 109385554 102963396 89665979 77739046 76999279 88009685 102149107 114571167
39710A14571167J4950214J7792579P177313j6191756l0784336k1399484j627113
$$ 114571167 129521381 147313960 154491273 138299517 107515181 86115697 84488584
39703H4488584L613098q213501j5562016m427750J2627966J5574284N217409J074688
$$ 84488584 88101682 79888181 64326165 59898415 72526381 88100665 93318074 94392762
39695I4392762J2967706K6094400K0277107k132243j7227910r079835J0332400
$$ 94392762 107360468 133454868 153731975 151599732 134371822 125291987 135624387
39688A35624387J6278967J122261j8602819k3026441r079583J0513360K0601586
$$ 135624387 151903354 153025615 134422796 111396355 102316772 112830132 133431718
39681A33431718J3610028o190327k3466644k2995145o538436O100172N29355j1734625
$$ 133431718 147041746 140851419 117384775 94389630 87851194 93951366 94480721 82746096
39673H2746096p251285J4978311K6633723N471911l1821819m5412320j9439200
$$ 82746096 75494811 90473122 117106845 122578756 90756937 45344617 25905417
39666B5905417J9251708L3786423J8454252j774688o440234n94620Q35400l933047
$$ 25905417 45157125 78943548 97397800 95623112 89182878 88588258 89423658 85490611
39658H5490611o033153l568724k891737l557039L272443J6405653J8169280k343726
$$ 85490611 79457458 75888734 72996997 69439958 72712401 89118054 107287334 104943608
39650A04943608k8497307l3152924j3046327Q416644J2500819M379107j859549
$$ 104943608 76446301 43293377 30247050 38663694 51164513 55543620 53684071
39643E3684071j961908K173303J1085509K1364228K1145674N118396j2813856
$$ 53684071 51722163 53895466 64980975 86345203 107490877 112609273 99795417
39636I9795417j4569506p51282J2943266J6652058J1201062j931705j9669868
$$ 99795417 85225911 84474629 97417895 114069953 125271015 123339310 103669442
39629A03669442k9782574k1653338m318398L073058p83958P56099J2521939J8749350
$$ 103669442 73886868 52233530 47915132 50988190 50204232 50960331 63482270 82231620
39621H2231620J0617713J274301K269008M823817r58097o795104m141038m350651
$$ 82231620 92849333 94123634 96392642 101216459 100258362 93463258 89322220 84971569
39613H4971569j8432247l0273602j6888825J2351471K5165501J2967267m45260
$$ 84971569 66539322 36265720 19376895 31728366 56893867 69861134 69415874
39606F9415874O58050M097586o39469j454566J0952005K0536112J1265486k582432
$$ 69415874 70073924 74171510 73532041 72077475 83029480 103565592 114831078 112248646
39598A12248646K424421J8573037J6705179p182417k4559233j8336098o197245
$$ 112248646 114673067 133246104 149951283 142768866 118209633 99873535 93676290
39591I3676290p543074j2408884m069355P249101J721409j0231456N45355L0229970
$$ 93676290 86133216 73724332 69654977 76904078 78625487 68394031 68939386 99169356
39583I9169356L7454126L724633l3521836l2275810m865071O960309k089479j009267
$$ 99169356 136623482 140348115 106826279 74550469 69685398 76645707 74556228 73546961
39575G3546961J7002522K0128386n134913k4739932q943249J9689641K1763750
$$ 73546961 90549483 110677869 105542956 80803024 71859775 91549416 113313166
39568A13313166L76730j1473915p212609r591719k1684009j7244852J0342237
$$ 113313166 113689896 102215981 95003372 85411653 63727644 46482792 56825029
39561E6825029K6167292K124744l7673871m5616638j2274915K4854626L1124358
$$ 56825029 82992321 85117065 47443194 1826556 -10448359 14406267 45530625
39554D5530625J2704242l1613O911566J7915100J1733380j0986714k9376413k7378722
$$ 45530625 58234867 58203254 65114820 83029920 94763300 83776586 54400173 27021451
39546B7021451q553794J4266642L2867343M1638593L3674999J1044989q899737
$$ 27021451 18467657 32734299 65601642 107240235 140915234 151960223 143060486
39539A43060486j1572182m684944n820994j5404570j8816204j2562938q835359
$$ 143060486 131488304 126803360 120982366 105577796 86761592 74198654 65363295
39532F5363295j2597509j3693149o681765j97241M96860K928710J0736968J4230947
$$ 65363295 52765786 39072637 32390872 32193631 32690491 35619201 46356169 60587116
39524F0587116P978602J925889L209468K779325n825346j0466656j161630P856488
$$ 60587116 68565718 70491607 73701075 76480400 70655054 60188398 59026768 66883256
39516F6883256n18526j3966227o708140J7368211K6818605R936205r092565j0033359
$$ 66883256 66364730 52398503 45690363 63058574 89877179 99813384 90720819 80687460
39508H0687460m754715r628220j4726445m428362R580446N449955q561881l494741
$$ 80687460 75932745 66304525 51578080 47149718 56730164 62180119 53618238 50123497
39500E0123497K1251554L1361194R249415j8037200j9768800m470107J802548
$$ 50123497 71375051 102736245 111985660 93948460 74179660 69709553 71512101
39493G1512101q37252N620963J8149368J5689482l006366j6834853j8211160j9659709
$$ 71512101 70674849 76295812 94445180 110134662 107128296 90293443 72082283 52422574
39485E2422574k1336086o862264J8949271K4803828K941465j0774606Q239684
$$ 52422574 31086488 24224224 43173495 67977323 70918788 60144182 68383866
39478F8383866L0856169J9103189j3984609k7374667j3680907L273805J6003281
$$ 68383866 99240035 118343224 104358615 76983948 63303041 66576846 82580127
39471H2580127L3157344M1758424J8333917k2861470l9478152k3571382r571492
$$ 82580127 115737471 157495895 175829812 152968342 113490190 89918808 80347316
39464H0347316j3007535r495036J0953828J8289141l794798k2843092q991732
$$ 80347316 67339781 57844745 68798573 87087714 83292916 60449824 51458092
39457E1458092J5845685J6478333Q04297k042255N249634j76925j3784847j1299313
$$ 51458092 67303777 83782110 84586407 82544152 87793786 87616861 73832014 62532701
39449F2532701M715631P032620r165210j8122206n727396J1463741J5557631R722721
$$ 62532701 67248332 74280952 65115742 46993536 41266140 52729881 68287512 78010233
39441G8010233L884326j180558p540043j2244113j1224221l136378Q946924J3718041
$$ 78010233 81894559 80714001 73173958 60929845 49705624 46569246 55516170 69234211
39433F9234211M3198k1005629j9195045J2809717L8915049K5275277j0985086
$$ 69234211 69277409 48271780 29076735 41886452 80801501 106076778 95091692
39426I5091692k8809049k2796150j8100634j7559947J497K9530028L6110162J2192565
$$ 95091692 66282643 43486493 25385859 7825912 7827409 37357437 73467599 85660164
39418H5660164o111034K470454J1155138n009053k3776290j3245578J4028945
$$ 85660164 79549130 82019584 93174722 88165669 64389379 51143801 65172746
39411F5172746K1759270O185212n455262k441827r14351q530349j0217003M680012
$$ 65172746 86932016 93117228 87661966 85220139 84305788 75775439 65558436 70238448
39403G0238448K3287541K5396852O255432k0062361l1632529j6040717J3337993
$$ 70238448 93525989 118922841 125178273 105115912 73483383 57442666 70780659
39396G0780659K4732501M642944k0435566j6132361J2544806K8368503J4484189
$$ 70780659 95513160 100156104 79720538 63588177 76132983 104501486 118985675
39389A18985675n856670q140477J47842k30502p145717n717533J729498j630811
$$ 118985675 113129005 104988528 105136370 104905868 97760151 92042618 93772116 92141305
39381I2141305j6889178k4024680j1676237N543177Q847538J104624j141074P326967
$$ 92141305 75252127 51227447 39551210 45094387 53941925 55046549 53905475 61232442
39373F1232442J6511897J7591859J0458723k707872j8549657k7673555k2101583
$$ 61232442 77744339 95336198 105794921 103087049 84537392 56863837 34762254
39366C4762254r521140o610154j4267014j3901765M307033K3706973K3235681
$$ 34762254 25241114 18630960 4363946 -9537819 -5230786 18476187 41711868
39359D1711868N882847q295314q929136r70703R245875J7816332J7621523N354259
$$ 41711868 47594715 39299401 30370265 29399562 38645437 56461769 74083292 79437551
39351G9437551p121516m112758J0327345J4969798O90455j6038137j4507663M743704
$$ 79437551 72316035 68203277 78530622 93500420 94190875 78152738 63645075 68388779
39343F8388779K1295183J6566132p736468k9143723k4857861K073691K2855324
$$ 68388779 89683962 106250094 98513626 69369903 44512042 46585733 69441057
39336F9441057J7672803J863913K950047J9170111K2351156R91360k3267897k8321858
$$ 69441057 87113860 88977773 91927820 111097931 133449087 134440447 111172550 82850692
39328H2850692j8691780q454202L272838K1873784L5205321K3837938q659487
$$ 82850692 64158912 55704710 58977548 80851332 116056653 139894591 131235104
39321A31235104l3357349k8867685n974474P742654K359960n184241J543679J2169850
$$ 131235104 97877755 69010070 63035596 70778250 73138210 67953969 69497648 81667498
39313H1667498L340893k4310971m1825022l1220154j0033416k129426k223057
$$ 81667498 85008391 60697420 18872398 -12347756 -22381172 -24510598 -26733655
39306b6733655P727818K1254797J7427901J995836L580507K5072237L3364741
$$ -26733655 -19005837 2248960 19676861 21672697 25253204 50325441 83690182
39299H3690182J0477298j5790604j2550616J0746694K0045365O106492r050696
$$ 83690182 94167480 78376876 65826260 76572954 96618319 102724811 93674115
39292I3674115p720041L762188J0220179O474374j769649p195474q555020j0692263
$$ 93674115 85954074 89716262 99936441 106410815 104641166 97445692 88890672 78198409
39284G8198409j5689927j7353279j1511118o273191q884341q352088Q525462K7271088
$$ 78198409 62508482 45155203 33644085 27370894 18486553 10134465 18659927 45931015
39276D5931015J9240053j1652598k6327726n743283K1402534K3210992Q175129
$$ 45931015 65171068 53518470 27190744 21447461 42849995 66060987 74236116
39269G4236116J705603M925484M249002J000539K228066o63031j4447332k1390359
$$ 74236116 75941719 80867203 85116205 86116744 88344810 87681779 73234447 51844088
39261E1844088n695051J2522729N488663j2748134o839969J6638412J4508674
$$ 51844088 46149037 58671766 64160429 51412295 44572326 61210738 75719412
39254G5719412j9338433l4874842r92250M2095899L7952745o414962l3225011
$$ 75719412 56380979 21506137 20513887 62609786 100562531 94147569 60922558
39247F0922558j3587730K1119270K8885904R533764n299265R82023J1116962K483893
$$ 60922558 47334828 68454098 97340002 106873766 101574501 102556524 113673486 116157379
39239A16157379j9138432k6834651j0791756P559342P544465o57333M802353J9254800
$$ 116157379 97018947 70184296 59392540 66951882 74496347 73839014 78641367 97896167
39231I7896167J6871487p509658k7127852k1046541k095866N381522r8717j134607
$$ 97896167 114767654 107257996 80130144 59083603 56987737 62369259 62270542 61135935
39223F1135935Q718874J5647308O466886j2081462j9993998p269063J3307990
$$ 61135935 69854809 85502117 91969003 79887541 59893543 52624480 65932470
39216F5932470J9314840M046156j6400329k3510988j6965853r431588p740676
$$ 65932470 85247310 89293466 72893137 49382149 32416296 22984708 15244032
39209A5244032p939422m461404M616502J7896655K8264050K4786598N891623j3946735
$$ 15244032 7304610 2843206 7459708 25356363 53620413 78407011 84298634 70351899
39201G0351899j9869278j3994020p768959l806524K221872P457752M766705k492606
$$ 70351899 50482621 36488601 28719642 24913118 27134990 34592742 39359447 36866841
39193C6866841k906614N655401J2882854J0568664R97068q431130j1519316o952328
$$ 36866841 33960227 39615628 52498482 63067146 64064214 55633084 44113768 37161440
39185C7161440j493480l743920j0167526q357042J45210k087746j6476082j6844259
$$ 37161440 35667960 31924040 21756514 13399472 13544682 11456936 -5019146 -21863405
39177b1863405J0574144L7722230L2969973R540326K085533J0779911Q567291
$$ -21863405 -11289261 26432969 59402942 68943268 71028801 81808712 90376003
39170I0376003o111037q375887M020194O359649m842980n320075O588205K32032
$$ 90376003 84264966 75889079 79909273 86268922 81425942 76105867 82694072 82926104
39162H2926104l0708680m7762369k7046762K730081R374791N605233J5562335
$$ 82926104 52217424 4455055 -22591707 -19861626 -10486835 -4881602 10680733
39155A0680733K7407036J7855038j939834m198177J0146093J9404485J8576032
$$ 10680733 38087769 55942807 54002973 49804796 59950889 79355374 97931406
39148I7931406J5374655M392272j9835665l6930645k4216372K470469P407252
$$ 97931406 113306061 117698333 97862668 60932023 36715651 39186120 46593372
39141D6593372j0575280j7850347K01860J9480712J7146661K212745m113192K210534
$$ 46593372 36018092 18167745 18369605 37850317 54996978 57209723 53096531 55307065
39133E5307065Q841908N128010o428569j1295621J510039K0616330K0933713r34961
$$ 55307065 64148973 69276983 62848414 51552793 53062832 73679162 94612875 93677914
39125I3677914j7930608j2491441k705670p760658j2067061N363038K7141825
$$ 93677914 75747306 63255865 60550195 52789537 40722476 46085514 73227339
39118G3227339K1526024m461807j7164114j1574553j0728833j5958798o078821
$$ 73227339 94753363 90291556 73127442 61552889 50824056 34865258 28786437
39111B8786437J2622978O709919k3432828l3193306m298194K1086085O168637
$$ 28786437 41409415 48119334 24686506 -8506800 -12804994 8281091 14449728
39104A4449728k0734795j0352269L1652194N4068412L1876017p233901k4360694
$$ 14449728 -6285067 -16637336 15014858 69083270 100959287 93725386 69364692
39097F9364692j0644176J3404311K1905652N925451j8859628k8939327j9751904
$$ 69364692 58720516 72124827 94030479 99955930 81096302 52156975 32405071
39090C2405071o496317J281895P883200J1990747L570592j1250389r115022J2118131
$$ 32405071 25908754 27190649 35073849 47064596 50635188 39384799 30269777 42387908
39082D2387908K1096086m0421k2281126j1158221J9292207K6933992L314151j8613453
$$ 42387908 63483994 63443573 41162447 30004226 49296433 76230425 79544576 60931123
39074F0931123j4275688N026767J5847323J0052472m447838j2978621l909439
$$ 60931123 46655435 51682202 67529525 77581997 73134159 60155538 56246099
39067E6246099J6380325K2619644O92811k7737066k9747469n019790J5901767
$$ 56246099 72626424 95246068 95938879 68201813 38454344 33434554 49336321
39060D9336321J4064425P34009o263225l378156M337194J1423962J1369068K864261
$$ 49336321 63400746 64134755 57871530 54493374 58830568 70254530 81623598 84487859
39052H4487859l042035K886775R757145R60771j6448478j9465943n119638O760799
$$ 84487859 81445824 84332599 94089744 95050515 78602037 59136094 54016456 60777255
39044F0777255Q247089J1717213J7165498L625935l0642955m9400289k4968012
$$ 60777255 69024344 80741557 97907055 101532990 70890035 21489746 -3478266
39037c478266J8323845L5358464J9587203J539220j816870l045797j0240833r853175
$$ -3478266 14845579 50204043 69791246 71330466 69513596 66467799 56226966 46373791
39029D6373791N686214J8440098J0164565q859945j4368134k597095P744653N026329
$$ 46373791 52060005 70500103 80664668 71804723 57436589 54839494 62584147 67610476
39021F7610476j228867O57348O167497M304808m373626j1357050j5596253k1068543
$$ 67610476 66381609 67038957 73206454 77511262 73137636 61780586 46184333 25115790
39013B5115790k2024447q726371R619590Q724571j3451354k4361587j386991K9333066
$$ 25115790 3091343 -5635028 3984562 12709133 -742221 -25103808 -26490799 2842267
39005B842267K7073174j522404j0405496J6069050L9871371K8300576M67551q538644
$$ 2842267 29915441 28393037 17987541 34056591 73927962 102228538 102696089 94157445
38997I4157445p47003j055212r637218m728233J4895980K4360087J0722097j1184578
$$ 94157445 93410442 92355230 82718012 77989779 92885759 117245846 127967943 116783365
38989A16783365k4322563k6714096j9584705k509606J3229569R780074r429305
$$ 116783365 92460802 65746706 46162001 43652395 56881964 66662038 57232733
38982E7232733j8345667n588552Q281843M743634l118917M233893J5601359M383760
$$ 57232733 38887066 33298514 41580357 46323991 43205074 47438967 63040326 67424086
38974F7424086k6471676m2594512k3507118J2163905L2996040K8997613J1607272
$$ 67424086 40952410 -1642102 -25149220 -12985315 20010725 49008338 60615610
38967F0615610n706964j5237086j2962978j855056N742452l51160j3835443j7151931
$$ 60615610 54908646 39671560 26708582 24853526 30595978 30244818 16409375 -742556
38959g42556k959353J6208170K3160891J5058366J773264q973349j4986292j1369673
$$ -742556 -3701909 12506261 35667152 50725518 52498782 43525433 28539141 17169468
38951A7169468N881746K4329022K0105558r409105l2443923k0888526R141632
$$ 17169468 23051214 47380236 67485794 58076689 25632766 4744240 13885872
38944A3885872J8628655J644172r419418L166853J6667673Q110461r197914j0870825
$$ 13885872 32514527 34158699 24739281 27906134 44573807 52684268 43486354 32615529
38936C2615529R0054N673198O188584J3339999K2060842J7523117K716919p466895
$$ 32615529 32705583 38378781 44567365 57907364 79968206 97491323 100208242 92741347
38928I2741347j2921096k2108406k6268815j1062406R810115P527889j3537710
$$ 92741347 79820251 57711845 31443030 20380624 30190739 37718628 24180918
38921B4180918j7116925P282894K5186673J1333635j1627051j1463680N485382
$$ 24180918 7063993 14346887 39533560 50867195 39240144 27776464 33261846
38914C3261846J1452799N70446j2462413k0474508k4263738j8096439J56797J4850899
$$ 33261846 44714645 45285091 32822678 12348170 -11915568 -30012007 -29855210 -15004311
38906a5004311J1556702O20456L76006P528475O673448j273442m160991k623433
$$ -15004311 -3447609 -2827153 -2451147 5077328 11750776 10477334 6316343 3692910
38898C692910m167206k234097J2035020K4844933J5961426m777420p947834R667836
$$ 3692910 -474296 -2708393 9326627 34171560 50132986 45355566 37407732 47075568
38890D7075568K0968120J2303941J05844k093942k996708j0226560j5030106j1795384
$$ 47075568 68043688 80347629 80453473 78359531 75362823 65136263 50106157 38310773
38882C8310773q671711p860387Q09654J5305074J5107726n938555k3100135j3773763
$$ 38310773 29639062 21778675 22588329 37893403 53001129 47062574 23962439 10188676
38874A0188676J1578502K6787647K1488852K706186j6880796k0626044J366640
$$ 10188676 21767178 48554825 70043677 72749863 55869067 35243023 36609663
38867C6609663L0496857L1544490P90885k3165511j4117753N229016N502248j117149
$$ 36609663 67106520 98651010 99441895 76276384 62158631 67387647 72889895 71772746
38859G1772746J0704978K8387786K1184223n142524j7811177j2321771j3212451
$$ 71772746 82477724 110865510 132049733 126907209 109096032 96774261 83561810
38852H3561810k2714271j5826055P889229J4159602r389024k8231835j4576024
$$ 83561810 60847539 45021484 52910713 67070315 57681291 29449456 14873432
38845A4873432R324477Q328880j3271687k6223163k2249448j4732134o945999
$$ 14873432 24197909 32526789 19255102 -6968061 -29217509 -43949643 -50895642
38838e0895642R477318K8727735L0203334P395362j9637847k5414350m435821
$$ -50895642 -41418324 -12690589 17512745 24908107 5270260 -20144090 -24579911
38831b4579911K4729230L5908796J9526900o266420j5264722n249526K249536
$$ -24579911 149319 36058115 55585015 49318595 34053873 28804347 31053883
38824C1053883k907011l886981J2683610L0212457K4698902l0426j9809167k2570285
$$ 31053883 28146872 24259891 36943501 67155958 91854860 91824434 72015267 49444982
38816D9444982j3293145L593009K3557061L0458930J1455358j7790271k7276282
$$ 49444982 36151837 39744846 63301907 93760837 105216195 87425924 60149642
38809F0149642j3555454k400856p066875j0079658L335787J8298575J3860229
$$ 60149642 46594188 44193332 37126457 27046799 30382586 48681161 62541390
38802F2541390m274518j4043650q933333j023986J675618M127930J2023447K2949279
$$ 62541390 58266872 44223222 35289889 34265903 35941521 40069451 52092898 75042177
38794G5042177K9754867K5462290P765728j4916590k6966351k2555893j3515283
$$ 75042177 104797044 130259334 138025062 123108472 96142121 73586228 60070945
38787F0070945j2477864j5408619j1294926j963229J926510N20594M501753J5191986
$$ 60070945 47593081 32184462 20889536 18926307 20852817 21373411 25875164 41067150
38779D1067150K0312680J3231679L121341p953M45371m154220j2896811j6369755
$$ 41067150 61379830 74611509 77732850 77724897 78170268 74016048 61119237 44749482
38771D4749482q852448M984964J3052928N146362j5279351k9159496k0342590
$$ 44749482 35897034 40881998 53934926 59081288 43801937 14642441 -5700149
38764e700149K826265J4806125M779019j0329824j0386473K572680J2575179J2179732
$$ -5700149 -2873884 11932241 16711260 6381436 -4005037 -1432357 11142822 23322554
38756B3322554M618180p322715j9919317k2440224q837595P709181R011736k31474
$$ 23322554 27940734 20618019 698702 -21741522 -30579117 -22869936 -13858200 -14089674
38748a4089674K169318J9271623K5015660K687541k4651495k2086219Q018760
$$ -14089674 -11920356 7351267 32366927 35054468 10402973 -11683246 -3664486
38741c664486K7652562J4685606q483239q003880J4852987K7338048J0661092
$$ -3664486 23988076 38673682 30190443 22186563 37039550 64377598 75038690
38734G5038690j6013630k2307150m858735J1832942P306485j3173917k8477953
$$ 75038690 59025060 36717910 31859175 43692117 50998602 37824685 9346732
38727I346732k4349892m537869J4387646J7747059P032614j392854K597801P888963
$$ 9346732 -15003160 -19541029 -5153383 12593676 19626290 18233436 20831237 28720200
38719B8720200k14446j2432904o038107J5858902K1941765Q16301j6541312m657564
$$ 28720200 28505754 16072850 10034743 25893645 47835410 48651711 32110399 27452835
38711B7452835J2259887k020066l3302398l6362539q614039O173762p160159j0295268
$$ 27452835 39712722 37692656 4390258 -31972281 -40586320 -34412558 -41572717 -51867985
38703e1867985J7838227L7742888J4452953j7679455o930240K9202675L0367581
$$ -51867985 -34029758 3713130 18166083 486628 -6443612 22759063 53126644
38696E3126644p740242k7013614l825691J3634507j0885027l8840659k0015823
$$ 53126644 45386402 18372788 14547097 28181604 17296577 -21544082 -41559905
38689d1559905K3990553L2621295k34931k1323572k134211K3582126J7932256
$$ -41559905 -17569352 15051943 14817012 -6506560 -8640771 14941355 32873611
38682C2873611p383177j8080869r007714q77575p56038O046898K6418169M2995225
$$ 32873611 25490434 7409565 -1598149 -2475724 -3231762 2815136 29233305 72228530
38674G2228530L4258841J625778k9744581l5225802j3948501J1980088K0915303
$$ 72228530 106487371 108113149 78368568 43142766 29194265 41174353 62089656
38667F2089656J1685632j571993q334760p580540m25695R440657R790465q604759
$$ 62089656 73775288 72203295 63868535 56287995 55862300 65302957 75093422 66488663
38659F6488663l1596874l1376954m043131K1141858K0694573N201817n905071
$$ 66488663 34891789 3514835 -528296 20613562 41308135 46509952 40604881
38652D0604881j4810133k7087210k5563500K786438K9462018J7094528j6532662
$$ 40604881 25794748 -1292462 -26855962 -24069524 5392494 22487022 5954360
38645E954360j5833384K5884359M9107965J7117408k7474257k8467198L704337
$$ 5954360 -9879024 16005335 65113300 82230708 54756451 26289253 29993590
38638B9993590K0258188R864587k741931j1033836k6925953l8972671k2711219
$$ 29993590 50251778 60116365 57374434 46340598 19414645 -19558026 -42269245
38631d2269245J0437385K3336865J2637238J0227730K2157633J7116718j3272184
$$ -42269245 -31831860 -8494995 4142243 14369973 36527606 53644324 40372140
38624D0372140l3229903k0822273j151543J237583j66520R714651J5056876L926125
$$ 40372140 7142237 -13680036 -14831579 -13593996 -13760516 -4045865 11011011 14937136
38616A4937136k494922J0764737J9445226K814849j4598877m459177J4029235
$$ 14937136 12442214 23206951 42652177 45467026 30868149 26408972 40438207
38609D0438207Q814865q209633q065728j398166j3274878k4638965k331323K7954424
$$ 40438207 49253072 41043439 32977711 31579545 18304667 -6334298 -8665621 19288803
38601A9288803J0056213m4112177n9306932j2160288L2275210K5430000O250817
$$ 19288803 29345016 -14767161 -74074093 -86234381 -53959171 -28529171 -22278354
38594b2278354K4830605N5599716M4642122J901895j7697269l283049L540004
$$ -22278354 2552251 58151967 102794089 104695984 86998715 83715666 87255670
38587H7255670j5811282k8419212p499433K3756127K6208506k272982k7868822
$$ 87255670 71444388 43025176 35525743 59281870 85490376 83217394 55348572
38580E5348572k3700022K883242K3472221K0774291L731915q881549j2068541
$$ 55348572 31648550 34531792 58004013 78778304 82510219 73628670 61560129
38573F1560129j2459350r235680M333356K0143879J7972836l580134j9087888
$$ 61560129 49100779 39865099 44198455 64342334 82315170 78735036 59647148
38566E9647148j0459208Q599119J4631318M640743q616946j6174666j4826623
$$ 59647148 49187940 57787059 72418377 77059120 68442174 52267508 37440885
38559C7440885m512894M219663l523697k1281280k1399512L961026K3815839J1363306
$$ 37440885 32927991 37147654 33623957 12342677 -9056835 -5095809 18720030 30083336
38551C0083336j4372189j6364145O722100K3918934J8842325M037806n949957
$$ 30083336 15711147 -652998 6069102 29988036 48830361 52868167 46918210
38544D6918210q586656l230577Q068480J1414926l891039k2674562j9408182M103160
$$ 46918210 38331554 35100977 43169457 54584383 50693344 28018782 8610600 12713760
38536A2713760J9342766J0156175j0415492k3180229k1218470m691288J9761979
$$ 12713760 32056526 42212701 31797209 8616980 -12601490 -17292778 2469201
38529B469201L2220809J6355137j1605907j4950418J3990526L9872414L2154514
$$ 2469201 34690010 51045147 39439240 24488822 38479348 78351762 110506276
38522A10506276N061924p469926N06774O150352l658817j4972084j0402833M609522
$$ 110506276 115568200 108098274 108605048 114755400 111096583 96124499 85721666 90331188
38514I0331188Q197539q632940k7524881k4186802j351832J2843752M463373m886720
$$ 90331188 98528727 89895787 62370906 38184104 36832272 49676024 54139397 49252677
38506D9252677Q010657K7119066J6519092k3852722n1718644l8546229n658494
$$ 49252677 57263334 84382400 100901492 77048770 25330126 -13216103 -18874597
38499a8874597J0207150O386479Q389577K5958443L8049019K3259634j0115328
$$ -18874597 -8667447 -2280968 6108609 32067052 70116071 93375705 83260377
38492H3260377l2819661k8945156j3209054r319393j6331553j0299805J6835916
$$ 83260377 50440716 21495560 8286506 -1032887 -17364440 -27664245 -10828329
38485a0828329L7903511K5710160o096905k0464168q048464N765666M187595N03918
$$ -10828329 27075182 52785342 46688437 26224269 18175805 23941471 28129066 28632984
38477B8632984Q546251J7895571J3101788j636741j2327597j5314335j3997616
$$ 28632984 37179235 55074806 68176594 66539853 54212256 38897921 24900305
38470B4900305q113184Q43709M663021P93660p30452O442977J2690891P603940
$$ 24900305 16787121 17630830 22293851 23087511 22357059 28800036 41490927 49094867
38462D9094867l187979q106915o739804n395826n037965m695180p002610r367971
$$ 49094867 45906888 37799973 31060169 25664343 20626378 15931198 8928588 -439383
38454d39383j067822J7976645K7664840J3119644j0755131j8384386q904459k325247
$$ -439383 -1507205 16469440 44134280 57253924 46498793 28114407 19209948 16884701
38446A6884701o092097q063798k333181N19421n438133q875690R02065J6605642
$$ 16884701 10792604 2728806 395625 915046 -4523087 -13398777 -12496712 4108930
38438D108930K3024132J5495915O05478j3848338k1763333j7747142k103261J5327901
$$ 4108930 27133062 42628977 43234455 29386117 7622784 -10124358 -12227619 3100282
38430C100282K3170611K0191522J4374361J0658261M928961p426852k1509003
$$ 3100282 26270893 46462415 60836776 71495037 76423998 68997146 47488143
38423D7488143k7144780k1782419j2206943k604179R765904K2236279K1219366
$$ 47488143 20343363 -1439056 -13645999 -16250178 -6484274 15752005 36971371
38416C6971371N70753k2571580k5552576r453813N629577J1003671J5145781J9712514
$$ 36971371 37542124 14970544 -10582032 -20035845 -14406268 -3402597 11743184 31455698
38408C1455698J3758834k212123j0146192l015304K692729l632088p157882M976113
$$ 31455698 45214532 43002409 32856217 29840913 32533642 28901554 21743672 26719785
38400B6719785J7766286J1885203m709430j2645666j2334957j2909161n929737
$$ 26719785 44486071 56371274 51661844 39016178 26681221 13772060 7842323
38393G842323J7582652L5832609J9845629j5796076k5402233J165746K3436237
$$ 7842323 25424975 61257584 81103213 65307137 39904904 41070650 64506887
38386F4506887J2362572j0532384j4349594n020482m365656r537873l975087P880067
$$ 64506887 76869459 66337075 51987481 46966999 42601343 33063470 29088383 36968450
38378C6968450O931038p769206j8037078j4296713l946652M292086O955464J307278
$$ 36968450 43899488 36130282 18093204 3796491 -150161 4141925 11097389 12404667
38370A2404667r367029j1407140J630881J3480785N997218j0644651j0535763
$$ 12404667 3037638 -8369502 -6738621 6742164 12739382 2094731 -8441032
38363h441032Q523593K2253496J6951543M242756n084822j5187314k3707067j3723643
$$ -8441032 82561 22336057 39287600 43530356 38445534 23258220 -448847 -14172490
38355a4172490J5207849L1639627J2140059k0402196k5955266l711119J1150385
$$ -14172490 1035359 32674986 44815045 24412849 -1542417 -5253536 5896849
38348E896849K493303q147866k750342N831661K244821l316176K565214P487204
$$ 5896849 8390152 242286 -2508056 3323605 5568426 2252250 4817464 12304668
38340A2304668n772874k2758873j3521451J8482560L5569294J9363768l888561
$$ 12304668 6531794 -16227079 -29748530 -11265970 24303324 43667092 39778531
38333C9778531m238856J0938549J5921655O677806k572341r749946k3411108l4980140
$$ 39778531 35539675 46478224 62399879 69077685 66505344 56755398 33344290 -1635850
38325a635850k1985277J4563497M0757799L0965362Q48837j5555974q174729O294106
$$ -1635850 -23621127 -9057630 31700169 62665531 63514368 47958394 39783665 46077771
38317D6077771J3507258J3443529P502358n602379j8593568j8351154o045428
$$ 46077771 59585029 73028558 80530916 74928537 56334969 37983815 31938387
38310C1938387J006275m670652q923399j865683J407682j3945178k9419658j3939841
$$ 31938387 32944662 28274010 19350611 17484928 18892610 4947432 -24472226 -38412067
38302c8412067K4922857M2507785J8785399j1864773j1322485Q876669J3447304
$$ -38412067 -13489210 29018575 47803974 35939201 24616716 33493385 46940689
38295D6940689J831654K011074J4729973Q668909k1280134l3702354j161901M2439142
$$ 46940689 48772343 50783417 65513390 74182299 52902165 19199811 18037910 60477052
38287F0477052M6797408J5509314m671255N665053J6276961j766954l4637398
$$ 60477052 107274460 122783774 118112519 123777572 140054533 138287579 103650181
38280A03650181m8071918l0875267k192499J3446799Q071983o074434r028020
$$ 103650181 55578263 24702996 22510497 35957296 44029279 37954845 28926825
38273B8926825N745324K1824880J8604909k129155j9385599k1445385j6575529
$$ 28926825 34672149 56497029 75101938 72972783 53587184 32141799 15566270
38266A5566270j3606245q542882K427131J1068614Q421003j934995j0377446j2237415
$$ 15566270 1960025 -6582857 -4155726 6912888 15333891 13398896 3021450 -9215965
38258i215965o121733P634585J9906940J7485752M086478J349556J5661629K1245492
$$ -9215965 -15337698 -7703113 12203827 29689579 33776057 35125613 50787242 72032734
38250G2032734k637561l2540142k8473363O190913K6662860J1415836j0596084
$$ 72032734 69395173 36855031 8381668 14572581 41235441 52651277 42055193
38243D2055193j0378946j872519r408729k0597346p508557K1214549K9081303
$$ 42055193 31676247 29803728 20394999 -202347 -7710904 13503645 42584948
38236D2584948Q544473r087137m467638N986245P976094J4042315K9735796K8804121
$$ 42584948 51129421 42042284 37574646 43560891 51536985 65579300 95315096 124119217
38228A24119217o461070m4862057m3385906r575377J1727687N537903o73122Q713902
$$ 124119217 117658147 72796090 29410184 19834807 31562494 37100397 36427275 45141177
38220D5141177J3949999K161348o366712N050047J8159598J0295868q259901j3677385
$$ 45141177 59091176 61252524 54885812 59935859 78095457 88391325 80131424 66454039
38212F6454039o048251j035634L37027O626888J2463380O439785n995231j1528874
$$ 66454039 60405788 59370154 59707181 66334069 78797449 85237234 79242003 67713129
38204F7713129j2125279j5319051j1707134R919309L2958911K9570452L089043
$$ 67713129 55587850 40268799 28561665 38480974 71439885 101010337 104099380
38197A04099380j7335418k2047997k6476256l0825220j4167010K0480899L4340401
$$ 104099380 86763962 64715965 38239709 7414489 -6752521 13728378 48068779
38190D8068779P328394k7104442k6821683L545547K7566943K7457724J3066597
$$ 48068779 55397173 28292731 1471048 5016595 32583538 60041262 73107859
38183G3107859l904018j7351473j8273409l768977J0964079R613524j995108o496951
$$ 73107859 69203841 51852368 33578959 29809982 40774061 50387585 48392477 41895526
38175D1895526n38589P475034J5187148K2448547J9630337J804484j3478764o118582
$$ 41895526 41356937 48831971 64019119 86467666 106098003 107902487 94423723 88305141
38167H8305141J4654472K2161735J1350915R67744q1918j435009o226748m982227
$$ 88305141 102959613 125121348 136472263 137440007 137358089 135923080 129696332 124714105
38159A24714105J773989J276513n666324k725279J1255750J6499911O425628j45008
$$ 124714105 126488094 127764607 122098283 119373004 130628754 147128665 153554293 153409285
38151A53409285O818893J0672018R35035m860867N349051J0068541j1189510l7645563
$$ 153409285 160228178 170900196 171835231 166974364 172323415 182391956 171202446 133556883
38143A33556883l5747503j1939396k8127n634049k841642J5185478K2111516L664472
$$ 133556883 97809380 85869984 85841857 80207808 77366166 92551644 114663160 118327632
38135A18327632j6944991j3636517P852191K4274592K3575491P336124j6218695
$$ 118327632 101382641 87746124 95598315 119872907 143448398 150784522 134565827
38128A34565827l0231229j8741673J0343171K8775147K3255521Q072862m184101
$$ 134565827 104334598 85592925 95936096 124711243 147966764 156039626 151855525
$$ [...]
##END NTUPLES=NMR SPECTRUM
##END=
