##TITLE=31Pdec_SR19_K
 CDCl3, 24 sc
 30.10.2020
##JCAMPDX= 6.0         $$ Bruker NMR JCAMP-DX V2.0
##DATA TYPE= NMR SPECTRUM
##DATA CLASS= NTUPLES
##ORIGIN= UXNMR, Bruker Analytische Messtechnik GmbH
##OWNER= root
$$ XWIN-NMR		Version 3.5
$$ Fri Oct 30 12:40:50 2020 Russian Standard Time (UT+4h)  she@DPX200
##.OBSERVE FREQUENCY= 81.013821
##.OBSERVE NUCLEUS= ^31P
##.ACQUISITION MODE= SIMULTANEOUS
##.ACQUISITION SCHEME= undefined
##.AVERAGES= 24
##.DIGITISER RES= 17
##SPECTROMETER/DATA SYSTEM= spect
##.PULSE SEQUENCE= zgpg30
##.SOLVENT NAME= CDCl3
##.SHIFT REFERENCE= (INTERNAL, CDCl3, 0, 182.463)
##AUDIT TRAIL= $$ (NUMBER, WHEN, WHO, WHERE, WHAT)
$$ ##TITLE= Audit trail, XWIN-NMR		Version 3.5
$$ ##JCAMPDX= 5.01
$$ ##ORIGIN= Bruker BioSpin GmbH
$$ ##OWNER= she
$$ F:/spectra/data/she/nmr/P31/1/pdata/1/auditp.txt
$$ ##AUDIT TRAIL=  $$ (NUMBER, WHEN, WHO, WHERE, WHAT)
(   1,<2020-10-30 12:39:21.79 +0400>,<she>,<DPX200>,
      <created by zg, POWCHK disabled, PULCHK disabled
       configuration hash MD5:
       00 E9 B6 7A A2 85 ED C7 34 08 36 98 17 FE 4E 26
       data hash MD5: 32K
       1C 9D 22 9A D7 32 11 E4 C9 28 AC 08 4D B8 92 96>)
(   2,<2020-10-30 12:39:26.21 +0400>,<she>,<DPX200>,
      <Start of raw data processing
       efp BC_mod = 2 LB = 1 FT_mod = 6 PKNL = 1 PHC0 = -2417.749 PHC1 = 139.2008 SI = 64K 
       data hash MD5: 64K
       0D 17 1C 61 9E BE E1 9E CF FE 38 1B 09 3E 3E 53>)
(   3,<2020-10-30 12:39:42.21 +0400>,<she>,<DPX200>,
      <pk PHC0 = 5.66572 PHC1 = 0 
       data hash MD5: 64K
       FD 5C B7 24 EC 1B BD 4B 6A 4C 8B 52 46 6C C6 1F>)
(   4,<2020-10-30 12:39:45.65 +0400>,<she>,<DPX200>,
      <abs ABSG = 5 
       data hash MD5: 64K
       A3 85 B0 93 72 E0 34 5A 02 2F F0 08 7C B3 28 80>)
$$ ##END=
$$ 
$$ hash MD5
$$ FE EF B7 15 0E FB 8F 70 8B 7B A9 90 C2 E3 9C DF
##$RELAX= 
##$RELAX= 
##$RELAX= 
##$RELAX= 
##$RELAX= 
##$RELAX= 
##$RELAX= 
##$RELAX= 
$$ Bruker specific parameters
$$ --------------------------
##$DU= <F:/spectra>
##$EXPNO= 1
##$NAME= <P31>
##$PROCNO= 1
##$TYPE= <nmr>
##$USER= <she>
##$AMP= (0..31)
100 100 100 100 100 100 100 100 100 100 100 100 100 100 100 100 100 100 
100 100 100 100 100 100 100 100 100 100 100 100 100 100 
##$AQSEQ= 0
##$AQ_mod= 1
##$AUNM= <au_zg>
##$AUTOPOS= <>
##$BF1= 81.014009
##$BF2= 200.13
##$BF3= 200.13
##$BF4= 200.13
##$BF5= 200.13
##$BF6= 200.13
##$BF7= 200.13
##$BF8= 200.13
##$BYTORDA= 1
##$CFDGTYP= 0
##$CFRGTYP= 5
##$CHEMSTR= <none>
##$CNST= (0..31)
1 1 145 1 1 1 1 1 1 1 1 1 1 1 1 1 1 1 1 1 1 1 1 1 1 1 1 1 1 1 1 1 
##$CPDPRG= <waltz16>
##$CPDPRG1= <>
##$CPDPRG2= <waltz16>
##$CPDPRG3= <>
##$CPDPRG4= <mlev>
##$CPDPRG5= <mlev>
##$CPDPRG6= <mlev>
##$CPDPRG7= <mlev>
##$CPDPRG8= <mlev>
##$CPDPRGB= <>
##$CPDPRGT= <>
##$D= (0..31)
0 1 0 0 0 0 0 0 0 0 0 0.03 2e-05 3e-06 0 0 0 0 0 0 0 0 0 0 0 0 0 0 0 0 
0 0 
##$DATE= 1604047161
##$DBL= (0..7)
120 120 120 11 120 120 24 19 
##$DBP= (0..7)
150 150 150 150 150 150 150 150 
##$DBP07= 0
##$DBPNAM0= <>
##$DBPNAM1= <>
##$DBPNAM2= <>
$$ [...]
##$SUBNAM3= <"">
##$SUBNAM4= <"">
##$SUBNAM5= <"">
##$SUBNAM6= <"">
##$SUBNAM7= <"">
##$SUBNAM8= <"">
##$SUBNAM9= <"">
##$SW= 369.568048894756
##$SWIBOX= (0..15)
0 1 3 0 0 0 0 0 0 0 0 0 0 0 0 0 
##$SW_h= 29940.119760479
##$TD= 32768
##$TD0= 1
##$TE= 0
##$TE2= 300
##$TE3= 300
##$TEG= 300
##$TL= (0..7)
0 120 53 12 22 120 120 120 
##$TP= (0..7)
150 150 150 150 150 150 150 150 
##$TP07= 0
##$TPNAME0= <>
##$TPNAME1= <>
##$TPNAME2= <>
##$TPNAME3= <>
##$TPNAME4= <>
##$TPNAME5= <>
##$TPNAME6= <>
##$TPNAME7= <>
##$TPOAL= (0..7)
0.5 0.5 0.5 0.5 0.5 0.5 0.5 0.5 
##$TPOFFS= (0..7)
0 0 0 0 0 0 0 0 
##$TUNHIN= 0
##$TUNHOUT= 0
##$TUNXOUT= 0
##$USERA1= <user>
##$USERA2= <user>
##$USERA3= <user>
##$USERA4= <user>
##$USERA5= <user>
##$V9= 5
##$VALIST= <valist>
##$VCLIST= <CCCCCCCCCCCCCCC>
##$VD= 0
##$VDLIST= <DDDDDDDDDDDDDDD>
##$VPLIST= <PPPPPPPPPPPPPPP>
##$VTLIST= <TTTTTTTTTTTTTTT>
##$WBST= 1024
##$WBSW= 4
##$XGAIN= (0..3)
0 0 0 0 
##$XL= 0
##$YL= 0
##$YMAX_a= 17825
##$YMIN_a= -4213
##$ZGOPTNS= <>
##$ZL1= 120
##$ZL2= 120
##$ZL3= 120
##$ZL4= 120
##$ABSF1= 182.463
##$ABSF2= -187.1042
##$ABSG= 5
##$ABSL= 3
##$ALPHA= 0
##$AQORDER= 0
##$ASSFAC= 0
##$ASSFACI= 0
##$ASSFACX= 0
##$ASSWID= 0
##$AUNMP= <proc_1d>
##$AZFE= 0.1
##$AZFW= 0.5
##$BCFW= 0
##$BC_mod= 2
##$BYTORDP= 0
##$COROFFS= 0
##$CY= -3
##$DATMOD= 1
##$DC= 0
##$DFILT= <>
##$DTYPP= 0
##$F1P= 0
##$F2P= 0
##$FCOR= 1
##$FTSIZE= 65536
##$FT_mod= 6
##$GAMMA= 0
##$GB= 0
##$INTBC= 1
##$INTSCL= 5.30512e-09
##$ISEN= 30
##$LB= 1
##$LEV0= 0
##$LPBIN= 0
##$MAXI= 10000
##$MC2= 0
##$MEAN= 0
##$ME_mod= 0
##$MI= 50
##$NCOEF= 0
##$NC_proc= -9
##$NLEV= 6
##$NOISF1= 182.463
##$NOISF2= 159.3651
##$NSP= 0
##$NTH_PI= 0
##$NZP= 0
##$OFFSET= 182.463
##$PC= 4
##$PHC0= -2412.083
##$PHC1= 139.2008
##$PH_mod= 1
##$PKNL= yes
##$PPARMOD= 0
##$PSCAL= 0
##$PSIGN= 0
##$REVERSE= no
##$SF= 81.014009
##$SI= 65536
##$SIGF1= 159.3651
##$SIGF2= -187.1042
##$SINO= 113.3802
##$SIOLD= 16384
##$SREGLST= <1H.CDCl3>
##$SSB= 0
##$STSI= 65536
##$STSR= 0
##$SW_p= 29940.119760479
##$SYMM= 0
##$S_DEV= 0
##$TDeff= 32768
##$TDoff= 0
##$TI= <>
##$TILT= no
##$TM1= 0
##$TM2= 0
##$TOPLEV= 0
##$USERP1= <user>
##$USERP2= <user>
##$USERP3= <user>
##$USERP4= <user>
##$USERP5= <user>
##$WDW= 1
##$XDIM= 65536
##$YMAX_p= 318997941
##$YMIN_p= -62111126
$$ End of Bruker specific parameters
$$ ---------------------------------
##NTUPLES= NMR SPECTRUM
##VAR_NAME=  FREQUENCY,     SPECTRUM/REAL,   SPECTRUM/IMAG
##SYMBOL=    X,             R,               I
##VAR_TYPE=  INDEPENDENT,   DEPENDENT,       DEPENDENT
##VAR_FORM=  AFFN,          ASDF,            ASDF
##VAR_DIM=   65536,         65536,           65536
##UNITS=     HZ,            ARBITRARY UNITS, ARBITRARY UNITS
##FACTOR=    0.456856943014862, 1,           1
##FIRST=     14782.0589164895, 0,            0
##LAST=      -15158.0608439895, 0,           0
##MIN=       -15158.0608439895, -62111126,   0
##MAX=       14782.0589164895, 318997941,    0
$$ Real data points
##PAGE= N=1
##DATA TABLE= (X++(R..R)), XYDATA
$$ [...]
45285 57822471 46856090 30130746 13387829 -2062781 -10485287 -8819285 -4996915
45278 -4996915 -7466442 -12149592 -9593380 550598 11111682 17659109 18771143 12356634
45270 12356634 377187 -9010418 -12324807 -16335087 -23816259 -23327378 -6316652 13701257
45262 13701257 15705714 983281 -8641045 -1791097 9956127 13287083 11254217 13450592
45254 13450592 19800749 22635487 18362778 10416619 4040849 1683243 1145037 -2010740
45246 -2010740 -7182910 -6820591 2006469 8245082 -283088 -16593444 -20746306 -8447741
45238 -8447741 973971 -8041974 -24654912 -27206326 -12777983 1476606 2874595 -2689430
45230 -2689430 -1866293 9266912 21982584 24274034 12183092 -5556723 -13930934 -4784213
45222 -4784213 15850520 33108430 34513802 17848227 -6747072 -22488355 -20824379
45215 -20824379 -12662564 -17058630 -35541373 -47671382 -39181099 -23922676 -25085229 -41887641
45207 -41887641 -51686732 -43394445 -30748681 -28041021 -29182954 -20753526 -3915292 8848934
45199 8848934 11844833 9614245 6505864 3089578 643002 545856 980705 1166126 5331878
45190 5331878 14583115 19415545 10897956 -4052679 -10601743 -6888065 -3285519 -2048253
45182 -2048253 5337988 17752310 19940651 6621337 -5752025 -3058104 5559193 5261548
45174 5261548 586960 4671423 13283677 10667267 -3455310 -13687734 -14559414 -15698060
45166 -15698060 -19544818 -14477484 3559784 20566751 24420271 20490475 18260593 15913811
45158 15913811 8656163 783510 -1778195 -1822773 -3481487 -3133657 1916716 3857569
45150 3857569 -5143493 -19060159 -25274609 -20576389 -10734530 -281497 7739641 8679789
45142 8679789 3540056 2374895 9066455 10922477 -1969461 -15035653 -6381048 18201599
45134 18201599 29788393 18043910 5891776 14052194 30856834 31583337 13696095
45127 13696095 -3730455 -7843014 -3620131 -878543 -2860165 -7597456 -10860920 -7426121
45119 -7426121 3035826 11585407 8314856 -5563902 -20373616 -31223220 -40414688 -47023341
45111 -47023341 -44429196 -32073860 -20676705 -18706394 -19734387 -11772554 4050719 13629576
45103 13629576 8942465 -1924000 -7063556 -5608229 -4625247 -6501667 -7081087 -4646585
45095 -4646585 -3600050 -8038890 -16118406 -21771801 -19420451 -8379654 3444607 2681924
45087 2681924 -15831434 -39082193 -47401809 -37243117 -24636989 -23589363 -29582349 -29209362
45079 -29209362 -18248296 -3395095 7822818 11322513 5280068 -7293942 -17101849
45072 -17101849 -16279603 -6235264 6145480 16047268 19556938 11039601 -9316088 -28646877
45064 -28646877 -32182353 -21042001 -11382135 -14892904 -26418245 -31700161 -22269657 -2547649
45056 -2547649 13369546 12866044 -2739834 -18326493 -21620911 -16529672 -14739985 -18836938
45048 -18836938 -21916868 -20309603 -16862958 -13462908 -10317472 -11597478 -21051923 -31787963
45040 -31787963 -31572591 -20377054 -12264333 -16727480 -27548051 -33472298 -30832168 -21901870
45032 -21901870 -9847640 -215727 364352 -7751326 -15987103 -17280592 -11305639 188229
45024 188229 13899436 19879144 8378564 -13746322 -25902267 -19757290 -10406516 -13205906
45016 -13205906 -21666526 -20005223 -7262627 5135774 12324654 17456388 18971224 11817641
45008 11817641 -91565 -6595053 -6602799 -8155510 -12736957 -12582963 -6202683 -3974749
45000 -3974749 -12795581 -24939184 -28462786 -21611104 -11477732 -4337453 -2175749 -3475525
44992 -3475525 -2939075 4489607 14885292 15906314 1661005 -17318077 -25417300 -20572366
44984 -20572366 -14881321 -17596671 -24302845 -24713525 -16032409 -4874129 1829375 3976503
44976 3976503 5891743 9445487 12165729 12008920 10892531 11073679 10233074 4804985 -1754009
44967 -1754009 -32265 12050610 21678676 14359258 -5826206 -17471591 -7227651 12738444
44959 12738444 19796889 9257049 -2051505 -389281 7859594 8992576 2459054 -1286287
44951 -1286287 1332930 2472653 -3649368 -12150618 -15089820 -10756799 -2292597 7190976
44943 7190976 14556798 16279552 11815001 4277568 -4362228 -14778475 -24734356 -27090652
44935 -27090652 -17838576 -2900940 7510242 9316488 5962048 2125778 618346 3738194
44927 3738194 12013768 20659311 21793874 13060179 1863618 -2206937 1343804 4036829
44919 4036829 1322953 520889 9901547 22827648 23029590 7791186 -5368023 -2043559
44911 -2043559 9426864 12347384 6305289 2341638 236884 -9728520 -23501508 -23276626
44903 -23276626 -6074666 7729733 4336384 -2727286 4829054 21690811 29529808 24804241
44895 24804241 18070596 12986596 4709512 -4141816 -4173504 3440405 6000428 -1503302
44887 -1503302 -9268969 -8228216 -1293937 4995847 9973410 14919901 17609891 15976975
44879 15976975 11714045 6594467 154576 -6255850 -8153707 -3614115 3559560 8250389
44871 8250389 7940977 1422252 -11345935 -25848010 -33817883 -30750134 -20655347 -11526399
44863 -11526399 -7874999 -9180340 -13768784 -21031527 -28279967 -27669386 -12434170 10287661
44855 10287661 19486698 2876792 -23547722 -31316732 -15386607 486392 -1782554
44848 -1782554 -11828863 -12255558 -6133140 -7151163 -14838202 -18524776 -17867941 -19918057
44840 -19918057 -21013054 -11698992 2602007 5585669 -5217410 -16245720 -21036857 -26507767
44832 -26507767 -34031755 -34022784 -24452928 -16506326 -15683156 -14657477 -11324868 -15785526 -30793633
44823 -30793633 -42722226 -42231676 -37731754 -37601644 -35394086 -25049007 -14832813 -12015243
44815 -12015243 -8886325 301493 3487866 -9417097 -24073280 -20578566 -5151993 -147512
44807 -147512 -8608655 -12267340 -2538860 9530615 15524703 20329943 26358584 26504593
44799 26504593 19442040 15479333 19540483 22006580 14023707 340182 -9765190 -13836693
44791 -13836693 -13009890 -8286859 -5467387 -12318687 -24543433 -26395054 -12900147 534793
44783 534793 280076 -5571955 -2046493 7867196 9019237 -837166 -8451298 -6729589
44775 -6729589 -3820039 -7723897 -14201882 -15048898 -9601265 -2995826 883371 1264484
44767 1264484 837078 6369613 22333271 41299229 48238827 38680114 25306468 20955045
44759 20955045 22529394 19881113 14123568 15455758 25005164 31083772 25883425 16116642
44751 16116642 12590531 16342863 20030232 17869024 9622492 -1225537 -9157621 -9741884
44743 -9741884 -4371122 952652 3326920 5245388 7846779 8174686 5958351 5865620 8675273
44734 8675273 8080324 2224359 -341736 4976940 7115435 -5374191 -23356491 -26744520
44726 -26744520 -13354667 -2541486 -7732738 -19472531 -21331984 -11499209 -1453932
44719 -1453932 -666304 -8895999 -19017434 -23594319 -21913541 -20596853 -22444128 -17894744
44711 -17894744 2508823 29162724 40697083 32070700 20766246 20079442 21459064 12449117
44703 12449117 -1640911 -6964604 -2282674 2969852 5428617 9044298 13217650 12612303
44695 12612303 7906172 5567923 6124098 2091286 -9910803 -21803785 -22350721 -10062908
44687 -10062908 4038515 6560324 -4177506 -14821937 -11287969 4457276 17832298
44680 17832298 21153187 20402154 20784933 17351081 6761890 -1714789 2963850 17598231
44672 17598231 28589099 28104873 19327101 9031894 1093039 -5189028 -13797664 -25459053
44664 -25459053 -31901145 -24612772 -10377963 -6275900 -15238252 -19986096 -8048291 11170646
44656 11170646 23193552 27511356 28226391 21182846 6268495 -1407181 7966404 18060949
44648 18060949 7272289 -17455934 -29854950 -22389055 -12441362 -12456356 -16402618 -17372806
44640 -17372806 -17871899 -18749162 -15607643 -10011477 -8721460 -9781164 -5306218 841682
44632 841682 -3912047 -17860794 -24141007 -17456308 -12566276 -18855577 -24488565 -15998636
44624 -15998636 1143731 12234521 12216117 5894276 -791987 -2404857 3799051 11611504
44616 11611504 11010322 3285348 363403 6084237 10882085 9053962 7652308 12865759
44608 12865759 20798281 27304152 33727276 37484424 31004098 16184545 5973921 5575356
44600 5575356 6442856 4155488 5430481 10977306 10511014 3858689 6438065 21057427
44592 21057427 25233539 4048197 -23023185 -28979552 -17717174 -12562489 -17904543 -17223073
44584 -17223073 -3984275 8727713 9308156 654811 -8347197 -11128732 -4742113 6076987
44576 6076987 9824605 2886528 -3497969 -831881 2575233 -2011637 -6117087 -461633
44568 -461633 3656833 -7540287 -20429921 -9799570 19099731 33300355 19718676
44561 19718676 2606555 5493655 20232138 26406588 21654835 17239672 16921291 15174703
44553 15174703 8854984 -314525 -9532398 -14100616 -8567248 5804653 19934739 26321353
44545 26321353 23621171 11667131 -8156537 -25838029 -27871957 -14235366 54912
44538 54912 4960730 6052206 9630056 9800807 342332 -10435633 -9307845 2531556
44530 2531556 11404062 10074188 4296264 852077 -1037934 -3732142 -4644294 -1375906
44522 -1375906 836053 -6279532 -21806700 -33933941 -33541199 -24857422 -17530336 -12427465
44514 -12427465 -3867906 6281889 8525040 1699209 -3125628 302492 4482306 3481320
44506 3481320 4727520 15054707 26583002 29633703 29310000 33672853 34580084 19206421
44498 19206421 -4782658 -15412150 -5987068 9717520 20394258 26157234 24901473
44491 24901473 11313741 -6183201 -7881542 10104292 28348530 31363131 25680055
44484 25680055 22382871 19064034 11244256 6564521 12682608 21683722 20901862 11502533
44476 11502533 3332204 -1998935 -9745337 -18276653 -19434300 -11332383 -994701 5522316
44468 5522316 8587120 11173631 14947391 19596395 23079630 24333986 26681069 33828810
44460 33828810 41110887 37513407 19845540 -1382561 -13892720 -15391865 -10368300 -2832184
44452 -2832184 2834637 1104932 -7808616 -14903341 -11883252 -399894 11662322 18798108
44444 18798108 19703490 15439087 9276535 4473789 252378 -5779138 -10995097 -9737490
44436 -9737490 -2215788 5602854 10813795 14082694 12441676 2769995 -7306333 -5378383
44428 -5378383 6223194 10992507 3107493 -2919201 5099376 18766688 23493023 18812865
44420 18812865 12682115 5753409 -5653628 -17781420 -22849473 -20318786 -15660911 -11843881
44412 -11843881 -9270501 -9530746 -12834105 -16445751 -20200985 -27091233 -34568413 -34062064
44404 -34062064 -23914432 -13022289 -6374151 1825510 14136389 21375892 16959356 8337475
44396 8337475 4664992 3970455 2012467 2313809 6989794 9240705 6002698 6121169 14212058
44387 14212058 19069076 11366350 108794 -3140335 -3378209 -9164080 -13730783 -8191814
44379 -8191814 -1622528 -6329328 -12795550 -2772752 19185451 30939808 25577444 16019823
44371 16019823 9314186 -319916 -12457635 -16826063 -11751345 -7106267 -5895332 -313352
44363 -313352 11359781 20399744 22342940 20804886 15770316 3617074 -10552071 -15969564
44355 -15969564 -12032496 -6970675 -2832178 2765379 3882125 -6206455 -17982393 -16298461
44347 -16298461 -5321798 -1705382 -6015580 -4822837 1235145 -1386961 -10201631 -8423625
44339 -8423625 2004675 974669 -10489766 -5975653 19809615 35200750 20465009
44332 20465009 414236 4786762 23865905 30398361 22682979 16831423 13904134 4412455
44324 4412455 -6579803 -6643365 -209096 -1190061 -7945135 -7774396 -744447 1582281 -3339933
44315 -3339933 -8178139 -10728069 -13026126 -10712878 540450 12893318 15162506 8318299
44307 8318299 -149245 -8771790 -16207833 -14025171 -582893 9364398 5021919 -3255982
44299 -3255982 -4405482 -8482561 -25636599 -38923275 -26542156 126379 11516985
44292 11516985 5088322 3266446 11295479 12041501 2571965 -96732 5194712 -2176216
44284 -2176216 -24471443 -33599084 -15047171 6420814 4556910 -10633044 -14842469 -7834620
44276 -7834620 -5956261 -11681969 -14026585 -9707383 -4087007 1814207 8728304 10304211
44268 10304211 1696598 -8818976 -9432897 -247376 10870509 19719111 23016879 14660555
44260 14660555 -2661973 -12016537 -2709313 12204431 13664335 3866383 -523538 4267966
44252 4267966 7003512 3653551 3256779 10519860 18310478 20323238 18468343 15270121
44244 15270121 10481818 7270192 10378087 15747437 13271979 3176779 -1370554 7286998
44236 7286998 20155676 24641772 20041191 13292367 6769332 -1148875 -7542827 -5579988
44228 -5579988 6424122 21529068 29830553 24985287 6841610 -18406369 -40698045
44221 -40698045 -52042233 -51689483 -45032985 -37531753 -30509298 -22713298 -14568371 -9327830
44213 -9327830 -9458658 -12920307 -14616958 -11617880 -5868224 -2105831 -4418767 -13545281
44205 -13545281 -24484012 -27620367 -17075995 850772 12175830 10265848 1953140
44198 1953140 -3720681 -7069598 -13117763 -20587797 -23414621 -21439403 -21626028 -27461203
44190 -27461203 -33321270 -31816612 -22572550 -11445037 -4015514 -1601253 -1131009 2533841
44182 2533841 11920303 23332499 29899075 28941454 23920854 18642315 13350826 8596747
44174 8596747 8720596 16555859 26371258 27775792 17863427 5205728 -408589 1374151
44166 1374151 4037897 3850922 1825222 -1982220 -9043694 -15948399 -14506318 -2916283
44158 -2916283 8280626 7906954 -940453 -4857701 1693830 9813405 9577757 2834502
44150 2834502 -2006464 -2654958 -3682150 -6637898 -6684529 -923009 5268364 4473799 -2616878
44141 -2616878 -8144342 -7885346 -5738255 -5164330 -1849836 8923771 21071372 22817386
44133 22817386 13230189 4148304 2542550 1100680 -6691803 -11668126 -1120299 19261594
44125 19261594 29341143 20414602 4755522 -3564498 -6248761 -13228827 -25707178 -34464189
44117 -34464189 -31681191 -19052914 -5779054 -1293349 -7846307 -18259509 -22822806 -18878766
44109 -18878766 -11118027 -3422348 4740483 13638745 20291283 21730903 17887143 11405390
44101 11405390 7963851 14050518 28287076 37911284 32593638 19657020 14909144 19718972
44093 19718972 20758227 13514951 9786066 16186762 21787347 17487560 12776835 18721740
44085 18721740 25979414 17484883 -3551825 -16520577 -12538683 -4291131 -5027748 -11410589
44077 -11410589 -11468598 -137449 16838186 28206438 25261037 10419898 -2730475 -3708071
44069 -3708071 2952383 6845363 8221145 14693749 24525598 26776970 18896356 10978459
44061 10978459 9304696 7865448 1074585 -6486387 -9514429 -11072891 -14353866 -13860032
44053 -13860032 -4100529 8858516 14148085 11140762 8989673 12494340 16388464 14715076
44045 14715076 9961795 10025980 18349609 29082775 32340177 24322485 11354214 2808953
44037 2808953 1782709 5107682 9685807 13664994 13450587 7006946 223854 1816799
44029 1816799 9797414 11348500 357959 -12653196 -14267572 -5585835 1622030 1930200
44021 1930200 1070750 5179271 12724420 17950183 17027759 9681533 -1155427 -9843539
44013 -9843539 -11217321 -5263592 2232282 4511454 -484468 -8372954 -12032110 -8447136
44005 -8447136 -2222697 -516822 -4293157 -7313125 -4646004 1215973 5099799 7309040
43997 7309040 13275393 25165704 36601262 37805368 26500148 12319398 7623003 13576533
43989 13576533 19250411 16329264 9372161 7207778 10326372 14519664 21301581 32905087
43981 32905087 39991436 29575470 7249814 -4063431 5645437 18315703 13048246
43974 13048246 -5170391 -15288443 -10733374 -4914891 -9001502 -18178969 -21577204 -15918358
43966 -15918358 -6779539 -2280452 -6038211 -12053553 -8775121 6844133 23311702 28835110
43958 28835110 26234258 24926787 23840834 15043562 1533286 -3327044 4350390 13047687
43950 13047687 13389167 9643537 8687700 8565536 5198525 1987198 4739042 12047536
43942 12047536 16891720 14843153 7876427 3627451 10762681 28496688 41507905 35186308
43934 35186308 16140351 4746266 5572791 2224382 -11670512 -16168351 4616361 31999996
43926 31999996 35075873 15009067 2428504 11816822 22717310 12732532 -10953256
43919 -10953256 -24708778 -19693460 -7381828 -1399990 -4709870 -11713286 -15926076 -16690859
43911 -16690859 -20131366 -29499337 -35074505 -22755970 4682161 25529001 24685528 12104611
43903 12104611 7637142 15658489 24832398 26579755 21740042 12494469 503337 -7256884
43895 -7256884 -3234247 7286606 8349033 -5736061 -20167120 -17578873 -490199 12356450
43887 12356450 9526152 -1526754 -7148607 -4374602 -842672 -2234153 -5909030 -6379029
43879 -6379029 -1658953 6952295 16238196 19833098 11438109 -5785269 -18223668 -17307396
43871 -17307396 -11678347 -14747145 -23835098 -24457062 -14575586 -8920291 -15032932 -21263111
43863 -21263111 -17681817 -13614070 -20334328 -28886827 -23388096 -8583995 -3951945 -13044341
43855 -13044341 -18550157 -9273251 6168069 16186464 19629258 16882683 4333654 -13602184
43847 -13602184 -21170588 -10351416 7679421 18969894 23348231 25242322 20436019 5029914
43839 5029914 -12120169 -20199539 -22543050 -27859229 -31560088 -21630229 -179604 16285761
43831 16285761 18200485 11570830 5121969 1442741 1949218 8193994 15504693 16172605
43823 16172605 11819267 12460485 20502083 26049896 21877127 12923657 5968256 -687655
43815 -687655 -10832319 -21298680 -26239901 -25247977 -21664845 -17076654 -11513599 -4758580
43807 -4758580 5061651 18259802 26764635 19029853 -3309823 -22045628 -22762427 -11778058
43799 -11778058 -5270087 -8463029 -15312915 -23163094 -34980244 -47899574 -51372397 -39937655
43791 -39937655 -20282737 -2976312 6876075 9178987 5730345 638431 -1424741 -733295
43783 -733295 -2217510 -7101062 -9593654 -5735374 -1043706 -3567208 -11752491 -15851862
43775 -15851862 -11601634 -6293040 -8597237 -16952693 -22060216 -18081595 -6954603 6551334
43767 6551334 18571407 24826183 21269693 8693980 -6834115 -20113994 -29678553 -32828815
43759 -32828815 -23754858 -2020924 21082708 31672761 27683000 18532672 11581068 5354356
43751 5354356 -3459373 -12858738 -18127577 -17757097 -14543114 -12734519 -14315789 -16186511
43743 -16186511 -12620130 -3637084 1880483 -3207299 -12967502 -14867365 -6672093 1072403
43735 1072403 4374 -6659209 -11469600 -11650327 -7763543 -626089 6763654 9990545
43727 9990545 8933756 7547878 6593767 3419261 335570 4352016 15160313 22110525
43719 22110525 17668681 5870199 -6440981 -17091460 -22526449 -16121266 -830433
43712 -830433 7811620 2310008 -3438217 5215686 18781210 16338935 -1998143 -13971679
43704 -13971679 -6590706 8596156 15399229 13200164 10671119 10966850 11508682 11385439
43696 11385439 11736827 12462916 12561806 10625028 3817598 -8780699 -20934623 -23241896
43688 -23241896 -14004457 -881192 9023627 14586888 15648141 10538319 1639389 -3625926
43680 -3625926 -1938159 499185 -4330003 -16464572 -28648560 -33832383 -30200850 -21654581
43672 -21654581 -14358016 -10120892 -3671388 9726736 25251591 32713938 29286600 21821825
43664 21821825 16278671 11486661 4583012 -3657546 -10680778 -14183113 -11587080 -2805120
43656 -2805120 6675568 11530973 14440671 20770856 27005283 24615447 15355395 10674654
43648 10674654 13523685 13345904 4000885 -5651204 -6006501 -249765 4496060 8751361
43640 8751361 13896739 14287361 7832626 5171956 14360580 23670376 15859459 -4230071
43632 -4230071 -13691668 -3714483 9048828 8264699 440817 2218213 14931399 23756538
43624 23756538 19401201 10661677 12722874 27789161 41598977 39285995 21590923 2172245
43616 2172245 -9421580 -15823629 -21579963 -23012040 -15082840 -2956901 2528183 -569716
43608 -569716 -3677942 -988964 3320594 3029416 -1508050 -5782127 -7366069 -6248200
43600 -6248200 -1989189 6095404 16875566 27139334 32885952 30776651 19677992 1747839
43592 1747839 -17530962 -30191575 -29211257 -15632728 -1950066 -2070130 -15522837 -27694164
43584 -27694164 -28796631 -25117227 -26240561 -29993653 -29645545 -28564682 -34078657 -40368989
43576 -40368989 -33182992 -12984455 1588118 -1276082 -11084102 -12478510 -6899395 -5730821
43568 -5730821 -9666205 -8494456 719688 7854229 4688646 -3483012 -5933677 -702058
43560 -702058 4333292 2016548 -6636728 -14778438 -16506031 -11426139 -4826564 -3460486
43552 -3460486 -8884493 -14571646 -12370034 -2833000 4541021 3723132 -108631 -569665
43544 -569665 -2441294 -13633647 -26981259 -24507680 -3932288 13623186 11930963 2858751
43536 2858751 7266122 22919877 30039262 23344217 16960752 16913634 11661989 -2370243
43528 -2370243 -7444908 8322398 26822256 22662385 509187 -11473684 -2311729 8994281
43520 8994281 4685789 -7484042 -11459383 -9415772 -15358195 -29174928 -34196410 -22155188
43512 -22155188 -6595610 -4180123 -11789973 -12540695 -508878 12147349 14000323 9682663
43504 9682663 10732994 18908042 26798019 30371042 31711152 31292299 26952571 20902851
43496 20902851 18822017 19925007 16279514 5419974 -4349523 -6468602 -6891342 -14919173
43488 -14919173 -27715273 -32487891 -23475685 -9794851 -4442306 -9483343 -14610433 -9110574
43480 -9110574 6416292 20853290 24621667 18928179 11771728 7941388 6988606 8470414
43472 8470414 12804820 17513060 19235593 19541102 21589109 21148828 10664881 -5603217
43464 -5603217 -11807795 -1613505 11515979 13339636 8295848 9063836 15311867 17243693
43456 17243693 15302693 19903490 31508262 36688720 28483046 17911899 18634516 29792168
43448 29792168 40861767 45327812 42173797 31242234 16672196 10373559 21220747
43441 21220747 40780245 48858226 36289388 15998211 7185676 12747585 18244398 12100444
43433 12100444 -153672 -5424379 -1845561 -400028 -7995966 -17375112 -18634008 -14684398
43425 -14684398 -17564940 -31532501 -47046523 -51670265 -41334516 -20872453 419124
43418 419124 12463968 9639740 -4235399 -18837758 -26576535 -26537803 -20485769 -10851033
43410 -10851033 -3695247 -6884276 -20876167 -35040636 -37309565 -26008593 -10400353
43403 -10400353 -1869978 -5542876 -16962353 -25291302 -23239540 -15269799 -12123237 -16450956
43395 -16450956 -19877660 -16562515 -12136808 -13753169 -18008621 -16817267 -10802916 -7616791
43387 -7616791 -9003683 -8843016 -3910808 2280404 7373108 12882250 16528539 11268061
43379 11268061 -2694709 -13174719 -11061597 -3908072 -4806651 -11421461 -7912951 11179206
43371 11179206 30149949 30908250 15024152 -213538 -3212428 2172870 6077208 3675520
43363 3675520 -3862131 -12300998 -15387581 -8307859 6054262 17638033 19384493 14587427
43355 14587427 11725890 14918868 22125687 29277949 32390963 28633264 19769982 12350896
43347 12350896 10695412 12817963 17149665 27258248 41827644 46023461 26840704 -3754686
43339 -3754686 -16897915 -2847683 15905023 16074904 3583546 -1783770 449153 -6018903
43331 -6018903 -23273674 -33118256 -25724304 -14728191 -14515399 -18374816 -12499169 -226589
43323 -226589 3772000 -2409592 -6242202 -2613316 -1858759 -11530718 -22556756 -21645504
43315 -21645504 -9705261 1099271 4744573 6947424 13682384 21640273 23216089 16938858
43307 16938858 9103551 5918491 6666472 5366431 -1912960 -12675555 -21251159 -25363335
43299 -25363335 -27750193 -31133419 -34063516 -33996830 -32779422 -34787457 -38725172 -35969838
43291 -35969838 -21269459 -2369638 7020415 3782877 -1473192 148578 4159324 1672593
43283 1672593 -5734236 -8387187 -2921030 4819007 10814671 17236768 24001608 25684165
43275 25684165 21158144 17496450 18299592 16286912 5250368 -7786304 -11838734 -7816425
43267 -7816425 -4635146 -3883689 -284932 5124056 5524532 2362094 5976452 19576754
43259 19576754 34010863 41487852 43352603 41455314 34787800 29255484 36051784 51887313
43251 51887313 55098065 33514846 4042605 -9667901 -8137832 -7591560 -9613703 -941407
43243 -941407 18936904 32008748 27670516 16307352 10304632 6699011 -2711858 -15941386
43235 -15941386 -24735452 -25530684 -19060430 -6432509 7812529 15442086 13159859 5513955
43227 5513955 -4480587 -19109172 -35453672 -41263411 -30084031 -13254618 -7492364 -15117512
43219 -15117512 -24400301 -25437276 -18573789 -10596046 -8607421 -14350058 -20390221 -16971787
43211 -16971787 -6266432 -2143045 -10550063 -19357341 -15672975 -4363083 725933 -3716445
43203 -3716445 -10722639 -15851225 -17970525 -13769393 -4252238 -583429 -9418720 -18277556
43195 -18277556 -11746447 2537411 3124125 -11881329 -21503127 -14219486 -2817165 -763504
43187 -763504 -3378050 -2470479 -2654268 -10333867 -19521538 -21620760 -19307989 -18812111 -17364742
43178 -17364742 -10119681 -1830922 -52115 -3099159 -5337146 -7931212 -13550853 -16691831
43170 -16691831 -10982984 -1350266 2389232 170894 -484158 2857765 7302425 12295705
43162 12295705 16305764 10861957 -8596864 -28946077 -30880230 -13976331 2689095
43155 2689095 5116781 -3138245 -13191674 -21194306 -23749546 -17028420 -5910303 -2192747
43147 -2192747 -7675439 -9565409 931227 15361443 20686863 16674074 12746174 14124815
43139 14124815 18573626 21845172 20283396 12641129 3619389 -245210 -1539669 -10195383
43131 -10195383 -25900513 -33252713 -23473333 -10707064 -13951028 -30316118 -41201068
43124 -41201068 -40400891 -39058133 -42763978 -41114777 -25717105 -4722834 9118766 15017117
43116 15017117 19506846 22336599 17286005 4305775 -7966826 -12247111 -9632385 -5918620
43108 -5918620 -4776261 -5718213 -6670097 -7057656 -7813561 -8162228 -4562955 4122638 11971097
43099 11971097 11373618 2815725 -6303868 -12820996 -20272301 -27983049 -26704632 -11615456
43091 -11615456 7173639 15278084 10579658 1168647 -8300769 -17926570 -23754154 -20540921
43083 -20540921 -13744862 -16178685 -29537126 -40814872 -41704051 -39888088 -44028923 -48684730
43075 -48684730 -44145471 -32238172 -20841208 -10085518 2867887 10991101 4577692
43068 4577692 -10891995 -19178451 -15762814 -11359328 -12023261 -11850381 -8963721 -11189208
43060 -11189208 -18014705 -14118453 6684876 25844065 24146404 9560848 2950305 5324416
43052 5324416 918593 -11623203 -15045515 -2923691 8737175 6932104 22351 227631
43044 227631 3569619 352547 -6512395 -8057327 -5709200 -6973341 -10326966 -8213571
43036 -8213571 -1888107 -377973 -5956385 -12176496 -15855128 -20171363 -25603323 -28197634
43028 -28197634 -28015913 -29596941 -32434609 -30456599 -23107319 -17480190 -16304231 -13006772
43020 -13006772 -3022653 8263147 13606538 12368027 6323352 -4767563 -17413303 -22107517
43012 -22107517 -14466772 -2563723 4092485 6498994 8999011 7395763 -4061958 -18096458
43004 -18096458 -20080376 -8098643 4393547 7421039 5254358 5704980 8999230 11996581
42996 11996581 14854624 17630425 16743290 10765901 5104628 5637368 10847751 14085759
42988 14085759 11070958 3375121 -2011492 3549953 20782069 36154925 33896373 16930537
42980 16930537 5739190 11629188 22621866 24035111 20857893 25986520 35297866 32098059
42972 32098059 13189548 -6718278 -16979780 -21126625 -22437332 -15962349 -1786283
42965 -1786283 7935969 4894825 -2853069 -3931386 -413432 -1326688 -6798616 -10211777
42957 -10211777 -11471264 -16433656 -24945693 -29896492 -28150069 -23535796 -18299493 -9900253
42949 -9900253 1392911 8398584 4203424 -9704152 -24185460 -29263776 -20784480 -3877794
42941 -3877794 10124335 13342849 8053302 1909159 -1477529 -3947195 -7506576 -12721288
42933 -12721288 -20415178 -28759115 -29782259 -16559083 4655680 16988672 11573896 -2057262
42925 -2057262 -8922908 -7126904 -6994388 -14313838 -22499712 -23294105 -18759925 -17200653
42917 -17200653 -20086341 -20106839 -13607925 -8246605 -12505355 -21465403 -21464866 -9146252 2833391
42908 2833391 2847663 -4484226 -6461791 65034 7533710 10828870 12132932 12842296 9908414
42899 9908414 3228572 -491489 3997114 12529426 15953666 9893145 -2799053 -16286927
42891 -16286927 -24772969 -23696660 -12974721 524559 7615725 5964449 2480720 4112401
42883 4112401 7907914 4759762 -5986717 -11299152 708669 23795951 38991335 36697416
42875 36697416 25294363 16141042 9613005 1413500 -6256648 -9049735 -10119175 -15031300
42867 -15031300 -20394095 -18465135 -11900546 -12440102 -23079962 -32166425 -29667548 -20491416
42859 -20491416 -15191415 -13971002 -8327297 3819278 13086667 11370081 4564415 6595964
42851 6595964 20302544 30317518 20769295 -3357052 -21647005 -24746657 -23665524 -28660680
42843 -28660680 -32224020 -23157558 -6471537 4508153 7954741 10572604 11528879 6464012
42835 6464012 2713359 11102085 24651137 26298831 17912669 18446426 29791026 30208405
42827 30208405 10999008 -6190374 -3896705 3297152 -4210524 -17336797 -17100479 -10164331
42819 -10164331 -15390141 -25479295 -15489377 12492146 26350160 11648876 -7160746
42812 -7160746 -4895300 10372655 17754168 17316468 22545987 32106246 31472357 18474596
42804 18474596 8301152 11828101 23021154 31206774 34889696 37597324 37189478 27446729
42796 27446729 9503411 -4746556 -4812168 4982357 9915817 3815610 -2871741 1640231
42788 1640231 13477552 19282368 14858354 7524954 2219437 -3063381 -7752545 -7123347
42780 -7123347 -3338919 -5892874 -15424747 -18498389 -6605223 9316274 13032196 3946668
42772 3946668 -6339368 -11426316 -12166800 -6949787 5570005 16040674 12079243 -1666045
42764 -1666045 -5916882 5393418 13677650 1525426 -21684090 -33039595 -26983327 -17394067
42756 -17394067 -12506958 -5321561 8371884 18659756 16092885 5611202 -2864430 -7256696
42748 -7256696 -7193528 3603354 24972521 39778509 33381048 17658460 15415639 23868330
42740 23868330 17910642 -7252522 -23524645 -11743404 8314406 8702204 -5550363
42733 -5550363 -10084215 -2272150 -1049856 -11689188 -18268982 -12420910 -5270255 -5402027
42725 -5402027 -5625963 636926 6981669 6643986 3581461 2926369 2196531 -1175991 -4509514
42716 -4509514 -7380449 -12813053 -16366914 -7700513 10729772 20860397 13068969 -847000
42708 -847000 -7585344 -10123423 -14148489 -12607059 -193986 9880567 3570957 -8106776
42700 -8106776 -1963805 22572275 41948836 41047428 27859426 13922190 -432424 -15123505
42692 -15123505 -21755784 -16311024 -8736367 -9653249 -15635178 -16678000 -11374027 -5282608
42684 -5282608 598440 9431842 18601542 20053194 12206071 3996716 3285569 6316429
42676 6316429 3928257 -4390609 -9386694 -6083236 -2316482 -8017997 -20106537 -25626473
42668 -25626473 -19036945 -8493709 -3406484 -3150089 -1363004 5025656 15171271 27104138
42660 27104138 36785068 39283410 34916376 29407180 24782130 16528480 3636494 -6608354
42652 -6608354 -9916449 -12881531 -21579862 -30101864 -30399113 -26634446 -27813059 -31299100
42644 -31299100 -26914134 -14582953 -4489214 -758912 1787248 4607514 2851536 -2369819
42636 -2369819 -2695111 2696745 3853172 -2941944 -7050251 102356 10874871 12789077
42628 12789077 6318095 2109423 6080250 15785163 26896478 34717450 33002542 20592573
42620 20592573 7720493 6706787 15536052 18526967 6202006 -11804760 -18744764 -12218947
42612 -12218947 -7037641 -15641829 -31375625 -36296265 -23126206 -2906201 9219917
42605 9219917 8407548 -1744998 -16289915 -27696897 -25452604 -6987175 15052839 25851335
42597 25851335 25356415 22952360 20157311 11791868 1838683 2218011 13482717 21385949
42589 21385949 17235361 8194718 1740268 -6211718 -19057103 -27840047 -23222178 -10548643
42581 -10548643 -2308379 -2373860 -7344859 -16586315 -30095246 -41450568 -43528962 -38315400
42573 -38315400 -32844306 -29245404 -26411552 -26361667 -30062788 -31535199 -25148624 -14592538
42565 -14592538 -6327025 267255 7148906 9414567 4868774 4584765 18471790 35269372
42557 35269372 34539853 16439925 849202 -3206508 -6543966 -14331097 -13770626 2097644
42549 2097644 17210757 14108973 -873878 -9360183 -7080619 -2675324 583563 4772033
42541 4772033 5246499 -3347856 -11834159 -5438621 11251809 15497926 -3234177 -29090047
42533 -29090047 -41966494 -40362110 -34276173 -27646601 -19161687 -12161017 -11007285 -11288966
42525 -11288966 -5027712 5211231 7348862 -3636078 -18143474 -23942723 -19880123 -13720510
42517 -13720510 -10142912 -5962416 2685123 12149333 13857768 5891158 -1523096 3041341
42509 3041341 16381176 22274792 11444001 -6594428 -16644123 -16390387 -13469076 -8875328
42501 -8875328 3994760 22757765 31215545 18135165 -6962485 -24587991 -27032625
42494 -27032625 -21947116 -17870481 -14873725 -9446981 -1414834 6318837 10949155 11291594
42486 11291594 8922722 8227363 12599958 20515044 27980090 34363375 42168617 50573025
42478 50573025 52841195 42322450 19968117 -4713068 -19858713 -20119572 -11605062 -6731524
42470 -6731524 -11563059 -19597774 -20812863 -14405045 -7822516 -5074193 -2834390 1375980
42462 1375980 4348058 3470779 1854390 2923752 4668403 4399260 5575106 13595169
42454 13595169 26116226 33548365 29932866 18968994 8192062 963983 -4114928 -9048264
42446 -9048264 -14170334 -18244668 -19005579 -15344873 -10538287 -10411173 -14878047 -14206613 -159198
42437 -159198 19613971 26934165 16653993 6294627 13797156 32118000 38301957 25370065
42429 25370065 10482388 8722645 13623496 11509589 2272953 -5875108 -12654225 -22432294
42421 -22432294 -30352525 -26634191 -12985550 -1433502 2899031 5340291 7798174 4765020
42413 4765020 -4026773 -9656801 -7930002 -6697502 -13110276 -21975954 -23219973 -14973618
42405 -14973618 -4143133 1772734 980904 -215375 7818279 23998355 30254073 11413873
42397 11413873 -19710518 -32906615 -18907590 104689 4260752 1050033 4967236
42390 4967236 10616088 4632324 -8100353 -10976238 -2374907 2709874 -5159735 -21461802
42382 -21461802 -38017813 -46632532 -36558958 -5671358 27310136 39134986 31309543
42375 31309543 26787812 36318817 45715689 40648088 26515029 15644190 9421783 3291731
42367 3291731 -1513225 -1791287 -732321 -3729151 -10356602 -15647476 -14504548 -2784294
42359 -2784294 17945891 34412547 31200832 11310517 -3767340 -1225012 6979241 4209863
42351 4209863 -5795043 -7018815 3423888 13241652 15510366 16670937 22652289 29102940
42343 29102940 29506907 24442464 18232359 12375318 6532250 1800913 -804423 -2259650
42335 -2259650 -2841821 -127932 6741572 12511998 10330328 1863619 -1593256 7617984
42327 7617984 21322775 22788479 7321590 -10555773 -14039188 -2641672 11120123
42320 11120123 18020760 17587199 11804741 3518997 -339859 5607124 15350201 16739267
42312 16739267 8296974 1510669 3909341 9556525 10521207 8595509 9738600 14282369
42304 14282369 18744704 21456559 21104179 15266448 5288400 -2534299 -4472618 -2616289
42296 -2616289 1570669 8745643 13598830 5819165 -14470226 -31975499 -34498664 -26692300
42288 -26692300 -17997824 -8218095 4060776 10354909 4868072 -803151 6668080 18100740
42280 18100740 13126944 -6729903 -17685380 -8843709 3058517 985092 -9241485
42273 -9241485 -14030570 -14261450 -17847447 -21235699 -14631599 -454475 8002566 4937947
42265 4937947 -2585015 -7342555 -9526387 -10287734 -7318889 -1052938 1259395 -6835969
42257 -6835969 -21851186 -33014295 -33730679 -27732479 -22984700 -21352402 -17315496 -7694708
42249 -7694708 1186194 436682 -9111150 -17439454 -18360277 -15436980 -12945555 -8339389
42241 -8339389 1076631 10108236 12101494 10043723 12600888 19854037 21923737 14070963
42233 14070963 5209264 6184995 14806022 18877790 11731690 -1276380 -10984064 -13143872
42225 -13143872 -7882651 3535751 17107004 24565952 19219476 3914382 -10511797
42218 -10511797 -16341424 -16230447 -17623698 -21956368 -22730691 -14877153 -3397356 85008
42210 85008 -10318497 -27619644 -38238653 -34226878 -18080150 2357960 19874691 29170076
42202 29170076 27647148 18358561 9260148 5937823 6641792 7056207 7305354 10361324
42194 10361324 15715458 19549477 20496892 20979384 23213134 27426210 32931062 37266276
42186 37266276 36132933 28644799 20384858 16088736 12443096 4973466 -1790355 -1013236
42178 -1013236 2216561 -3783233 -17360486 -22942098 -13621724 33808 9371787 20401832
42170 20401832 37240042 47297612 37838161 17541849 5730381 6144863 6494797 -210713
42162 -210713 -8950286 -14936922 -18155959 -16554685 -8196009 84677 -658051 -6032276
42154 -6032276 -2862769 10069133 19839544 20028933 19014515 23271281 26353088 21135700
42146 21135700 10977229 1409350 -8404668 -18236945 -21184778 -14367856 -6387262 -4983060
42138 -4983060 -5332400 -463297 4249032 -943080 -12166624 -14490145 -2140622 13919890
42130 13919890 20238252 15361434 7869466 4986451 6014872 5570082 1877222 79091
42122 79091 4577174 9999801 6491403 -5504014 -14360480 -14365316 -14111556 -21291954 -28417001
42113 -28417001 -24253418 -13255190 -10762329 -20562851 -29445446 -25934625 -14374470 -6441094
42105 -6441094 -6377340 -9993975 -13250770 -15466330 -15272390 -8939716 4470239 18167494
42097 18167494 22074113 14238649 4400348 1950953 3671592 773388 -4264154 351027
42089 351027 14684815 21295236 8478986 -11777126 -20204676 -15858159 -12054405 -13495487
42081 -13495487 -13574285 -11729742 -15996987 -25740942 -27490121 -14201480 3293874 10829981
42073 10829981 7218203 -28887 -5665556 -6421396 980706 12705833 16245824 5718607
42065 5718607 -6925143 -5959101 7088154 16707939 14815465 7991909 4095838 2596402
42057 2596402 402839 -1745584 -2282000 -1490396 1753397 9662434 19046187 21540426
42049 21540426 14250867 4487232 -402692 -2176325 -5083039 -5517362 3470451 19297537
42041 19297537 29473807 25238856 10543434 -3217329 -7348684 -939566 9500434
42034 9500434 14984183 12640002 9388565 13102725 21437730 25610044 24460504 25927469
42026 25927469 32383478 34244989 24286388 10326203 4999061 8207213 9469336 4841116
42018 4841116 1105127 2992100 5884832 4013327 -1630525 -7329959 -12721555 -18348218
42010 -18348218 -21092255 -16841685 -6400465 4410953 10421303 11603590 11940879 13714979
42002 13714979 13172009 4446890 -10637404 -20526339 -16148956 -2650316 6556086 5916986
41994 5916986 1787615 967247 2158098 491232 -5092307 -11511610 -14956255 -13239621
41986 -13239621 -7734393 -2974359 -1160386 1402182 7814337 12934886 9240485 -861543
41978 -861543 -6757961 -3950087 1623030 4537954 6360362 9007578 10334579 9533337
41970 9533337 8997097 7750334 1205582 -9283404 -15391768 -14389429 -13898293 -19471387
41962 -19471387 -26423637 -29234845 -29653882 -29279346 -23933280 -13296398 -6941898 -11633883
41954 -11633883 -20425248 -23263158 -20547505 -16894503 -10004260 2902661 14816212 17405071
41946 17405071 14234690 13900825 15560606 13441826 10124542 11619045 13406920 5720157
41938 5720157 -9722955 -21870504 -26983588 -29460866 -28375763 -18357831 -3402924 5255026
41930 5255026 5766175 5838007 6133328 -461275 -11146305 -11940803 890146 13740661
41922 13740661 16123323 13561891 13302606 12024224 6814452 4954014 11983481 20800816
41914 20800816 23081193 22057689 23822556 24901816 19149309 9366912 1765340 -4093696
41906 -4093696 -9670159 -8772836 4162312 22152803 32671201 32631139 27206956 18923288
41898 18923288 8682897 3232523 8962346 19310691 19947257 7963109 -3276401 -797155
41890 -797155 13106790 24697634 22878548 8485671 -6976706 -11555036 -3603239 9055476
41882 9055476 20745328 32894973 45061164 49384994 40853923 26595476 16888872 12291220
41874 12291220 8026874 5298804 7581653 10134676 5625997 -1661070 206094 12378570
41866 12378570 22791497 23988277 21775461 22505226 22651629 17080955 9423833 7379413
41858 7379413 12520262 19324214 20319297 10229830 -8781328 -23793221 -21096540 -3735819
41850 -3735819 8995770 5223566 -4905244 -6265595 -1477454 -3646060 -11701933 -9744965
41842 -9744965 7089724 21816661 18548897 4442117 -2578760 -154881 -1498163 -11450231
41834 -11450231 -17272546 -7526196 10927742 22023856 19638788 10339624 1929338 -2893052
41826 -2893052 -3870116 -1400588 2863091 8075913 15160860 21807700 20591982 8707983
41818 8707983 -3945201 -4933356 4453808 12258348 13736179 15258471 19769396 20552545
41810 20552545 13588229 5275304 1924830 767482 -2156806 -3746391 -867604 1968544
41802 1968544 47286 -2893573 -1747946 -42099 -4014552 -11095092 -12745282 -5263657
41794 -5263657 9512423 29528047 50117644 61054432 56108238 42737514 32692717
41787 32692717 25714271 12975445 -5287016 -17547626 -17405548 -11525349 -8470367 -8491013
41779 -8491013 -7708376 -5087675 -1699139 1525895 2902891 1510423 658055 4926964
41771 4926964 13226573 19727142 21371222 18969512 12111850 435298 -10286211 -11676899
41763 -11676899 -3913429 3946451 6138982 5347090 4514064 1963594 -2706572 -6118475
41755 -6118475 -8212555 -14299477 -25612425 -34342620 -32573448 -20830542 -4898029 9186767
41747 9186767 14199186 4721042 -13302041 -24000947 -19302077 -7876385 398215 9457291
41739 9457291 25238283 36851532 26262443 -4006387 -28660645 -29339210 -13912787
41732 -13912787 -380936 6419118 12628914 19718783 24356189 29284704 40056554 50830945
41724 50830945 47343080 28360388 11645795 10767196 17019152 15608893 10073101 13917461
41716 13917461 22858329 16429106 -8958993 -28531631 -21915312 -2245488 2282062 -14455881
41708 -14455881 -34047504 -41365502 -37322792 -26673377 -11141178 3082765 6554251
41701 6554251 221519 -4311999 -2560047 -3262056 -11379467 -16943854 -8959898 8817086
41693 8817086 24273802 31430962 30577908 21534672 6579419 -5047980 -5510649 1229806
41685 1229806 5206462 3979965 2855710 4292123 5498900 5527350 6847354 9733506
41677 9733506 11904019 14078657 19507428 27351924 32593827 33269373 31670799 27475014
41669 27475014 16869637 1302060 -9815065 -9910638 -3457219 1856254 6154822 13729406
41661 13729406 22319418 25027099 21651728 18423643 15509284 5545843 -11129791 -20757979
41653 -20757979 -14022157 -575537 5271929 5666475 11600449 19537070 14309688 -4027995
41645 -4027995 -15506253 -8331836 5745691 12752023 16073888 22603705 25705972 18814750
41637 18814750 12686500 19034570 26663965 16342695 -6036738 -14921546 -2942865 10097682
41629 10097682 9357812 3506625 3611581 4047356 -3333146 -11421526 -8065932 5404668
41621 5404668 17149738 19714028 13688723 2613844 -8731094 -15379568 -15695879 -10375261
41613 -10375261 798798 13868218 16599118 3117117 -10221931 -2275349 19060006
41606 19060006 22915078 803579 -18759470 -12868531 2725552 1465283 -14081991
41599 -14081991 -23353265 -22812419 -23728310 -25252192 -16542272 -1299776 4512408 -1454304
41591 -1454304 -6032515 -4347308 -4800344 -9426232 -9907381 -5980072 -7611415 -13718594
41583 -13718594 -8195419 14475971 36319179 38763054 25405056 12161124 6238313
41576 6238313 5400090 8369837 13647797 13446334 589876 -19348813 -31053990 -25821520
41568 -25821520 -10227587 2929864 9287110 15037729 23731858 26302831 12730403 -7296066
41560 -7296066 -8927193 15429959 40711141 39078539 15856776 -485552 2251490 9907388
41552 9907388 9295699 4714453 3057036 1224506 -3275088 -3880614 3388973 11156757
41544 11156757 12329807 10855638 12648315 14770790 12161475 7275282 4494645 1820322
41536 1820322 -3277205 -5693544 519140 11088991 15514459 10002409 266715 -6321354
41528 -6321354 -6113041 829814 10838276 17813533 17746516 11285627 1322859 -8400847
41520 -8400847 -12163153 -6413692 2447071 2044043 -8999798 -15171188 -3324535 16816956
41512 16816956 21730208 3494496 -19545498 -25365811 -13916399 -2571544 72839
41505 72839 4290108 19381823 34624080 31965267 13415274 1115671 8209170 23486985
41497 23486985 30154542 26070670 17140477 4540836 -9301360 -14348812 -7397909 -2321175
41489 -2321175 -9697624 -16734452 -6762608 11184723 16080320 11005406 17265802 34183350
41481 34183350 35656907 12577204 -10442584 -11589767 509574 8426946 11172219 12788535
41473 12788535 8279110 -1366784 -43549 18550050 34700783 31022523 19989040 21836250
41465 21836250 31042451 29017992 16756056 8550072 3479157 -8932063 -21181452 -14865080
41457 -14865080 6334619 18019957 10908532 -104391 -5474778 -13636387 -27400951
41450 -27400951 -32502583 -21175649 -7013761 -3618008 -5211022 -1495639 3167223 255895
41442 255895 -4737193 -446398 10641917 14665633 5637475 -8399362 -16438719 -13706493
41434 -13706493 -2470310 8687768 8644875 -5472044 -21499031 -22289669 -3587106 21343940
41426 21343940 34698584 29310347 12279868 -2882605 -7387110 -3067141 1169222 -1255738
41418 -1255738 -8488489 -13152852 -10890509 -5646678 -5462720 -12243007 -17821131 -13490956
41410 -13490956 -2037683 4904932 1688672 -4964717 -5863162 162534 7637478 10438780
41402 10438780 4497506 -8816474 -19817940 -18508431 -7801925 -177393 826638 4056253
41394 4056253 11912555 12968217 1887019 -8171091 -5516311 1128977 -1298131 -7458291
41386 -7458291 -4859931 2459821 2066997 -2413828 2746170 14865415 17197234 7569144
41378 7569144 2635524 10824918 21210280 23460548 20287710 15424940 7072689 -1467590
41370 -1467590 -1805738 3357181 733004 -11455493 -18990237 -15060688 -10034301 -10680353
41362 -10680353 -8674677 457695 5773164 749215 -2697932 5379805 14004077 9112522
41354 9112522 -2320810 -3135031 8550156 20744013 26625466 27266525 22461648 13479772
41346 13479772 9146416 15506771 24362757 24143844 16578278 11153468 9928393 10136779
41338 10136779 14238805 23187041 26659154 15962657 1528268 734611 11436401 14911119
41330 14911119 4619004 -4857478 -76167 14330693 24574805 22147985 6666789
41323 6666789 -15156613 -30628448 -30239609 -17971640 -5389892 3500225 12409617 19724207
41315 19724207 17691341 6078333 -4615492 -6255504 91113 11719696 27844601
41308 27844601 43112417 48943943 46092709 45832701 52842277 55953302 43460323 21068956
41300 21068956 6216654 7308095 15357681 16270355 7471413 545276 7179775 23922006
41292 23922006 35349605 33835711 28911720 30988226 33497756 22665668 778090 -14352542
41284 -14352542 -13461199 -6019782 -3478964 -5030672 -5650725 -7176010 -13120327 -19757285
41276 -19757285 -20260291 -13563894 -3969226 3870440 5985479 583427 -7534073 -9776937
41268 -9776937 -5433040 -4756887 -15004199 -28377794 -30188707 -16111732 3966428 17417769
41260 17417769 20214611 18139832 18964068 22447825 19481152 5742810 -6281318 712267
41252 712267 22932337 34052043 17483290 -10223010 -19668501 -5206598 12307071
41245 12307071 15777028 9571221 5342994 4982943 5335531 9328509 21191023 35025047
41237 35025047 39086349 31724944 24125315 24341125 26471187 21794955 14671669 17238259
41229 17238259 29330407 35158078 24492271 7160310 -2023430 -4523894 -11593408 -21205520
41221 -21205520 -18019497 1397374 19235678 20218161 11903471 10166037 14495932 12250496
41213 12250496 1916156 -4318353 -1599332 -787907 -10257204 -20915135 -18069722 -1521691
41205 -1521691 14901494 20636909 17432745 12058326 7126008 1332639 -5475988 -10721674
41197 -10721674 -11466180 -6722786 1975819 11027996 16118829 15160277 11587366 13543839
41189 13543839 25947870 41610773 44244334 25628469 -1459271 -14085718 -4817734
41182 -4817734 9705017 10112466 -1550646 -6573973 4699976 21802332 30019368 27866800
41174 27866800 23707581 22395247 23001036 25669277 32204807 40451496 44745738 42399965
41166 42399965 35013891 24392249 12882602 6498127 9943328 17607327 17130455 4358187
41158 4358187 -11757862 -20986976 -20997003 -12613135 4090909 23286297 32536437 27284973
41150 27284973 19050391 19614351 23416249 17011834 1130918 -10115123 -10122424 -5919479
41142 -5919479 -2521373 4631650 16980445 25137418 21685649 13006631 10420409 15546390
41134 15546390 21287448 22327592 18413533 11519804 5284349 3196560 2793936 -3132440
41126 -3132440 -14755483 -21487054 -16987031 -10517125 -12978116 -17526017 -7901909 15768669
41118 15768669 34443813 35971274 29366979 27434678 28266626 24006787 17661135 17898993
41110 17898993 22890165 23279106 19179509 20289646 27851160 30029519 20204263 8299006
41102 8299006 6366673 11850752 13994883 10252894 6811882 7035351 8405764 8310506 5311666
41093 5311666 -2058941 -10245187 -9079172 5096091 19218923 18311771 6787780 639836
41085 639836 1068381 -5382339 -18451462 -17441114 7446158 35889326 44385040 37805222
41077 37805222 36521097 42901602 41227105 26589825 13855258 15812543 27369339 35283360
41069 35283360 33177832 24051754 15738666 15441586 23164516 31565695 36646465 43016056
41061 43016056 51735976 51765215 35981891 18396290 19162259 36383790 49918863 50997818
41053 50997818 49409854 51206039 49829686 43908180 44142921 54384695 62920830 61761877
41045 61761877 58794565 60541246 58286292 44346534 29270161 28281018 39691185 49989216
41037 49989216 52729054 50219083 43982708 36336672 35489069 46452116 60761285 65608564
41029 65608564 59182201 48615717 39455075 36734937 47923226 71450797 88970584
41022 88970584 84192706 65602867 55764146 61035073 67454842 65123767 59568307 56943186
41014 56943186 54732416 53035601 60918229 83026103 109777328 128791101 138802085
41007 138802085 146087184 154392999 164801347 178721931 193654409 201234292 196967924
41000 196967924 188238963 185860208 190989711 197499875 204218942 215683371 231077779 242340728
40992 242340728 246810486 253135495 267822669 282443169 284265131 276884369 278241621 295761764
40984 295761764 314920888 318997941 310335280 302256069 297921892 290678640 281320687 279417836
40976 279417836 285831389 287431303 273987256 250299573 227394527 211014329 202797849
40969 202797849 202884484 205424262 199657294 181544352 158492150 139393938 127325027 123901982
40961 123901982 130123071 138550886 135665965 118124914 97144976 81923496 69961486
40954 69961486 59087891 55391888 60836961 66147420 65750340 66861766 73286123 74421288
40946 74421288 63632002 53650921 57612512 66969581 66059152 58182601 58203290 67571415
40938 67571415 75697321 78917807 79403219 72672233 55814876 40523158 36731824 31276248
40930 31276248 7573195 -19890072 -19878895 7760336 28405529 20971700 1816764 -6839738
40922 -6839738 -5238915 -1845821 4530267 14071764 17384482 11848262 9910925 18523862
40914 18523862 26249016 22984091 16753339 17945649 21642663 19428428 15783111 18662217
40906 18662217 24334565 24382434 18948689 12749308 6955314 3216390 5098089 8212672
40898 8212672 1714792 -12635613 -17662116 -6296480 5933408 5071976 -1112717 -495426
40890 -495426 2704823 1023873 1772766 12236701 19582262 7168171 -17417161 -31172290
40882 -31172290 -26964020 -17532186 -13004795 -11961680 -11491025 -10403694 -5352128 3140386
40874 3140386 5796090 -1725661 -7796131 -1558034 8273718 7886431 2178411 4061755
40866 4061755 8047377 -1605967 -19940921 -23645443 -6425305 10550422 9123828 -3483659
40858 -3483659 -9097457 -437429 16600094 29750984 26494410 5989778 -13390500 -11549853
40850 -11549853 7355847 20286533 16961694 10089517 11920493 17602986 17199462 9528364
40842 9528364 -1939882 -14297257 -21222241 -15828109 -2138371 7284866 8033754 6432965
40834 6432965 4155946 -4911125 -19268473 -27221162 -25433030 -25039602 -32338338 -37727509
40826 -37727509 -31926837 -19923017 -10086762 -1764480 7046779 10956609 5924952 -2503542
40818 -2503542 -8151358 -12493866 -16739656 -15761904 -8449025 -4769487 -13366370 -29514504
40810 -29514504 -42811317 -49086010 -48234065 -39372937 -25699619 -15721168 -12587880 -10619385
40802 -10619385 -8171625 -12903319 -26466874 -35723260 -29877403 -16693023 -10565722 -12811644
40794 -12811644 -14806187 -13054898 -9894007 -5680267 -998591 -952720 -7621860 -14088837
40786 -14088837 -14722768 -14466003 -18893471 -22892313 -19333952 -11267737 -4953158 1126042
40778 1126042 8940152 11344812 3213265 -5571061 -2744349 7302698 12023950 11732685
40770 11732685 15392319 20717063 17331734 7519303 4591025 10060995 11215785 4117012
40762 4117012 421909 5634147 8109671 -1082617 -11811790 -9929179 1338616 6731036
40754 6731036 -105978 -11272465 -17690341 -19334076 -21722225 -26584710 -28529934 -22150683
40746 -22150683 -11765756 -9004634 -17626028 -27119085 -27711745 -24784346 -28264369 -33627253
40738 -33627253 -27492478 -10195167 2044060 -673070 -10511325 -15665431 -13584672 -6783571
40730 -6783571 2975760 11096936 10506821 1105184 -8618962 -12848404 -13731046 -13792249 -12685159
40721 -12685159 -13457242 -20827198 -29921149 -28649210 -16004714 -5815480 -6255796 -8129784
40713 -8129784 -1511312 8083779 10355221 6698560 4681801 4248544 779107 -4613256
40705 -4613256 -8468449 -12777683 -19348357 -22341383 -16861402 -9486122 -9517261 -14708175
40697 -14708175 -16551791 -14923963 -15603144 -16864608 -10868038 3336038 18991185 31640524
40689 31640524 39287718 35718298 16738356 -7645962 -20310246 -17656518 -11930153 -12015554
40681 -12015554 -13869630 -12268232 -9889828 -9954707 -9577744 -5417315 1675488 10984421
40673 10984421 23094246 33922399 36008142 29206513 22105125 19430910 16118208 7415473
40665 7415473 -3402963 -11583509 -17413615 -22100714 -24504746 -25488493 -27712642 -28098261
40657 -28098261 -19850322 -5912838 50696 -8076694 -19482406 -21519807 -14100826 -2596379
40649 -2596379 11677519 24682506 25372494 10538435 -5750674 -10303620 -9130140 -13968017
40641 -13968017 -20669841 -18590935 -13447542 -19825162 -34460041 -38458916 -26304941 -12054049
40633 -12054049 -4484556 3088348 13425663 16848525 10750128 8462389 17297109 24544704
40625 24544704 18263352 6831511 2905377 1103262 -10931894 -28527308 -35202006 -27184274
40617 -27184274 -16555301 -12003863 -10273613 -6198325 -7894 5221230 5347120 -3179684
40609 -3179684 -16346617 -22450009 -17236030 -12356590 -18615974 -29001436 -31668452 -31304361
40601 -31304361 -39617503 -50278150 -44948218 -23996697 -9462332 -13140149 -21853203 -21586200
40593 -21586200 -17138340 -17178188 -16614666 -7741715 3479780 6561250 3105552 1326391
40585 1326391 1284022 -1801141 -5517331 -4316204 -1524315 -5047859 -13376568 -17189566
40577 -17189566 -13949845 -10458503 -10474735 -9105821 -1545332 9395660 16535559 14882904
40569 14882904 5006484 -5973282 -7960803 2367729 15874739 19722615 11330662 -764868
40561 -764868 -8867909 -13294263 -16995509 -18429759 -13201426 -1321403 9567554 9672806
40553 9672806 -3192177 -20076424 -29126182 -26597551 -17243990 -6292613 3198689 6749359
40545 6749359 1135932 -7939892 -10167279 -6014656 -8106484 -21602501 -33081241 -27981336
40537 -27981336 -11385922 -431794 -724818 -1831609 5122412 15688020 19516221 12799712
40529 12799712 1375298 -5458984 -4305109 -1688539 -5256424 -10774658 -6063155 8996975
40521 8996975 17301854 7271063 -9425459 -14117801 -6586644 -645295 -859955 309202
40513 309202 5067340 6406281 2529851 841678 4974096 9750497 11336909 11536103
40505 11536103 10328171 5031864 -1541329 -3057627 -1124443 -3241656 -7852207 -4182291
40497 -4182291 10089121 23735194 28445398 27986735 26791533 22412774 14518959 8163999
40489 8163999 2199175 -11403694 -29444103 -34651376 -22017965 -12314000 -23576995 -41813454
40481 -41813454 -39410990 -14900640 6204105 7542038 -902340 -3592380 127711 2383008
40473 2383008 611972 -2147910 -2748986 1095464 8719159 12922806 6418486 -5445681
40465 -5445681 -7477300 5209132 18685815 18669261 9648263 6155706 10411427 10805610
40457 10805610 2209280 -4344221 2683409 18479012 28095233 24735268 14230471 4242843
40449 4242843 -2356542 -3899714 973869 7990662 8874305 2083879 -5054721 -8614979
40441 -8614979 -13899234 -23101896 -26692221 -17149941 -3735018 -852646 -6337262 -5091446
40433 -5091446 7618116 20337188 22964968 16878191 6498434 -5832676 -14260823 -12271651
40425 -12271651 -5045706 -6186525 -17786914 -26602667 -24717417 -19889046 -18971472 -16296930
40417 -16296930 -8275069 -5041847 -14336619 -25197371 -22336672 -8594669 1208757 2710063
40409 2710063 4277318 10615377 16961301 18350870 15064677 10150046 8055492 12241632
40401 12241632 18922949 19184266 12081303 6404905 3905731 -5578939 -22499061 -27295357
40393 -27295357 -8365176 13753084 11926641 -7624856 -15244021 -1970071 12364309
40386 12364309 14018909 11273409 10991147 5004632 -10039268 -20620601 -16753627 -7746970
40378 -7746970 -5183744 -4451106 3944006 16271193 21516838 16902640 7019680 -4505621
40370 -4505621 -13106723 -11333598 1141223 12275146 11706813 4445079 2715160 10150983
40362 10150983 21611337 32478013 40257756 42465368 40307754 39413512 40919167 38405751
40354 38405751 29893557 24356322 27435577 28979111 16784001 -2687034 -10443258 -64134
40346 -64134 15055602 19937718 13534414 4423692 -520485 -98469 2730927 3100116 -2041732
40337 -2041732 -10624885 -17023230 -16607116 -8253917 4915170 15624704 16897876 9396450
40329 9396450 1447780 -506540 2004744 4510888 5204084 2788895 -4483276 -12813547
40321 -12813547 -12628851 -1117567 10585086 10385103 839305 -6248733 -6593953 -5348018
40313 -5348018 -4984725 -1866276 4699649 9109585 7107127 -174499 -11003413 -24779751
40305 -24779751 -37120302 -40278280 -32113972 -19798358 -11506979 -8526688 -8152909 -9785225
40297 -9785225 -13972124 -18262397 -18446859 -13283023 -5260289 2635363 8510754 10602320
40289 10602320 7890662 2783099 827653 5325535 12955034 17136423 15580854 11684108
40281 11684108 8162173 3405093 -3763246 -9999767 -11992216 -11516672 -11324697 -9589005
40273 -9589005 -4346800 675 -1765085 -6209778 -6094073 -2751193 -3139568 -5268829
40265 -5268829 639517 13935166 19869983 10482803 -2317672 -2882977 8083013 18062295
40257 18062295 19283948 12030525 -903723 -13257547 -15362954 -5651639 2999529 -1190720
40249 -1190720 -11468111 -11555481 1144458 12666111 11467000 -87038 -12811158 -19591578
40241 -19591578 -16739457 -5445437 6228267 9310246 3095748 -6076512 -13581998 -18228365
40233 -18228365 -17508161 -8865922 4249810 13473839 12633892 446069 -20072262 -39585113
40225 -39585113 -45113574 -33065978 -16092537 -8868203 -11002683 -12740960 -12285025 -15423622
40217 -15423622 -21340055 -22371222 -17355189 -12761532 -10699908 -8124025 -7484387 -14314162
40209 -14314162 -23559528 -23392236 -14986822 -12502165 -19006613 -19604634 -6534773 5686574
40201 5686574 2358417 -8179074 -8235880 2602523 10251702 8477966 2624539 -4680599
40193 -4680599 -15388764 -24350210 -21015481 -6008164 5764035 2956392 -10015435 -22275874
40185 -22275874 -29501742 -32584518 -30663794 -23007082 -14338695 -11027988 -12264781 -10773997
40177 -10773997 -3913704 483801 -6830248 -23625126 -36954417 -37352567 -28233801 -19333587
40169 -19333587 -14793264 -11306240 -5124753 3531755 11442072 14055484 8375426 -1750131
40161 -1750131 -6117782 475105 9821061 9856572 684532 -6682917 -6583446 -4784475 -7262741
40152 -7262741 -11622595 -12693317 -9664995 -4493102 941935 3449860 -209082 -8286385
40144 -8286385 -14932295 -17185988 -16247853 -12454623 -5890428 -1436200 -4604312 -11826202
40136 -11826202 -13999946 -10549355 -9866900 -14417157 -16955206 -14546404 -14173969 -19533112
40128 -19533112 -23910012 -21941390 -17147508 -11824416 -1402739 14255756 26289148 31136541
40120 31136541 36203585 42863936 39433061 23227483 13353245 24196312 39736086 34860770
40112 34860770 12352127 -3376229 -2445718 3773649 8068381 14828696 21355036 15536751
40104 15536751 -2419428 -15836238 -15060648 -7311057 1841106 17295396 37100442 45848591
40096 45848591 36913833 24752813 22421708 22061931 12413697 2142585 7644474 26104138
40088 26104138 38681796 36339730 26595847 16993146 7229528 -1764636 -4495630 172381
40080 172381 6359876 9741492 10906284 9350415 2881498 -5242961 -7417146 -3125564
40072 -3125564 -1187513 -6291930 -11059851 -7930012 -2428038 -5430452 -15371770 -18791531
40064 -18791531 -10021316 -462929 -2766870 -13426757 -19663101 -18614408 -18228372 -20010862
40056 -20010862 -14127010 3637324 21710760 27905301 25359774 22830867 17419243 1432341
40048 1432341 -18156303 -24124378 -13796348 -3449026 -3627126 -5210075 2020302 10631575
40040 10631575 7612248 -4014182 -9706128 -5605533 -3249879 -12072900 -27638425 -39562845
40032 -39562845 -43386074 -41185177 -35663716 -27858829 -19012104 -11872553 -9168882 -10387835
40024 -10387835 -10841116 -6363358 780569 4045696 1948024 1184953 7450332 16796690
40016 16796690 20849655 18828150 18985440 26906296 36170945 34330870 18528017 2250119
40008 2250119 2415300 18931232 31803507 22700317 -3773817 -25654176 -28210604 -16567963
40000 -16567963 -4971033 -1218680 -3337493 -5232849 -2573622 3446176 7151819 5789817
39992 5789817 3754407 4863071 4516701 -2298683 -9017704 -4924315 7511825 16286600
39984 16286600 20229024 29114747 40736995 37164949 12979147 -10175124 -10666401 5094681
39976 5094681 15942507 15111854 10034960 3298121 -7703574 -18194875 -20961293 -20525183
39968 -20525183 -26449363 -35523171 -36280803 -28676590 -23356642 -23145416 -21241090 -16496468
39960 -16496468 -13976222 -11034386 -249824 13471394 16986366 11369200 10519044 14355714
39952 14355714 5741695 -17833105 -31447815 -15326347 16811347 36610186 34639489
39945 34639489 21320401 7490451 -644920 1936310 11903150 15370667 6488469 -1274773
39937 -1274773 3689457 10400044 3788284 -6956429 -1712652 15100089 18465218 2586707
39929 2586707 -9044828 -166717 14588110 14231797 1302537 -7345695 -6454531 -3744950
39921 -3744950 -3922537 -5984565 -11824125 -24275037 -37920776 -42353378 -34830714 -22117291
39913 -22117291 -10219880 415906 9314960 12880757 9556885 3580565 632119 1756896
39905 1756896 3499419 2988012 1160463 512623 796262 -671124 -3663133 -3416350 2418083
39896 2418083 8388608 8321534 5672695 9462042 20227322 28537100 29220503 28006257
39888 28006257 29996255 30605540 24623293 16491174 13020450 11916769 7141595 1148680
39880 1148680 1186667 6201637 8608858 7944439 10881543 16918577 16754670 8640363 3948563
39871 3948563 9547825 15481945 9802027 -2852905 -9146838 -7945404 -10245387 -19844397
39863 -19844397 -26980902 -23726430 -15234397 -10986109 -12476843 -14731091 -14426810 -11482561
39855 -11482561 -6795814 -3150620 -5160701 -13870529 -23613444 -27687398 -24995600 -18540746
39847 -18540746 -10901886 -4852945 -4547316 -10544827 -16095214 -14430117 -8683264 -8460718
39839 -8460718 -16315814 -23348464 -19710820 -4922670 13819804 29282620 37728939 38120324
39831 38120324 31100503 18652030 4443348 -5496626 -5587768 2290871 7450608 2009193
39823 2009193 -7528660 -7485623 4167500 14296929 11636678 -1021542 -14622572 -24617468
39815 -24617468 -28629726 -22550487 -7451814 6021962 8719333 3471559 -2368737 -7229491
39807 -7229491 -8995146 1681811 26287985 43887360 32086346 1095359 -15083073
39800 -15083073 -4897876 6471540 -1659435 -13452750 -3420855 23312819 40996676
39793 40996676 41988063 40301707 41834167 36948274 23889071 15543423 16902250 16841576
39785 16841576 10709103 11243625 25029386 35773429 27006379 8167522 476401 6179237
39777 6179237 10341881 7546474 7359353 13691319 16435262 7697773 -6794409 -16991490
39769 -16991490 -19121286 -13895997 -4076151 2786188 -1078078 -11968242 -16282629 -8141707
39761 -8141707 3199101 8544643 12197626 22424086 35306568 37321787 21382978 -6099956
39753 -6099956 -31894884 -45009120 -42582665 -32220491 -26047753 -27995356 -29718817 -23037149
39745 -23037149 -12334384 -8857273 -15414332 -22812545 -20868948 -9124007 2488271 1919946
39737 1919946 -12737444 -27662081 -25789745 -8020645 5548700 858157 -12411189
39730 -12411189 -16812925 -11792546 -9559106 -13012870 -14119701 -12011896 -15295557 -24122745
39722 -24122745 -26404204 -17369003 -8311183 -8620940 -12553253 -12718790 -13657143 -19953231
39714 -19953231 -21829806 -7806114 14627108 26346278 22116550 14939553 15464945 20343287
39706 20343287 23027376 23960315 25099082 23512755 16756731 9165343 7284416 11547008
39698 11547008 15520802 11950469 -583177 -14171047 -15892964 -735940 19922307
39691 19922307 28400108 19872660 5746312 -2314821 -3842834 -2659365 2232329 11664454
39683 11664454 18329770 13199785 -1586212 -14138453 -17519954 -16269305 -16844492 -18536773
39675 -18536773 -18096823 -17890664 -22540388 -29680639 -31833827 -28320636 -27300093 -31952767
39667 -31952767 -32520965 -20367326 -4242517 -422543 -8188377 -9485572 3375880 14449769
39659 14449769 7785319 -8446519 -15435401 -12225760 -13353274 -22372489 -26983116 -21770631
39651 -21770631 -16947864 -18149205 -14293376 3955041 26638539 37769478 36795315 34394474
39643 34394474 34150915 31567970 26466935 22896081 18797972 8316353 -6000656 -14961186
39635 -14961186 -17378762 -21637647 -30348379 -34106066 -24835886 -6878337 9653097 19406202
39627 19406202 21773083 17691979 11433061 9349186 11775289 11681300 5996632 1788699
39619 1788699 4858335 8417752 1938800 -12458003 -22043028 -20681681 -14619604 -10326013
39611 -10326013 -6131302 -31173 2314427 -4888431 -15572510 -15659943 -426628 17308059
39603 17308059 20080154 5100192 -12661199 -16848601 -6378829 5766213 7949997
39596 7949997 715426 -7008949 -8253118 -2982686 3939376 7094778 4775350 1245854
39588 1245854 3051346 11043221 18340155 18767852 14515242 11471497 9609161 3944739
39580 3944739 -5618222 -11955042 -9900569 -2521658 3962323 6803783 5890071 1338180
39572 1338180 -4534644 -7523056 -8194495 -13629853 -26682112 -37578514 -34209959 -19079954
39564 -19079954 -7519614 -8629339 -16237941 -20547064 -19969208 -16946574 -9967023 2775459
39556 2775459 16278005 22722555 20626268 14644324 8890010 5923979 8870458 16904273
39548 16904273 20807373 12020683 -3805841 -11246135 -4695053 5204983 7479495 4063229
39540 4063229 2523418 4610955 9017335 17313320 27824856 30309688 18528828 4396454
39532 4396454 6612367 25297870 40060947 35201524 15435524 -6297956 -23960387
39525 -23960387 -34936465 -33660650 -19803065 -5124436 -702004 -2461462 -442285 2823758
39517 2823758 -2616309 -12984691 -11643165 4864559 17087702 8086102 -12935351 -23839917
39509 -23839917 -18507431 -9863416 -8380202 -10914464 -10618911 -5771547 3798042 18594885
39501 18594885 33303809 37392149 27664897 13786341 5761194 2128515 -2802093 -6052406
39493 -6052406 95664 14080540 25250519 28654284 30294581 34735024 36103993 27586353
39485 27586353 14270513 8874075 16230836 28165919 33878602 30369836 21425939 10841577
39477 10841577 28191 -9505242 -14855250 -14008865 -8447310 -2556880 -151703 -1505738
39469 -1505738 -3860001 -4869458 -5254501 -7542019 -11968967 -14257744 -8918005 4237859
39461 4237859 17920141 23829635 21292682 17030593 15998604 16198825 14682747 14117251
39453 14117251 17912326 21522609 16261897 2473710 -8554167 -9068125 -4835496 -5578722
39445 -5578722 -10683126 -11723139 -6670831 -3251659 -6851893 -11767145 -8361379 4521277
39437 4521277 18114321 23333866 18722778 9013051 -1061654 -9102281 -12402895 -7509151
39429 -7509151 4150567 12655299 7544357 -9444889 -24574473 -27352690 -21052029 -15417733
39421 -15417733 -14519327 -16494094 -19688283 -21868545 -17629370 -5572644 4365308 1027283
39413 1027283 -10649225 -13399779 -1355800 10813892 8108396 -4950713 -12965625 -11115829
39405 -11115829 -7725059 -8765214 -10244892 -6792204 138917 5464368 7253686 7805052
39397 7805052 10238034 15149453 19331813 18064689 10106206 -231349 -6878349 -6486859
39389 -6486859 891002 11904894 19636404 18517196 12479957 12462302 21302778 27545934
39381 27545934 21070244 8287654 1833106 591785 -6429836 -18496348 -21575169 -11545209
39373 -11545209 -3377318 -9435603 -21837852 -26715202 -24544228 -23173802 -19933049 -7323641
39365 -7323641 8069565 10285265 -1682552 -10582456 -5752781 3775078 7334444 9154932
39357 9154932 16295528 22070174 15961065 3335569 266236 10840425 22970515 26689365
39349 26689365 24034881 19271074 12058345 4638879 4151837 11245361 16285805 14318310
39341 14318310 14036477 22098862 27824889 17554409 -1418158 -8233030 351165 3680886
39333 3680886 -11772300 -30348827 -27920957 -4934465 15362469 17728938 9867610 5306151
39325 5306151 4077431 -2374107 -14354592 -21661916 -17734450 -8821305 -5528424 -8828983
39317 -8828983 -9558788 -1848079 7815606 8167823 -2723513 -14793879 -16518889 -4951097
39309 -4951097 13402924 27535554 28656578 17298920 4534816 1514312 6922698 9434861
39301 9434861 3181599 -5090890 -6142032 220498 6420921 5210763 -5118558 -17969548
39293 -17969548 -20009455 -3712394 19300437 27336130 15520412 2661128 4574309
39286 4574309 13235503 13662828 8961240 11483311 17715068 12908819 -1908874 -8902555
39278 -8902555 -1895534 3941939 -2901116 -13333277 -14822347 -10270059 -8588776 -8786983
39270 -8786983 -5688375 -2003768 -2358419 -2601768 2658546 7191797 24081 -17442361
39262 -17442361 -31727372 -33671622 -26273288 -17260750 -11282768 -9182778 -9166005 -8224171
39254 -8224171 -4996601 248338 8812562 21314146 31029674 27701383 11441506 -6107823
39246 -6107823 -18655084 -32025847 -47446810 -51611194 -35709738 -13477212 -5502269
39239 -5502269 -13485740 -24581341 -32923973 -39583473 -38340131 -22553960 -3704726 -1891697
39231 -1891697 -16583581 -26339814 -20163930 -9797723 -6795977 -7081048 -5095684 -4918831
39223 -4918831 -8876594 -11741497 -14159732 -24211052 -36886091 -32178902 -6851437 11719878
39215 11719878 1455803 -21512313 -26804873 -12916634 -2807052 -6154427 -11327526
39208 -11327526 -10342066 -7141716 -1801361 10399195 22540290 20613910 7886594 3535625
39200 3535625 11994820 15213254 3556684 -6879710 -461352 12685572 13153309 151357
39192 151357 -13072615 -20631839 -24504862 -22472070 -12598808 -3994067 -6596532 -13838166
39184 -13838166 -11141891 995256 8509035 7045743 6467845 10478170 9423469 -939816
39176 -939816 -9567959 -7587965 -1805708 -380021 2508768 14190780 25137567 19164056
39168 19164056 -2045909 -19542341 -21295195 -12686264 -3066917 4506614 7963430 4064666
39160 4064666 -3633141 -6415942 -5390545 -12523318 -29272590 -37547604 -24356165 -4158823
39152 -4158823 75945 -9376304 -10304731 2727923 9909230 216794 -7877450 5729147
39144 5729147 29513773 34027791 11702296 -15908517 -29234225 -30911065 -30644877 -26039363
39136 -26039363 -9881798 12000267 23110911 15887789 116150 -10176047 -12113548
39129 -12113548 -12794364 -16821669 -20655581 -19523314 -15146064 -13306335 -15853134 -18939475
39121 -18939475 -18804842 -15659334 -11271225 -6323602 -1855935 -396823 -3253744 -8131220
39113 -8131220 -10866172 -8405042 -250166 10140223 15226126 9003301 -5387002 -17567548
39105 -17567548 -21715090 -22427478 -26014283 -30512656 -29187837 -21010884 -12377160 -9442926
39097 -9442926 -12672853 -18108678 -20850614 -18173581 -11712642 -5612962 -1410238 2529188
39089 2529188 5417214 2911610 -5166857 -11262485 -9623765 -5402592 -7969408 -17709001
39081 -17709001 -25611054 -24588919 -16038140 -6364782 -1093545 -611046 1182364 10078180
39073 10078180 20381066 17632327 -1273519 -18904153 -18437984 -6826607 -3138610 -8883771
39065 -8883771 -7550732 6250658 16114369 8923660 -5090848 -8018780 733087 6510763
39057 6510763 39909 -14204268 -26633254 -31142512 -26777380 -17143130 -8134701 -3611198
39049 -3611198 -4052375 -8625580 -14350728 -14719400 -6671235 1389520 -1772750 -12300618
39041 -12300618 -13381352 1022249 16880997 20859229 17767233 17661746 17225428 7608108
39033 7608108 -6821970 -12206876 -4332845 8412228 18998315 27197582 32382505 31839016
39025 31839016 26753255 21517265 17438650 14133971 14553286 20087544 23462946 16476747
39017 16476747 3071464 -5548122 -7545209 -11329388 -20412581 -29021062 -33442059 -35593412
39009 -35593412 -33285078 -19929170 1087029 13660180 8163540 -5462864 -11259991
39002 -11259991 -6584557 -664520 -459838 -6004161 -14921935 -23308138 -24825640 -16242109
38994 -16242109 -3020508 5444284 4893774 -2679026 -13529309 -22920873 -24459659 -15107452
38986 -15107452 -539336 9310431 10308985 6395881 2502447 -553964 -3474154 -4768377
38978 -4768377 -2423764 1938295 3123230 -2249655 -11137130 -16578339 -15331477 -11137776
38970 -11137776 -9108255 -9250914 -8227198 -5384607 -3140033 -2552989 -2765978 -4226363
38962 -4226363 -7787780 -10392661 -6495148 4650581 16642692 22257962 19604282 11788495
38954 11788495 3507145 -1999596 -5690170 -12050725 -22578366 -31413065 -31873547 -25806479
38946 -25806479 -20869695 -19666433 -18049485 -13636773 -8779000 -4879760 -1366433 -856276
38938 -856276 -6843881 -14713892 -14210575 -3855874 5982195 8067628 7287343 10212343
38930 10212343 15041549 17726049 19054384 19095518 13777071 4431025 804114 5055303
38922 5055303 3047584 -15384092 -35942970 -35768743 -15361458 2098284 2345947 -5353253
38914 -5353253 -7156193 -2627440 1835757 5013906 8838593 12779452 16309146 20404335
38906 20404335 22632122 18044541 8797606 4875988 10261957 15892445 12245523 2401524
38898 2401524 -3726081 -2699002 1256757 3919140 3923655 1590951 150523 4584051 14490724
38889 14490724 21931497 20948881 14807909 8998196 2798593 -5204228 -8624893 -110058
38881 -110058 15521407 24575757 21105725 12173746 6065477 3477221 2348294 3645223
38873 3645223 8348809 14109644 18738128 22996788 26788787 26467177 19590011 9600094
38865 9600094 2257136 -1063056 -3867919 -9205359 -15400768 -16671630 -8064650 8795904
38857 8795904 25504790 34441152 35285295 31555364 24054620 13630325 7237217 11072001
38849 11072001 17174735 8829670 -15633831 -35589196 -33055768 -15424666 -2633852
38842 -2633852 -102738 1493335 5250673 4423571 -272180 2833503 17276790 29929160
38834 29929160 28616925 16873976 4388708 -5511401 -10428422 -3120087 16342225 31541298
38826 31541298 27010450 9418747 -1721184 -405293 2539577 -358324 -4972889 -7987009
38818 -7987009 -12687641 -18900036 -20107840 -15319257 -11986075 -11545965 -3868163 15660779
38810 15660779 33395178 32299148 13876203 -4128136 -8470962 -1203717 7272227 8612017
38802 8612017 1402091 -8824294 -15207827 -17700081 -22048172 -28293431 -27007958 -12724219
38794 -12724219 5354063 14342406 14505481 15421719 18781693 16780288 7657019 583401
38786 583401 702693 -531670 -12423389 -28887998 -34382408 -24020197 -9703150 -5199810
38778 -5199810 -11566101 -20078079 -23896647 -21546319 -13036085 -940356 5284245 -3757287
38770 -3757287 -22011125 -29199824 -15660804 2220798 3310947 -7772854 -7919753 8186888
38762 8186888 18697452 7681845 -10705990 -13929045 -3277860 2196967 -3810121 -7974464
38754 -7974464 634108 16568136 28058095 29942685 23778891 13546249 4345707 -267977
38746 -267977 -1472557 -1903484 29085 7786617 19680922 29152913 31586694 27641023
38738 27641023 21958865 21079232 27828035 34189954 26674913 4515722 -15439321 -19809169
38730 -19809169 -15712757 -16185804 -18455913 -12332146 -2740490 -4149858 -14915277 -17615380
38722 -17615380 -6892177 2661937 1477530 -758773 5857088 14586081 15019077 9861508
38714 9861508 7459537 7947649 7768894 9245074 14633306 17248286 8858877 -8201299
38706 -8201299 -23900815 -31391438 -29686972 -21250858 -12367818 -9955633 -13017487 -13502337
38698 -13502337 -9469160 -9081347 -16799547 -24957570 -25205104 -19339495 -12631343 -6013435
38690 -6013435 -1327813 -3513281 -9926377 -8937746 2192778 10709024 9997000 13368756
38682 13368756 31370917 48777819 43727771 20750405 4169250 4367356 11205144 17180961
38674 17180961 25135229 32571556 29294156 14909694 1905053 -2288266 -1314565 3307081
38666 3307081 14153113 24275093 20635604 6434932 1002061 9836116 14133830 1273549
38658 1273549 -13079743 -9224463 5451549 8760767 -2904958 -13570454 -14973398 -15056651
38650 -15056651 -18981860 -19191162 -9485002 3262295 7772431 1542083 -8783808 -14649592
38642 -14649592 -10672818 1715853 12773943 11835334 -130660 -9558101 -6243844 2790247
38634 2790247 1125322 -15600762 -31945671 -29788438 -9518745 11446242 20088794 20345055
38626 20345055 21757684 23503688 17660787 4635958 -4380739 -1693495 7300407 11815130
38618 11815130 8469767 3340644 3624035 9513787 14221169 12355130 7528748 7679545
38610 7679545 12269099 11594178 3066940 -1056433 8434598 20131809 16121342 -863416
38602 -863416 -10346861 -3267757 8382842 13136593 14016964 15243560 11801889 2199265
38594 2199265 -2300046 6693399 20299531 25568470 24184583 25634819 29316322 27202616
38586 27202616 19963152 17294543 23399170 32060759 35046399 27975846 11151412 -7418401
38578 -7418401 -13832638 -2375258 15197884 23017995 20072920 16705418 16766981 15198580
38570 15198580 11084803 10179394 13413121 13931865 7831317 -925384 -7716964 -11334573
38562 -11334573 -10464461 -4787520 -75768 -3125755 -10833848 -13582033 -10061274 -8084653
38554 -8084653 -9258775 -5435927 5030834 10069425 1188725 -11800790 -13309787 -2612107
38546 -2612107 7764339 9568409 4979200 -1955705 -10091915 -17171294 -19206918 -16207661
38538 -16207661 -13446293 -15119373 -20175348 -25350153 -28905878 -30177708 -28618262 -25347524
38530 -25347524 -23523702 -24683271 -25654910 -21931113 -14649129 -11207520 -16064598 -22711600
38522 -22711600 -19577815 -4602732 11023076 16106726 11748476 6811265 6228634 9807901
38514 9807901 18414363 32657553 46395838 50241847 43333625 34833180 31478985 29586054
38506 29586054 22017002 7779120 -8368112 -21393572 -27852133 -25801416 -16256153 -3292480
38498 -3292480 8430036 15006627 13955256 7675633 4485290 9969947 17929503 17095872
38490 17095872 6781009 -2788566 -6709717 -11319878 -19947142 -23998389 -16267869 -4188110
38482 -4188110 245829 -2479022 -2924831 1223725 3762106 2291674 773039 -8440
38474 -8440 -3945596 -10058798 -11139166 -4969961 1404528 2119148 -769271 -5527037 -17500273
38465 -17500273 -39401373 -59594448 -60186900 -38070460 -11292955 -1153618 -11039947
38458 -11039947 -25891853 -30723053 -25628010 -21355652 -23786015 -27886554 -27178937 -23203315
38450 -23203315 -21102254 -19526366 -11760997 3168350 16691576 20202296 14142002 5344278
38442 5344278 -939881 -3665771 -3964046 -4036884 -6313200 -10898043 -15135067 -17287225 -18031744
38433 -18031744 -16309692 -7980872 6655671 17658401 15200990 3722272 -1625178 5840378
38425 5840378 16601910 19779766 17373858 17012035 17621633 12527409 3295697 -818371
38417 -818371 2975570 8296405 12416317 19832419 28541696 25277961 4051437 -19764408
38409 -19764408 -25724187 -13065095 2309754 10563590 14146381 14501411 8880133 2043930
38401 2043930 5167034 17582063 23883422 16778691 9193277 13360927 20802320 17362667
38393 17362667 7912781 8230991 17882625 20611991 11121916 2053728 434416 -3840738
38385 -3840738 -16855281 -24707379 -13294383 7077946 13729598 2754094 -8639868
38378 -8639868 -9563281 -8249426 -13730101 -20457006 -20607092 -20191543 -29619121 -43694550
38370 -43694550 -45151852 -28594683 -8781697 -712606 -1211840 2221493 11147258 15341973
38362 15341973 10602424 6674462 13438831 26504370 33269543 30006724 25575782 27778863
38354 27778863 32683999 31492906 23960202 18655592 19917320 20869705 13229222 -205628
38346 -205628 -9010723 -9519049 -8493980 -11244947 -13807443 -11396024 -7776259 -8832814
38338 -8832814 -11501260 -8249283 -302220 3698181 2350870 4194252 12932243 20275989
38330 20275989 19059843 14395082 13993667 14715956 8399480 -3414833 -10439109 -7299074
38322 -7299074 2144210 12075028 17685567 13124960 -2528794 -16998791 -14502037 2602585
38314 2602585 13071719 4082000 -10988597 -11740866 492227 6560830 -1179299 -8928076
38306 -8928076 -4351338 4241377 1418473 -11019053 -16185452 -6875883 4360248 3484727
38298 3484727 -6926101 -14975639 -17246689 -19200319 -21701266 -18922917 -10200740 -2839284
38290 -2839284 297728 5580064 15197396 19007162 9269275 -3936044 -3937423 9589124
38282 9589124 20929581 20388097 14099413 10819205 10855200 11985432 15714589 21471459
38274 21471459 22894099 16760296 9138486 5824930 2391802 -8506815 -23983566 -33132863
38266 -33132863 -30497344 -20451166 -9274243 792884 9488160 15482095 16344951 9870093
38258 9870093 -2392139 -11194213 -4913589 15418823 31599905 27509500 9825460 -684912
38250 -684912 2772886 6126837 -1737233 -11360591 -7459413 7913671 18464768 15940867
38242 15940867 8084551 4266527 2914161 -3089653 -14582739 -24433702 -25691681 -19033150
38234 -19033150 -12896117 -16127542 -28362557 -38106526 -33566808 -15647787 3021071 11978704
38226 11978704 11582871 7442139 2655281 -682294 1952407 12436490 23843072 26359490
38218 26359490 19400708 12180502 11969434 17408212 23796303 28048229 26524232 16088718
38210 16088718 2412434 -210422 14306929 31686650 31456700 11554842 -10449685
38203 -10449685 -20025031 -18930943 -14039583 -5224442 7989613 16942304 12364226 -1189364
38195 -1189364 -9757181 -7985150 -3455625 -2450797 -1056791 5614357 13180237 13469145
38187 13469145 6051236 -1841464 -4783199 -3227990 477382 4480180 5500063 -29464
38179 -29464 -10186299 -16245838 -10756474 3626255 15517491 15225321 3106208 -11814666
38171 -11814666 -20241553 -19613852 -14055802 -8735980 -5017337 -1007818 4240794 8140693
38163 8140693 5945559 -5741633 -25618398 -46058382 -55824957 -48012601 -27062018 -5967647
38155 -5967647 5176507 6632307 4656453 3278108 3278285 5876783 11702003 16671854 14682713
38146 14682713 5963026 -1829216 -2887241 591333 4008704 7496148 13049399 17894194
38138 17894194 16394667 7743587 -2887989 -10773546 -15244742 -16831045 -14951424 -9921790
38130 -9921790 -4540030 -2055539 -3614776 -7766266 -11216519 -10828080 -6755605 -2759422
38122 -2759422 -1528861 -1323781 232427 1652167 1312665 3246984 12345277 24056197
38114 24056197 26875074 17806153 8093391 8586170 15039197 14433680 2498783 -11909109
38106 -11909109 -18604919 -15941802 -8618331 -1165381 4422306 8041199 10583612 12233212
38098 12233212 11351695 7062854 2854767 4653070 14171470 26308112 34217064 34969379
38090 34969379 29205438 18154015 4169175 -7380186 -11461998 -10025640 -11478938 -20216087
38082 -20216087 -29134895 -27184812 -13373754 2257911 11993003 17870415 22882109 22492969
38074 22492969 12173848 -1737099 -7787400 -3809578 2955184 8012022 11705787 10349353
38066 10349353 -1474564 -16760409 -18047509 -1104472 15255285 13514367 1716756
38059 1716756 185516 11120078 17400677 9526687 -2394378 -6284440 -3826713 -2579032
38051 -2579032 -3193191 -2485436 -1966996 -4783890 -8095300 -6468635 -1801731 -3101848 -14595506
38042 -14595506 -28143430 -30861029 -19492147 -3871758 5527328 9730596 15508777 20289173
38034 20289173 13738341 -2563468 -9772188 3675137 22082535 21896974 5299065 -3114777
38026 -3114777 7974962 22934275 24915377 17306657 11517763 9310874 8370451 12039955
38018 12039955 20284948 21538892 7697496 -10922461 -19581513 -20480902 -24852344 -30681114
38010 -30681114 -26955301 -16760276 -15495126 -24248198 -25052506 -9222727 7469058 8066100
38002 8066100 -1911552 -6624226 -4193554 -4214101 -8147358 -7261067 2067422 13428182
37994 13428182 20643963 23042664 20545431 13076429 6087836 7852224 18487666 28614832
37986 28614832 31622794 30996701 32660768 36452166 39284375 40988754 41454544 36432416
37978 36432416 23155202 8066146 1797019 6161429 12246245 12512282 8494725 4021567
37970 4021567 -1994556 -9744117 -11073014 2154071 22988833 32911971 23678945 7094947
37962 7094947 -2132369 -4983190 -11268705 -20947541 -24341936 -18935177 -13507837 -13617109
37954 -13617109 -13921682 -9002443 -2170043 1845573 4185531 5497487 1003839 -9678977
37946 -9678977 -15809606 -9608616 -1092208 -5746537 -20469117 -26184525 -14888942 478070
37938 478070 7145414 9441428 16324677 23270980 18539582 1939069 -13744023 -18206534
37930 -18206534 -12246912 -2615205 3843551 1671790 -9672351 -22350815 -25967414 -18584027
37922 -18584027 -8217475 -3180614 -4875314 -9739431 -13381880 -12306672 -6441495 -1344081
37914 -1344081 -3887228 -14258131 -25184256 -29409873 -24718758 -12571296 2561491 12030219
37906 12030219 8008496 -6973599 -20286719 -22292542 -15269482 -7073699 -1607640 378306
37898 378306 -2808899 -9971508 -13047969 -5524916 6209524 8294692 -2454440 -13437306
37890 -13437306 -12905679 -5389086 -4302674 -12353495 -16923775 -6557993 13693802 28264309
37882 28264309 29948700 26361357 26408491 27550763 22592120 13896980 10654463 12923988
37874 12923988 10292096 -9041 -5762116 1276162 9960271 6158522 -3199530 733308
37866 733308 18238630 28444161 20524804 9247755 10483026 17375493 15172343 7882931
37858 7882931 11779384 27509989 37436539 31564409 19637326 13223583 10639522 7219819
37850 7219819 7579482 16085246 23838182 18844600 5739294 2330604 15797791 33266188
37842 33266188 38986132 31694133 20510616 11703272 6040196 3339342 1843813 -3579837
37834 -3579837 -14995407 -25132192 -25303110 -18538518 -16085242 -20084245 -19611717 -8007637
37826 -8007637 5198764 7086479 -783206 -6285082 -4065020 815317 4218257 7590191
37818 7590191 11169488 12338820 12605109 17141624 24416905 25136032 16008465 6322309
37810 6322309 4606886 5590734 -2084489 -19660944 -36670574 -42341235 -33249678 -13941753
37802 -13941753 3879759 7370949 -4340120 -15888376 -11966577 4742186 19221709
37795 19221709 23907786 22946982 19346114 10635380 -881965 -5532912 834245 10113576
37787 10113576 13363813 11500114 9338369 6341299 212004 -5702604 -6031560 -1637808
37779 -1637808 1374240 -1179682 -9066497 -18751135 -23165122 -15079126 3567104 19232376
37771 19232376 19817456 7950081 -3887329 -8642871 -9179726 -9983784 -11419307 -11901910
37763 -11901910 -10283670 -6390582 -3461841 -7929003 -20916147 -32009972 -29131782 -14420706
37755 -14420706 -2596179 -2532172 -8256979 -10519375 -9146005 -8989820 -10120118 -9015943
37747 -9015943 -6373954 -7133642 -13085977 -20087023 -23362758 -22706744 -21187686 -19951346
37739 -19951346 -15976504 -6449924 4812428 8758721 1865595 -7452871 -8350301 -1789856
37731 -1789856 1314893 -3826326 -9308150 -6531787 2242631 8576394 8342679 2724313
37723 2724313 -6148045 -14855476 -18109589 -14786202 -11684836 -15185178 -21529266 -21782727
37715 -21782727 -14646994 -7212446 -3372708 1022508 9487875 17405344 16863643 6229691
37707 6229691 -7310472 -13415999 -7049893 6032675 12853986 6072456 -6744785 -10952785
37699 -10952785 -2477042 7291668 6393753 -2604639 -6955271 -1076432 5872717 1776337
37691 1776337 -12089705 -21037969 -14516096 615642 9209526 7561153 5926977 10839452
37683 10839452 15277209 11920565 6435798 7763548 12206960 9221488 -1099929 -8887086
37675 -8887086 -10083540 -7693288 501137 18974597 37920042 38028703 18133633 906577
37667 906577 1557208 7418785 1676897 -8381044 -5124630 8886884 15605580 11130261
37659 11130261 9023027 14703617 16917648 8142051 -4373726 -13557165 -22568786 -32358768
37651 -32358768 -33261546 -19136272 281173 11235631 12854610 13240364 14953565 14028039
37643 14028039 10186649 9394905 15990448 26573841 31982731 25159777 9862928 315460
37635 315460 5939118 16956826 14167125 -5416117 -23251721 -23840166 -13684356 -8382854
37627 -8382854 -10618813 -11278339 -5967176 310046 1734778 -3357271 -12989155 -20248294
37619 -20248294 -16175919 -1770779 7919207 1275939 -12143942 -12065732 6070821 25968755
37611 25968755 32219091 27163696 23183729 25728007 28419512 22100977 6734034 -5654673
37603 -5654673 -2753021 12106664 21931400 17663952 9531426 9739649 13223838 7697349
37595 7697349 -4411494 -9661768 -5723259 -3121202 -5215696 -3593419 3682246 6153660
37587 6153660 -381827 -4465678 3086173 14636319 18808260 16959558 15926172 14117238
37579 14117238 7203853 623476 3447840 13568029 20783419 22827326 27502724 38564861
37571 38564861 48536088 47822630 35407591 18939173 7656135 5449808 8331449 9017059
37563 9017059 4898716 -544503 -4065121 -5520300 -3768002 3309978 11873918 12686530
37555 12686530 3240121 -7574505 -12136675 -14333222 -20890824 -29586629 -33783854 -32663824
37547 -32663824 -28985457 -22314355 -12726167 -5711400 -4640726 -3627854 3142270 10569630
37539 10569630 10739925 5848882 2344070 -1178114 -7404227 -8468816 3054591 16161143
37531 16161143 13424654 -512497 -2910928 12502870 25989212 22833908 13194992 10658924
37523 10658924 10198012 2312671 -6300728 -3875813 5122559 7613119 4014303 5417196
37515 5417196 12495560 14256312 7603138 2846368 6925036 13539486 14382320 10858031
37507 10858031 9768322 13809378 20809640 28396258 35798983 42335840 45393924 40496718
37499 40496718 26271599 10214739 4195866 10816777 19643625 21213221 18202892 16784832
37491 16784832 14620371 6624838 -3872136 -10699148 -15938615 -22704432 -21800180 -1887029
37483 -1887029 28042232 43644426 35927272 21301606 15984631 15883456 9788395 -1789346
37475 -1789346 -11605175 -17800148 -19651338 -11497839 6389307 19314079 14340761 -928855
37467 -928855 -8991790 -6529362 -3772836 -4268975 -1438869 6042592 11753953 15479335
37459 15479335 23570214 32456239 28523274 10636165 -3280322 -1359068 5367604 3139053
37451 3139053 -1526216 4701431 16145621 15883585 4494422 140177 9317121 17534698
37443 17534698 14182945 7862837 7336823 3870993 -12832986 -32906640 -37876358 -28047320
37435 -28047320 -21267955 -26048007 -32239571 -30287407 -24034856 -18448686 -8317943 10794313
37427 10794313 29446012 33276349 20567132 2030394 -12994143 -21454160 -21476336 -13064038
37419 -13064038 -3492247 -2165014 -8340849 -11974297 -8497585 -4590541 -6429236 -10512838
37411 -10512838 -11092899 -9654740 -10585420 -12549785 -11199076 -7464503 -6600618 -10058679
37403 -10058679 -13035958 -9540718 2287249 17170611 23459692 12934907 -6074893
37396 -6074893 -12585759 2873983 24643469 31746997 24830067 20746030 25232692 27496539
37388 27496539 21659507 15813160 15041141 11784392 990807 -9527088 -13252038 -15988076
37380 -15988076 -21875701 -21935906 -10507895 -720607 -6285518 -17682818 -16130648 -4059305
37372 -4059305 456637 -4156468 -958849 13805681 21699004 11959783 -1787649 -5156512
37364 -5156512 -3386811 -5063085 -3544842 8974365 23183854 25957626 20833706 17849032
37356 17849032 12901223 -3380774 -23077784 -27881076 -16255998 -5214167 -5248396 -10204780
37348 -10204780 -12464510 -11967135 -8688014 -1742525 1910100 -6657711 -20933317 -23280764
37340 -23280764 -10885173 -1055445 -4061185 -7013582 4899005 24869204 34781772 29343075
37332 29343075 17690816 7958971 1663372 -1129393 -534680 2305755 8905062 22374551
37324 22374551 37369358 39577303 23674132 4288246 -700715 8222778 16875141 17680446
37316 17680446 14644879 12706278 12991436 15460614 16611781 8529881 -9626693 -23786539
37308 -23786539 -20535770 -6785966 -652226 -5508338 -8394041 -3759603 -1556212 -7470396
37300 -7470396 -11334346 -3752760 8360345 12961036 10121032 7637565 6684003 3237073
37292 3237073 -271943 3829684 15716762 25526892 25590864 19150565 14496837 14825095
37284 14825095 17137855 18894488 21742161 27504351 32814439 30984412 19701801 4414790
37276 4414790 -6665755 -8389601 160222 14648788 23869366 16773779 -3349864 -18517494
37268 -18517494 -17261882 -9584721 -11102133 -18942944 -17256172 -3139172 9288018 11633845
37260 11633845 11933398 18113869 25400254 27059232 24946918 21304247 11358480 -6756885
37252 -6756885 -23968765 -30901171 -28572593 -21491651 -9948436 2630228 5726191 -3608714
37244 -3608714 -11412661 -4226343 12064821 22490936 23435196 19832502 11471243 -1542196
37236 -1542196 -7753845 1827313 14115461 9165582 -7478979 -10382267 6682801 21104134
37228 21104134 16880653 6410799 5930882 10140807 6684109 -773763 -1824508 -1791
37220 -1791 -6239770 -19052558 -27464853 -28473341 -26868147 -22266172 -11344638 -313350
37212 -313350 -378157 -10826044 -19213579 -19002314 -16110662 -17669386 -24528128 -34773476
37204 -34773476 -44270384 -44039857 -28463751 -6738394 5408445 6562740 9769355 19815134
37196 19815134 24882702 16852866 5961943 5121518 10456142 9641894 2286134 -1124935
37188 -1124935 2796196 5743031 1248683 -6820649 -11057251 -9054066 -3494603 1734933
37180 1734933 4893364 8907606 18907670 33543042 42101031 36408576 22947091 15508946
37172 15508946 17274188 18772178 13414163 5235054 -791578 -5706525 -8835122 -2936848
37164 -2936848 14360078 31039051 32648089 20406524 8104705 3265410 1526175 -688795
37156 -688795 518565 6664836 10152567 4342611 -6113762 -12447679 -14642021 -18857953
37148 -18857953 -24549658 -23299688 -11425479 3850832 13491790 16009729 14524848 9758722
37140 9758722 902905 -9491561 -16482580 -17690986 -13773893 -5065049 8135365 21642398
37132 21642398 27757833 22244465 9925545 1226507 2130957 7804406 7459828 -3450387
37124 -3450387 -17196471 -22087387 -15727982 -6403403 -1550538 82937 3058091 7146999
37116 7146999 8035563 2098005 -12618918 -34864190 -54883592 -56926223 -35618608 -6358271
37108 -6358271 9808040 9590914 6277202 7584209 7811149 3380102 1491575 6458076
37100 6458076 9602121 2517536 -8548019 -11854516 -6718123 -540375 4487004 10260990
37092 10260990 13207003 8427642 928938 581310 7176521 12113835 13443084 16134871
37084 16134871 17947978 10363855 -3765433 -9320518 -1681760 4531734 -1736015 -10240782
37076 -10240782 -6373808 5437677 9341622 1356737 -9211296 -16430595 -21566717 -23149712
37068 -23149712 -17062061 -6096648 2330021 7487556 13256666 16263651 9220586 -3858881
37060 -3858881 -10297160 -9116067 -13525127 -27210154 -33184562 -16798925 11683901 30158515
37052 30158515 32526412 30336210 31453494 31189511 24759698 16602870 13331207 14509475
37044 14509475 14421328 9667899 3010055 937341 6503021 13303429 10241002 -4393089
37036 -4393089 -18115146 -18947015 -10559708 -5453626 -6907069 -7548190 -4236521 -2771102
37028 -2771102 -5740872 -6728836 -1726935 2860645 603781 -3558101 -338930 9966987
37020 9966987 18331090 18831562 12423376 1280428 -12552961 -23125595 -22848929 -10990075
37012 -10990075 4820021 16678320 21833835 20132624 12124652 1776274 -4211135 -3101246
37004 -3101246 1230366 4501366 6941793 9539039 9877551 5833306 197862 -2623005
36996 -2623005 -2098259 -70672 3103974 6317345 5069417 -2314353 -8079249 -2932677
36988 -2932677 9365796 14093642 4865955 -7491001 -10154353 -4697685 -840924 163365
36980 163365 5426944 15419803 20037920 12871601 1187003 -4029613 -2901422 -4718200
36972 -4718200 -13018351 -19620177 -15687861 -4194439 2931091 -1150414 -11158442 -17599617
36964 -17599617 -17761380 -15524990 -12939976 -7616564 928736 7500895 6681712 -842731
36956 -842731 -9651096 -14763939 -14028390 -9054872 -5976848 -10953225 -21590941 -27210256
36948 -27210256 -21749409 -11737544 -6405669 -5399896 -3621372 -2743520 -7435712 -13694535
36940 -13694535 -13619927 -10849649 -16965142 -30370049 -34294633 -22467109 -11713818 -17577897
36932 -17577897 -29873983 -27839623 -11229148 1493255 2519437 3466833 12455500 19775667
36924 19775667 14414827 2073393 -3936565 -1910478 -1175181 -6462002 -12858420 -15412452
36916 -15412452 -15351640 -15190731 -13676429 -8535699 -1227015 3407272 1225656 -7916177
36908 -7916177 -19433620 -26329769 -24322798 -16091644 -9462849 -9915147 -14988598 -17277975
36900 -17277975 -13216162 -7517711 -7519466 -13757611 -18297285 -13219213 658608 14623653
36892 14623653 20729569 18578145 13963211 11661613 9993273 3379382 -9311474 -21327645
36884 -21327645 -25750483 -24579708 -25017300 -27319525 -23415747 -9950118 4488681 10297281
36876 10297281 9256666 9480783 12682808 14565587 14856331 17563137 21690509 21009795
36868 21009795 14963117 11580765 16134353 23638893 26628079 24555168 20812117 15346764
36860 15346764 6097825 -4717875 -10951205 -8730821 315386 10885909 17276256 16936219
36852 16936219 12856402 10421620 10341694 7679560 32283 -7134320 -7446787 -3416471
36844 -3416471 -4214034 -13962899 -26447295 -32441875 -29429668 -22600892 -17856495 -15552051
36836 -15552051 -11352638 -2576882 7628170 13590541 13818176 12419480 13856466 18368787
36828 18368787 22924671 24510795 21762319 15349171 7753946 1433959 -2871420 -4587459
36820 -4587459 -1219440 8833667 21577260 29609007 30206326 27869513 27531910 28517024
36812 28517024 26801733 20412899 11208389 3780524 2852601 8232005 12344187 7718734
36804 7718734 -2437423 -7150468 -2712915 2361595 747873 -3186501 -2415452 92880
36796 92880 -3504520 -12111064 -16131844 -10519946 212319 9398794 13758559 12068284
36788 12068284 5463385 -327653 391502 5080053 5022255 -2993534 -12243060 -14885335
36780 -14885335 -10482392 -4009315 375315 1667994 1448005 2345502 4729001 5434197
36772 5434197 3001519 2213611 7836903 15431265 16142695 10648989 9006073 14132421
36764 14132421 15672663 6607334 -2831523 2352641 20151198 32432134 26821583 9717943
36756 9717943 -3074916 -2386267 8526352 18847909 19395609 10566443 1683087 -208598
36748 -208598 903354 -2974121 -10278834 -10953366 -1517950 9109994 12004098 9111719
36740 9111719 6957184 6124922 3932440 2582818 5867564 9738329 5007765 -9809327
36732 -9809327 -25563166 -33651157 -33514366 -27747935 -17691611 -7489552 -4955370 -12353083
36724 -12353083 -21662755 -24934880 -24186101 -24403417 -22679696 -14303480 -5820746 -9405304
36716 -9405304 -23813620 -33398001 -29849090 -23582676 -27025703 -36397947 -39268190 -33221939
36708 -33221939 -26354908 -22773407 -18237852 -9964098 -1812423 2001747 1793632 -827593
36700 -827593 -5620083 -10829583 -11801139 -5216605 7074759 19448394 26400905 25695196
36692 25695196 19941055 14627540 12654585 11829942 9405229 6502936 5074731 3511757
36684 3511757 -113469 -2841117 -636569 3591517 1705464 -9445376 -24183869 -34680622
36676 -34680622 -37376042 -33222252 -26332355 -22260088 -22636713 -21258454 -10320966 9071982
36668 9071982 27042754 35403590 33533994 25169686 15557425 10943281 13273652 14873718
36660 14873718 6274836 -9355098 -18069234 -13966926 -7343876 -9652227 -18486119 -23542191
36652 -23542191 -20945264 -15067269 -10937391 -10852478 -14770060 -19246172 -19598299 -16523607
$$ [...]
##END NTUPLES=NMR SPECTRUM
##END=
