##TITLE=31Pdec_SR18_ost
 D2O, 24 sc
 2.9.2020
##JCAMPDX= 6.0         $$ Bruker NMR JCAMP-DX V2.0
##DATA TYPE= NMR SPECTRUM
##DATA CLASS= NTUPLES
##ORIGIN= UXNMR, Bruker Analytische Messtechnik GmbH
##OWNER= root
$$ XWIN-NMR		Version 3.5
$$ Wed Sep  2 13:44:55 2020 Russian Standard Time (UT+4h)  she@DPX200
##.OBSERVE FREQUENCY= 81.013821
##.OBSERVE NUCLEUS= ^31P
##.ACQUISITION MODE= SIMULTANEOUS
##.ACQUISITION SCHEME= undefined
##.AVERAGES= 24
##.DIGITISER RES= 17
##SPECTROMETER/DATA SYSTEM= spect
##.PULSE SEQUENCE= zgpg30
##.SOLVENT NAME= CDCl3
##.SHIFT REFERENCE= (INTERNAL, CDCl3, 0, 182.463)
##AUDIT TRAIL= $$ (NUMBER, WHEN, WHO, WHERE, WHAT)
$$ ##TITLE= Audit trail, XWIN-NMR		Version 3.5
$$ ##JCAMPDX= 5.01
$$ ##ORIGIN= Bruker BioSpin GmbH
$$ ##OWNER= she
$$ F:/spectra/data/she/nmr/P31/1/pdata/1/auditp.txt
$$ ##AUDIT TRAIL=  $$ (NUMBER, WHEN, WHO, WHERE, WHAT)
(   1,<2020-09-02 13:44:10.40 +0400>,<she>,<DPX200>,
      <created by zg, POWCHK disabled, PULCHK disabled
       configuration hash MD5:
       00 E9 B6 7A A2 85 ED C7 34 08 36 98 17 FE 4E 26
       data hash MD5: 32K
       CB C0 40 1B 99 10 69 3B 7D 56 C4 58 CF 37 C6 AA>)
(   2,<2020-09-02 13:44:12.82 +0400>,<she>,<DPX200>,
      <Start of raw data processing
       efp BC_mod = 2 LB = 1 FT_mod = 6 PKNL = 1 PHC0 = -3511.067 PHC1 = 1942.202 SI = 64K 
       data hash MD5: 64K
       57 ED 59 06 43 81 F1 E2 92 56 10 0E 7E 54 66 3A>)
(   3,<2020-09-02 13:44:25.40 +0400>,<she>,<DPX200>,
      <pk PHC0 = -21.08309 PHC1 = 0 
       data hash MD5: 64K
       37 D4 65 5C 9F CE 7E FF E7 12 A4 D5 A3 15 7E 91>)
(   4,<2020-09-02 13:44:33.76 +0400>,<she>,<DPX200>,
      <abs ABSG = 5 
       data hash MD5: 64K
       6C BB BA E2 CB D7 6F 4C 29 49 09 85 07 CA 08 1D>)
$$ ##END=
$$ 
$$ hash MD5
$$ 2F 4E 5C B8 2A DB 76 F2 FA 41 3D 65 5F 3E 56 D5
##$RELAX= 
##$RELAX= 
##$RELAX= 
##$RELAX= 
##$RELAX= 
##$RELAX= 
##$RELAX= 
##$RELAX= 
$$ Bruker specific parameters
$$ --------------------------
##$DU= <F:/spectra>
##$EXPNO= 1
##$NAME= <P31>
##$PROCNO= 1
##$TYPE= <nmr>
##$USER= <she>
##$AMP= (0..31)
100 100 100 100 100 100 100 100 100 100 100 100 100 100 100 100 100 100 
100 100 100 100 100 100 100 100 100 100 100 100 100 100 
##$AQSEQ= 0
##$AQ_mod= 1
##$AUNM= <au_zg>
##$AUTOPOS= <>
##$BF1= 81.014009
##$BF2= 200.13
##$BF3= 200.13
##$BF4= 200.13
##$BF5= 200.13
##$BF6= 200.13
##$BF7= 200.13
##$BF8= 200.13
##$BYTORDA= 1
##$CFDGTYP= 0
##$CFRGTYP= 5
##$CHEMSTR= <none>
##$CNST= (0..31)
1 1 145 1 1 1 1 1 1 1 1 1 1 1 1 1 1 1 1 1 1 1 1 1 1 1 1 1 1 1 1 1 
##$CPDPRG= <waltz16>
##$CPDPRG1= <>
##$CPDPRG2= <waltz16>
##$CPDPRG3= <>
##$CPDPRG4= <mlev>
##$CPDPRG5= <mlev>
##$CPDPRG6= <mlev>
##$CPDPRG7= <mlev>
##$CPDPRG8= <mlev>
##$CPDPRGB= <>
##$CPDPRGT= <>
##$D= (0..31)
0 1 0 0 0 0 0 0 0 0 0 0.03 2e-05 3e-06 0 0 0 0 0 0 0 0 0 0 0 0 0 0 0 0 
0 0 
##$DATE= 1599039849
##$DBL= (0..7)
120 120 120 11 120 120 24 19 
##$DBP= (0..7)
150 150 150 150 150 150 150 150 
##$DBP07= 0
##$DBPNAM0= <>
##$DBPNAM1= <>
##$DBPNAM2= <>
$$ [...]
##$SUBNAM3= <"">
##$SUBNAM4= <"">
##$SUBNAM5= <"">
##$SUBNAM6= <"">
##$SUBNAM7= <"">
##$SUBNAM8= <"">
##$SUBNAM9= <"">
##$SW= 369.568048894756
##$SWIBOX= (0..15)
0 1 3 0 0 0 0 0 0 0 0 0 0 0 0 0 
##$SW_h= 29940.119760479
##$TD= 32768
##$TD0= 1
##$TE= 0
##$TE2= 300
##$TE3= 300
##$TEG= 300
##$TL= (0..7)
0 120 53 12 22 120 120 120 
##$TP= (0..7)
150 150 150 150 150 150 150 150 
##$TP07= 0
##$TPNAME0= <>
##$TPNAME1= <>
##$TPNAME2= <>
##$TPNAME3= <>
##$TPNAME4= <>
##$TPNAME5= <>
##$TPNAME6= <>
##$TPNAME7= <>
##$TPOAL= (0..7)
0.5 0.5 0.5 0.5 0.5 0.5 0.5 0.5 
##$TPOFFS= (0..7)
0 0 0 0 0 0 0 0 
##$TUNHIN= 0
##$TUNHOUT= 0
##$TUNXOUT= 0
##$USERA1= <user>
##$USERA2= <user>
##$USERA3= <user>
##$USERA4= <user>
##$USERA5= <user>
##$V9= 5
##$VALIST= <valist>
##$VCLIST= <CCCCCCCCCCCCCCC>
##$VD= 0
##$VDLIST= <DDDDDDDDDDDDDDD>
##$VPLIST= <PPPPPPPPPPPPPPP>
##$VTLIST= <TTTTTTTTTTTTTTT>
##$WBST= 1024
##$WBSW= 4
##$XGAIN= (0..3)
0 0 0 0 
##$XL= 0
##$YL= 0
##$YMAX_a= 7967
##$YMIN_a= -9865
##$ZGOPTNS= <>
##$ZL1= 120
##$ZL2= 120
##$ZL3= 120
##$ZL4= 120
##$ABSF1= 182.463
##$ABSF2= -187.1042
##$ABSG= 5
##$ABSL= 3
##$ALPHA= 0
##$AQORDER= 0
##$ASSFAC= 0
##$ASSFACI= 0
##$ASSFACX= 0
##$ASSWID= 0
##$AUNMP= <proc_1d>
##$AZFE= 0.1
##$AZFW= 0.5
##$BCFW= 0
##$BC_mod= 2
##$BYTORDP= 0
##$COROFFS= 0
##$CY= -3
##$DATMOD= 1
##$DC= 0
##$DFILT= <>
##$DTYPP= 0
##$F1P= 0
##$F2P= 0
##$FCOR= 1
##$FTSIZE= 65536
##$FT_mod= 6
##$GAMMA= 0
##$GB= 0
##$INTBC= 1
##$INTSCL= 5.30512e-09
##$ISEN= 30
##$LB= 1
##$LEV0= 0
##$LPBIN= 0
##$MAXI= 10000
##$MC2= 0
##$MEAN= 0
##$ME_mod= 0
##$MI= 50
##$NCOEF= 0
##$NC_proc= -7
##$NLEV= 6
##$NOISF1= 182.463
##$NOISF2= 159.3651
##$NSP= 0
##$NTH_PI= 0
##$NZP= 0
##$OFFSET= 182.463
##$PC= 4
##$PHC0= -3532.15
##$PHC1= 1942.202
##$PH_mod= 1
##$PKNL= yes
##$PPARMOD= 0
##$PSCAL= 0
##$PSIGN= 0
##$REVERSE= no
##$SF= 81.0140089999434
##$SI= 65536
##$SIGF1= 159.3651
##$SIGF2= -187.1042
##$SINO= 113.3802
##$SIOLD= 16384
##$SREGLST= <1H.CDCl3>
##$SSB= 0
##$STSI= 65536
##$STSR= 0
##$SW_p= 29940.119760479
##$SYMM= 0
##$S_DEV= 0
##$TDeff= 32768
##$TDoff= 0
##$TI= <>
##$TILT= no
##$TM1= 0
##$TM2= 0
##$TOPLEV= 0
##$USERP1= <user>
##$USERP2= <user>
##$USERP3= <user>
##$USERP4= <user>
##$USERP5= <user>
##$WDW= 1
##$XDIM= 65536
##$YMAX_p= 281703686
##$YMIN_p= -32622487
$$ End of Bruker specific parameters
$$ ---------------------------------
##NTUPLES= NMR SPECTRUM
##VAR_NAME=  FREQUENCY,     SPECTRUM/REAL,   SPECTRUM/IMAG
##SYMBOL=    X,             R,               I
##VAR_TYPE=  INDEPENDENT,   DEPENDENT,       DEPENDENT
##VAR_FORM=  AFFN,          ASDF,            ASDF
##VAR_DIM=   65536,         65536,           65536
##UNITS=     HZ,            ARBITRARY UNITS, ARBITRARY UNITS
##FACTOR=    0.456856943014862, 1,           1
##FIRST=     14782.0589164792, 0,            0
##LAST=      -15158.0608439998, 0,           0
##MIN=       -15158.0608439998, -32622487,   0
##MAX=       14782.0589164792, 281703686,    0
$$ Real data points
##PAGE= N=1
##DATA TABLE= (X++(R..R)), XYDATA
$$ [...]
41407b170916k253962J424310J398154N3834J82359N76548l03693j108096o88878
41398b890340m23078j010366n90948J604093L139228K222765N04999j03826k29465
41389B223062n65581L588J459142J275576j262550k739609p69950J727510J108428
41380B459616r90176n08147K253174L297803J347442o97683m32577J529167L590459
41371A1849078M546320L105728q43172m536003m905127k864840k010691l008012
41363A333281k758232Q7269K386806J218352j456838j500659J583322M238129
41355E131430L801973J460535k55573j013115k166412l513755k761363R09632
41347A593352M487275M366824J124833j398888j565654j513155k695514l239771
$$ plain form
41407 -2170916 -4424878 -3000568 -1602414 -1548580 -1366221 -789673 -1093366 -2201462 -2890340
41398 -2890340 -3313418 -4323784 -4914732 -3310639 -171411 2051354 2556353 2452527 2223062
41389 2223062 1657481 1661069 3120211 4395787 3133237 393628 -376322 1351188 2459616
41380 2459616 1469440 961293 3214467 6512270 7859712 7162029 6729452 8258619 11849078
41371 11849078 16395398 19501126 18657954 14121951 9216824 6351984 4341293 1333281
41363 1333281 -1424951 -1337682 1049124 2267476 810638 -690021 893301 5131430
41355 5131430 8933403 10393938 10138365 9125250 6958838 3445083 683720 1593352
41347 1593352 6080627 10447451 11572284 10173396 8607742 7094587 4399073 1159302
41339A159302j566359M26288N04078o5693R54989K405558J652513m22661n15415
41330D532600J426760J833260o56375k920401k284693l88992j40049j302349j441499
41321a341738J74931J724491J417347l73445j581712p22230J241886J840124M05692
41312B785346p88532k0414Q62975o17997k934411k336814J124742L294665K160939
41303C530499M22197M24266M71756j336072k914825j251432K332212L408062K58879
41294E345542m076862n381534k364294K324280M276286J567570k552836k971822
41286c833670O33046L185127J639495n21368Q34742L510651K505514j611616l401966
41277B939955j152653Q86165r4957j158300P28597L140538K080303j430937k882227
$$ plain form
41339 1159302 -407057 19231 523309 457616 1412605 3818163 5470676 5048015 4532600
41330 4532600 5959360 7792620 7136245 4215844 1931151 1542159 1402110 99761 -1341738
41321 -1341738 -1166807 557684 1975031 1601586 19874 -702356 539530 2379654 2785346
41312 2785346 1996814 1976400 2839375 2221378 -713033 -3049847 -1925105 1369560 3530499
41303 3530499 3952696 4376962 4848718 3512646 597821 -653611 1678601 5086663 5345542
41294 5345542 1268680 -4112854 -6477148 -4152868 123418 1690988 -861848 -3833670
41286 -3833670 -3200624 -15497 1623998 1102630 1937372 5448023 7953537 6341921 2939955
41277 2939955 1787302 2673467 2578510 1420210 2148807 5289345 7369648 5938711 3056484
41268C056484j167100Q4005j679531m042202l022158J421355N046613M264710
41260C962176L14828k171780o81854K112333J837650j712774m252754k890592
41252c482767N9116P65954o00818p21381J434229L124202K164806j2146r05560
41243A825635m75038l89151j110852j621339j343270o07698M47400J854447K822934
41234A403068K294904O24452o27279p56444n13611m67799j76118O12556J277687
41225C671416J387882J192079O04680q31941k404008k395536p49359K57112p18323
41216A4002k006032j755935q61837q47426p83861P14293K000922O09269j902183
41207d818788j494544J876013L649580J587092q62498j18756K295158K835945
$$ plain form
41268 3056484 1889384 1973389 293858 -3748344 -6770502 -5349147 -302534 3962176
41260 3962176 4277004 2105224 1423370 3535703 5373353 3660579 -592175 -3482767
41252 -3482767 -3423651 -2657697 -3258515 -3979896 -2545667 578535 2743341 2731195 1825635
41243 1825635 1350597 961446 -149406 -1770745 -3114015 -3721713 -3274313 -1419866 1403068
41234 1403068 3697972 4322424 3695145 2938701 2425090 1957291 1781173 2393729 3671416
41225 3671416 5059298 6251377 6856057 6024116 3620108 1224572 475213 732325 14002
41216 14002 -1992030 -3747965 -4609802 -5457228 -6241089 -5526796 -3525874 -2916605 -4818788
41207 -4818788 -6313332 -4437319 -787739 799353 -63145 -181901 2113257 4949202
41199D949202J286196k32054j400878l276952m913479l973857o54603J853583
41191f362842J385237o12306j119432R30600L566425L838423J111879j832730
41183I05254j987518j10557N21673o08382m36371K061814L269392P58003j867459
41174B505849k80828L061619K233453k542037m739332j619553J630532L82485
41166F32188k115514k95337M336907M929729l45283m870631k363110M339335O627547
41157A0875831J328352n016573m627814J377954M841448J800467k661612k427925
41149E490128J114084K319674P2310j690880r82278p4717o12701j215602j062128
41140C357890j582741k937205k653859J53087K566791K130293L91651p8003N67350
$$ plain form
41199 4949202 6235398 6003344 4602466 1325514 -3587965 -7561822 -8216425 -6362842
41191 -6362842 -4977605 -5589911 -6709343 -5778743 -2212318 1626105 2737984 905254
41183 905254 -1082264 -1192821 -671148 -1279530 -1715901 345913 3615305 4373308 2505849
41174 2505849 2225021 5286640 7520093 4978056 238724 -1380829 249703 632188
41166 632188 -1483326 -1778663 2558244 7487973 7142690 2272059 -91051 4248284 10875831
41157 10875831 12204183 7187610 2559796 3937750 8779198 10579665 7918053 5490128
41149 5490128 6604212 8923886 8996196 7305316 6323038 6248321 5635620 4420018 3357890
41140 3357890 1775149 -1162056 -3815915 -3662828 -1096037 1034256 1425907 1347904 1915254
41131A915254J069250J732746K763513K367486m74223l281054l168490j121954
41123A802528k68781j231173k051918j597058l17221J284761K400068J494337
41115A515543j115348j883811J405544N193532M328852k21542k487202k90650
41107F444918K022307Q11062j674740j777800j72043J86739q68743j249278o14553
41098C107869m51642q72447m04438J058673J755916R64824J38652K68400R1007
41089E656814j572733l135019k088827Q45317J889610n63971l068421j570131
41081c607361K639450M420282J992049q19824o43903N81451o23637l314701l528584
41072b904778l55627L064722M288537L884696K767498N36798k488166m303694
$$ plain form
41131 1915254 2984504 4717250 7480763 9848249 9374026 6092972 2924482 1802528
41123 1802528 1533747 302574 -1749344 -3346402 -3663623 -2378862 21206 1515543
41115 1515543 400195 -1483616 -78072 5115460 9444312 9222770 6735568 6444918
41107 6444918 8467225 9278287 7603547 5825747 5653704 5840443 4971700 3722422 3107869
41098 3107869 2656227 1783780 1379342 2438015 4193931 5158755 5297407 5565807 5656814
41089 5656814 4084081 949062 -1139765 -294448 1595162 1031191 -2037230 -3607361
41081 -3607361 -967911 3452371 5444420 4624596 3980693 4562144 3938507 623806 -2904778
41072 -2904778 -3260405 -195683 4092854 7977550 10745048 11281846 8793680 4489986
41064D489986l713882j887397l73560O63636J388325J415250R92814J142357J532853
41055E650382K99908k562354l807912j182527K550514K639904j182717m074102
41047a668904k409901J560302K798159p3529l287118k905905M28197K930229K808840
41038A80370J812939J603825J264076j22418q95887M99710K038524P46866k121064
41029E006941k408416N05655K618308J433315p62491j259423q45950j196329j585100
41020A506510p93281L53349Q36113J327701J856528M66478k907393m275750j096531
41011b726276K731481J951535j942718k852641O61743L690385K669285m18285
41003C764509k492439l211419k756949k48754L314047M313785J431446j730717
$$ plain form
41064 4489986 776104 -1111293 -1484853 -821217 567108 1982358 2975172 4117529 5650382
41055 5650382 5950290 3387936 -419976 -1602503 948011 3587915 2405198 -1668904
41047 -1668904 -4078805 -2518503 279656 206127 -3080991 -5986896 -5558699 -2628470 180370
41038 180370 1993309 3597134 4861210 4738792 3842905 4342615 6381139 7128005 5006941
41029 5006941 2598525 3104180 5722488 7155803 6393312 5133889 4287939 3091610 1506510
41020 1506510 713229 1066578 1902691 3230392 5086920 5553398 2646005 -1629745 -2726276
41011 -2726276 5205 1956740 14022 -2838619 -2176876 1513509 4182794 3764509
41003 3764509 1272070 -1939349 -4696298 -4945052 -1631005 2682780 4114226 2383509
40995B383509j640902K34448L68615j292529j973470o62542J139065K335021K966843
40986C858058K571002O03288j552855j543051N64888J907228N42547k034148k945149
40977A971808j395806Q59004J948775J813667J526130J345079M02215j391464
40969G079408k265931p41814J763230K321998M54189j343208j428309j114585
40961D724978j876924k654123j720509L69022J675385J592385Q52704j54603j216695
40952A591620j375706j49454J045207O38206n87055p50346R078n8528j211768
40943h48746j957349j741555j393310q31312R34973L062215L018305N17114j417122
40934f56787p75317O50391O58911K03487R57765J626633J90418j659323n22429
$$ plain form
40995 2383509 742607 977055 1345670 53141 -1920329 -2582871 -1443806 891215 3858058
40986 3858058 6429060 7032348 5479493 3936442 4501330 6408558 6951105 4916957 1971808
40977 1971808 576002 1435006 3383781 5197448 6723578 8068657 8470872 7079408
40969 7079408 4813477 4071663 5834893 8156891 8611080 7267872 5839563 4724978
40961 4724978 2848054 193931 -1526578 -1157556 517829 2110214 2962918 2808315 1591620
40952 1591620 215914 66460 1111667 1749873 1162818 412472 421550 363022 -848746
40943 -848746 -2806095 -4547650 -5940960 -6772272 -5837299 -2775084 243221 760335 -656787
40934 -656787 -1432104 -781713 -122802 80685 1038450 2665083 2855501 1196178 673749
40925F73749K562412K501616k056319n502051k685434L466120N547642J416779
40917E924514l623684m246316j035448J919961K270400N59075j560458k310673
40909b102629o35473K134741K908595Q05678j210134o88571L95515q59220k711033
40900a962531j018379L610892N807401L319497J44114k0350J020539N1910k190676
40891H762417l235087l208154l184036k052087Q31183K446180K65896k546060
40883a919748j375073K027054J955270j748353l196046o1923K917105J939029
40875E37315n09103j088266p83407j172426o24950J737524K866421R80663l52139
40866A591632J753088L500545L40183m519825m364253L83233K930074O93057j952719
$$ plain form
40925 673749 3236161 5737777 3681458 -1820593 -4506027 -1039907 4507735 5924514
40917 5924514 2300830 -1945486 -2980934 -1060973 1209427 1768502 208044 -2102629
40909 -2102629 -2738102 -603361 2305234 3110912 1900778 1212207 1607722 748502 -1962531
40900 -1962531 -2980910 629982 6437383 9756880 9900994 9880644 10901183 10953093 8762417
40891 8762417 5527330 2319176 -864860 -2916947 -2085764 360416 626312 -1919748
40883 -1919748 -3294821 -1267767 687503 -1060850 -4256896 -4318819 -1401714 537315
40875 537315 28212 -1060054 -1843461 -3015887 -3640837 -1903313 963108 1943771 1591632
40866 1591632 3344720 6845265 7185448 2665623 -1698630 -1315397 1614677 2307734 355015
40857C55015j699111k81200O04523J865780K785914N10691l788670m293625O05876
40848c334807M458984J934704l144318l931239n26667J923000J994910K467042
40840A841609L560561K174396j829059m101451k043755J576175K948892J972595
40832F099963Q98803O59007M36509m46162j596623j958292q03613J113469J844737
40823F247798O62759o74956n08711N9336p66079j903147r31355J303233J182768
40814D671646k047850m540477l103914O14179K923588K733531J448768J05169
40806B804640j158219j809996j086646Q34455K844557L681628K396844p99238
40798G708025l731760l857246j407361O71848P29302M04958J385447K336895J170231
$$ plain form
40857 355015 -1344096 -1625296 -1020773 845007 3630921 4141612 352942 -3940683 -3334807
40848 -3334807 1124177 3058881 -85437 -4016676 -4543343 -2620343 -625433 1841609
40840 1841609 5402170 7576566 5747507 1646056 -397699 1178476 4127368 6099963
40832 6099963 6998766 7657773 8094282 7648120 6051497 4093205 3289592 4403061 6247798
40823 6247798 6910557 6235601 5726890 5786226 5020147 3117000 2185645 3488878 4671646
40814 4671646 2623796 -1916681 -5020595 -4406416 -1482828 1250703 2699471 2804640
40806 2804640 1646421 -163575 -1250221 -415766 2428791 6110419 8507263 7708025
40798 7708025 3976265 119019 -1288342 -616494 112808 517766 1903213 4240108 5410339
40789E410339j252116k149791o89384J440941K734136K997920K159160P5111k355044
40780H371272l532783k784086o55498J852845L208885J704453k118944m478818
40772A567326k470897J435119K158893q22781k727783p32979J919437J279739
40764A606074j259388j683914J55329Q76467m75616r69726J139608L445901L104937
40755E939672R07927m37837l60270m37909j234257j434751k05508J403894J967816
40746F108777J377191M37733k79603n41513j86208M48077L52187j009311k581985
40737D125345k565828m76190K130815L048545J285991k145196m809927m591361
40729c997806j649554J515451K678391K239686K020736K279989J679703J60951
$$ plain form
40789 5410339 4158223 2008432 1319048 2759989 5494125 8492045 10651205 10726316 8371272
40780 8371272 4838489 2054403 1398905 3251750 6460635 8165088 6046144 1567326
40772 1567326 -903571 531548 2690441 1867660 -860123 -1593102 326335 1606074
40764 1606074 346686 -1337228 -1181899 -305432 -781048 -1750774 -611166 2834735 5939672
40755 5939672 6847599 6409762 6049492 5611583 4377326 2942575 2737067 4140961 6108777
40746 6108777 7485968 7923701 7644098 7102585 6916377 7364454 7716641 6707330 4125345
40737 4125345 1559517 1083327 3214142 6262687 7548678 5403482 593555 -3997806
40729 -3997806 -5647360 -4131909 -1453518 786168 2806904 5086893 6766596 6927547
40721F927547m41451N01494R77811l63637j535441k91122J650749P03039k780228
40712E348761m377957k034119P40416N8887k509236k220462J855206N243557L981038
40703F086091j46568j908826N81474L229626J071659m880843p978221l903728
40695g849336L631608P266696M766687L87436k023251l206545m589409m442020
40687f058134j158816K603392L225265J901402K677815N405706N484686J304587
40679A5385903k774237k925286j334525k108643m691809n079684j940081K033858
40671c434504M083899L641122J302005j368809j561853J798557M910770K820375
40663A2191562l069986n512306j314895L555576K240802l133206m788631o90505
$$ plain form
40721 6927547 6486096 6987590 7965401 7601764 6066323 5775201 7425950 8128989 5348761
40712 5348761 970804 -1063315 -322899 -264012 -2773248 -4993710 -3138504 2105053 6086091
40703 6086091 5939523 4030697 4612171 7841797 8913456 4032613 -3945608 -7849336
40695 -7849336 -4217728 3048968 7815655 8203091 6179840 2973295 -1616114 -6058134
40687 -6058134 -7216950 -4613558 -1388293 513109 3190924 8596630 14081316 15385903
40679 15385903 12611666 9686380 8351855 6243212 1551403 -3528281 -5468362 -3434504
40671 -3434504 649395 4290517 5592522 4223713 2661860 4460417 9371187 12191562
40663 12191562 9121576 3609270 2294375 5849951 8090753 4957547 168916 -521589
40655e21589L046915J475990k664611l843122j260922J460576J699053q630j906229
40646b522569k628026j571767M77685J700121J529125J548558K761968L466788
40638D761883J818803q29697j602038k23604J054638J043234N00019j72284j330868
40629E020086k275895j834239q54218j183497j939822k13092L654582N132238
40621E506143J693073l187728m587761k174397P19138J777968Q79964j367607
40613g41207l417582k752707J013846M292694L609718M01701j129140J21195J495435
40604B893953R70935r05779k947126m141350l040489M99512L375923K398909q75522
40595a771034k047930l69826Q65463O19275J754484M864145N623611J505528l088572
$$ plain form
40655 -521589 2525326 4001316 1336705 -2506417 -3767339 -2306763 -607710 -616340 -2522569
40646 -2522569 -5150595 -6722362 -6244677 -4544556 -3015431 -1466873 1295095 4761883
40638 4761883 6580686 5750989 4148951 3925347 4979985 6023219 6523238 6350954 5020086
40629 5020086 2744191 909952 55734 -1127763 -3067585 -3280677 373905 5506143
40621 5506143 7199216 4011488 -576273 -2750670 -2031532 -253564 626400 -741207
40613 -741207 -4158789 -6911496 -5897650 -1604956 2004762 2406463 1277323 1398518 2893953
40604 2893953 3864888 2959109 11983 -4129367 -7169856 -6670344 -3294421 -895512 -1771034
40595 -1771034 -3818964 -4188790 -3323327 -2704052 -949568 3914577 9538188 11043716 7955144
40586G955144k689387J106724K103929j278346l986725j838032K741394M053053
40578H167754K06129m763317n472075j140090L531580L800013M08434j869067
40570B869361o85483J484320J786275P70949K79934L25436J73419K52483P20382
40561G977076J58057j958576l405316k286022r2376Q76462J139773K078026K337362
40552F824466p7532l421081l875532j078663J602660K017773J091777M1877q67518
40543B258227r02606N22398J881844J339889J56264Q47042K460592J802259q04717
40534I561192j661858p7657L81166j684523k868566r67086J076275K42552j599692
40525B401803j309516K42583K48998j105835j378419R9610J838565K490529J430976
$$ plain form
40586 7955144 5265757 6372481 8476410 7198064 3211339 1373307 4114701 8167754
40578 8167754 8373883 3610566 -1861509 -3001599 529981 4329994 4738428 2869361
40570 2869361 2183878 3668198 5454473 6225422 6505356 6830792 7004211 7256694 7977076
40561 7977076 8135133 6176557 2771241 485219 392843 1269305 2409078 4487104 6824466
40552 6824466 6746934 3325853 -549679 -1628342 -25682 1992091 3083868 3125745 2258227
40543 2258227 1355621 1878019 3759863 5099752 5256016 6103058 8563650 10365909 9561192
40534 9561192 7899334 7821677 8202843 6518320 3649754 2682668 3758943 4001495 2401803
40525 2401803 1092287 1334870 1583868 478033 -900386 -800776 1037789 3528318 4959294
40516D959294j189166l247953j974270J617767K623477r70120m648489l630315
40508f459775M30883K706638K144042Q89570n16541k461036k855993K80545M083729
40499a757938L891381L41519j584660j65897J445298J091362K6406q29437k084051
40490C73983k700486m86833L328279M666479K709429P87221L02587r94991l284719
40481D700949k998558N63545K478297l17764l609276k280258J820114L104747
40473C461796M65972k384326k873196j703534l23181L35276k71266j090727J77335
40464d205851L230754M139257R20285k738376k753741o85526l40324j177975k04320
40455c815817J734205J347497n80931j01425K673686L238305K90379k107701j471427
$$ plain form
40516 4959294 3770128 522175 -1452095 165672 2789149 1819029 -2829460 -6459775
40508 -6459775 -6028892 -3322254 -1178212 -288642 -805183 -3266219 -6122212 -5841667 -1757938
40499 -1757938 2133443 2474962 890302 724405 2169703 3261065 3287471 2458034 373983
40490 373983 -2326503 -2813336 514943 5181422 7890851 8678072 8980659 7985668 4700949
40481 4700949 1702391 2265936 4744233 4426469 817193 -1463065 357049 3461796
40473 3461796 3927768 1543442 -1329754 -3033288 -3356469 -3021193 -3292459 -4383186 -4205851
40464 -4205851 -975097 3164160 4084445 1346069 -1407672 -2093198 -2433522 -3611497 -3815817
40455 -3815817 -2081612 -734115 -1315046 -1416471 1257215 4495520 4785899 2678198 1206771
40446A206771n34192j625693k408207m43104K048548J722154n19903j391854m19029
40437b364509K41112j02714L3810J412052K967778L489691K700766R40828r09121
40428H409693j595242p07679O43333J105835M69580o79009j718974j917185p96891
40419C213461P62310J044060j80587j148394o23020N42093J168640J442199J729836
40410G950598J336126j29548j508195j690072j233021r42216j86513J565569K689611
40401G852339J091373k525105n059218m599588k043619O89195K421107K617490
40393D43974J186298r08783j822677m91886K014481L209744J545942j742439l501898
40384f7244k030951P58769J684209M85627j78708Q57643J368455l62102k070636
$$ plain form
40446 1206771 672579 -953114 -3361321 -3804425 -1755877 -33723 -553626 -1945480 -2364509
40437 -2364509 -2123397 -2226111 -2192301 -780249 2187529 5677220 8377986 9318814 8409693
40428 8409693 6814451 6106772 6750105 7855940 8325520 7646511 5927537 4010352 3213461
40419 3213461 3975771 5019831 4839244 3690850 3067830 3609923 4778563 6220762 7950598
40410 7950598 9286724 9157176 7648981 5958909 4725888 3783672 3597159 5162728 7852339
40401 7852339 8943712 6418607 1359389 -3240199 -5283818 -4594623 -2173516 443974
40393 443974 1630272 721489 -1101188 -1593074 421407 3631151 5177093 3434654 -67244
40384 -67244 -2098195 -1339426 344783 830410 651702 1509345 2877800 2515698 445062
40375D45062n22362L294442M947301K454801j183421k047964Q0105K296602K463223
40366A2227789J081396l02700j191002k033657k700482k242628n61914P61986
40358E038788M11742o55999o39251K21810J50926r83723j371309m29748K99504
40349B042740J60374N41161J813559J992247K51246j074514l60610K10986j576260
40340D000929l645932k767233m3060Q80532k61685o26782L05477K33905j040550
40331b964399q68895J291698K556785J557977O51487J474328K063567N47740j602773
40322D707515k316797j941481j220941P30830L702676M478540J077037l164724
40314F052655l352149L90755L484320L163417Q60216j234495k581181k904041
$$ plain form
40375 445062 -77300 3217142 8164443 10619244 9435823 7387859 7467964 9764566 12227789
40366 12227789 13309185 13006485 11815483 9781826 7081344 4838716 4276802 5038788
40358 5038788 5450530 4794531 4155280 4377090 4528016 3544293 2172984 1743236 2042740
40349 2042740 2203114 2744275 4557834 6550081 6801327 5726813 5366203 5577189 4000929
40340 4000929 354997 -2412236 -2455296 -1574764 -1836449 -2463231 -2157754 -1923849 -2964399
40331 -2964399 -3833294 -2541596 15189 1573166 2224653 3698981 5762548 6310288 4707515
40322 4707515 2390718 449237 -771704 -40874 3661802 8140342 9217379 6052655
40314 6052655 2700506 3091261 6575581 9738998 10599214 9364719 6783538 3879497
40306C879497j474133J023374K085416L54966k238697k653761n06184J480515
40298A950993R15318j192168j669112N96542K986964K581482r1396k420609l536871
40289A21143m118731l349765J43135M255808M686491J467826k69983J802178L295227
40280H033329N18396k844261j588271K125329K108502j688244l240149l11513
40272C113118K458098J421983j112888j809314j042729k53906J006230K700413
40264F481005K832482J037421P4746J061685Q82378k482704n573681m275860j70044
40255a32572K117547J671642J054563J039017J84652j211901j225389j65270k59950
40246C072339j416447j243436L16460L34947k160657m222390l341063o34665J729630
$$ plain form
40306 3879497 2405364 3428738 5514154 5869120 3630423 976662 470478 1950993
40298 1950993 2866311 1674143 5031 601573 3588537 6170019 6078623 3658014 121143
40289 121143 -3997588 -7347353 -7204218 -2948410 1738081 3205907 2935924 4738102 8033329
40280 8033329 8551725 5707464 4119193 6244522 8353024 6664780 3424631 3113118
40272 3113118 5571216 6993199 5880311 4070997 3028268 2774362 3780592 6481005
40264 6481005 9313487 10350908 10425654 11487339 12369717 9887013 4313332 37472 -132572
40255 -132572 1984975 3656617 4711180 5750197 5934849 4722948 3497559 3332289 3072339
40246 3072339 1655892 412456 728916 1063863 -1096794 -5319184 -8660247 -9294912 -7565282
40237g565282L280936L825211K317840o98713k127390k21594K607570L213937
40229D632515J933316Q69572L5711j582257k689928j265868J146090P83932k270779
40220A592304l311478J99739M454803M399142N92432k055590j134097Q54692Q80496
40211F472443o45074j394658p62989k31139o59523q85131L24251J826207J049998
40202E094385k276572m758377l176458J049923L384143K177008N66948J386011
40194C447011K947784K197290k40688j467504j290858j809924k591745q94157
40186B97209K565169K961525j196497m426747j748867L737330N345349K325856
40178I860327m16758o69874j003570k474795k368705N8303J131522j022312k589754
$$ plain form
40237 -7565282 -4284346 -459135 1858705 1159992 -967398 -1188992 1418578 4632515
40229 4632515 6565831 7435403 7471114 5888857 3198929 1933061 3079151 3863083 1592304
40220 1592304 -1719174 -1519435 2935368 7334510 7926942 5871352 4737255 5591947 6472443
40211 6472443 5827369 4432711 3669722 3438583 2779060 1893929 2218180 4044387 5094385
40202 5094385 2817813 -1940564 -5117022 -4067099 -682956 1494052 2061000 3447011
40194 3447011 6394795 8592085 8351397 6883893 5593035 3783111 1191366 297209
40186 297209 2862378 5823903 4627406 200659 -1548208 2189122 7534471 9860327
40178 9860327 9443569 8773695 7770125 5295330 2926625 2984928 4116450 3094138 504384
40169E04384k25887K925970K088780j249984j737401J109848K238087q77969m665805
40160A10023n080627k501029O12483L226493M833427M174992J372608q71793n17196
40151E359381J033711J271991l291j441929k495116k927707j744397R77193K713002
40142B742838J599420m29140n12489L97647p54600l408532l620819m82393J940377
40133b527691P08717j651270j373612R35808J901073N63439j080646j459125n64590
40124d547897J354893L632713M443757K758756M42321n9315N67516j47126k021813
40115F423805k433533q80193K26957j13867j4056J269804J440539p03742k452308
40106B763406j103140J814018K930989J618818l52616j729674j829466R5848K663302
$$ plain form
40169 504384 278497 3204467 5293247 4043263 2305862 3415710 5653797 4775828 110023
40160 110023 -4970604 -7471633 -6859150 -3632657 1200770 5375762 6748370 5876577 5359381
40151 5359381 6393092 7665083 7661792 6219863 3724747 797040 -947357 29836 2742838
40142 2742838 4342258 3913118 3400629 3798276 3043676 -364856 -3985675 -4468068 -2527691
40133 -2527691 -1818974 -3470244 -4843856 -3908048 -2006975 -1443536 -2524182 -3983307 -4547897
40124 -4547897 -3193004 439709 4883466 7642222 8084543 8025228 8592744 8445618 6423805
40115 6423805 3990272 3110079 3337036 3223169 3209113 4478917 5919456 5215714 2763406
40106 2763406 1660266 3474284 6405273 8024091 7671475 5941801 4112335 4208183 6871485
40097F871485J951059l066027o948958m230734K246075M751234J619952j194334
40089A999752O3481J968348R29068o95340P00164L530606L667528O69785k589777
40080A0243615m376534m639264l056776m6046J844495Q31880j177590j482377
40072a858597o80919p12274p67667R46153K911816K138321n92403j722149o70181
40063a007900p5680m45581N65422K922008L184579K43806k356440j841700k0240
40054A168274N06956K37353M05915K20572p53330o17515J447277K740140J245433
40045F601075n50147K70122J765486K82763l054428l871521j573522J46790k35227
40036b18609j00390J843725K771960N43016k396324k599724n02486R90660Q97924
$$ plain form
40097 6871485 8822544 5756517 -1192441 -5423175 -3177100 1574134 3194086 1999752
40089 1999752 2063233 4031581 4960649 4265309 4965473 8496079 12163607 12833392 10243615
40080 10243615 5867081 1227817 -1828959 -1875005 -30510 801370 -376220 -1858597
40072 -1858597 -2539516 -3251790 -4019457 -3073304 -161488 1976833 1384430 -337719 -1007900
40063 -1007900 -1083580 -1529161 -963739 1958269 5142848 5386654 3030214 1188514 1168274
40054 1168274 1675230 1912583 2318498 2539070 1785740 1168225 2615502 5355642 6601075
40045 6601075 6050928 6321050 8086536 8369299 5314871 1443350 -130172 16618 -218609
40036 -218609 -318999 1524726 4296686 4839702 2443378 -156346 -658832 331828 1229752
40027A229752M14392Q031r94236k282440k360738p46283J265980K408949K728090
40018A671497K593587J579374p32958l361863m420693l235998j263530l45137
40010g515721m99664k37113J153494K692188L204118K555906J021178j210470
40002A163916l090330k782452j17365K258491K011639M29872M23197J942992K171070
39993D411030K95433r95940J12914J481968L19830k415434l397530j640136O59491
39984a168374J626778J690258J733935J386763K34757o93814j70826J032783O85604
39975F357864j837465m110365l264596K76111K848387J797458j289385k606689
39967a828680p74487J988102L221941K975475K504129J937460P84773l56167n84030
$$ plain form
40027 1229752 1644144 1652175 657939 -1624501 -3985239 -4731522 -3465542 -1056593 1671497
40018 1671497 4265084 5844458 5111500 1749637 -2671056 -5907054 -7170584 -7515721
40010 -7515721 -8015385 -8252498 -7099004 -4406816 -1202698 1353208 2374386 1163916
40002 1163916 -1926414 -4708866 -4826231 -2567740 -556101 -126229 296968 2239960 4411030
39993 4411030 4706463 3710523 3823437 5305405 5625235 3209801 -187729 -1827865 -1168374
39984 -1168374 458404 2148662 3882597 5269360 5504117 4810303 4639477 5672260 6357864
39975 6357864 4520399 410034 -2854562 -2578451 269936 2067394 778009 -1828680
39967 -1828680 -2603167 -615065 2606876 5582351 8086480 10023940 10808713 10452546 9868516
39958I868516p05545k232393m205913l507449M96425L890082K929084q10411k800620
39949B921776k046669j545090k204162p93399L895430O937561L486887l351506
39941G300828n850608k036062K362089K657246O26217m99053j248858k767916
39933E43883k736200R35005N034625M566016l3634l637109l559176j674881N3780
39924e07691J657225K564411J338856j035936j447692O44033K299401J894551
39916G407158J143532J125060K68930j893357k924397j756448r24376j753506
39908F92596j269517K421334N378553L248218j306828k061980J405823L457161
39900A1965360J168873k109405k794323j730535j097999p64205K7469M85075O8888
$$ plain form
39958 9868516 9162971 6930578 2724665 -782784 -286359 3603723 6532807 5722396 2921776
39949 2921776 875107 -669983 -2874145 -3667544 227886 7165447 10652334 7300828
39941 7300828 1450220 -585842 1776247 4433493 5059710 4560657 3311799 543883
39933 543883 -2192317 -1257312 3777313 8343329 8309695 4672586 1113410 -561471 -507691
39924 -507691 1149534 3713945 5052801 4016865 2569173 3213206 5512607 7407158
39916 7407158 8550690 9675750 9944680 8051323 5126926 3370478 2446102 692596
39908 692596 -576921 1844413 7222966 10471184 9164356 7102376 8508199 11965360
39900 11965360 13134233 11024828 8230505 6499970 5401971 4637766 4665235 5150310 5219198
39891E219198j7162P70088O76767j338284k938281j399156J991469L317496J473822
39882G755957l72740O21103K953172K932917L334k192935q45573J673773Q00672
39873A3329680l457313n961402l633987J73019J005508l4597J053905L854734
39865F329547L928052J93635l126135k928609j106221l58898k36627L92053N22600
39856C609397o60807j586510j032005l71819n79451J27544K691922M121398J633973
39847G953642k368465l379286j139746R47003J254818P46232l92705k557079l927711
39838b863297k349541L56431N10984j133160k20413L605931N371003K664129m45743
39829E496324j51347J202514k60338l220258l479073n93617K046022K346775J082051
$$ plain form
39891 5219198 5202036 5972124 6648891 5310607 2372326 973170 2964639 6282135 7755957
39882 7755957 7383217 8004320 10957492 13890409 13893743 11700808 10855235 12529008 13329680
39873 13329680 9872367 3910965 276978 449997 1455505 1420908 2474813 6329547
39865 6329547 10257599 10451234 7325099 4396490 3290269 2931371 2694744 3086797 3609397
39856 3609397 2948590 1362080 330075 -41744 -621195 -493651 2198271 6319669 7953642
39847 7953642 5585177 2205891 1066145 2013148 3267966 4014198 3621493 1064414 -2863297
39838 -2863297 -5212838 -4856407 -4345423 -5478583 -5698996 -2093065 3277938 5942067 5496324
39829 5496324 5344977 6547491 6287153 3066895 -412178 -1005795 1040227 3387002 4469053
39820D469053n74212j794880j311979J005769K561166R79109k067774k945514
39812C20738j309213j07303o99232j297447n12209O49406J004963Q11885M34294
39803g04118l44054j041223n94018P20346J433794J246430J170309J230251M87263
39794C604980m31880L10043K236405K359920m18790l563092m751368m499202l533640
39785h686624r61346K707377M049302J382198j775514j399070J157217J824481
39777a701979M58096L23152J994086K559017R49090m67744l94046n25193j645454
39768A549025j693513L29489J923414R95955n81534o0905J715113J894600K04306
39759F275950j046323q36328n00862r71123j383020r62255l89165l61803j15431
$$ plain form
39820 4469053 3894841 2099961 787982 1793751 4354917 5334026 3266252 320738
39812 320738 -988475 -1095778 -1795010 -3092457 -3604666 -2955260 -1950297 -1138412 -704118
39803 -704118 -1048172 -2089395 -2683413 -1963067 -529273 717157 1887466 3117717 3604980
39794 3604980 3173100 3483143 5719548 8079468 7660678 4097586 -653782 -5152984 -8686624
39785 -8686624 -9647970 -6940593 -2891291 -1509093 -3284607 -4683677 -3526460 -1701979
39777 -1701979 -1243883 -920731 1073355 3632372 4581462 4113718 3719672 3194479 1549025
39768 1549025 -144488 185001 2108415 3104370 2522836 2461931 4177044 6071644 6275950
39759 6275950 5229627 4393299 3892437 2921314 1538294 576039 186874 -174929 -290360
39750b90360J371552L226915L131161M17876k277142j857244R77399K265241K63075
39741G228473j926559j095957R58271L51520k312568k609342N59300L090974K125621
39732F369733l3122n71315o71831k294362l822856k661222J86595J811563J889197
39723B02380J991408K028270R65054k39808n0034L93468r00498k664517j967309
39714b41586P45820K160387J245686m4981q71444k057966k667238o56102K617383
39705B29959L272651J120464J14619J403364J279572j850141l992744k329078
39697g51334k30781j197711k472796j78413K907412J290913l547665m377840Q49904
39688g708311N632835M132327j256758m106021k188037J305019K666191J263838
$$ plain form
39750 -290360 1081192 4308107 7439268 7857144 5580002 3722758 4700157 6965398 7228473
39741 7228473 5301914 4205957 5164228 5515748 3203180 593838 1153138 4244112 6369733
39732 6369733 6336611 5765296 5093465 2799103 -1023753 -3684975 -3498380 -1686817 202380
39723 202380 2193788 4222058 5187112 4947304 4897270 5290738 4390240 1725723 -241586
39714 -241586 504234 2664621 3910307 3865326 2993882 935916 -1731322 -2387424 229959
39705 229959 3502610 4623074 4737693 6141057 7420629 5570488 1577744 -751334
39697 -751334 -982115 -2179826 -4652622 -4831035 -1923623 -632710 -4180375 -8558215 -7708311
39688 -7708311 -2075476 2056851 800093 -3305928 -5493965 -4188946 -1522755 -258917
39680b58917q77641j383919L23946K482079K864740J257777n36352r61930j38037
39671B771746Q02489R61787L59188j35210R0970K20165r58434k608657k350263
39662h46219o0902J194402k74263j774302l64749K253487K382387J95905r64568
39653A741178j84895L56922J6345N21800J677746P11916k604569m282663j846515
39644c892735J675760K259103O24334K53020J551342J581512r01920l327442k911127
39635c088153l12475J529737J281375N77965J261714K379055J471821j296761
39627C804278k640191r36653R44506J323j949144j291505R69347N16208k813346
39618c395177m029372o87318L257638L604798J676156R05117J281756Q33412j59082
$$ plain form
39680 -258917 -1136558 -2520477 -2196531 285548 3150288 4408065 3871713 2909783 2771746
39671 2771746 3574235 4536022 4895210 4760000 4850970 5071135 4112701 1504044 -846219
39662 -846219 -907121 287281 13018 -1761284 -2126033 127454 2509841 2705746 1741178
39653 1741178 1556283 1913205 1929550 2451350 4129096 4841012 2236443 -2046220 -3892735
39644 -3892735 -2216975 42128 666462 919482 2470824 4052336 3150416 -177026 -3088153
39635 -3088153 -3400628 -1870891 -589516 -11551 1250163 3629218 5101039 3804278
39627 3804278 1164087 227434 1171940 1173263 -775881 -2067386 -1098039 -581831 -3395177
39618 -3395177 -7424549 -8111867 -4854229 -1249431 426725 1331842 2613598 3447010 3287928
39609C287928l19218m79584j893273k688016k59562L593038M181186P72999k024833
39600D170665q91822J529244O98613l215857n467716l000129J714400M045896
39592d16706L000648J604861J657172J003256k111990m690721k784368J775252
39584i62596L260346N99949j237045M53777K108656P85336o23554P72202J925729
39575G082800p01636l874000k339722J968752K671489n98225j914068Q48591L022247
39566F166228J606990j05864J039115K805213K027309k84350j662613k223647
39558I368381k793330k311384k72329J075829j8617j828785k094275j438073j191464
39549a504047m55150J637049L133948K083434J57802P1375J062929N12745j250105
$$ plain form
39609 3287928 2968710 2489126 595853 -2092163 -2351725 1241313 5422499 6195498 4170665
39600 4170665 3278843 4808087 5506700 2290843 -3176873 -6177002 -4462602 -416706
39592 -416706 2583942 4188803 5845975 6849231 4737241 46520 -2737848 -962596
39584 -962596 2297750 2897699 1660654 2114431 4223087 5008423 4384869 5157071 7082800
39575 7082800 6381164 2507164 167442 2136194 4807683 4209458 2295390 3143981 6166228
39566 6166228 7773218 7667354 8706469 11511682 13538991 13254641 11592028 9368381
39558 9368381 6575051 4263667 3991338 5067167 5048550 3219765 1125490 -312583 -1504047
39549 -1504047 -1959197 -322148 2811800 4895234 5053036 5124411 6187340 6700085 5449980
39540E449980j568999k59087P573j676235k801940j329718J307947K288699Q91141
39531B309361j089956j509360J11392K216713K727969J168210j028170k362552
39523B543607k526081j735124l15504O35929n893j296002r53974R01184J324772
39514a427086p07684k085213l65368K192044K497708J699093K361751L034796
39506G200041O82948k955922l203104l41900L98671k230299k843869J578681N766385
39497D051632L746123j825028l461881K92861L572541K302468p90261j587023
39489F301432o14653r61706k825575l375724j284874J294165J730631J56514j223132
39480h02922j083263j28857L59325M5005n23497o36141J68356J640334K540832
$$ plain form
39540 5449980 3880981 3621894 3629467 1953232 -848708 -2178426 -870479 1418220 2309361
39531 2309361 1219405 -289955 -178563 2038150 4766119 5934329 4906159 2543607
39523 2543607 17526 -1717598 -2033102 -1397173 -1403066 -2699068 -3653042 -2751858 -1427086
39514 -1427086 -2134770 -4219983 -4585351 -2393307 104401 1803494 4165245 7200041
39506 7200041 7882989 4927067 1723963 1382063 1780734 -449565 -3293434 -1714753 4051632
39497 4051632 7797755 5972727 2510846 2803707 6376248 8678716 7888455 6301432
39489 6301432 5686779 4725073 1899498 -1476226 -2761100 -1466935 263696 420210 -802922
39480 -802922 -1886185 -2015042 -1655717 -1610712 -2134209 -2770350 -2601994 -961660 1579172
39471A579172J772289R1624n49828J01486M7957j534635k358415o36362J226583
39462b60129j51430l208152k867734J652215M732508K131904k602618k762619
39454c336055K526703P449760O938422J899348l086831m728848l000745r1295
39446D570459J467245N40388j805578l362300k792453n38457J780834K431152
39438B291290P35668j887174k617732j94846L059043L506760N94579k342874k171327
39429I73387L21045J752267N07209j504598j602563J91249J372727M41463j014529
39420A437657n25241J675699K718819R34238j790722k405397n41629J220483N82958
39411C306865k026792m204792l958496j302089J898127L535204L019665J387196
$$ plain form
39471 1579172 3351461 3443085 2893257 2994743 3042700 1508065 -850350 -1486712 -260129
39462 -260129 -411559 -3619711 -6487445 -4835230 -102722 2029182 -573436 -3336055
39454 -3336055 -809352 6640408 13578830 15478178 12391347 7662499 4661754 4570459
39446 4570459 6037704 6578092 4772514 1410214 -1382239 -1920696 -139862 2291290
39438 2291290 3026958 1139784 -1477948 -1672794 1386249 4893009 5487588 3144714 973387
39429 973387 1294432 3046699 3553908 2049310 446747 637996 2010723 2452186 1437657
39420 1437657 912416 2588115 5306934 6241172 4450450 2045053 1503424 2723907 3306865
39411 3306865 1280073 -2924719 -6883215 -8185304 -6287177 -2751973 267692 1654888
39403A654888k80414j712942k356911q23611K997230O118894N036765L21033l538594
39394G416338l675159k118836k071213k958417j848738J225585K695830P80260
39386e54350j545453p03109K272976L051373j48638m181031m643405n38703M940296
39377b050044P297852M482975j137398m587141l155054O84791K410646J009212
39369D955839n78881l72309J14277q09881j978803j653226o06201m44754n98976
39360a972915J98933Q46297m07650k039093q24792K680375M166634J943838n16052
39351D075575j14552J346409P69872j072687j380826l38164m77984j885755j815542
39342h93654O09919K577038J602866j025049k343108j649344o97551p33097r04534
$$ plain form
39403 1654888 1374474 -338468 -2695379 -3518990 -521760 5597134 10633899 10954932 7416338
39394 7416338 3741179 1622343 -448870 -3407287 -5256025 -4030440 -1334610 -554350
39386 -554350 -2099803 -2802912 -529936 2521437 2372799 -1808232 -6451637 -6990340 -2050044
39377 -2050044 5247808 9730783 8593385 4006244 851190 1535981 3946627 4955839
39369 4955839 4376958 4004649 4118926 3309045 1330242 -322984 -929185 -1373939 -1972915
39360 -1972915 -1773982 -927685 -1335335 -3374428 -4199220 -1518845 2647789 4591627 4075575
39351 4075575 3961023 5307432 6077304 5004617 3623791 3285627 2807643 921888 -893654
39342 -893654 -283735 2293303 3896169 2871120 528012 -1121332 -1818883 -2551980 -3456514
39333c456514J91894K279080L420698K343778J31034j171162j296093j705863
39325G36852k605171j983399J062638L833895L126855j18968j829345k71004J983690
39316C936043J994962R3036j340711r53333P34361K187888J804085n66754k430774
39307E458803r00237K830510L576174j181886o702319o175693L63403N821045
39299C089800N069834P69625j364577j85973P79811p05310k766775k664075l73165
39290A649195J987756K770518J885397K76204q59460r46824o20563q23376j198245
39281D120602n11750J018638J437856K5215j150396k53570J273526R41673o92072
39272F209722j053486q6841k88852j872644j709785J318772L524859J743708j452086
$$ plain form
39333 -3456514 -3264620 -985540 2435158 4778936 4909970 3738808 2442715 736852
39325 736852 -1868319 -3851718 -2789080 1044815 4171670 4052702 2223357 1952353 3936043
39316 3936043 5931005 6024041 4683330 3729997 4464358 6652246 8456331 7889577 5458803
39307 5458803 4558566 7389076 10965250 9783364 3081045 -3094648 -2731245 3089800
39299 3089800 8159634 8929259 7564682 7378709 8158520 7453210 4686435 2022360 1649195
39290 1649195 3636951 6407469 8292866 8569070 7709610 6762786 6142223 5318847 4120602
39281 4120602 3608852 4627490 6065346 6090561 4940165 4686595 5960121 6901794 6209722
39272 6209722 5156236 5069395 4780543 2907899 1198114 2516886 6041745 7785453 6333367
39263F333367j553071Q53654J233776j438708l058074r92568J976306K336406
39255E691088R82807P79950J497450P42824j258681j558209O30924K182608M79880
39246A0170641k780437m058442k715899j091197n18267K77601K353642M252155
39238E889797L953664J832583p0710j023131j889485k652595j946561K13521J391285
39229E698368o073j983096j494272J207949K978662K175015L40350p46892j408508
39220F761503k434893k999267j864502L25874J602749J133945k14663j540368
39212G70378k665680l071762j657903J428458L828462L420267J368141R18414
39204D338775K812863L891206J581043j976655k621822o7254J775074M37285k047417
$$ plain form
39263 6333367 4780296 5633950 6867726 5429018 2370944 1378376 3354682 5691088
39255 5691088 6673895 7453845 8951295 9694119 8435438 6877229 7508153 9690761 10170641
39246 10170641 7390204 3331762 615863 -475334 -993601 -716000 1637642 5889797
39238 5889797 9843461 11676044 11605334 10582203 8692718 6040123 4093562 4307083 5698368
39229 5698368 5692295 3709199 2214927 3422876 6401538 8576553 8916903 8170011 6761503
39220 6761503 4326610 1327343 -537159 -211285 1391464 2525409 2310746 770378
39212 770378 -1895302 -4967064 -6624967 -5196509 -1368047 2052220 3420361 4338775
39204 4338775 7151638 11042844 12623887 10647232 8025410 7958156 9733230 10170515 8123098
39195H123098k679562j462194k69206J15361Q780m22225p24259j06065O31627
39186C215355q06929m264832n733825k650839J746073K829262J241026Q73415
39178c551294J870398R30862j903841k467298O43107L684476L901607L073975
39170F181992K817295J358817j901576l261407k95277L092189J839795k631545
39162G200283m626755k276737J088671K562108K288521R28278j414872l422958
39154B326539l024570k46152K622490L737246K788876K29672k404974k552499
39146C476628L59512L064610K457205J43256l10567P20521n0274k714246l839324
39137C307321k302323o59510n4264J291377L147425K029534k470740m801801q01721
$$ plain form
39195 8123098 5443536 3981342 3712136 3827497 3836277 3414052 2689793 2583728 3215355
39186 3215355 2408426 -1856406 -7590231 -10241070 -8494997 -5665735 -4424709 -3551294
39178 -3551294 -1680896 -750034 -2653875 -5121173 -4478066 -793590 3108017 6181992
39170 6181992 8999287 10358104 8456528 5195121 4899844 7992033 9831828 7200283
39162 7200283 2573528 296791 1385462 3947570 6236091 7164369 5749497 2326539
39154 2326539 -698031 -944183 1678307 5415553 8204429 8434101 6029127 3476628
39146 3476628 3836140 6900750 9357955 9501211 9190644 9911165 9860891 7146645 3307321
39137 3307321 1004998 345488 291224 1582601 4730026 6759560 4288820 -512981 -1314702
39128a314702N454638O559265J555340l440418l615915o22625J013736k91835
39120E297484k256693k267587n27981N82337q7261q70053j6022J330718R56290
39111B141232o69019j339841j110245j672075j981325Q55122N434282N928609
39103G586740M84300m957263m549030j17694K927583L328352L051500K114834
39095I869322k30237j645699K44927K641021J146123k668583l346435n35637O48042
39086F122844j435566k500773m78872N91081k044755m426448k165486K283397
39078d054578L370686M14009k677151l437004k397715k18256K677052M470625
39070a852332L586609J564242J238370K366622J994449p75778l088194k086862
$$ plain form
39128 -1314702 4139936 10699201 12254541 8814123 5198208 4575583 5589319 5297484
39120 5297484 3040791 773204 245223 827560 740299 -129754 -145776 1184942 2141232
39111 2141232 1472213 132372 -977873 -2649948 -4631273 -3776151 1658131 7586740
39103 7586740 8071040 3113777 -1435253 -1552947 1374636 4702988 7754488 9869322
39095 9869322 9639085 7993386 8238313 10879334 12025457 9356874 6010439 5474802 6122844
39086 6122844 4687278 2186505 1707633 2298714 253959 -4172489 -6337975 -4054578
39078 -4054578 -683892 -269883 -2947034 -6384038 -8781753 -9000009 -6322957 -1852332
39070 -1852332 1734277 3298519 4536889 6903511 8897960 8122182 5033988 2947126
39062B947126J463080M073731L194643k44320k614970j388431J728065K702671
39054A1861595M49245j903203j821861p74022j026361j755575j163170k81651
39046C584997j199205k897805k552518l08722Q22781k81805j492418r46922J030437
39037d241180L606966O030228O439616L356138j151290l014390j609539m39057
39029H977492j474602k301649m90470K431598L531319K402444M53126j437279
39021A2091979k576041k051345o40403p66929k542759k599688N64874L063542
39013D543230J048770k878684l236276j6734J687687M1698r78311J369616L853186
39004E434182K298060k007156m176106k238529J010024J968191N5782k184788
$$ plain form
39062 2947126 4410206 8483937 11678580 11434260 8819290 7430859 9158924 11861595
39054 11861595 12310840 10407637 8585776 7811754 6785393 5029818 3866648 3584997
39046 3584997 2385792 -512013 -3064531 -3373253 -2550472 -2832277 -4324695 -5271617 -4241180
39037 -4241180 -634214 5396014 11835630 15191768 14040478 11026088 9416549 8977492
39029 8977492 7502890 5201241 4710771 7142369 10673688 13076132 13529258 12091979
39021 12091979 9515938 7464593 6824190 6057261 3514502 914814 1479688 4543230
39013 4543230 5592000 2713316 -522960 -539694 1147993 1189691 211380 1580996 5434182
39004 5434182 7732242 5725086 1548980 -689549 320475 2288666 2344448 159660
38996A59660j734732J769045N043917M188568p62125n397416n707963k193177
38988d634223J505744K835349K148200J228735J170712J447026O57575j413056
38980D946062k772603j510591J109984J885636L23015m67235J333454L141747
38972G989469J925326r84913j991711o76508J80758o20731j333133q26895k83573
38963C378089n15848m90184K56876L31802q40143j443079l13985N84300q39882
38954A07946l033591k851409k61531K042961L074061M153014N044177L355864
38946A1631492q63987l532568k007419P20518N05349j533618j133695J781771
38938E567843K665989l53158l363639k671410L7482J245711J015068J340948J610824
$$ plain form
38996 159660 -1575072 193973 5237890 9426458 8664333 3266917 -2441046 -4634223
38988 -4634223 -3128479 -293130 1855070 3083805 4254517 5701543 6359118 4946062
38980 4946062 2173459 662868 1772852 3658488 3981503 3514268 4847722 7989469
38972 7989469 9914795 8929882 6938171 6261663 6442421 5821690 4488557 3661662 3378089
38963 3378089 2862241 2372057 2628933 2960735 2120592 677513 363528 947828 107946
38954 107946 -2925645 -5777054 -6038585 -3995624 -921563 3231451 8275628 11631492
38946 11631492 10767505 7234937 5227518 5948036 6453385 4919767 3786072 5567843
38938 5567843 8233832 7880674 4517035 1845625 1883107 3128818 4143886 5484834 7095658
38929G095658m8445k218843j463355J968202L831072J935374j143290k377135
38921G579238j836170o14345J305880L162860K599534p33697l436718k905639
38913E120943j118872q97358r52020J371236M301974L447055j078891m097361
38905F096706k658547L54933J345252R06530J414143K752418L154910K325681
38897A5692026J209044K3018j281549j785571r72521l33723j347300k541733j042733
38888G618958K961098N626187M068755q1203k734642j921734O61205K094359J256503
38879A9549486n48065j300634k63329J552587K563185K074636O97244m50267q55847
38870B3018996r11603j018367o37777J078825L553625M643702L064406K93480
$$ plain form
38929 7095658 7047213 4828370 3365015 5333217 9164289 11099663 9956373 7579238
38921 7579238 5743068 5128723 6434603 9597463 12196997 11463300 8026582 5120943
38913 5120943 4002071 3104713 2152693 3523929 7825903 11272958 10194067 6096706
38905 6096706 3438159 3793092 5138344 6044874 7459017 10211435 13366345 15692026
38897 15692026 16901070 16924088 15642539 13856968 12884447 12550724 11203424 8661691 7618958
38888 7618958 10580056 16206243 20274998 20193795 17459153 15537419 16198624 18292983 19549486
38879 19549486 19001421 17700787 17437458 18990045 21553230 23627866 24325110 23874843 23018996
38870 23018996 22107393 21089026 20451249 21530074 25083699 29727401 32791807 33085287
38862C3085287r84234N8936J887810K747262K159171O49666o89209n99817R88823
38853C9303695K208059J322041p19750j539614q26891l19809l34386Q51112L395234
38844D3339691M617601K939786O10486M48772J892448K522484J867790J365490
38836E9604548J831196L179957N450817P927737Q561988O741823N425220P757497
38828A06480783J2565257J6159431J7633052J8793216J9371765J6677187J0856363
38821B18537054O371855O221026P887615P458449N220366M366009N840358P377213
38813B69279945O906696M466869J050176k273461m005797k967958j51882J401894
38805B73706482m06691m223705o501459n450019l142547k976188n425886p831816
$$ plain form
38862 33085287 32101053 32159989 34047799 36795061 38954232 39603898 38914689 38314872 39303695
38853 39303695 41511754 42833795 42114045 40574431 39747540 39427731 39093345 39944457 43339691
38844 43339691 47957292 50897078 51507564 51956336 53848784 56371268 58239058 59604548
38836 59604548 61435744 64615701 70066518 77994255 86556243 93298066 98723286 106480783
38828 106480783 119046040 135205471 152838523 171631739 191003504 207680691 218537054
38821 218537054 224908909 231129935 239017550 246475999 251696365 256062374 261902732 269279945
38813 269279945 276186641 280653510 281703686 279430225 275424428 272456470 272304588 273706482
38805 273706482 273299791 269076086 262574627 257124608 253982061 251005873 245579987 237748171
38797B37748171q735837j0232125j4265432j8562110j9236398j6396761j3640465
38790A36679043j2296695j0221639o946590n596897p654741r748011q577568n788087
38782F9848815m636966m798034m379146m410569o490512p896034m741702O43628
38774C3139480J607010k760575n522238k188809K490250J913705k655005m792065
38766B1231753k511013K74817O63663j35217p47995j889574l391753k977234q0057
38757A0437390K148208J079449j379485j612375M69255J850526J247995N34949
38749A4775912J130770J660661M30523j615613k142969p99799L51141k24277j531694
38740A2034655j641801m57494K16845o09535j425315j69513K581173L756831J600099
$$ plain form
38797 237748171 229012334 218780209 204514777 185952667 166716269 150319508 136679043
38790 136679043 124382348 114160709 107214119 101617222 93962481 84214470 75636902 69848815
38782 69848815 65211849 60413815 56034669 51624100 45133588 37237554 32495852 33139480
38774 33139480 34746490 31985915 26463677 24274868 26765118 28678823 26023818 21231753
38766 21231753 18720740 18995557 19659220 19524003 18776008 16886434 13494681 10517447 10437390
38757 10437390 12585598 13665047 12285562 10673187 11142442 12992968 14240963 14775912
38749 14775912 15906682 17567343 17997866 16382253 14239284 13439485 13790626 13566349 12034655
38740 12034655 10392854 9935360 10152205 9542670 8117355 7947842 10529015 14285846 15885945
38731A5885945j824121k998208j142279J280809J914344Q10787p38174j984945
38723A1204158k558175j928945k77235J024195J039601O83130J215834J967039
38715A2369602J164256j154947k698382j693530J115476L515804L799016J596009
38707A8013304j926846m368146l928704j517946J20736j79181q46034l72567M60789
38698E455405L48568j67412J56617Q61283M74178j007609k147761k185001j450702
38689C37566j84211J203360J243949q29150k679569j112064K843743M249315R63428
38680F036367l076033l447496j232122k56502o93378L63946L009690L857734J650918
38671F213124o88245p99433J47026P90942J986906L575333K722536j121999l262638
$$ plain form
38731 15885945 14061824 11063616 9921337 11202146 13116490 13927277 13189103 11204158
38723 11204158 8645983 6717038 6439803 7463998 8503599 9186729 10402563 12369602
38715 12369602 13533858 12378911 9680529 7986999 9102475 12618279 16417295 18013304
38707 18013304 16086458 11718312 7789608 6271662 6392398 6213217 5367183 4994616 5455405
38698 5455405 5803973 5636561 5793178 6654461 7128639 6121030 3973269 1788268 337566
38689 337566 153355 1356715 2600664 1771514 -908055 -2020119 823624 5072939 6036367
38680 6036367 2960334 -487162 -1719284 -1975786 -2669164 -2305218 704472 4562206 6213124
38671 6213124 5524879 4725446 4872472 5663414 7650320 11225653 13948189 12826190 9563552
38662I563552k75782L533902J864554l421413m632996k80297K663602J5975l471621
38653E559476k611013K59464P30430N6380J320304K413506n8208l071496j156458
38644C442385L700963M201332o00187l888388k243389j04759q57790j390785O64185
38635B923567J519523j715427m606626k166017K570323L252395J45274j281596
38627F41416M75323J698990M13826j251749j531794j010688k27259O23640J63361
38618d934k032571k840750M57650M798116M891990J245701q60386J20155N53880
38609F328851j084513j824565l44003N71280l79918o27302Q55652J240612n53769
38600D182325j376524K19282J007656p25757j618871L01849J279607j290035l171266
$$ plain form
38662 9563552 9287770 12821672 14686226 11264813 6631817 6351520 9015122 9031097 5559476
38653 5559476 2948463 3207927 3938357 3994737 5315041 7728547 7670339 4598843 3442385
38644 3442385 7143348 11344680 10744493 6856105 4612716 4507957 3650167 2259382 2923567
38635 2923567 4443090 2727663 -1878963 -4044980 -1474657 1777738 1923012 641416
38627 641416 1116739 2815729 3229555 1977806 446012 -564676 -791935 -168295 -4934
38618 -4934 -2037505 -4878255 -4420605 377511 5269501 6515202 5654816 5774971 6328851
38609 6328851 5244338 3419773 3075770 3647050 3267132 2639830 3495482 4736094 4182325
38600 4182325 2805801 3025083 4032739 3306982 1688111 1989960 3269567 1979532 -1191734
38591a191734l43173L221408J730077k480123k851123L52013J127447j494480
38583a929688k116407J296110M052293K670473l34279j579923j212013k73437
38575E73129J309019K337866P08719k176446k090105J314728L420654K040694
38567G438258N58651J312214J457453j140537l215605j715221M40918p67271l493058
38558H75802l242282k83934J485359J059795N63338N12709j40522l92052J430178
38549A868391L461923K392908p69355k016204j111214j597203l639609k788770
38541d199133K249328O104777M207106n37596k291655l38704J393288P44554p85975
38532F545990j627196j940024j686863K44831M013258P393561P327966K820557
$$ plain form
38591 -1191734 -1534907 1686501 3416578 936455 -1914668 -1562655 -435208 -1929688
38583 -1929688 -4046095 -2749985 1302308 3972781 3638502 2058579 846566 573129
38575 573129 1882148 4220014 4928733 2752287 662182 1976910 5397564 7438258
38567 7438258 7996909 9309123 10766576 9626039 6410434 4695213 5136131 4368860 875802
38558 875802 -2366480 -2650414 -1165055 -105260 458078 970787 830265 438213 1868391
38549 1868391 5330314 7723222 6953867 4937663 3826449 2229246 -1410363 -4199133
38541 -4199133 -1949805 4154972 8362078 7824482 5532827 5194123 6587411 7331965 6545990
38532 6545990 4918794 2978770 1291907 1536738 5549996 12943557 20271523 23092080
38524B3092080l519665o944577m727091O99709L989301K792662o3729r45935J06792
38515A4479547P63348L31424n443K31125L53404J10304k80657j241715k951602
38506A1789735l790986j989062J212044K457496P94551j054005q24093J59797
38498H755477m15685j926151j750840N70412K333010J147236k059354m240929
38490B413176l658316j338931O43735J565020K240892L162645L445277K195644
38482A0669142J38249j219804j647482k074959k526449j822548J89478J772210
38474C477837J678295R84866J212765J819388J272734k20612j012373o22001n0800
38465H540099L68001J257879K097912J219713j188724k365203q16515J076526
$$ plain form
38524 23092080 19572415 12627838 7900747 8600456 12589757 15382419 15318690 14372755 14479547
38515 14479547 15242895 15574319 15568876 15800001 16153405 16263709 15983052 14741337 11789735
38506 11789735 7998749 6009687 7221731 9679227 10473778 9419773 8595680 8755477
38498 8755477 8339792 6413641 4662801 5233213 7566223 8713459 6654105 2413176
38490 2413176 -1245140 -2584071 -1940336 -375316 1865576 5028221 8473498 10669142
38482 10669142 10807391 9587587 7940105 5865146 3338697 1516149 1705627 3477837
38474 3477837 5156132 6140998 7353763 9173151 10445885 10225273 9212900 8590899 8540099
38465 8540099 8908100 10165979 12263891 13483604 12294880 9929677 9113162 10189688
38457A0189688L79380j986512k698445r81785P58956J048354J028053J398352
38449I136041P07568j607473k964454r87745K373515K984752K96608j929180j135253
38440F874379M51314p16672m229861o012378l412313J691111N091710M530385
38432D267675J435293r65912r04848L75925L25458j624329l097996j785659J222585
38423g51808K548670J009280p45288n941K092284K205998m44071l058295l112196
38414b61367j242676L91588Q86519O22319k8452n85812j28726J394850K383319
38405C431562J694299O89268J257850K534155K013714k94019j607861p36261J10214
38396I092921r70775k623411k684911j381251j05714J030054K205539K279131
$$ plain form
38457 10189688 10569068 8582556 5884111 4902326 5661282 6709636 7737689 9136041
38449 9136041 9843609 8236136 5271682 4283937 6657452 9642204 9938812 8009632 6874379
38440 6874379 7325693 6609021 2379160 -3633218 -7045531 -5354420 -262710 4267675
38432 4267675 5702968 4737056 3832208 4208133 4533591 2909262 -188734 -1974393 -751808
38423 -751808 1796862 2806142 2060854 2054913 4147197 6353195 5909124 2850829 -261367
38414 -261367 -1504043 -1112455 -225936 396383 367931 -217881 -346607 1048243 3431562
38405 3431562 5125861 5815129 7072979 9607134 11620848 11326829 9718968 8982707 9092921
38396 9092921 8122146 5498735 2813824 1432573 1326859 2356913 4562452 6841583
38388F841583P49590k88373Q78001K047213P3447l584706m378737j530621J044787
38379A852184J227837J274444K256561J055820l614287o562317k608381M853967
38371b64172P382839K725518k793161l467759p67708Q96584N85904J84845K99190
38362D782080K6962n95544o00499M2064M71234M62460M83626N83285L30969m63373
38352E523264j686531k993625l432154k035406M77522J876377J363946R54182
38344D7575K369954L892071K527178j336652l889211k692428N37606K487555J892850
38335E836498j14009j878284k399149j453185M45456K290829L093561K224885
38327H046602j65471k544661k693308k52081K124450J791997l06552j209556o21043
$$ plain form
38388 6841583 7591173 7302800 8180801 10228014 10301461 6716755 2338018 807397 1852184
38379 1852184 3080021 4354465 6611026 7666846 4052559 -2509758 -5118139 -264172
38371 -264172 7118667 9844185 7051024 3583265 2815557 3712141 4298045 4482890 4782080
38362 4782080 4809042 4213498 3612999 3655063 4126297 4588757 5072383 5655668 5986637 5523264
38352 5523264 3836733 843108 -2589046 -4624452 -4146930 -2270553 -906607 47575
38344 47575 2417529 6309600 8836778 7500126 3610915 918487 1456093 3943648 5836498
38335 5836498 5722489 3844205 1445056 -8129 437327 2728156 5821717 8046602
38327 8046602 7881131 5336470 2643162 2391081 4515531 6307528 6000976 4791420 4170377
38318D170377j039231k815890k666608R88316M360625L096557j335767l669943
38310A088436k175834j71238l04456j162667p18419O0140q26675k770607l117334
38301a0098654o70084K865351M704984L561402P53969j005675m56855Q02596O96084
38292A153118j86435K74898J818444J815377k63194j477855n9889J479264K53812
38283D807540k376756l015621j277078N21180J385640J996727J915134O5493k216955
38274A805304k198473q6159J029376P9708n83845M15388J239258M98376k14492
38265A984441M58254Q66686p02628k795718l194133k486748k459390k643134j375106
38256a2347476R81367K679439L424666L914687L554381J439697j127027j937731
$$ plain form
38318 4170377 3131146 315256 -2351352 -1363036 2997589 6094146 4758379 1088436
38310 1088436 -1087398 -1258636 -1563092 -2725759 -3444178 -3384038 -4210713 -6981320 -10098654
38301 -10098654 -10768738 -7903387 -3198403 362999 1116968 111293 -345562 457034 1153118
38292 1153118 966683 1241581 3060025 4875402 4612208 3134353 3074464 4553728 4807540
38283 4807540 2430784 -584837 -1861915 -1340735 44905 2041632 3956766 4022259 1805304
38274 1805304 -393169 -479328 550048 629756 45911 461299 1700557 2198933 1984441
38265 1984441 2442695 3309381 2606753 -188965 -3383098 -5869846 -8329236 -10972370 -12347476
38256 -12347476 -11366109 -8686670 -5262004 -1347317 2207064 3646761 2519734 582003
38248E82003j211101r31466j334877q87889N00092J171132O69420J99211j2221
38239a255696r74176k209794j657287R50745L153478L032542J204426r68900k769695
38230a494357l247200j614787P12105J099808m19250q89411J042354L173448L422648
38221A785358K479721J390964l65808k511007k732369k52939J971290J187704
38213B952914j236589k250945j276145M53818K299479L298597J386582l180352
38205B447359n865748l098532K166234M028529J581891p56352j69275J457745
38197A791851J570564M04784n28597p84539q15164r67772j001014Q6120K818787
38188B575020N162261L903891m34195l073252j744170m16398k714799n447822
$$ plain form
38248 582003 -629098 -1560564 -2895441 -3783330 -3283238 -2112106 -1442686 -1243475 -1255696
38239 -1255696 -2229872 -4439666 -6096953 -5146208 -1992730 1039812 2244238 1275338 -1494357
38230 -1494357 -4741557 -6356344 -5644239 -4544431 -4963681 -5853092 -4810738 -1637290 1785358
38221 1785358 4265079 5656043 5290235 2779228 46859 -206080 1765210 2952914
38213 2952914 1716325 -534620 -1810765 -1356947 942532 4241129 5627711 2447359
38205 2447359 -3418389 -6516921 -4350687 -322158 1259733 503381 334106 1791851
38197 1791851 3362415 3767199 3238602 2454063 1638899 671127 -329887 -243767 2575020
38188 2575020 7737281 11641172 11206977 8133725 6389555 5973157 3258358 -2189464
38180b189464l799097L98838J934761J161160K288838M399257K571461k167815
38172D597939k949692J305076L135903j431248o276389n058747n25053J371508
38164e830703O36085P70180J960068K346588K284865K441310J281930j247416
38156D642907j677168J027955K193019r92248l724622j279392K597464J950655
38148D738570j287609j433492M38689j008747m771301m624282L5629L265299K559310
38139b087934J573088K335910K520379J367408R80044Q20911j803720m973509
38131G32577l556320J492040L296610K01613j673125O12308K113327k35556j949281
38122A034193J67007J847088k38968j741407J056464L406844K48076m111876k963748
$$ plain form
38180 -2189464 -5988561 -5589723 -3654962 -2493802 -204964 4194293 6765754 4597939
38172 4597939 1648247 2953323 6089226 4657978 -1618411 -6677158 -7202211 -5830703
38164 -5830703 -5194618 -4424438 -2464370 -117782 2167083 4608393 5890323 4642907
38156 4642907 2965739 3993694 6186713 5194465 1469843 190451 2787915 4738570
38148 4738570 3450961 2017469 2456158 1447411 -3323890 -7948172 -7912543 -4647244 -2087934
38139 -2087934 -514846 1821064 4341443 5708851 6688895 7509806 5706086 732577
38131 732577 -2823743 -1331703 1964907 2166520 493395 1105703 3219030 2983474 1034193
38122 1034193 1201200 3048288 2809320 1067913 2124377 5531221 5779297 1667421 -1296327
38113a296327J317513J845296p01779j82518L340938L838805L82482j402335M64673
38104G606748J342622j041044k443804J48448L118416K134226j389044l200631
38096F275937k034807L63265K267257K715207J420937l97924r20732k55267p6895
38087I356978n50725j75101J132597J716121J311834J483256K459225K691010
38079A9425195K176354K812311M349020L481719j123897n786949o150786k643166
38071A6539801N87065R36787l90450q43608K23325J035985j24390k324519k926623
38062A2713373j402261k74068j032713j491407M61233K805975K410559K13016
38054A4403707n40430K30466J49768n27501M43877K045523Q55627k525622l594531
$$ plain form
38113 -1296327 21186 1866482 1164703 982185 4323123 8161928 8544410 7142075 7606748
38104 7606748 8949370 7908326 5464522 5612970 8731386 10865612 9476568 6275937
38096 6275937 4241130 4604395 6871652 9586859 11007796 10609872 9689140 9433873 9356978
38087 9356978 8806253 8631152 9763749 11479870 12791704 14274960 16734185 19425195
38079 19425195 21601549 24413860 28762880 32244599 31120702 25333753 19182967 16539801
38071 16539801 17126866 18063653 17673203 16829595 17052920 18088905 17964515 15639996 12713373
38062 12713373 11311112 11037044 10004331 8512924 8974157 11780132 14190691 14403707
38054 14403707 13863277 14093743 14243511 13716010 14159887 16205410 17061037 14535415 10940884
38045A0940884j528367p56549l021688l899805m47474L244512K475005o98381
38037F308137j496312j99226m39357k191582k130293J11483J283974J37590p38395
38028F46019N67445K396137K223322j17682k733453l494990j238125L230351O926401
38019H405425O738034K212713l975202q008072p340819k496012K756725M286281
38011B579073J687718j474767k023537k85213J636839K567288K127749P5952k607121
38002D283981l727472k510666o80996J61850K70452n2852j229766k007505L79261
37993e113713N386215P870580M694514m61248k420568j601660j471188j768110
37985E114822J45662K811786J802789k615174m801824k031170J595705J583665
$$ plain form
38045 10940884 9412517 8655968 5634280 1734475 1287001 4531513 7006518 6308137
38037 6308137 4811825 4612599 4173242 1981660 -148633 -37150 1246824 1384414 646019
38028 646019 1213464 3609601 5832923 5715241 2981788 -513202 -1751327 1479024 8405425
38019 8405425 15143459 17356172 13380970 5372898 -1967921 -4463933 -1707208 2579073
38011 2579073 4266791 2792024 768487 483274 2120113 4687401 6815150 6891102 4283981
38002 4283981 556509 -1954157 -2635153 -2473303 -2202851 -2255703 -3485469 -5492974 -5113713
37993 -5113713 272502 8143082 12837596 12376348 9955780 8354120 6882932 5114822
37985 5114822 5260484 8072270 9875059 7259885 2458061 426891 2022596 3606261
37977C606261q52619j765953l68241R20154L48949j593732l263269k929248M0350
37968e857348L791012M906641J913617k851709n523705m180326L2837M095633
37960c673348N254538L187670L84831m08145R77850K532903K568567P90976k025003
37951I590839l947289k784452R28984L228926J497262j536767j761616j54266
37943E061621q85218l648292l372753J310961M782729K476282k242447l210587
37935B72296l13110J449479J07161r26948J069904L766288L326228o5508k578866
37926F106924j896496J39123N89515m81246o53180P59900J642698O31675p27597
37917F111316q45256p65697j745852k314582p70008J106508M52494j703017j840502
$$ plain form
37977 3606261 2753642 987689 619448 1539602 1888551 294819 -2968450 -5897698 -5857348
37968 -5857348 -2066336 2840305 4753922 1902213 -3621492 -7801818 -7768981 -3673348
37960 -3673348 1581190 4768860 5153691 4745546 5723396 8256299 10824866 11615842 9590839
37951 9590839 5643550 2859098 3788082 7017008 8514270 6977503 5215887 5061621
37943 5061621 4176403 528111 -2844642 -1533681 3249048 5725330 3482883 272296
37935 272296 -40814 1408665 1515826 588878 1658782 5425070 8751298 8685790 6106924
37926 6106924 4210428 4349551 4939066 4457820 3804640 4564540 6207238 6838913 6111316
37917 6111316 5266060 4500363 2754511 439929 -330079 776429 1228923 -474094 -2314596
37908b314596K74687J413412L77148o85946q11917j526017k718361j859691J120288
37899f730993K685994J437759N86742K243918L665268K356490P36625J750265
37891H732068L360535J930166j520567l045412j974099r92632j214038j265790
37883D010231o09215j38329R7228O87008R78541K32378k16335J096342K573572
37874H711421J494051j520305l166911k235180p29484m50237j217393k295744
37866a409782l027023k319664R6010K337049K517974J418570P35024N9320j495711
37857a088233k229490j81329K612728K474781J23496k20638K239167L686237K198276
37848I614995O00074J145409J780022J17428k489268l471517k749115j516498
$$ plain form
37908 -2314596 -2039909 -626497 -249349 -935295 -1747212 -3273229 -5991590 -7851281 -6730993
37899 -6730993 -4044999 -2607240 -2020498 223420 3888688 6245178 6981803 8732068
37891 8732068 12092603 14022769 12502202 9456790 7482691 6490059 5276021 4010231
37883 4010231 3401016 3262687 3359915 4046923 5025464 5257842 5041507 6137849 8711421
37874 8711421 10205472 8685167 5518256 3283076 2553592 2103355 885962 -1409782
37866 -1409782 -4436805 -6756469 -6660459 -4323410 -1805436 -386866 348158 407478 -1088233
37857 -1088233 -3317723 -3499052 -886324 1588457 1711953 1491315 3730482 7416719 9614995
37848 9614995 10215069 11360478 13140500 13257928 10768660 7297143 4548028 3031530
37840C031530N5814J606490J570686k05707j082342O97799K969319K761762O08354
37831A2013705q51098r53530r41442j067077o62000l80242j525132l251483l006219
37822f24518k07597K553668K780708J087861o5359J45463l4632k076362m252243
37813f93011l122612J574748N256990L618445j592659m486468k480541J011662
37805i13446J818947L682j679143j763207p01366N98409J128706J81282j212575
37796b538711q79136J161793J987042J18223j564077L01143M356464N942555K881058
37787A1766354k506280o466917o741803l197167J974066M879952L052141j672253
37779A088093m803579l785322N0213L491695M129884J780298j244879j875582
$$ plain form
37840 3031530 3087344 4693834 6264520 6058813 4976471 5674270 8643589 11405351 12013705
37831 12013705 11162607 10209077 9267635 8200558 7538558 7158316 5633184 2381701 -624518
37822 -624518 -832115 1721553 4502261 5590122 5524763 5670226 5635594 3559232 -693011
37813 -693011 -3815623 -2240875 3016115 6634560 5041901 555433 -1925108 -913446
37805 -913446 905501 909183 -769960 -2533167 -3234533 -2636124 -1507418 -1326136 -2538711
37796 -2538711 -3417847 -2256054 -269012 -150789 -1714866 -1413723 2942741 8885296 11766354
37787 11766354 9260074 2793157 -3948646 -7145813 -5171747 -291795 2760346 1088093
37779 1088093 -3715486 -7500808 -7450595 -3958900 170984 1951282 706403 -1169179
37771a169179L65439K574449K292170O90218J12170J71715q99869k362267j942700
37762a67854j33273K36343j171635j611366j59005P32450k670L02861L168098
37753A193949N235956K875448j931596m116709k485354l31834J85372L44963J245767
37744B215962J542418J13888j733112k320597j875638j316042n25659O62041J359382
37735a877357J128258J111661J880487J691425p50489l100839k058029J313511
37727f61372K512848K71633j477794J37747K345162J283309j696817k187621L85262
37718I12357K282845J545643L88035O92211Q92850p88563k886332k848256q50062
37709f59272P74168Q16140M4544m85525m22176J32174P65438J033900J098738
$$ plain form
37771 -1169179 -803740 1770709 4062879 4753097 4865267 5036982 4137113 1774846 -167854
37762 -167854 -301127 -64784 -1236419 -2847785 -3006790 -2274340 -2277010 -1974149 1193949
37753 1193949 6429905 9305353 7373757 3257048 771694 439860 625232 970195 2215962
37744 2215962 3758380 3872268 2139156 -181441 -2057079 -3373121 -3898780 -3236739 -1877357
37735 -1877357 -749099 362562 2243049 3934474 3183985 83146 -1974883 -661372
37727 -661372 1851476 2123109 645315 783062 3128224 4411533 2714716 527095 912357
37718 912357 3195202 4740845 5128880 5821091 6713941 5925378 3039046 190790 -659272
37709 -659272 114896 931036 975580 490055 67879 200053 965491 1999391 3098129
37700C098129J293991R08666r66440k859572j513698L325231O815029M268710
37692A4370046k611117p362896o265384j858162J111742J073984J45410O24618
37684g71759K130323K245935k03511l054303l031574n7072K355697J728695k02138
37675A140293l51950J305229K178036R03857j216635k162117j130244R36060J805119
37666C407648K5990k560904k199461J518482M099084K083074j859060k850831
37658A664022o96002R91022Q78549O36701M74684j127993l233437k893723m52386
37649c758563M22943q80755n52348K720885M599783J979992j557261j286474J333771
37640C021973J603646p52934j937711o79371N03949L06750K78757R22034K97388
$$ plain form
37700 3098129 4392120 5300786 4334346 1474774 -38924 3286307 10101336 14370046
37692 14370046 11758929 4396033 -1869351 -3727513 -2615771 -1541787 -1396377 -771759
37684 -771759 1358564 3604499 3400988 346685 -2684889 -2741961 -386264 1342431 1140293
37675 1140293 788343 2093572 4271608 5175465 3958830 1796713 666469 1602529 3407648
37666 3407648 3433638 872734 -1326727 191755 4290839 6373913 4514853 1664022
37658 1664022 968020 1959042 2837591 3474292 3948976 2820983 -412454 -3306177 -3758563
37649 -3758563 -3335620 -4216375 -4768723 -2047838 2551945 4531937 2974676 1688202 3021973
37640 3021973 4625619 3872685 1934974 1255603 1759552 2066302 2345059 3267093 3564481
37631C564481k060933l232494r98552K497537L484936J580471k65025l41963l05911
37622C922547j919583l550071k119023J836823L779502J152423k596031k520306
37614b013719R58485L172218K328800J196237J319315L76680k676708m262121
37606C99187j426250K792575L255504n6987k637912k040828k02651K64453j019625
37597f72534k771885l162063r45471K529884L728677J585373j00903K042937N242873
37588G476888M212539q07189m299182l346188n39761J222821K078530K345085
37580H343543R25796j660570k629849j334237p68852k590773m082496k556938
37572f354376L56829J669760J602507K128830L040277K603273P73718r73155j963794
$$ plain form
37631 3564481 1503548 -1728946 -2727498 -229961 3254975 4835446 4570421 4228458 3922547
37622 3922547 2002964 -1547107 -3666130 -1829307 1950195 3102618 506587 -2013719
37614 -2013719 -1055234 2116984 4445784 5642021 6961336 7338016 4661308 399187
37606 399187 -1027063 1765512 5021016 4964029 2326117 285289 82638 347091 -672534
37597 -672534 -3444419 -6606482 -7551953 -5022069 -1293392 291981 191078 2234015 7476888
37588 7476888 11689427 10882238 6583056 3236868 2697107 3919928 5998458 8343543
37580 8343543 9269339 7608769 4978920 3644683 2875831 285058 -3797438 -6354376
37572 -6354376 -5997547 -4327787 -2725280 -596450 2443827 5047100 5820818 4847663 2883869
37563B883869k222906j241045R49634K601997K268360Q99023L0910o85016j964782
37554C520044k501380r22297J027896M76660j882341k353152K49220K698601J966199
37545B279450p33639k028887r11020N43615L69350q17323r01815P69842K315860
37536H85433J631967q14347k568720k291563q28595P27137K078275K502142R96778
37527B318507j325195j457340J254848L418287K188804o74988j844877j375504
37519B502542j500603k145724j278859J019240K284320J330342o09121k094255
37511d92118k305266m40686K809667M110673J229052k799864l085834O5968J870219
37502I61811O75788j62980J187435J947948J65344j615551r34327M85499L17282
$$ plain form
37563 2883869 660963 -580082 369552 2971549 5239909 6138932 6169842 5484826 3520044
37554 3520044 1018664 96367 1124263 1600923 -281418 -2634570 -2385350 313251 2279450
37545 2279450 1545811 -483076 -1394096 -850481 -481131 -1298454 -2200269 -1430427 885433
37536 885433 2517400 1703053 -865667 -3157230 -3985825 -3258688 -1180413 1321729 2318507
37527 2318507 993312 -464028 790820 4209107 6397911 5722923 3878046 2502542
37519 2502542 1001939 -1143785 -2422644 -1403404 880916 2211258 1602137 -492118
37511 -492118 -2797384 -3238070 -428403 3682270 4911322 2111458 -974376 -908408 961811
37502 961811 1637599 1474619 2662054 4610002 4775346 3159795 2225468 2710967 3028249
37493C028249m25381l48150j033838l597895m961461j924673L218013N427891
37485f17245L758105J468347O06169M11699K42739L71918L70899j95287k44217
37476F173127Q28390J034052j131438l238981k363480j53881K7413p75823O29093
37467A028472K571896M98467m140683m451755Q11985M132856N02890m934117n120989
37458i100978j172689J352870J544807K120738K688556Q28631j884156j452552
37450e074773J579802K697930J003396N37049L060755M724399J968362l175323
37442G321597n978159m619051j166542J146469N91085j547733j881381J035789
37434e097926M183558L912987J230854j00053K57883n49022k393204j655683J945216
$$ plain form
37493 3028249 2602868 2254718 1220880 -2377015 -7338476 -9263149 -6045136 -617245
37485 -617245 3140860 4609207 5215376 5627075 5869814 6241732 6612631 6417344 6173127
37476 6173127 7001517 8035569 6904131 3665150 1301670 1147789 1175202 399379 1028472
37467 1028472 3600368 4098835 -41848 -4493603 -3681618 451238 954128 -3979989 -9100978
37458 -9100978 -10273667 -8920797 -7375990 -5255252 -2566696 -1738065 -3622221 -5074773
37450 -5074773 -3494971 -797041 206355 743404 3804159 8528558 10496920 7321597
37442 7321597 1343438 -3275613 -4442155 -3295686 -2704601 -4252334 -6133715 -5097926
37434 -5097926 -914368 2998619 4229473 4129420 4387303 3838281 1445077 -210606 1734610
37425A734610L526620N43408k847840k246085N66932J546312P99460N69783J58099
37416D351299j980380l527650j230954K869452L601890M87051j778220o52552
37408B139936J404680J931910J564095J072978l61151k461833l153977j921373
37400B15265n22090N66730K655573M788605L514405j472497n584680n447868k880826
37391d167383o18022J576095L702160L084957r21584l924836k648263k07712l04043
37382d428631k87382L573373P452748M687082k631167n507022j560245K042504
37374C341260P47121j034620Q59679K934593J108478j516894k98132K637563K412030
37365A1191078j22852p77266n0979j663951m746701m665131j256758N25775j182678
$$ plain form
37425 1734610 5261230 5804638 2956798 710713 1277645 2823957 3623417 4193200 4351299
37416 4351299 2370919 -1156731 -2387685 481767 4083657 4570708 2792488 2139936
37408 2139936 3544616 5476526 7040621 8113599 7752448 5290615 2136638 215265
37400 215265 -306825 259905 2915478 7704083 11218488 9745991 4161311 -1286557 -4167383
37391 -4167383 -4785405 -3209310 492850 3577807 2656223 -1268613 -3916876 -4124588 -4428631
37382 -4428631 -4716013 -1142640 6310108 10997190 8366023 2859001 1298756 3341260
37374 3341260 4088381 3053761 3913440 6848033 7956511 6439617 6141485 8779048 11191078
37365 11191078 11068226 10290960 10239981 8576030 3829329 -835802 -2092560 -1566785 -2749463
37356b749463k512430p55431J721875K395904K374211K853844K233650l58710
37348E203450k267536j063196J598729K487546R25208j643921l813108m050162
37340b622990j088181L295634M596383J257504k506053k419568j97202l39347
37332b3820k807740l140455O09620M916746N481742K274326j078239j466245P86194
37323E552129K602413J747905m26598j032234j25478m80321k382206k367304Q87943
37314C976249L314281J405868k042112k425905n90259m62013j758372j031151
37306C86586J314829J457422o66688j138434M88844K57819k297124k387430J264263
37297a319913K965012n36093l785880j364099K792747J765901k784927l310393
$$ plain form
37356 -2749463 -5261893 -6017324 -4295449 -1899545 474666 3328510 5562160 5203450
37348 5203450 2935914 1872718 3471447 5958993 6884201 5240280 1427172 -2622990
37340 -2622990 -3711171 -415537 4180846 5438350 2932297 512729 315527 -23820
37332 -23820 -2831560 -5972015 -5362395 -445649 5036093 7310419 6232180 4765935 5552129
37323 5552129 8154542 9902447 9475849 8443615 8318137 7837816 5455610 3088306 3976249
37314 3976249 7290530 8696398 6654286 4228381 3638122 3176109 1417737 386586
37306 386586 1701415 3158837 2492149 1353715 1842559 2100378 -196746 -2584176 -1319913
37297 -1319913 1645099 1109006 -2676874 -4040973 -1248226 517675 -2267252 -5577645
37289e577645J474933M999141L240690k88136j119377M14767J744527J746277
37281F635177J74375k711455m625239l053064L63137J164411j066390j611923
37273d730971J750959M687302K992871p15670j195275J409127K491228N03307
37265G192878j186172q2747J766837J236192j359214k982736j981066L3327M72853
37256C110152p92897j234191O47520K650953J786881q39361j076849J905249L827717
37247I985174J634508j795802k222735m64806l22139k048647k482908q88660P2969
37238A466954n33347l84884J356379J991243q7482k370274k263213j020131r09289
37229b754044j218902k74915Q22321Q8149j278826m87279K051545L197189J937670
$$ plain form
37289 -5577645 -4102712 896429 4137119 3848983 2729606 3144373 4888900 6635177
37281 6635177 6809552 4098097 -527142 -3580206 -3217069 -2052658 -3119048 -4730971
37273 -4730971 -2980012 1707290 4700161 3984491 2789216 4198343 6689571 7192878
37265 7192878 6006706 5923959 7690796 8926988 7567774 4585038 2603972 2637299 3110152
37256 3110152 2317255 1083064 1730584 4381537 6168418 5329057 4252208 6157457 9985174
37247 9985174 11619682 9823880 7601145 7136339 6814200 4765553 2282645 1393985 1466954
37238 1466954 933607 548723 1905102 3896345 3808863 1438589 -824624 -1844755 -2754044
37229 -2754044 -3972946 -4247861 -3425540 -3337391 -4616217 -5103496 -3051951 145238 2082908
37220B082908J79329j103741k613628l409218j244138K565137L125275p74333
37212a192409l570424o48886M334673M477238l83955m023834l192989j019797
37204e220383n08054q4377K147238M114251L003328j13727k093764k151565j541408
37195b448461n34432J183479K297293J223608q64857j240239M29335J934361K031000
37186D011087J371677J26543k230173m392557l669030l9013L021098L095511J626281
37177B921424P04534j22466j658182k279203l91430K110690K180376L90974m2581
37168C814136J407092J795190l41695k663848k881405j958181j656499j360594
37160c845804K78427K262211K466425J061939J96144N55664N92639o24340j902087
$$ plain form
37220 2082908 2262237 1158496 -1455132 -4864350 -6108488 -3543351 -418076 -1192409
37212 -1192409 -4762833 -5411719 -1077046 3400192 3016237 -1007597 -4200586 -5220383
37204 -5220383 -5728437 -5812814 -3665576 448675 3452003 3338276 1244512 -907053 -2448461
37195 -2448461 -2982893 -1799414 497879 1721487 856630 -383609 45726 1980087 4011087
37186 4011087 5382764 5509307 3279134 -1113423 -4782453 -4821466 -1800368 1295143 2921424
37177 2921424 3625958 3503492 1845310 -433893 -825323 1285367 3465743 3856717 3814136
37168 3814136 5221228 7016418 6674723 4010875 1129470 -828711 -2485210 -3845804
37160 -3845804 -3567377 -1305166 1161259 2223198 2419342 2975006 3567645 2943305 1041218
37151A041218j909659r58755M9891J036625K062364K362937J296501l86457j323553
37142C271112j219409q31813o00105k32400M02192P81583L60210o43886j213286
37133G4198l80181J533314K683177J552860r10576k150275j244194J65793O57304
37124A981420P32418O80340p25237l183769l080084J647251O613635N578393o26505
37115I617862m734484l070143K99268R25314n524O8293M232j566196k014114Q48648
37105C73156L542962J918493j303440m70126L251161L284224j470694m615844
37097D509892k459165P95589P06171q63734m86358R27002J184353J261239K178297
37088G753286J370088k836761o344238m376187P41331K523748j79925k325236
$$ plain form
37151 1041218 -868441 -1827196 -1777305 -740680 1321684 3684621 4981122 4594665 3271112
37142 3271112 2051703 1219890 619785 387385 789577 1571160 1931370 1287484 74198
37133 74198 -305983 1227331 3910508 5463368 4552792 2402517 1158323 1324116 1981420
37124 1981420 2713838 3394178 2668941 -514828 -3594912 -1947661 4665974 10244367 9617862
37115 9617862 4883378 1813235 2112503 3037817 3032293 3100586 3104818 1538622 -475492 373156
37105 373156 3916118 5834611 4531171 4061045 7312206 10596430 9125736 4509892
37097 4509892 2050727 2846316 3552487 2688753 2202395 3129397 4313750 5574989 7753286
37088 7753286 9123374 6286613 -57625 -4433812 -3692481 -1168733 -1348658 -3673894
37080c673894j131776K51301j109773k934447j602624J975681L452952J021593
37072c750987k000517j068367L860865P578860N579912J0265k750160o30885J498462
37063H327448n48848l870401l291809M17829K032291N4873j765281r48038N44980
37054I53044N03615l31516o56697q20018j172088r38125q841N01570M16372Q94208
37044f58476J938521J934225M34424r51165j158701q81688o89713l23259j75686
37035e31518q62770j161148N97729K947771K698036K87026m68851J140975J284807
37026E932057j514773l095589m47475K741676J575981k462556m024502j575450
37018b870631J852237L758705L805312J832950j569635l564273k066977N76537
$$ plain form
37080 -3673894 -4805670 -4554369 -5664142 -8598589 -10201213 -8225532 -4772580 -3750987
37072 -3750987 -5751504 -6819871 -2959006 4619854 10199766 10210031 7459871 6828986 8327448
37063 8327448 7778600 3908199 616390 1034219 3066510 3121383 1356102 408064 953044
37054 953044 1456659 1125143 468446 -351572 -1523660 -2461785 -2470626 -1969056 -1552684 -658476
37044 -658476 1280045 3214270 3648694 2697529 1538828 657140 -32573 -355832 -531518
37035 -531518 -1394288 -2555436 -1957707 990064 3688100 3975126 3506275 4647250 5932057
37026 5932057 4417284 1321695 874220 3615896 5191877 2729321 -1295181 -2870631
37018 -2870631 -1018394 2740311 6545623 8378573 6808938 3244665 1177688 1754225
37010A754225N97613j490572k115257o74975Q2973n58582k07192J690957K230654
37001A309844j51187k925505l291221j734575o5134J318090K272684J524223j195014
36992b937795l335427k283110R32052K724119J469119o66188o50562J646873L280847
36983A79928J780278j726658l803507k987128j246721n83938j23326J770996M116557
36974b623519M416203K302344j45776j195064o68559Q49487K025780J023582j972454
36965D012024l672679j845130P85172K70465k101839j517352K518893N025404
36957C474958L137429N1847m73683P28367J027698K25138p50381k159045l618833
36948A643495k894831M12709K593534N79742l164030l915796j146414J722916
$$ plain form
37010 1754225 2351838 861266 -1253991 -1928966 -1845993 -2404575 -2611767 -920810 1309844
37001 1309844 1158657 -1766848 -5058069 -6792644 -6857778 -5539688 -3267004 -1742781 -2937795
36992 -2937795 -6273222 -8556332 -7624280 -4900161 -3431042 -4097230 -4747792 -3100919 179928
36983 179928 1960206 233548 -3569959 -6557087 -7803808 -8387746 -8511072 -6740076 -2623519
36974 -2623519 1792684 4095028 3949252 2754188 2085629 2935116 4960896 5984478 4012024
36965 4012024 339345 -1505785 -720613 -450148 -2551987 -4069339 -1550446 3474958
36957 3474958 6612387 6664234 6190551 6918918 7946616 8171754 7421373 5262328 1643495
36948 1643495 -1251336 -838627 1754907 2334649 -829381 -4745177 -5891591 -4168675
36940d168675K631357K417715J891355Q08407m19503q77646r79034j760635k582064
36931c038723j834283K86418J929589K296622K108621J706971Q51333J11121K53420
36922D671089N10308k93789j209737l22100J656782J842764k83298j716378m89541
36913D366100J224822M27011k253844l679280k699181j208866q82740r38555Q3065
36904e561468J715790K143822R67352j15746J51929O92971j37332j898263k775106
36895d816051k263212j236220J36253K136722L416184K152260l75815p13247J381356
36886a81770K185605K02477j068938P71407K379308J57308l181399k615632J114482
36877b37152K935608J415537k47685m10814o07313j142121m64240P65800J49218
$$ plain form
36940 -4168675 -1537318 880397 2771752 3580159 3160656 2283010 1303976 -456659 -3038723
36931 -3038723 -4873006 -4586588 -2656999 -360377 1748244 3455215 4306548 4417669 4671089
36922 4671089 5181397 4887608 3677871 3355771 5012553 6855317 6572019 4855641 4366100
36913 4366100 5590922 6017933 3764089 84809 -2614372 -3823238 -4705978 -5644533 -5561468
36904 -5561468 -3845678 -1701856 -734504 -850250 -698321 -5350 -142682 -2040945 -4816051
36895 -4816051 -7079263 -8315483 -8179230 -6042508 -2626324 -474064 -849879 -1563126 -181770
36886 -181770 2003835 2206312 1137374 1908781 4288089 4445397 1263998 -1351634 -237152
36877 -237152 2698456 4113993 3866308 3455494 2848181 1706060 1241820 2007620 2156838
36868B156838j551321j261765L23396n38518l027706j672431M025221O917559
36860E371273K833635k631067k788370M27831J232081l54866l59646J001517R4881
36851D827269k938625m208443k549988m47788R04800K340560L112731J658781
36843B699297l80163R4692K041976J408944k110063m460689l661715j832062l49520
36834f549303J742590L640275K590058o87601j775561K82498J054306j513507
36826a216245l044986j35197L421780K610384p90333j553439P10721K171502J584236
36817C758423R54708O09973j041612l194963l038754p07261N80140j43697k77500
36808b500543J426862K542618J032163j628707l019137k822403j868562n43802
$$ plain form
36868 2156838 605517 -656248 -332852 -871370 -3899076 -5571507 -1546286 5371273
36860 5371273 8204908 5573841 2785471 3213302 4445383 4090517 3730871 4732388 4827269
36851 4827269 1888644 -2319799 -4869787 -5317575 -4412775 -2072215 1040516 2699297
36843 2699297 2319134 2413826 4455802 5864746 3754683 -706006 -4367721 -6199783 -6549303
36834 -6549303 -4806713 -1166438 1423620 736019 -1039542 -757044 297262 -1216245
36826 -1216245 -4261231 -4396428 -974648 1635736 845403 -708036 2685 2174187 3758423
36817 3758423 4713131 5323104 4281492 1086529 -1952225 -2659486 -2079346 -2223043 -2500543
36808 -2500543 -1073681 1468937 2501100 872393 -2146744 -4969147 -6837709 -7381511
36800g381511M80068K15564n94154L44695L207853M828259K877585p90366k910421
36791B77572l012631k634237k015125l15166J792067K487776J606759Q28223J032798
36782D8036J392176J161888N68006k00046j065190j000681J020249L506198L182856
36773H613492m95212l649519k779302K77599P83301k169275m345155k376939J627878
36764d513132L284761J932287Q65035K054512L347281J949131j203386k514291
36756E202198o01193J845826J575334j245113l604212l429356j517264J44569
36748a629211P13553P33090R33519J424238J639261P52290j339348l289982l454848
36739c517438k075240j081385j118130m99812J516813K448111J86127k672078
$$ plain form
36800 -7381511 -6901443 -6685879 -7280033 -6935338 -3727485 1100774 3978359 3187993 277572
36791 277572 -2735059 -5369296 -7384421 -7699587 -5907520 -3419744 -1812985 -984762 48036
36782 48036 1440212 2602100 3170106 2970060 1904870 904189 1924438 5430636 8613492
36773 8613492 8118280 4468761 1689459 1967058 2750359 581084 -3764071 -6141010 -4513132
36764 -4513132 -1228371 703916 1568951 3623463 6970744 8919875 7716489 5202198
36756 5202198 4601005 6446831 8022165 6777052 3172840 -256516 -1773780 -1629211
36748 -1629211 -915658 -182568 750951 2175189 3814450 4566740 3227392 -62590 -3517438
36739 -3517438 -5592678 -6674063 -7792193 -8292005 -6775192 -4327081 -4140954 -6813032
36731f813032j811119K033158L651611J303927o85896P71413K479551P58807j971290
36722b82870j398245J049086P32490j855907j819945J451085K974101N54324j899219
36713d95100j495321p13696j579745j260007K241363M940044K665214j769018
36705B533734k754666m02876Q96202K74688N83303J927338J339063j028539j382854
36696A985393J047175K321934M15714j466249m57542J467901J318796k02334p88558
36687E642230n12061q08281j588101j901219j776673j378351q7502J786402K325698
36678A702142Q46332o03570m26289N9881n74988r89552L40143J806584J143012
36669C303695m04335J36306K429563L064907N80686k826987m657657m392287k352501
$$ plain form
36731 -6813032 -8624151 -6590993 -2939382 -1635455 -2321351 -1549938 929613 1688420 -282870
36722 -282870 -1681115 -632029 100461 -1755446 -3575391 -2124306 849795 1404119 -495100
36713 -495100 -1990421 -2704117 -4283862 -5543869 -3302506 1637538 4302752 2533734
36705 2533734 -220932 -623808 272394 547082 1130385 3057723 4396786 3368247 1985393
36696 1985393 3032568 5354502 5770216 4303967 3846425 5314326 6633122 6430788 5642230
36687 5642230 5130169 4321888 2733787 832568 -944105 -2322456 -2409958 -623556 1702142
36678 1702142 2548474 1944904 1518615 1578496 1003508 13956 354099 2160683 3303695
36669 3303695 2899360 3035666 5465229 8530136 9110822 6283835 1626178 -2766109 -5118610
36660e118610Q65302L342711K983602O66643j29706J913005L681575J800239k488451
36651G516310m687354k703627P83700J919501K15199j514302j116529M85653J314814
36642B213365J320306J703561K031555M58090k796976m659465l221587n41620
36634c492771L46955m15071m61380R15122K150232K044873Q99737n90898j702973
36625c06174j382169N29001K189591J826264M35102K48642R40334Q5266k387307
36616B178550l165071k35451L753317M687380K121198p10837j351757p15657r69324
36607E592348k231161k565025j021768P08060O49439m28232j71372J484599J993076
36598D009964K05183j915770k669567k866580k954950j057864L217078N868572
$$ plain form
36660 -5118610 -4253308 -910597 2073005 2739648 2609942 4522947 8204522 10004761 7516310
36651 7516310 2828956 125329 909029 2828530 3043729 1529427 412898 898551 2213365
36642 2213365 3533671 5237232 7268787 7726877 4929901 270436 -2951151 -3492771
36634 -3492771 -3145816 -3560887 -4022267 -3107145 -956913 1087960 1987697 1396799 -306174
36625 -306174 -1688343 -1159342 1030249 2856513 3291615 3540257 4480591 4565857 2178550
36616 2178550 -986521 -1221972 2531345 7218725 9339923 8629086 7277329 6561672 5592348
36607 5592348 3361187 796162 -225606 482454 1131893 703661 532289 2016888 4009964
36598 4009964 4215147 2299377 -370190 -3236770 -6191720 -7249584 -4032506 1836066
36590A836066L381175j437860k856931k03769K074024J556992K25037k35315n82464
36581C756955q70099J59903J534747M10236k819237m217626k399659k82362O34273
36572d092869K441428N180718M827864K92569l101044j473517J372276O06089
36564F053514j659969j163400K07471j632545m026608j203363M708283N442514
36556F725897j60156l685683l47803L686817J495436m026388n516378k090598
36548c918856J240993J895037J391437N39801j261867k528981q06572K356987
36540a092021K341673j491785m036315j725518K276001L149038J503618J215063
36532B139754K141281L72978m026365n212471k74155M977121L752642j327259
$$ plain form
36590 1836066 5217241 3779381 922450 718681 2792705 4349697 4574734 4339419 3756955
36581 3756955 2886856 3046759 4581506 4991742 2172505 -2045121 -4444780 -4727142 -4092869
36572 -4092869 -1651441 3529277 8357141 8649710 5548666 4075149 5447425 6053514
36564 6053514 4393545 3230145 3437616 1805071 -2221537 -3424900 1283383 6725897
36556 6725897 6565741 2880058 2532255 6219072 7714508 3688120 -1828258 -3918856
36548 -3918856 -2677863 -782826 608611 1148412 -113455 -2642436 -3449008 -1092021
36540 -1092021 1249652 -242133 -4278448 -6003966 -3727965 -578927 924691 2139754
36532 2139754 4281035 4654013 627648 -4584823 -4858978 118143 3870785 2543526
36524B543526j925226L034904N421143N35174n444524m891899J78021K457448
36516A908567P61924m6107J430608J319585j500522k665836J92879L054800J837373
36507F293271j375283k209907q21418p02058k564488l453116j592347J035076
36499e390270J586233j2791j225573o3644K562355L980393L113907J642380J215646
36490G408636J065611n8581j208937r52155l91563j309100k307399o71808K344698
36481C919402K544591m59533k196241m48993J171960q24559m289259m930382k303233
36472g816247O97819J927349R63134j686072l911539k873098J104486L872126
36464g722042K912814P32390L80762P55198m04968j812220q83482J469366K278797
$$ plain form
36524 2543526 618300 3653204 9074347 9609521 4164997 -726902 -548881 1908567
36516 1908567 2670491 2624384 4054992 5374577 3874055 1208219 1401098 4455898 6293271
36507 6293271 4917988 2708081 1886663 1184605 -1379883 -4832999 -6425346 -5390270
36499 -5390270 -3804037 -3816828 -5042401 -5106045 -2543690 1436703 4550610 6192990 7408636
36490 7408636 8474247 8415666 7206729 6254574 5863011 4553911 2246512 1574704 3919402
36481 3919402 6463993 6004460 3808219 3359226 4531186 3706627 -582632 -5513014 -7816247
36472 -7816247 -7118428 -5191079 -4227945 -5914017 -9825556 -12698654 -11594168 -7722042
36464 -7722042 -4809228 -4076838 -3696076 -2940878 -3345846 -5158066 -6041548 -4572182 -2293385
36455b293385J207985K47144J89602O45349J851032L228937K194984k005973n424655
36446a58980m301072o39606J358341J923271L574481M671049J591918l637085
36438D382317m673515j77470M294080M430032J473676k282696o237526q474826
36430g265928o170898r89015J611961M81233M09969L493608N252645K614732n67165
36421a128858k95197J062032Q3061j121900N98229K847152J872000l13342L75291
36412C978468K155928J94331m420761n663824k035630J587345J911806J022734
36404a269603J285397J838107J605691J310353J071636j60693j756656j666636
36396B257596k64635j09712j186203n38547K286968L730856J803757q25919j325304
$$ plain form
36455 -2293385 -1085400 -838256 -648654 -3305 1847727 5076664 7271648 5265675 -158980
36446 -158980 -4460052 -5099658 -3741317 -1818046 1756435 6427484 8019402 4382317
36438 4382317 -291198 -468668 3825412 8255444 9729120 7446424 1208898 -7265928
36430 -7265928 -13436826 -14425841 -12813880 -12332647 -11922678 -8429070 -3176425 -561693 -1128858
36421 -1128858 -1424055 -362023 -278962 -1400862 -802633 2044519 3916519 3603177 3978468
36412 3978468 6134396 6328727 1907966 -3755858 -5791488 -4204143 -2292337 -1269603
36404 -1269603 15794 1853901 3459592 4769945 5841581 5680888 3924232 2257596
36396 2257596 1992961 1883249 697046 158499 2445467 6176323 7980080 7154161 5828857
36387E828857n49261j38011O72397K540361L315164R98527k656991m352078l514695
36378B144270k030890j173761r83290j401619j987911j546481L07858K219076
36370d452748K907405K596675J704406m018j814767j870540j06009R86292L28680
36361B75376L25946K491740L786166R32379l598529m236622k33135L286334K506173
36352E535828o16335k181986j467096l59888J44167O30644J254406R59072q33144
36343C065668k614663k011981Q66278K413008k54442m467194m335942J245110
36335f094158O210942N119784L06689k041299n39362R06898l7161j415353j178310
36326A238670j4251Q02591J140190Q42234l61547j340710p07237M23180j45791
$$ plain form
36387 5828857 5279596 5141585 5813982 8354343 11669507 12668034 10011043 5658965 2144270
36378 2144270 113380 -1060381 -2043671 -3445290 -5433201 -6979682 -6671824 -4452748
36370 -4452748 -1545343 1051332 2755738 2751720 936953 -933587 -1039596 -53304 275376
36361 275376 601322 3093062 6879228 7811607 4213078 -23544 -256679 3029655 5535828
36352 5535828 4919493 2737507 1270411 910523 1054690 1685334 2939740 3898812 3065668
36343 3065668 451005 -1560976 -694698 1718310 1463868 -3003326 -7339268 -6094158
36335 -6094158 116784 5236568 5543257 3501958 2962596 3869494 3832333 2416980 1238670
36326 1238670 1224419 2027010 3167200 4009434 3647887 2307177 1599940 2023120 1877329
36317A877329j616373j218983O42934O86239j171461j055898J908948L186770
36309C239505K10068k884658j844834Q68227P09211j179785m91159K447499L339584
36300D413658J174410p49399o43684p3616q9924j16139o11105k385498l499975
36291b581272j585748J027029l0128l231519k271167L515252O672951K651891
36283D167289l122364l769572r48857m56815k198901j580076J520106K485220
36275c903970K68286p67431J537408L426142J428796k165872k979563o99925J360801
36266b495328J099159n01459j469345r64686M11738J390698J257642N62962K10253
36257d98366J37060j19144K3477J459432L301691L420552J499515k59460k05173
$$ plain form
36317 1877329 260956 -958027 -315093 371146 -800315 -1856213 52735 3239505
36309 3239505 3449573 564915 -1279919 -411692 297519 -882266 -1373425 1074074 4413658
36300 4413658 5588068 4838669 4194985 4121369 4031445 3915306 3304201 918703 -2581272
36291 -2581272 -4167020 -3139991 -3170119 -6401638 -8672805 -5157553 1515398 4167289
36283 4167289 1044925 -2724647 -3673504 -4130319 -6329220 -7909296 -6389190 -3903970
36275 -3903970 -3635684 -4403115 -2865707 560435 1989231 -176641 -3156204 -3856129 -2495328
36266 -2495328 -1396169 -1897628 -3366973 -4331659 -3919921 -2529223 -1271581 -708619 -498366
36257 -498366 -361306 -480450 -456973 1002459 4304150 7724702 9224217 8964757 8759584
36248H759584P02196Q85857N56808O58352O76549n88749k552213l068059j493600
36239D536725j5144q62890l020678l247619n57955J942498J051631j787440k081306
36230d042178J358234M372951L079990q23944k623690q57594J606300J939845
36222D009914K04421j884623k728259j468369J113962K514498J271679o82947
36214B350276o63990N63661J77295j699402k128494o00415N3951j034131r34747
36205c915996J676306L519506K003803k71760M3684J307867p8902l188388l832164
36196b736044j125727J656548K238975J296581l64306k475570l207259o14109
36188e330911L281824L887926M76100k565510k052588K43428J634844K320933
$$ plain form
36248 8759584 9461780 10347637 10904445 11562797 12239346 11650597 9098384 6030325 4536725
36239 4536725 4521581 3658691 638013 -2609606 -3167561 -1225063 -173432 -1960872 -4042178
36230 -4042178 -2683944 1689007 4768997 3945053 1321363 463769 2070069 4009914
36222 4009914 4214335 2329712 -398547 -1866916 -752954 1761544 3033223 2350276
36214 2350276 1686286 2249947 2427242 727840 -1400654 -2001069 -1947118 -2981249 -3915996
36205 -3915996 -2239690 1279816 3283619 3011859 3055543 4363410 4284508 1096120 -2736044
36196 -2736044 -3861771 -2205223 33752 1330333 966027 -1509543 -4716802 -5330911
36188 -5330911 -2049087 1838839 2314939 -250571 -2303159 -2059731 -424887 1896046
$$ [...]
##END NTUPLES=NMR SPECTRUM
##END=
