##TITLE=31Pdec_SR18_K1
 D2O, 24 sc
 26.8.2020
##JCAMPDX= 6.0         $$ Bruker NMR JCAMP-DX V2.0
##DATA TYPE= NMR SPECTRUM
##DATA CLASS= NTUPLES
##ORIGIN= UXNMR, Bruker Analytische Messtechnik GmbH
##OWNER= root
$$ XWIN-NMR		Version 3.5
$$ Wed Aug 26 09:45:33 2020 Russian Standard Time (UT+4h)  she@DPX200
##.OBSERVE FREQUENCY= 81.013821
##.OBSERVE NUCLEUS= ^31P
##.ACQUISITION MODE= SIMULTANEOUS
##.ACQUISITION SCHEME= undefined
##.AVERAGES= 24
##.DIGITISER RES= 17
##SPECTROMETER/DATA SYSTEM= spect
##.PULSE SEQUENCE= zgpg30
##.SOLVENT NAME= CDCl3
##.SHIFT REFERENCE= (INTERNAL, CDCl3, 0, 182.463)
##AUDIT TRAIL= $$ (NUMBER, WHEN, WHO, WHERE, WHAT)
$$ ##TITLE= Audit trail, XWIN-NMR		Version 3.5
$$ ##JCAMPDX= 5.01
$$ ##ORIGIN= Bruker BioSpin GmbH
$$ ##OWNER= she
$$ F:/spectra/data/she/nmr/P31/1/pdata/1/auditp.txt
$$ ##AUDIT TRAIL=  $$ (NUMBER, WHEN, WHO, WHERE, WHAT)
(   1,<2020-08-26 09:44:28.04 +0400>,<she>,<DPX200>,
      <created by zg, POWCHK disabled, PULCHK disabled
       configuration hash MD5:
       00 E9 B6 7A A2 85 ED C7 34 08 36 98 17 FE 4E 26
       data hash MD5: 32K
       5B 34 9E D8 AB F7 CF ED 22 28 E5 9B 9A CB 64 B2>)
(   2,<2020-08-26 09:44:30.23 +0400>,<she>,<DPX200>,
      <Start of raw data processing
       efp BC_mod = 2 LB = 1 FT_mod = 6 PKNL = 1 PHC0 = -3526.977 PHC1 = 1953.002 SI = 64K 
       data hash MD5: 64K
       7A 23 86 61 76 BC 88 7D 0B 04 C4 3C 14 A0 2F 6E>)
(   3,<2020-08-26 09:45:03.73 +0400>,<she>,<DPX200>,
      <pk PHC0 = -11.2676 PHC1 = -10.8 
       data hash MD5: 64K
       AF 35 48 67 83 78 5A D9 0E 3A 78 36 CA D5 C5 C0>)
(   4,<2020-08-26 09:45:07.20 +0400>,<she>,<DPX200>,
      <abs ABSG = 5 
       data hash MD5: 64K
       6C 3B FA C9 9A 80 08 05 7B E8 0D 6A DC D9 D3 19>)
$$ ##END=
$$ 
$$ hash MD5
$$ C6 FA 6F 42 35 C4 AC 38 2F E2 13 36 6F AB FA 78
##$RELAX= 
##$RELAX= 
##$RELAX= 
##$RELAX= 
##$RELAX= 
##$RELAX= 
##$RELAX= 
##$RELAX= 
$$ Bruker specific parameters
$$ --------------------------
##$DU= <F:/spectra>
##$EXPNO= 1
##$NAME= <P31>
##$PROCNO= 1
##$TYPE= <nmr>
##$USER= <she>
##$AMP= (0..31)
100 100 100 100 100 100 100 100 100 100 100 100 100 100 100 100 100 100 
100 100 100 100 100 100 100 100 100 100 100 100 100 100 
##$AQSEQ= 0
##$AQ_mod= 1
##$AUNM= <au_zg>
##$AUTOPOS= <>
##$BF1= 81.014009
##$BF2= 200.13
##$BF3= 200.13
##$BF4= 200.13
##$BF5= 200.13
##$BF6= 200.13
##$BF7= 200.13
##$BF8= 200.13
##$BYTORDA= 1
##$CFDGTYP= 0
##$CFRGTYP= 5
##$CHEMSTR= <none>
##$CNST= (0..31)
1 1 145 1 1 1 1 1 1 1 1 1 1 1 1 1 1 1 1 1 1 1 1 1 1 1 1 1 1 1 1 1 
##$CPDPRG= <waltz16>
##$CPDPRG1= <>
##$CPDPRG2= <waltz16>
##$CPDPRG3= <>
##$CPDPRG4= <mlev>
##$CPDPRG5= <mlev>
##$CPDPRG6= <mlev>
##$CPDPRG7= <mlev>
##$CPDPRG8= <mlev>
##$CPDPRGB= <>
##$CPDPRGT= <>
##$D= (0..31)
0 1 0 0 0 0 0 0 0 0 0 0.03 2e-05 3e-06 0 0 0 0 0 0 0 0 0 0 0 0 0 0 0 0 
0 0 
##$DATE= 1598420667
##$DBL= (0..7)
120 120 120 11 120 120 24 19 
##$DBP= (0..7)
150 150 150 150 150 150 150 150 
##$DBP07= 0
##$DBPNAM0= <>
##$DBPNAM1= <>
##$DBPNAM2= <>
$$ [...]
##$SUBNAM3= <"">
##$SUBNAM4= <"">
##$SUBNAM5= <"">
##$SUBNAM6= <"">
##$SUBNAM7= <"">
##$SUBNAM8= <"">
##$SUBNAM9= <"">
##$SW= 369.568048894756
##$SWIBOX= (0..15)
0 1 3 0 0 0 0 0 0 0 0 0 0 0 0 0 
##$SW_h= 29940.119760479
##$TD= 32768
##$TD0= 1
##$TE= 0
##$TE2= 300
##$TE3= 300
##$TEG= 300
##$TL= (0..7)
0 120 53 12 22 120 120 120 
##$TP= (0..7)
150 150 150 150 150 150 150 150 
##$TP07= 0
##$TPNAME0= <>
##$TPNAME1= <>
##$TPNAME2= <>
##$TPNAME3= <>
##$TPNAME4= <>
##$TPNAME5= <>
##$TPNAME6= <>
##$TPNAME7= <>
##$TPOAL= (0..7)
0.5 0.5 0.5 0.5 0.5 0.5 0.5 0.5 
##$TPOFFS= (0..7)
0 0 0 0 0 0 0 0 
##$TUNHIN= 0
##$TUNHOUT= 0
##$TUNXOUT= 0
##$USERA1= <user>
##$USERA2= <user>
##$USERA3= <user>
##$USERA4= <user>
##$USERA5= <user>
##$V9= 5
##$VALIST= <valist>
##$VCLIST= <CCCCCCCCCCCCCCC>
##$VD= 0
##$VDLIST= <DDDDDDDDDDDDDDD>
##$VPLIST= <PPPPPPPPPPPPPPP>
##$VTLIST= <TTTTTTTTTTTTTTT>
##$WBST= 1024
##$WBSW= 4
##$XGAIN= (0..3)
0 0 0 0 
##$XL= 0
##$YL= 0
##$YMAX_a= 4692
##$YMIN_a= -8005
##$ZGOPTNS= <>
##$ZL1= 120
##$ZL2= 120
##$ZL3= 120
##$ZL4= 120
##$ABSF1= 182.463
##$ABSF2= -187.1042
##$ABSG= 5
##$ABSL= 3
##$ALPHA= 0
##$AQORDER= 0
##$ASSFAC= 0
##$ASSFACI= 0
##$ASSFACX= 0
##$ASSWID= 0
##$AUNMP= <proc_1d>
##$AZFE= 0.1
##$AZFW= 0.5
##$BCFW= 0
##$BC_mod= 2
##$BYTORDP= 0
##$COROFFS= 0
##$CY= -3
##$DATMOD= 1
##$DC= 0
##$DFILT= <>
##$DTYPP= 0
##$F1P= 0
##$F2P= 0
##$FCOR= 1
##$FTSIZE= 65536
##$FT_mod= 6
##$GAMMA= 0
##$GB= 0
##$INTBC= 1
##$INTSCL= 5.30512e-09
##$ISEN= 30
##$LB= 1
##$LEV0= 0
##$LPBIN= 0
##$MAXI= 10000
##$MC2= 0
##$MEAN= 0
##$ME_mod= 0
##$MI= 50
##$NCOEF= 0
##$NC_proc= -7
##$NLEV= 6
##$NOISF1= 182.463
##$NOISF2= 159.3651
##$NSP= 0
##$NTH_PI= 0
##$NZP= 0
##$OFFSET= 182.463
##$PC= 4
##$PHC0= -3538.245
##$PHC1= 1942.202
##$PH_mod= 1
##$PKNL= yes
##$PPARMOD= 0
##$PSCAL= 0
##$PSIGN= 0
##$REVERSE= no
##$SF= 81.0140089999434
##$SI= 65536
##$SIGF1= 159.3651
##$SIGF2= -187.1042
##$SINO= 113.3802
##$SIOLD= 16384
##$SREGLST= <1H.CDCl3>
##$SSB= 0
##$STSI= 65536
##$STSR= 0
##$SW_p= 29940.119760479
##$SYMM= 0
##$S_DEV= 0
##$TDeff= 32768
##$TDoff= 0
##$TI= <>
##$TILT= no
##$TM1= 0
##$TM2= 0
##$TOPLEV= 0
##$USERP1= <user>
##$USERP2= <user>
##$USERP3= <user>
##$USERP4= <user>
##$USERP5= <user>
##$WDW= 1
##$XDIM= 65536
##$YMAX_p= 364111940
##$YMIN_p= -72992313
$$ End of Bruker specific parameters
$$ ---------------------------------
##NTUPLES= NMR SPECTRUM
##VAR_NAME=  FREQUENCY,     SPECTRUM/REAL,   SPECTRUM/IMAG
##SYMBOL=    X,             R,               I
##VAR_TYPE=  INDEPENDENT,   DEPENDENT,       DEPENDENT
##VAR_FORM=  AFFN,          ASDF,            ASDF
##VAR_DIM=   65536,         65536,           65536
##UNITS=     HZ,            ARBITRARY UNITS, ARBITRARY UNITS
##FACTOR=    0.456856943014862, 1,           1
##FIRST=     14782.0589164792, 0,            0
##LAST=      -15158.0608439998, 0,           0
##MIN=       -15158.0608439998, -72992313,   0
##MAX=       14782.0589164792, 364111940,    0
$$ Real data points
##PAGE= N=1
##DATA TABLE= (X++(R..R)), XYDATA
$$ [...]
43349 -665048 -1043240 -2206962 -4440341 -6694497 -7696882 -6292389 -2407358 1517969
43341 1517969 2065619 -822472 -2798299 -74069 5934821 10535751 10941388 7748164
43333 7748164 2740724 -2238677 -4991596 -4293924 -1777428 -517477 -1556003 -3474646
43325 -3474646 -5174686 -6835354 -7945678 -6982493 -4076314 -1768264 -1657764 -2161557 -1298899
43316 -1298899 -203 -444046 -2299081 -3139745 -2065945 -411904 1010990 2734738
43308 2734738 4265875 3617004 530577 -2018465 -1339879 1486476 3413974 3381114 2506258
43299 2506258 1509870 350623 -157983 1062313 3049978 3409339 1709407 231004 617500
43290 617500 1672908 1523227 421911 141201 1474210 3292188 3610374 1399187 -1923961
43281 -1923961 -3155807 -853808 2266332 2587531 820440 937672 3737881 5387005
43273 5387005 3713321 1723734 2140291 2444571 -567138 -4500948 -4735848 -2074786 -1456993
43264 -1456993 -3825475 -5011718 -3155540 -1673545 -3194834 -5406084 -5308843 -3504518
43256 -3504518 -1505919 1612125 6599260 10786282 10867097 7205048 2576467 -1679356
43248 -1679356 -5425247 -7220252 -5377376 -1029511 2612398 4021945 4326649 4710497
43240 4710497 4850305 4172027 3216677 3287229 5166814 8011275 9555984 8437374 6286930
43231 6286930 5827896 6789561 6209786 3393266 1294207 1375195 769193 -2503921 -4966818
43222 -4966818 -2647777 1926347 2968893 444933 147355 4496678 8840812 8724096
43214 8724096 6075789 5225524 6237553 5685112 2137636 -2208938 -4531451 -3806567 -836481
43205 -836481 2423268 3883574 2867965 524863 -1634344 -2921396 -3093464 -2080630
43197 -2080630 -582249 276995 421643 870423 2027043 3210266 4056390 4803723 4972809
43188 4972809 3680915 1697712 1037530 1787072 1654414 -259184 -1698003 -843779 707521
43179 707521 710692 6973 912430 3269256 4812734 4738559 4428670 4903482 5595124 5551828
43169 5551828 4323055 1964403 -545987 -1562595 -777977 -58288 -838328 -1927761 -1736182
43160 -1736182 -1224345 -2120724 -3414831 -2749635 -673078 -72094 -1328846 -1532106 731349
43151 731349 3033041 2800482 538544 -2044024 -4402689 -5928373 -5031387 -1880064 23883
43142 23883 -2139305 -6130490 -7091852 -3846943 -162508 402391 -1367330 -2205765 -899716
43133 -899716 352242 -953067 -3857682 -4221365 471241 7220849 10115090 6973249
43125 6973249 1590832 -1094214 129056 3669935 8176212 12290391 13501900 10537840
43117 10537840 6061309 3956547 4306451 4024869 2317166 2088697 5050010 8555643
43109 8555643 9135167 7014924 5164184 5240634 6276127 6513465 5051114 2184838 -822726
43100 -822726 -2720143 -3544121 -4203009 -4588656 -3541130 -1273192 18325 -738647 -1503299
43091 -1503299 -131013 2020999 1917771 -466231 -1981781 -956621 498827 -264869
43083 -264869 -2842707 -4766123 -4786820 -3630869 -2072911 186610 3423875 6621423 8064948
43074 8064948 7137016 4960329 2943213 1162558 -1044490 -3189806 -3737852 -2554551
43066 -2554551 -1769730 -2943706 -4398017 -2988002 1912564 7668136 11282802 11588731
43058 11588731 9013521 5192120 2871806 3949982 6787673 7400319 4445461 1221074
43050 1221074 1168062 3103178 3259982 1019592 -421648 611287 1244838 -1810168 -6948528
43041 -6948528 -9109967 -6205407 -1698817 -61554 -1611882 -3326975 -3293614 -2154691
43033 -2154691 -827029 532171 933470 -1344647 -5648647 -8159194 -6275427 -2245437
43025 -2245437 -191783 -760057 -1280752 -388916 455244 -115927 -1793813 -4172333 -7153054
43016 -7153054 -9230857 -8130909 -4138609 -357730 1320804 2020902 2675133 1983183 -691806
43007 -691806 -3198766 -3700328 -3550336 -4601091 -5859052 -5621705 -4878576 -5302532 -5532712
42998 -5532712 -3174601 557605 2118316 1164655 922083 2780650 4280270 3412771 1651850
42989 1651850 1306136 2390000 3435214 3394322 1822440 -882258 -2809118 -2230533 -425575
42980 -425575 -388387 -2286119 -3132654 -1749714 -602729 -1104927 -637758 3099361 7671029
42971 7671029 9020343 6876126 3864424 1086733 -1800631 -3362853 -1309992 3356605
42963 3356605 6608610 6447545 4957383 4606693 4977253 4225664 1915822 -715380 -2137317
42954 -2137317 -1604596 63086 666607 -1059341 -3350317 -3330846 -1071185 430215 -162040
42945 -162040 -392499 2094772 5611663 6543648 4222448 1365411 65554 -406493 -1438205
42936 -1438205 -2605282 -2425633 -520580 2098043 4395493 5942662 6370998 5316164
42928 5316164 3318302 2007759 2646273 4726806 6588230 7217319 6834539 5900232 4465060
42919 4465060 2757349 1614715 1714776 2669637 3311347 2818843 1475711 424250 534861
42910 534861 1320848 1358576 172494 -944360 -723370 302154 1014166 1733293 3094543
42901 3094543 3716185 1832026 -806483 -56868 4564889 8290920 7368285 3775418 1266168
42892 1266168 -143450 -2331809 -4446176 -4543632 -4141992 -6219416 -9337429 -8860721 -4398927
42883 -4398927 -973631 -1417723 -2445108 -636389 2044084 2094686 434238 519635 2678310
42874 2678310 4286398 4352168 4167776 3973928 2577022 474418 163328 2452411 4894199
42865 4894199 5004861 3299375 2054986 2349036 3364232 3796542 3027351 1273316 -776449
42856 -776449 -2415343 -3124426 -2586959 -1186838 -630348 -2866270 -7425537 -10818883 -9982407
42847 -9982407 -5740728 -1471463 973504 2145514 2313469 599292 -2471608 -4061519
42839 -4061519 -2515259 -250466 -1019421 -4967951 -8483353 -8759470 -6343467 -2747908
42831 -2747908 2026879 7824701 11871632 10832337 5409875 473529 -426993 1092640
42823 1092640 1221297 -793032 -2365727 -1689306 234763 1785882 2923799 4489854
42815 4489854 6618132 8431873 8451278 5359435 -257935 -5003984 -5480488 -2554388 -863386
42806 -863386 -3180912 -7221696 -9215150 -8532393 -6929864 -5118443 -2694114 -404318
42798 -404318 294261 -250375 -139904 1166762 2182132 1945393 1523264 2396953 4565006
42789 4565006 6689834 7302821 5789332 2937647 368030 -1133592 -1991038 -1919892 668702
42780 668702 5493776 8284095 4957643 -2610474 -8249007 -8995822 -7594576 -7033493 -6572625
42771 -6572625 -5039873 -4332652 -6299089 -8461765 -6601063 -780984 4299469 4777457
42763 4777457 1075929 -3795400 -6990600 -6934764 -4077198 -1074790 -500109 -1991362 -3093109
42754 -3093109 -2799239 -2328243 -2317074 -1664801 -5415 958178 85176 -1073079 -652971
42745 -652971 389155 -215230 -2108836 -2356294 305436 3390608 3847883 1888140 264215
42736 264215 397659 696574 -988769 -4213897 -6201151 -5291774 -3242418 -3100176 -5047518
42727 -5047518 -5917811 -3592675 -275480 491325 -974883 -1112651 985476 1617371 -1904269
42718 -1904269 -6528620 -7319694 -4286793 -1926743 -2735019 -4821131 -5999133 -6348855 -5632278
42709 -5632278 -1985393 4506991 9889873 10774722 8528127 6330398 4251275 662834
42701 662834 -3147781 -3980182 -1907482 -463667 -1290305 -2300315 -2061489 -2374559 -4685897
42692 -4685897 -6905896 -6240722 -3341118 -1345518 -1850160 -3627822 -4675834 -4199160 -2954506
42683 -2954506 -2291360 -2415355 -1800018 436355 2065125 5450 -4863650 -8026829 -7225569
42674 -7225569 -4926118 -3589446 -1980251 1329499 3953428 2770762 -972431 -3266462
42666 -3266462 -2862082 -1904394 -1963546 -2619371 -3366348 -3913192 -3089642 -299534 2506246
42657 2506246 3118555 2534290 3026150 3689744 1736108 -2218516 -4337544 -3201014 -1075847
42648 -1075847 871204 4079790 8249078 10241138 9302087 8884550 10670000 11119034 7392794
42639 7392794 2772567 1846758 3296393 2315067 -1666961 -4612525 -4490444 -3706705 -4687374
42630 -4687374 -6736407 -7984513 -7731578 -6355862 -5029316 -5496180 -7989072 -9645388
42622 -9645388 -7368509 -2132138 1861238 2188870 183933 -1740170 -2232140 -639254
42614 -639254 2779877 5918171 6364683 4221625 1547163 -693032 -2867021 -4409390
42606 -4409390 -4228384 -3243012 -3394645 -3977589 -2260252 1782084 4859056 5373756 5482934
42597 5482934 6808418 7598439 6048147 3344385 1403083 421511 474039 2288283 4278800
42588 4278800 2463738 -3558559 -7946799 -5815675 -292364 1959160 -78268 -2007933
42580 -2007933 -1801932 -1728368 -2727166 -2419065 25891 1649355 292985 -2155792 -3172257
42571 -3172257 -3286382 -4112813 -5002241 -4167181 -1978463 -1113664 -3644074 -8764605 -13112732
42562 -13112732 -13456870 -9954528 -6317581 -5489115 -5986238 -4475106 -1012430 1156320
42554 1156320 596433 -849057 -1734920 -2635189 -3474392 -2906259 -1413154 -1194703 -1503660
42545 -1503660 1595566 8329713 12485019 9479752 3585599 2263544 5828574 8174222
42537 8174222 6411900 3917821 3547776 3448454 1551714 -188274 1045517 4315556 6314671
42528 6314671 5824421 4484977 4005114 4460261 4995337 4898167 4008615 2772150 1963012
42519 1963012 2247875 4018483 7107776 10202706 11389823 10276469 8719981 8181611
42511 8181611 7418210 4693037 1308703 279024 1748652 2617501 1140898 -877964
42503 -877964 -1367663 -807952 -423692 82867 1269218 2291396 2292499 1996979 2348214 2972356
42493 2972356 3489721 4755666 6996974 8263846 6957246 4729736 4451370 6002823
42485 6002823 6520455 4533258 1567904 -391332 -988349 -851069 -667578 -1098575 -1971317
42476 -1971317 -1562411 1454754 5314491 6637571 5015573 3657550 4509553 5399202 3978480
42467 3978480 2132661 3342713 6815791 7873407 4624161 1052242 1761398 5828325
42459 5828325 8243973 6453571 2988326 1502618 2307467 2799245 1019050 -2404844
42451 -2404844 -5243700 -5600157 -3186631 469236 3176026 3932892 3415974 2406053 666809
42442 666809 -1749341 -3167563 -2078383 112310 279344 -2009486 -3301711 -635553
42434 -635553 4462896 7892502 7848066 6123437 5133413 5388415 6037713 6519530 6983187
42425 6983187 7528202 7458589 5585024 1788685 -1843134 -2654248 -714464 838264 -240975
42416 -240975 -2295682 -2204051 307156 2735034 3434310 2922081 1835251 18568 -2014755
42407 -2014755 -2917199 -2426609 -1535441 -311690 2089966 4425422 3212555 -2444443 -8225950
42398 -8225950 -9456618 -6964940 -5147411 -5382683 -4979633 -2595498 -913309 -2506223
42390 -2506223 -5871305 -7637835 -6908979 -5311713 -3878180 -2018562 714415 3500774
42382 3500774 5062452 4747619 2942248 991594 267089 737540 1161522 1288500 2648222
42373 2648222 5891277 8542900 7423487 2831231 -1667484 -3416855 -2666438 -603561
42365 -603561 2082908 4185168 4096050 2175531 926796 1517555 2171791 1510099 1190331
42356 1190331 2941285 4956577 4269717 1540578 198254 1181526 1728615 -236666 -3309758
42347 -3309758 -4974846 -4523469 -2820718 -1068528 -446090 -1207946 -1707174 -169634 2368148
42338 2368148 3198542 2299403 2658828 5350221 7400000 6217476 3183774 618795 -1977749
42329 -1977749 -5692305 -8586443 -8015232 -5231188 -3983811 -5050188 -5560092 -3684093
42321 -3684093 -765463 1585983 3543010 5388072 6305944 5890192 4907810 3719200 1743163
42312 1743163 -718133 -1910423 -841316 1426845 3481195 4962253 5354323 3149298
42304 3149298 -2094053 -7801452 -10194252 -7974227 -3291855 740075 2654413 2856695
42296 2856695 2240552 1334415 732578 1468346 3978105 6845447 7764377 6126879 3624651
42287 3624651 1931816 1045813 309430 -635847 -2572896 -6155799 -9420604 -8535113 -3229741
42278 -3229741 1159181 170595 -3566427 -4424165 -2103883 -1056116 -2589748 -2994901 -1293
42269 -1293 3860544 5529642 4675475 1525835 -4024138 -9452617 -10248316 -5854040 -1142569
42260 -1142569 173359 -321927 -250482 -450856 -1515264 -949339 2300961 4586642 3139686
42251 3139686 1125223 2402992 4911547 4693142 3184672 4207724 6272459 4932337
42243 4932337 1394821 1400593 5631622 8432061 7007114 5018432 5178979 4744640 1230459
42234 1230459 -2944238 -4846163 -5439292 -6325409 -6228033 -4109251 -2078396 -1757579 -1140926
42225 -1140926 1413834 3309580 1765203 -941675 -479669 3161026 6214301 6610266
42217 6610266 5252974 3097808 574705 -1021601 -1075473 -1865280 -5772308 -10747759 -12086673
42208 -12086673 -8730781 -4446846 -2322462 -1316257 696117 3227430 4214459 3089738
42200 3089738 1263788 205317 -104902 -1005382 -3494226 -6584700 -8000347 -6946533
42192 -6946533 -4990138 -3376316 -1223266 1987556 3982689 2380158 -1386107 -3748992
42184 -3748992 -3942383 -4230019 -5574583 -6410035 -6001122 -5707171 -6017058 -5357079 -3098955
42175 -3098955 -1017151 -289865 412245 2171646 3525304 2851426 985370 -556506 -1992243
42166 -1992243 -3700595 -4188725 -2415974 -700973 -2203513 -6254712 -9187513 -9396314
42158 -9396314 -8497879 -7526255 -5373789 -1893044 555286 332060 -1004186 -1219336 -483631
42149 -483631 -48159 379655 1533400 2077308 37274 -3480480 -4729789 -2229932 871079
42140 871079 685505 -2398484 -4127659 -1576801 3172978 5028536 1395411 -4733337
42132 -4733337 -7792521 -5813502 -2579451 -2870618 -6647699 -9600360 -8911434 -6221495
42124 -6221495 -4431948 -3787049 -2628909 -675832 328361 -1013727 -3984526 -6451771
42116 -6451771 -6732701 -4810747 -2018089 516501 2784266 4711885 4891011 2322467
42108 2322467 -766061 -436090 3707064 7293533 6894207 4619546 4655549 7154169 8579918
42099 8579918 6947222 3568483 215205 -2332202 -3121143 -1542319 719247 1034912
42091 1034912 -543928 -1660984 -1752555 -2592321 -4203416 -3779011 -195261 3508837 4216564
42082 4216564 2877398 2493694 3926262 5652665 6065077 4350173 704510 -2852964
42074 -2852964 -3629944 -1635646 69850 -312322 -1040752 -515570 -414831 -2527828 -4895253
42065 -4895253 -4438727 -1903677 -873183 -2686286 -5202934 -6046679 -4651910 -1734424
42057 -1734424 1109607 2067211 1281945 1196635 2932284 4233132 3370476 2697299 4896728
42048 4896728 7827024 7391388 4112610 2171537 2682665 2836654 1578232 1066043 1918452
42039 1918452 2022161 1279181 2628592 6377873 8023349 4374234 -1785091 -5785258
42031 -5785258 -6682086 -6286174 -5576925 -4764763 -4442846 -4250486 -2680573 -218424 65507
42022 65507 -2738313 -5076699 -4102603 -2085933 -2277614 -3192235 -1252264 2765782 4512920
42013 4512920 2578390 28063 -654153 -588534 -1835600 -4443467 -6906983 -7726213 -6186508
42004 -6186508 -3005058 -70333 1602836 2903244 4458841 4998330 3761770 2810278
41996 2810278 4235151 6409679 6097302 3333236 914184 -310821 -2007112 -4301424
41988 -4301424 -4913919 -3059292 -972076 -592740 -1578013 -3368136 -6081361 -8177235 -6582547
41979 -6582547 -1291749 2832492 1444650 -3901882 -8166729 -9094388 -8454113 -8045455 -7473176
41970 -7473176 -6084264 -4580735 -3526664 -1745805 2181997 7064730 9133248 5869207
41962 5869207 -599762 -5164686 -5169837 -2936644 -1927681 -1831870 385361 5080691 8307714
41953 8307714 6519418 975537 -3921321 -5466982 -4392454 -2566079 -746455 1051406
41945 1051406 2179898 1541465 -729284 -2637259 -2267934 -47064 2030812 3200905
41937 3200905 4212306 4619980 2372913 -2402295 -5716553 -4441155 -826955 900204
41929 900204 935987 2790188 6431871 7423678 3890288 -267630 -1391989 -1372181 -3700855
41920 -3700855 -7174828 -7459202 -3439549 1661221 4900515 6061403 5581472 3290408
41912 3290408 183166 -987764 1463291 5830336 8721839 8558710 6567155 4710507
41904 4710507 3584763 2574198 1360467 389450 -116634 -517406 -622620 500689 2366369
41895 2366369 2059149 -2328936 -7851183 -9092250 -4761114 712649 2921682 2148159
41887 2148159 1057020 532959 54038 113681 1512987 3204703 3083663 417759 -3927217
41878 -3927217 -8644799 -11959836 -11953673 -8857074 -5679543 -4523802 -3773369 -1310828 1271911
41869 1271911 1097991 -598781 268983 4079121 6548731 5308040 3258390 3435379 4300433
41860 4300433 3101660 975438 970828 2720602 3030434 1247213 276915 1741623 3411700
41851 3411700 2800358 708471 -634882 -932472 -1055764 -381387 2265617 5424141 5729555
41842 5729555 2544030 -690085 -1100407 -189795 -974873 -3109546 -3661622 -1904766 -295919
41833 -295919 -615141 -1996115 -3407693 -5280324 -7364122 -7483931 -4424968 -374279 1511553
41824 1511553 870914 -191906 -200678 491486 782101 -182708 -2247373 -3572842 -2082421
41815 -2082421 1396034 3250197 1749527 -533668 -852973 -350768 -1166971 -1902440 17120
41806 17120 2989218 2943658 47729 -1026201 1825264 5223879 5782625 4353617 2914436
41797 2914436 1137738 -1174646 -1467437 2293447 7648343 10110520 8442132 4889161
41789 4889161 1302233 -2256810 -5642247 -7924205 -8650284 -8101960 -6420415 -3926560
41781 -3926560 -2016412 -2194793 -4173732 -6049600 -6366757 -5197919 -3384250 -1496719
41773 -1496719 499539 2898068 5318059 6228534 4346057 595712 -2519519 -3651123
41765 -3651123 -3269053 -1626877 1609232 5014753 5418510 2007574 -1838812 -2940877
41757 -2940877 -2510444 -3407591 -5014041 -4140017 -261993 3420763 4343914 3426476 3083410
41748 3083410 4283164 6039497 6637723 5449807 4327990 6023196 9806197 10532552
41740 10532552 4827467 -3240444 -6358859 -3321924 -116362 -1280156 -4475442 -5317729
41732 -5317729 -3674192 -2218860 -1428595 462195 3609540 5667397 4772804 1610812
41724 1610812 -1571918 -2933673 -2172341 -420836 1158050 2650904 4377180 4921285
41716 4921285 2289393 -2416833 -4960113 -3158713 19968 637768 -834170 -1053707
41708 -1053707 596981 1332067 -245319 -1891095 -1208885 1016437 2288742 1500726 -749142
41699 -749142 -3577694 -6054252 -6892964 -5525967 -3298450 -2310557 -2941273 -3537621 -2804104
41690 -2804104 -1420354 -557191 260871 2315438 4886605 5147881 1859761 -2213807 -3207574
41681 -3207574 -729331 2247446 3578457 3785051 3555277 2019908 -1126667 -3690365
41673 -3690365 -3028608 811072 5237105 7567429 6541572 2866195 -429840 268061
41665 268061 5180496 10021935 10786805 8540685 7286462 8222643 8948252 7721698 5267814
41656 5267814 2270411 -1608428 -5397893 -6641908 -4994888 -3331996 -3591295 -3945847
41648 -3945847 -2108988 798403 2186713 2077796 2445511 3529627 3645467 2338592 1243579
41639 1243579 1670548 3186516 4571506 4640660 2600348 -550929 -1614604 1344884 5391080
41630 5391080 5465714 1132233 -2489477 -1657531 1160591 1451145 -927017 -2427799 -1348006
41621 -1348006 636032 1996018 3174258 4270898 3689048 687744 -2440259 -2687180
41613 -2687180 -232072 1601901 379343 -2666904 -4403195 -3491348 -1310881 562200
41605 562200 2342890 4581250 5827703 3778950 -1070611 -4962136 -5229874 -3568927
41597 -3568927 -3273208 -4447788 -4380862 -2291479 -855775 -2027391 -3673942 -2382467 1572129
41588 1572129 4299496 3256160 259739 -1126371 109763 1937276 2470425 2139641
41580 2139641 2263113 2634612 1812769 -417750 -2209351 -1818842 246461 1963252 2126442
41571 2126442 1286764 819398 1701977 3774567 5585535 5481887 3507711 1586015 1091098
41562 1091098 1129856 272103 -1059460 -1439594 -704660 506623 2463177 5078364 5817426
41553 5817426 2413107 -2265795 -2218744 3378684 7928813 6131786 1322879 240242
41545 240242 3232684 4665305 1938783 -1185159 -919085 1452900 2656141 2231864 2042140
41536 2042140 3283416 5967370 9495831 11922515 10429027 4690111 -1439712 -3642848
41528 -3642848 -1737062 1145354 2950045 4083223 4973967 4825756 3349588 1837264
41520 1837264 1519135 1972907 1977639 1141872 20337 -687505 -453747 833877 2221461
41511 2221461 2035224 -41144 -1753027 -556354 2970980 5612564 5785315 5469667 6749469
41502 6749469 8352300 7868108 6072770 5901662 7360868 6963229 3202235 -726986 -1604137
41493 -1604137 -688303 -839742 -1476090 113899 3687238 5896687 5014346 2783990 1475234
41484 1475234 1690791 3136112 5032306 5681734 4072328 1914838 1634476 2640839 2505636
41475 2505636 1440491 1830325 3164579 1870198 -2595488 -5908122 -5166565 -2827812
41467 -2827812 -1728894 -329168 3479927 7400682 7912893 5791796 4038451 2562965
41459 2562965 -247395 -2409798 -303234 4742057 7210013 5347215 3461535 5003269
41451 5003269 7780181 8037781 5583976 2477361 -376033 -2695270 -3170029 -1106877
41443 -1106877 1507250 1855231 -396287 -3056323 -3940334 -2357593 906709 3787547
41435 3787547 3910100 793039 -3083630 -4331319 -1844544 2297924 4865051 4333250
41427 4333250 2125047 1025149 2094860 3556457 3206932 1182964 -615577 -1103746
41419 -1103746 -677118 243542 1928620 4674264 8310026 12034327 14264356 13817012 11984550
41410 11984550 11609645 12832986 12197721 8124077 4427839 4940826 7247095 6456387 3264813
41401 3264813 2507750 4554760 4650217 1392319 -808974 290316 717021 -2610492 -6465638
41392 -6465638 -7079684 -6315507 -7328073 -8305511 -5939433 -1978450 -731246 -2143528 -2697124
41383 -2697124 -1710853 -1525103 -2289681 -1690961 167322 184752 -2868332 -6524955 -8140817
41374 -8140817 -7263080 -4439762 -595069 2376306 3046138 2364540 1924904 1267145 -433301
41365 -433301 -1375930 620983 3870036 4682502 2896335 1592363 1742781 1400034 137273
41356 137273 -195509 416810 -202419 -1757680 -914524 3141386 6713276 6971688 5551344
41347 5551344 4795434 3995719 1787973 -671923 -1418710 -429449 1100367 2180696 1666667
41338 1666667 -900483 -3130508 -1648098 2644511 4708537 2373317 -646287 -859595
41330 -859595 21148 -692700 -1387129 707068 3929342 4300959 1613849 -644203 -457292
41321 -457292 1075946 2441746 3025129 2482177 1382961 1534898 3393392 4554671 3188418
41312 3188418 1179214 1132282 2257389 2464233 2508255 4107061 5604615 4079230 866164
41303 866164 211868 2547409 3768419 1729899 -1017138 -2065942 -2495216 -3538344 -3468335
41294 -3468335 -213021 5207160 9784300 11485200 10113988 7110345 5281043 6568900
41286 6568900 9130968 8739661 4078485 -1411566 -3933355 -3447361 -2239049 -1478664 -810859
41277 -810859 22512 548127 -130477 -2683099 -6104905 -7283070 -4095942 1153397 3935628
41268 3935628 3241228 2169950 2463930 2205554 271729 -906556 408812 1675729 85110
41259 85110 -2429335 -1947229 1386945 3868414 3833094 3121884 3313199 3893685 4345351
41250 4345351 5002297 5276055 3664299 309125 -2678170 -4275863 -5919013 -8770595
41242 -8770595 -11322510 -11051773 -7518222 -2799615 581492 1563562 918091 171484 -93592
41233 -93592 -751744 -2541858 -4584382 -5550491 -5733547 -6331052 -6901340 -5637878 -2656111
41224 -2656111 -803936 -1824214 -3444668 -2283198 1326125 3655709 2598204 233816
41216 233816 -243802 1523119 3331653 3543067 2529762 1434606 789246 457500 78104
41207 78104 -545326 -866281 396804 3719269 7316933 8453534 6452996 3232729 599287
41198 599287 -1439013 -3122026 -3713717 -3229937 -3506954 -5409461 -6476045 -4057884 240011
41189 240011 2514700 2526885 3837524 7341737 8863936 5490775 799483 226478 3405668
41180 3405668 5189330 3435619 1506821 2315392 3697952 1971670 -2280885 -4875260
41172 -4875260 -3738657 -1387666 -1281436 -3593553 -5688716 -5624567 -3770275 -1471345 365334
41163 365334 1295184 1349969 1390046 2165356 2726175 1500349 -402322 667516 5688070
41154 5688070 10156867 9320084 4601083 1377825 1406136 1629617 464260 568563 3799595
41145 3799595 7442764 7977515 5670134 2963928 835900 -704858 -764459 988227 2691636
41136 2691636 2627666 1686479 1292929 756034 -719815 -1298420 992149 4353335 5124236
41127 5124236 2792879 34809 -1492461 -2201068 -1985098 -39244 2639126 3718058
41119 3718058 2958405 2482827 3196456 3474105 1946669 -673581 -3052064 -4504230 -4506994
41110 -4506994 -2879501 -653846 958240 2200639 3478807 3227356 -191782 -4943457
41102 -4943457 -7235382 -6362662 -5053104 -4721768 -4016520 -2668511 -2847992 -5141353 -6632146
41093 -6632146 -4993745 -1664818 1005155 3143105 5782619 8224953 9207858 8988811
41085 8988811 8431332 7556029 6339901 5162896 3379836 -252690 -4508619 -5843546
41077 -5843546 -3422102 -1175046 -2474330 -5351314 -5821961 -3749789 -2256229 -2910825
41069 -2910825 -4582831 -5897718 -6011249 -3968129 5829 3432271 4289018 3922547 4900176
41060 4900176 6987633 7844896 6873732 5691328 5275591 5094322 4741755 4327242 3611042
41051 3611042 2472824 1487074 540601 -1620914 -4585067 -5096804 -1503122 2584757 2632593
41042 2632593 -303793 -1385114 728661 2765381 2617001 1697313 1148655 -11610 -2014376
41033 -2014376 -3388500 -3853371 -4611855 -4980243 -2630333 1693639 3836895 2336368 846336
41024 846336 2249723 4233575 3590737 1422874 565317 586196 -829463 -3305782 -4199801
41015 -4199801 -2611291 -85727 1819270 2318009 887045 -1740806 -3287271 -2783281
41007 -2783281 -2205614 -3049480 -3322100 -957541 1805942 1405197 -1073856 -1421720 729235
40998 729235 1319383 -1295354 -3836226 -3964721 -3885655 -5354842 -5340485 -768673 5339812
40989 5339812 7331426 5115217 3825979 5223875 4609256 -1523124 -8876184 -10216365
40981 -10216365 -4806275 1074558 2569341 1268041 857959 1359145 320357 -2376792
40973 -2376792 -4196632 -3903037 -2901772 -2222526 -634249 3096592 7777431 10930432
40965 10930432 11345393 9543000 6693271 4063529 2649674 2272880 1687673 510469
40957 510469 281789 2445716 5846972 7656616 6780932 5157946 5272364 7142946 8394248
40948 8394248 7174820 4470472 2967044 3596493 4236409 2844453 976140 2057485
40940 2057485 6029203 8264220 5370683 143326 -1730697 947696 3586369 2270145
40932 2270145 -1004866 -1289842 2486008 5975541 4879092 10450 -4247953 -5132704
40924 -5132704 -3220044 139668 4109637 6625566 4810213 -625738 -4123518 -1635578
40916 -1635578 3698109 5896602 4434953 3455451 3667904 1115244 -4938532 -9013832
40908 -9013832 -7291609 -3470160 -2934025 -5163634 -6201789 -5236610 -4027370 -2466940
40900 -2466940 350433 2575387 1946389 180273 360007 1445193 385419 -1642234
40892 -1642234 -764239 2485685 3614409 1861946 1221145 2720081 2011479 -3004583 -7849368
40883 -7849368 -7974557 -4940596 -2751712 -2101141 -1725671 -1864829 -2746363 -2663509 -967413
40874 -967413 -103919 -1356058 -1578314 2011236 6432284 6535982 2128954 -2438025 -4309603
40865 -4309603 -4135081 -3501307 -3879538 -6680879 -10852231 -11948901 -7307774 -650647 2355002
40856 2355002 1530047 788866 895943 -887164 -4328916 -5226885 -2006146 1564562 1823813
40847 1823813 -695419 -3940118 -6958510 -8303554 -6030149 -1452270 879326 -633311
40839 -633311 -1936749 626645 5000994 7243880 7570417 8760594 10679650 10466326 7335923
40830 7335923 3805575 2320687 3057171 4696467 5429738 3866272 795647 -814908
40822 -814908 584762 2634440 2257835 219097 -41322 2578013 5603918 6542100 5294582
40813 5294582 3026780 736767 -924209 -2164453 -4270807 -7602414 -9801228 -8168687
40805 -8168687 -3642870 -68597 633056 250152 915897 2333948 3031653 2203953 -418696
40796 -418696 -4310721 -6904088 -5139943 182440 3913457 2505461 -1390258 -2643633
40788 -2643633 -364400 2049330 2606700 2875981 4043923 4246102 1669641 -1957675 -3386926
40779 -3386926 -2265110 -1173920 -1514398 -1651729 86797 2284438 1835700 -2041006 -6456087
40770 -6456087 -7691908 -4803997 -321234 2235732 1557506 -382127 -533655 1770819
40762 1770819 4092105 4123773 2794063 2770134 4363490 4997309 3201586 992175 853945
40753 853945 2012843 1751277 -472718 -2436939 -2480442 -1374372 -617506 -668404 -1412743
40744 -1412743 -2744689 -3787804 -2869901 501031 4312022 5700815 3669408 -295175
40736 -295175 -3716901 -4754596 -3130404 -404666 966184 -304681 -3122588 -5203832
40728 -5203832 -5293830 -3831752 -1728921 758965 3660221 6209419 6847917 4816067 1590288
40719 1590288 -86821 912230 2806619 3182427 1945708 940673 1059190 1237120 518482
40710 518482 -314351 109142 1891672 3862957 4824523 4321213 2748530 1097130 133620
40701 133620 -302323 -663641 -621446 288592 1132228 368395 -1439092 -1560088 1178863
40692 1178863 4195722 4221631 1514787 -643928 -131326 1820472 2485551 684590 -2035775
40683 -2035775 -2882593 -891942 1488601 1142371 -1188525 -1166609 3290048 8670394 10353653
40674 10353653 8447296 6502306 6006756 5523862 4520808 4321420 4961092 4499115 2421810
40665 2421810 884176 1420384 2905831 3896728 4479528 4493597 2575304 -1086552 -3350712
40656 -3350712 -1917380 1089185 1810795 -137608 -1520954 65619 3722564 6928621
40648 6928621 7909047 6497137 4144562 2957510 3555169 4230217 3312264 1712171 1729762
40639 1729762 3855839 6254216 7085136 5916039 3180021 -125721 -2206638 -1543568
40631 -1543568 1250015 3509861 2853272 -776281 -4946851 -6227643 -2869629 2968260
40623 2968260 6609558 5774802 3217974 2975981 5018318 5720490 3040759 -1204378 -4265838
40614 -4265838 -5404327 -5448108 -5280966 -5381302 -5516467 -4684713 -2647548 -1199773 -2081356
40605 -2081356 -3979753 -4018327 -2157686 -1221375 -2117501 -2367917 -677426 467741 -853915
40596 -853915 -1960490 856632 6525582 10368324 10177449 7969438 6101094 4752273
40588 4752273 3544506 2912533 2999557 3148588 3242859 3937517 4989019 4986740 3465801 1789391
40578 1789391 1079019 638948 -495638 -1608640 -1295876 198224 1085054 563360 142825
40569 142825 1770126 5000227 6841117 4891908 289189 -3315675 -3812311 -2584723
40561 -2584723 -1804198 -1088474 1412292 5096996 6366244 2964320 -2569817 -5318268
40553 -5318268 -3473328 -143464 527439 -1920851 -4147756 -3202821 187623 2884366
40545 2884366 2994546 1220471 -1024606 -3300863 -5506453 -6958345 -7196859 -6906906 -6947634
40536 -6947634 -6997850 -6208064 -4771202 -3726616 -3362821 -2785771 -1086160 1666974 4346144
40527 4346144 5170930 2879133 -1564045 -5020944 -5120958 -2804011 -894110 -655922 -1032635
40518 -1032635 -767578 363478 2253470 4685891 6675402 7065632 6080946 5133878 5073164
40509 5073164 5707999 6564979 6530862 3556065 -2659830 -7955553 -7066912 -585110 4719369
40500 4719369 4169730 680891 -301651 1659996 2901237 1893381 437752 -490946 -2029086
40491 -2029086 -4399685 -6129114 -6869436 -7845807 -8777248 -7650739 -4821892 -3945005 -6568204
40482 -6568204 -8699424 -5849741 474538 4776502 4955338 4028462 4718793 6207169 7293898
40473 7293898 9176334 12654017 15044312 13045860 7686078 3503332 2931721 4041529
40465 4041529 4159319 3231269 2588467 2503191 2520219 2686466 2804622 1701084 -979529
40456 -979529 -3324661 -3577551 -3152880 -4664698 -7284513 -7158541 -3216091 405593 -384515
40447 -384515 -4069720 -5558474 -2550837 2466665 5989305 6975907 6529129 6106730 6681174
40438 6681174 8320730 9847867 9688585 7610247 5143801 4006781 4525079 5734951
40430 5734951 6562171 6661138 6338485 5851295 4929912 3275680 1372933 45545 -915412
40421 -915412 -2618618 -5062839 -6521583 -6031379 -5367638 -6850998 -9750129 -10759952 -8162228
40412 -8162228 -3909735 -1182337 -1176737 -2800759 -4396304 -5062414 -4973935 -4938292 -5306060
40403 -5306060 -5355426 -4380265 -3139622 -3123339 -4355143 -5198670 -4699849 -3862156 -3886398 -4167344
40393 -4167344 -3025017 41565 3554068 5279674 3983569 488730 -2624630 -2903059
40385 -2903059 -167000 3340906 5091887 4342975 2229479 403773 -299880 -318273 -604209
40376 -604209 -1252222 -1302347 -356684 420118 -31245 -790143 -394090 355940 -781712 -3714431
40366 -3714431 -5440128 -4176037 -1972169 -1730069 -3206504 -3763991 -2187096 -76703
40358 -76703 310808 -1368848 -2946365 -1487716 3479911 8387537 8859821 5042127 1767995
40349 1767995 2511766 5461574 7129291 7267394 7533434 7438619 5334925 2468844 2178980
40340 2178980 4909905 7403835 7472027 6567705 6755396 7918425 9082530 9917906 9674036
40331 9674036 7200605 3588846 2230211 4157405 5615900 2874509 -2344383 -5192327
40323 -5192327 -4197072 -2175582 -1223526 -366421 1249936 2171483 1308608 336342 1177638
40314 1177638 2567121 1536461 -2251657 -5937887 -7341034 -7281654 -7262186 -6763373 -4584169
40305 -4584169 -1762183 -867660 -2319776 -3462146 -2085588 851023 3204994 4746061
40297 4746061 6404958 7567053 6585743 3782216 1515064 872968 569993 -93473 456811
40288 456811 3194025 5843952 5411172 2444708 536818 1677540 3908364 3910404 695992
40279 695992 -3610477 -5862450 -4609404 -1314071 1201256 1899925 2537227 4814654 7426411
40270 7426411 7467062 4462366 1249882 478476 1701976 2723401 2720680 2890508 4322595
40261 4322595 6202105 6525598 4494396 1859308 1329197 3446169 5728986 5543057 3230843
40252 3230843 1513903 2238279 4735341 7024349 7377464 4907851 204150 -4228549
40244 -4228549 -5560786 -3515471 -892545 -633566 -2929872 -5498038 -5910860 -3315628
40236 -3315628 1249316 5615276 8082075 8655682 8384533 7728183 6489632 5019466 3915713
40227 3915713 2496034 -449890 -3839327 -4510097 -1616294 1318167 867419 -1348741
40219 -1348741 -764608 3895414 9013044 10421303 7140032 1102173 -4429817 -6288761
40211 -6288761 -3930433 -922901 -1308862 -3947113 -3442076 2139452 7677226 7341898 1855119
40202 1855119 -3471289 -5816181 -6408264 -6285196 -4609541 -1454616 1217718 2304813
40194 2304813 2551939 1942182 -991299 -5710138 -8182956 -5263562 945368 5284488
40186 5284488 5140597 2102700 -895910 -2020555 -803311 1825521 3722315 3342967
40178 3342967 1496011 271768 661362 2368585 5063066 7978137 9025277 6795815
40170 6795815 3347553 2367396 4067846 4525462 1180659 -3425621 -5077925 -3152640
40162 -3152640 -523847 446121 -174083 -1184430 -1698993 -1614334 -1718950 -2746595 -3625680
40153 -3625680 -2023719 2189302 5647575 5504773 3354536 2916393 4955193 7083775
40145 7083775 7801193 7794365 7498419 6397900 5049549 4965335 5896240 5859384 4467060 3497076
40135 3497076 3482086 2876073 1760024 2852446 6740831 9528683 8305695 6048761 7162399
40126 7162399 10309495 10434455 7059436 5444660 8616973 12720167 12475930 8037759
40118 8037759 3712598 1920204 1253271 -306174 -2656344 -4151735 -3465585 -689725
40110 -689725 2617769 4503199 4339758 3435013 3553018 5009010 6528648 6771449 5718391
40101 5718391 4678720 4971656 6374754 7003133 5234533 1785832 -667816 -153600 2624626
40092 2624626 5028376 4919300 2402993 -517206 -1964900 -1896676 -1582576 -1636310 -1523671
40083 -1523671 -1165268 -1518025 -2609964 -2527218 -141515 2224959 1210512 -2770833 -5474817
40074 -5474817 -4004518 -76528 2550658 2197078 -58639 -2355883 -3547125 -3531836 -3046117
40065 -3046117 -2865636 -2988947 -2935743 -2547957 -1843648 -659161 653537 1111183 1002649
40056 1002649 2548026 6466581 9248669 7048197 1505627 -2087772 -2146220 -1934159 -3065695
40047 -3065695 -3083342 -1144259 -640631 -2992231 -3853416 101616 4809285 4423947 15039
40038 15039 -2961517 -3277316 -3827212 -4687278 -3097645 -10086 79548 -3308186 -5359601
40029 -5359601 -3634743 -1207073 -347517 1037456 3919308 4675699 905068 -3843154
40021 -3843154 -5252643 -4343211 -4235908 -4332227 -2420611 135168 273686 -1442935 -2019270
40012 -2019270 -1299153 -1653976 -3262850 -3906111 -2968557 -1793945 -577735 1232453 1999502
40003 1999502 -380877 -3927566 -4156565 -658664 2258172 2319294 2176196 4070327 6098635
39994 6098635 6183287 5714098 6150061 5463839 1673488 -2749539 -4016208 -2666238 -1950210
39985 -1950210 -1958234 -34189 3267948 3645665 -192184 -3563429 -2189492 1724848 3065198
39976 3065198 1182174 -266991 147167 -318928 -3227408 -5745369 -5153048 -3456324 -4029820
39967 -4029820 -5618968 -4041180 571414 2972758 579337 -2283757 -731836 3489723
39959 3489723 4981665 2563118 -219609 -1258028 -1793736 -2107377 -84272 4370722
39951 4370722 7385495 5853977 1307757 -2929693 -5676411 -6721475 -4643237 787163
39943 787163 5835372 6190557 2653089 379212 2454169 6700410 8938990 7207223
39935 7207223 2634367 -1795191 -3164121 -1229073 735980 -435185 -3329711 -3353052
39927 -3353052 1049031 6033773 7276889 5078993 3016052 3140146 4378405 4833271
39919 4833271 4006431 2948376 3107249 4687716 5747092 3922526 -234552 -2975060
39911 -2975060 -1805699 788988 14323 -5061660 -9889082 -9553979 -4238721 1258443
39903 1258443 2761319 620161 -1450565 -670720 2198432 4401367 4467301 3141760 1576719
39894 1576719 83108 -1043655 -1028117 78645 825051 336881 -159348 723659 1955521
39885 1955521 1326245 -1184600 -3295046 -3667946 -3304620 -3438574 -4039054 -4991216 -6713219
39876 -6713219 -8503161 -8095780 -4424748 408847 3375980 3690307 2434310 314859
39868 314859 -2314469 -4077512 -3499863 -1281468 215593 17838 -410013 520914 2441133
39859 2441133 3639777 2813040 76796 -2792510 -3203968 -119646 4261313 6417336
39851 6417336 5291736 2893956 1037441 -649915 -2596575 -3044066 29891 5289921
39843 5289921 8352551 6483403 2081552 401252 3665238 8302410 8994104 5094909
39835 5094909 1377562 1905265 5179509 7016151 6430931 5860956 6412938 6306097 4476107
39826 4476107 2645366 2548421 3462312 3864867 3555351 2757510 944133 -1945705 -4575504
39817 -4575504 -5771173 -5733091 -4931955 -3557321 -2811796 -4442804 -7759946 -9496455 -8107442
39808 -8107442 -5709394 -4132998 -2041962 1645386 4505019 4036153 1903308 1257549
39800 1257549 1904656 1744128 1014376 1162950 1298601 -557 -1006232 462654 2233975
39791 2233975 782323 -2295498 -2578931 -723431 -1535431 -5204148 -6598595 -4381080
39783 -4381080 -3314242 -5112126 -4653237 641967 4797289 2283848 -2831773 -3340756
39775 -3340756 -30902 766417 -2212772 -4321936 -3433733 -2424415 -3259521 -4376979 -4672232
39766 -4672232 -5410659 -7199113 -8596861 -8387435 -6554862 -3241590 628899 2588241
39758 2588241 1456218 -233148 167186 1040684 -353327 -2206053 -748364 2553714
39750 2553714 2233478 -2584809 -6551299 -6055565 -3437602 -1732754 -464801 1113176
39742 1113176 1411991 -108790 -1110932 -706234 -1640111 -5096167 -7162648 -4222078 1234089
39733 1234089 4128813 3707316 2964479 3161975 3191683 3310275 5221591 8354058 9593918
39724 9593918 7493694 4177185 2161118 1206039 -530097 -3239401 -4555322 -2178381
39716 -2178381 2805439 6109536 4787491 1048870 -90438 3260262 8240229 11390184
39708 11390184 11882360 10344267 7518013 5145951 5200480 6693203 6084439 2577213 -72120
39699 -72120 713467 1985976 -139511 -4206333 -5571609 -3054221 520604 3263172 5648574
39690 5648574 7411986 6993487 4661354 3034933 3596659 5010580 5592570 5490708 5818881
39681 5818881 7146354 9107627 10256518 8611565 3886411 -1237172 -3767944 -3903356
39673 -3903356 -4098999 -5220927 -5771616 -4696515 -2825314 -1496792 -1518551 -3218233 -5656319
39664 -5656319 -6250805 -3402226 807063 2841083 2318365 1784799 2119561 1430834 -848559
39655 -848559 -2095982 -367593 2507192 3794670 3884108 5064122 7343831 7929322 4989817
39646 4989817 314581 -2512091 -1981241 13291 831350 347499 505868 1920913 2899259
39637 2899259 2624278 3065554 5756271 8523470 8238918 5724318 4713164 6209361 7086680
39628 7086680 4800509 745047 -1919576 -1569292 1467831 5682803 8710492 8644116 5874980
39619 5874980 2482885 -220008 -2126384 -2883135 -2216738 -1373756 -1725355 -2147778 -556431
39610 -556431 2161180 3004914 1684397 817813 816989 -1126698 -5488795 -8130369 -6002027
39601 -6002027 -1475357 1768333 3841728 6528690 9051302 9580420 8823710 8642377 8736117
39592 8736117 7784184 6237632 4975082 2916037 -803636 -3854647 -3310236 -1017
39584 -1017 2881731 4177166 4536175 3528022 912063 -647189 1250337 3655361 1393920
39575 1393920 -4677910 -7774231 -4588811 453880 2364587 2288986 3878648 6692560
39567 6692560 7286131 4925493 2461344 2121799 3204634 3855258 3242614 1927395 1158773
39558 1158773 1611434 2347981 1861466 560971 784616 3393865 5802640 4876539 907749
39549 907749 -2711364 -3290630 -1228512 1015243 1465039 382348 -115076 1389246 3417988
39540 3417988 3006236 -459741 -4163701 -5242682 -3873116 -2047330 -628309 917487
39532 917487 2625577 3385355 2165453 -823940 -3996780 -5186017 -3388757 -231990
39524 -231990 1219673 -181506 -2377732 -2864933 -1663586 -495712 2663 770576 2407466
39515 2407466 4038662 4131680 1860739 -1957624 -4786302 -4077093 -92393 3557669 3301767
39506 3301767 -763812 -5390369 -7679621 -7118260 -4963481 -3126428 -3241139 -5170434
39498 -5170434 -6439527 -4709507 -1003412 1053975 -400699 -3396824 -5076000 -5146403
39490 -5146403 -5202103 -5871011 -6398526 -6566836 -7182525 -8338029 -8637884 -6968015 -4144911
39481 -4144911 -1850812 -399957 1377930 4013335 6161456 6091808 3922717 1609563
39473 1609563 674917 530284 -609976 -3441776 -6656206 -8323706 -7782525 -5923816 -4011503
39464 -4011503 -2836886 -2898681 -4427446 -6669487 -7895496 -7075794 -5216116 -4102732 -4002302
39455 -4002302 -3700054 -2595814 -1326989 -223340 1217071 2847795 3561257 3191317 2934914
39446 2934914 2882296 1267063 -2112589 -3932121 -1505918 2683638 3876370 1510513
39438 1510513 -762799 -1114967 -1458315 -2715521 -2485278 549646 3454231 3079723 654638
39429 654638 -611945 -461787 -926179 -2108379 -1934610 332618 3062349 4606390 4607764
39420 4607764 3429742 2288439 3155014 6184840 8167377 6442350 3568656 4377511
39412 4377511 8460547 9976069 6146392 1496004 914376 2306494 251482 -5380995
39404 -5380995 -9229487 -8248634 -5242053 -3798369 -3432447 -1595074 2062585 5568063
39396 5568063 7228800 6546192 3734992 111960 -1940011 -1258152 333273 271725 -1101378
39387 -1101378 -1100539 1089516 2956022 2237227 93035 -679388 724420 2860029 4511539
39378 4511539 5662429 6343508 6161324 5047578 3261305 786393 -1949883 -3064414
39370 -3064414 -871178 3158005 5171077 3655245 1564573 2332861 5301933 6941124
39362 6941124 5551282 2739208 811659 759789 2594701 5510046 7374070 6050072
39354 6050072 2037785 -1718607 -3416802 -4206947 -5369749 -5440863 -2267759 2818677 5333129
39345 5333129 2737247 -2400317 -5323497 -4173950 -1089942 1088786 1706528 1665403 1300162
39336 1300162 142574 -1508848 -2171761 -1072719 236618 -752767 -4456806 -8389918
39328 -8389918 -9849280 -8788583 -7361680 -7038593 -7156876 -6394732 -4658419 -2904077 -1777880
39319 -1777880 -1240876 -1110952 -1065081 -359480 1416843 3382541 4284847 4393365 5038872
39310 5038872 5942798 4835309 884529 -3072672 -3449538 -49768 4375314 7637195
39302 7637195 9091256 8096823 4429775 268475 -1125933 435767 1554961 -206876
39294 -206876 -3468611 -5726960 -6584050 -6802085 -6259618 -4740421 -3179036 -2360366 -1727922
39285 -1727922 -905027 -709068 -1148076 -544631 1299594 1382074 -2263157 -6702831 -7886020
39276 -7886020 -6495633 -5981776 -6166256 -3809196 717949 2786609 750494 -1255432
39268 -1255432 -42558 1632491 -9779 -3562642 -4952261 -3452479 -1322742 375963
39260 375963 1497644 85156 -5291006 -10982986 -10890053 -4467468 1992646 3507651 2121400
39251 2121400 2394386 4568240 5478900 4139479 2610188 1893550 487341 -2335755 -4624948
39242 -4624948 -4536535 -3076040 -2376443 -2572890 -2299887 -1516954 -1667377 -3029616 -3985809
39233 -3985809 -3563021 -2938572 -3419320 -4462276 -5008087 -5410359 -6337076 -6792416 -5239205
39224 -5239205 -2135936 629157 2476531 4216967 5584201 5109018 2893976 1252361
39216 1252361 1730670 3370500 4707152 5557648 5918916 5148959 3487697 2415724 2026545
39207 2026545 41061 -4621904 -9030598 -9348910 -5633319 -1280444 1408744 2788071
39199 2788071 3584571 3510468 2331015 592932 -933211 -1554953 -883902 235694 47064
39190 47064 -1532774 -2033428 9966 2245636 1902542 479938 1434574 4039466 3948173
39181 3948173 263006 -2498008 -1187162 1206691 198680 -3867667 -7139824 -7637576
39173 -7637576 -6249236 -4004662 -1453064 228147 323675 176065 1311558 2754121 2701502
39164 2701502 1996641 2857907 4554751 3885789 523650 -1576138 367825 3927528 4895372
39155 4895372 2518736 -893742 -3620987 -5050017 -4021054 -67194 4017654 4287874
39147 4287874 1029366 -1057827 565196 2487876 517047 -3836735 -5506525 -3166518
39139 -3166518 -332822 766809 2089525 5035129 6724519 4004266 -1441142 -5341458
39131 -5341458 -6464456 -6507115 -5701595 -2670717 1577316 3748851 3192161 2940787 4529363
39122 4529363 5459087 3779255 1607957 1266499 1068165 -1329323 -3726944 -1996770 3097523
39113 3097523 6111569 4193470 389072 -1149391 -71182 1242086 1010499 -1055505
39105 -1055505 -4123809 -6234221 -5665714 -3345125 -2181449 -3048131 -3228163 52664 6237130
39096 6237130 12565195 16713113 17266782 13890013 8792090 5939445 6626545 7592610 5791494
39087 5791494 3065220 3089421 5396674 6352264 5286915 5247846 7191400 7771796 4633843
39078 4633843 331201 -1376871 -315441 1534540 3685775 6193185 6896600 3342733
39070 3342733 -3021512 -7766099 -8708698 -7667349 -6929641 -6609168 -5975345 -4929174 -3322030
39061 -3322030 -919699 1135112 926856 -1204857 -2393802 -1264438 -74925 -1187885
39053 -1187885 -3450753 -4248175 -3402144 -2421108 -1198196 1503722 4904257 6670502 6568549
39044 6568549 6717363 7779448 7799489 5773185 3682422 3597570 5043557 6693437 8401458
39035 8401458 9774032 8960380 5283499 1441227 548389 2163647 3637924 4143105 4575135
39026 4575135 4527351 2728409 150685 -745156 -35218 -150077 -1146061 14785 4013022
39017 4013022 6792585 5182839 1785603 1051797 2882142 3812696 2945641 2601723 3581997
39008 3581997 3759647 1895176 -460128 -1717259 -2035167 -1449753 849949 3931764 4551677
38999 4551677 1310227 -2681480 -3645145 -2111229 -1520778 -2883175 -3671006 -2004225 606905
38990 606905 1517798 278915 -1263576 -1248618 567006 2887331 4094543 3745311 3045985
38981 3045985 3467438 4893819 5703368 4781273 2909177 1957697 3057091 5619640 7761148
38972 7761148 7652183 4992658 1477282 -473064 144050 1872871 2034807 -601453 -4133559
38963 -4133559 -5006206 -1929790 2071747 2851589 415892 -776348 2404493 7573906
38955 7573906 10146732 9255146 7771285 7222270 5911112 2672774 -443726 -920379 744379
38946 744379 2098210 1910173 540389 -1607952 -3850196 -4189637 -1025675 3928614 6598711
38937 6598711 5129675 1819323 -295804 -956430 -1355703 -945359 1950632 6722466 10243180
38928 10243180 10797311 10217890 10849639 12115236 11975174 10516753 9583744 9329253 7949068
38919 7949068 5214901 3451632 3823782 4240966 2735545 543349 -548616 -1710728
38911 -1710728 -4665232 -7336899 -5972691 -1294951 1574933 124632 -2293600 -1623944
38903 -1623944 1749819 4878118 6316177 6007244 3649127 -9060 -2062028 -536366
38895 -536366 2574959 3933662 3443355 3580659 5030829 5932110 5280718 4376880 4534616
38886 4534616 5476259 6357452 6623039 5652770 3246090 645168 -489611 -274016 -356316
38877 -356316 -1479167 -2648118 -2573979 -611673 3226366 7522010 9384761 7372487 4157472
38868 4157472 3845070 6683704 8992057 8468924 6725342 5966542 6165797 6777339 8476461
38859 8476461 11354441 13501008 13270696 11382616 9272628 7061073 4748725 3736205
38851 3736205 5240772 8348686 11158997 12681484 12365371 9438903 4499876 310306
38843 310306 -986119 -397983 -144979 -382829 298238 2215467 4327089 5678740 5473457
38834 5473457 2984986 -710967 -2377132 -344647 2625307 2742941 325387 -1210561
38826 -1210561 -379218 1553456 3928318 7117357 9719671 9225606 6146421 3973244
38818 3973244 4126823 4350885 3147516 2088042 2053672 1002051 -1905565 -3338132 -375860
38809 -375860 4463490 6481837 5264531 4029266 3797960 2509660 -253365 -1879287
38801 -1879287 -1019010 211575 -181283 -1062897 -490523 1239617 2823882 4388062 6428380
38792 6428380 7543938 5730525 1667010 -1392321 -1277184 1076295 3474051 4724567
38784 4724567 4429879 2135418 -1761985 -4925481 -4642269 -869732 3381885 5301570
38776 5301570 5050219 4498692 4087874 2531591 -442789 -2965121 -3672048 -4048845 -6320602
38767 -6320602 -9640943 -10563577 -7658043 -3606919 -1546914 -991152 737643 4017630
38759 4017630 6255939 5746163 3973820 3266014 3949627 5056962 6315950 7734278 8268019
38750 8268019 6969417 5062961 4800217 6128554 6517171 4691606 2640215 2778243 4667214
38741 4667214 6086447 6321219 6628691 7833768 9104872 9301035 8386060 7199258 6580925
38732 6580925 6895398 7738155 7917568 6321599 3135063 -87623 -1789791 -1801313 -1361539
38723 -1361539 -1776041 -3015369 -3862787 -3665923 -3348321 -3814062 -3931123 -1816770 1775339
38714 1775339 3469003 1698972 -719639 -42901 3829771 8020644 10592295 11617686
38706 11617686 11342364 9872936 8358199 7984350 7755760 5583676 1706594 -1311030
38698 -1311030 -2196767 -2067764 -1541575 338457 3300281 4963506 4496699 4447933 6643624
38689 6643624 8617794 6966346 2533030 -797993 -1266595 -57061 2065267 5246593
38681 5246593 7819630 7041680 3624915 2086159 4788746 8510026 9158835 7367667
38673 7367667 6488125 6943311 6212650 3733893 2125367 3109132 5449909 7883301 10935435
38664 10935435 14125835 14353634 9930092 4275215 2379005 4613316 7199578 8162583
38656 8162583 9362873 12596949 17216445 22311378 27917766 33115190 36409479 39273963
38648 39273963 45499723 55333210 64754355 73270328 87276707 111386319 142035980 176345149
38640 176345149 221227712 281554969 340226363 364111940 336535802 275572378 213931175
38633 213931175 168222584 135093626 109054818 90823137 79609978 69566982 57641600
38626 57641600 47456826 42038535 38635726 34004750 29525208 27257055 25282028 21209991
38618 21209991 17006698 15864526 16477740 14872788 10807462 8170001 9032531 10755037
38610 10755037 9790433 6073636 2744489 2741502 5969850 9058501 8341518 4009449 409838
38601 409838 878021 3456684 3901545 1969309 1560216 4379303 6848915 5116509 665494
38592 665494 -1675772 -90266 2561090 3205066 2152116 1444791 1536201 1165183 -259778
38583 -259778 -1652519 -1697303 -387594 1205662 2246660 2893072 3855985 5363460 6668061
38574 6668061 6740590 5422433 3583494 2095170 1096765 422697 91433 -105722 -845923
38565 -845923 -2306300 -3420189 -3093774 -1961061 -1890247 -3690334 -6163571 -7425490 -6312311
38556 -6312311 -2701642 2224339 5886683 6018905 3234155 757179 739329 1746189 820820
38547 820820 -2676157 -6281888 -7152091 -4848665 -1577873 -20809 -779141 -2052937 -2252631
38538 -2252631 -2391393 -4708388 -9226396 -13289254 -14556683 -12724814 -8255732 -1794855
38530 -1794855 4462985 7418888 6542360 4563727 3323264 1460623 -1832636 -3638093
38522 -3638093 -1127926 3460093 5420655 4078084 3004504 4356807 6803147 9060207
38514 9060207 11564338 13790346 13509377 10286881 6866578 5329910 4219388 1327693
38506 1327693 -2545014 -4560767 -3297342 358242 4627787 7593592 7487769 4034036
38498 4034036 -607588 -3461625 -3536534 -2427458 -1962650 -1659526 790615 5998983 10592322
38489 10592322 10272529 5418993 1307122 1477073 3344070 2581367 -614980 -2908358
38481 -2908358 -3417092 -3732621 -3636898 -1668123 403086 -1027978 -4798884 -5156312 -308562
38472 -308562 4405480 4625796 3267885 4804293 7538195 6698148 2488372 -408448 -197533
38463 -197533 184438 -1422214 -3306291 -3077117 -771040 2086359 4091457 3972249 1103728
38454 1103728 -3246472 -6775596 -8758128 -10481156 -12791213 -14553529 -14094856 -11347311
38446 -11347311 -8114270 -6431111 -6500866 -6147427 -3016543 2376987 6723513 7464730 5209638
38437 5209638 2183453 -339181 -2251590 -3568873 -4174035 -3789298 -1816289 1671824
38429 1671824 4789314 5462004 4258389 3415532 3031474 1147687 -2004161 -3362861 -1634709
38420 -1634709 1178293 4049108 8315859 12890369 13201300 8277233 3919451 4357155
38412 4357155 5487359 2081777 -2623790 -1824321 3195770 4410861 -775395 -6454701
38404 -6454701 -7751189 -6241779 -4526823 -2104173 1061150 2604449 2054397 2297176
38396 2297176 4406696 5511444 4101698 3019689 4603539 6971381 7798889 7934098
38388 7934098 8535755 8349209 6804520 6440511 9123810 12737193 14515404 14908434 15290983
38379 15290983 14550340 11049249 5859154 1341228 -1553089 -2428294 -330561 4126602
38371 4126602 7834856 8682625 7751485 6256060 3359686 -701230 -2798636 -1341186
38363 -1341186 585660 -135624 -1879770 -1779336 -898137 -1530103 -2021417 623292 4703762
38354 4703762 5617675 2927696 826416 1738581 3741539 4382892 3217210 554342 -2637916
38345 -2637916 -3609336 -284884 4960297 7381978 5835977 3371765 1995981 593207
38337 593207 -1628031 -3424950 -4093714 -4379819 -3975429 -1360968 2924423 5999975 6637812
38328 6637812 6524507 6632778 5644390 3272114 1765641 2236454 2523900 888153 -960996
38319 -960996 -1060427 -974875 -3346246 -7324132 -9626944 -9371011 -8852966 -9572724 -10139484
38310 -10139484 -8836466 -6225140 -3904917 -1869645 1262438 5509572 8587165 8662154
38302 8662154 7052757 6520060 7211670 6543139 3623480 1192414 1506229 2674323 1656235
38293 1656235 -918005 -2066260 -1394126 -1219245 -2278214 -2947840 -2889529 -3846043 -5990463
38284 -5990463 -6815681 -4969204 -2324871 -802966 206741 1619728 2392653 1564213 556634
38275 556634 1140589 2397395 1871049 -881745 -3539230 -3525255 -341364 4088464 6707598
38266 6707598 5641528 1967113 -1176579 -1511870 602501 2861663 2778082 -362732 -4060450
38257 -4060450 -4269808 -418337 2556472 4612 -5622980 -7425494 -3217781 2098346
38249 2098346 3836808 2797830 1772061 1096650 222691 154488 1359031 1982770 953802
38240 953802 418378 2352424 5051920 5789364 4818704 3905657 2936871 987567 -1075984
38231 -1075984 -2094737 -3051256 -5025300 -6394278 -5208682 -2774326 -1579604 -1165389
38223 -1165389 388519 2194770 1678933 -867153 -2738470 -3291667 -4073452 -4800946 -3383493
38214 -3383493 -309626 1008825 -713125 -2677889 -2345746 -886862 -1107871 -4222194
38206 -4222194 -9370385 -14068334 -14869756 -10366538 -4050548 -1362683 -3275227 -5669461
38198 -5669461 -5609625 -4785561 -5477331 -6523870 -5417367 -1940455 2155539 5077836 5346764
38189 5346764 2668257 -252267 448723 4504413 6990418 5075537 2162922 2535167
38181 2535167 4845595 4704982 1734288 -170246 1094308 3246393 3255485 750879 -2467452
38172 -2467452 -4178188 -2948046 639060 4165247 6159089 7725229 9755281 10237142
38164 10237142 7190410 2899692 1473966 2688603 2357880 -790219 -2934460 -1396083
38156 -1396083 942052 180226 -2631155 -3445683 -1393315 404507 -426925 -2887614 -4798284
38147 -4798284 -5295144 -4667262 -3476769 -2527156 -2531719 -3169190 -3161989 -1701167 628271 2449547
38137 2449547 2729423 1375788 -845997 -2985138 -4692762 -6102533 -6866150 -6087109 -3762866
38128 -3762866 -1515602 -957625 -1796429 -2466716 -2232133 -1712867 -1699407 -2436362 -3709809
38119 -3709809 -4579910 -3524789 -302964 2626319 2329576 -772740 -3075951 -2303321 -113123
38110 -113123 648477 -393171 -1583607 -2055449 -2411385 -3135417 -3754715 -3572574 -2514927
38101 -2514927 -1385401 -1434023 -2939253 -4144544 -2960242 -72580 1478891 630187 -32370
38092 -32370 1562893 3539811 3254272 1783397 1974882 3569847 4167624 4235919 6729290
38083 6729290 11397726 13866117 11789504 8168178 6645526 6729599 5844510 3392944 573638
38074 573638 -1465868 -1313610 2281742 7401677 8982816 4620678 -1824172 -5162734
38066 -5162734 -5172829 -4857245 -4707831 -2793245 640925 2764971 2172998 129029 -1816370
38057 -1816370 -2618812 -1054947 2440328 4125246 953224 -4295851 -6024060 -3822420
38049 -3822420 -2922606 -6045435 -9517543 -9143342 -5701922 -2374787 -408192 92862 -1680662
38040 -1680662 -5268692 -7525012 -6052587 -2340499 751472 2737166 4568885 6035365
38032 6035365 6612618 7152111 8158631 7949945 5182939 1897992 1306657 3430847 5429376
38023 5429376 5487548 4005985 1644571 -1319322 -3945222 -5072312 -4773028 -3919650 -2811094
38014 -2811094 -1542966 -747170 -395938 917236 3651741 5627508 4912298 3108968 3103838
38005 3103838 4587100 4764540 2762420 135868 -2509597 -5813961 -8460440 -7469108
37997 -7469108 -2820467 1395041 1930882 -170568 -2519483 -4959713 -7986112 -9800478
37989 -9800478 -7929316 -3133081 665077 632510 -2040137 -3746905 -2437350 256255
37981 256255 969529 -1284508 -3747143 -3400848 -780736 1226355 1442776 1002039 433321
37972 433321 -1011127 -2889679 -3328276 -2036727 -859595 -377920 1080412 3615800 4118114
37963 4118114 779061 -3495359 -4992856 -4165739 -3546514 -2908067 -506122 2266591 2053254
37954 2053254 -842479 -2449176 -1375720 -746216 -2406266 -3374747 -797462 2866359
37946 2866359 3189370 301457 -1677055 -868009 298185 -531211 -2238650 -2332560 -429693
37937 -429693 1566554 1632683 -760175 -4219678 -6124825 -4740954 -1125668 1943043 3162256
37928 3162256 3684899 4653289 5319402 4519712 2741413 1558350 1832815 3304392 4972286
37919 4972286 5194007 2961445 236415 1049889 6150990 10316939 8056069 964898
37911 964898 -4129581 -4006662 -2043506 -1861896 -2363739 -1057108 1532661 3715011 5864235
37902 5864235 8462211 9400572 7011065 3882205 3455472 4069097 1096425 -5165445 -8596199
37893 -8596199 -5414463 893201 4697315 4861529 3917515 3414681 3033392 2742081 3015844
37884 3015844 3356438 2591940 681190 -889114 -550739 1850172 4753323 6260197 6346596
37875 6346596 6824650 7881302 6332685 312667 -5505844 -4030740 4355516 10976404
37867 10976404 9956680 5362050 4053903 6037453 6773165 5544449 5409585 6559003
37859 6559003 6013914 3784598 3494855 5974306 7435485 5510000 2315448 -370527
37851 -370527 -4183991 -9494812 -11916146 -7637830 336399 5276348 4583837 1254845
37843 1254845 -1179343 -1723366 -611264 1699492 3933288 4792860 4705959 5145719 6360489
37834 6360489 7338583 7568838 7099239 5414889 2283981 -717307 -1753576 -1574976 -2452156
37825 -2452156 -4323739 -4693084 -2834618 -1277422 -1892619 -3092147 -2781527 -1940354 -2712047
37816 -2712047 -4188177 -3011745 1698492 6293939 6452676 2032158 -2781832 -3830738
37808 -3830738 -974726 2332822 3213239 2436388 2682140 4418333 5296935 4011939 2720354
37799 2720354 4079362 7250541 8916242 7680708 5387766 4140749 4074156 4533772 5488788
37790 5488788 6601098 6309515 3492219 -393533 -2236306 -616088 2508104 3891603
37782 3891603 2573121 917217 1779208 4856506 6720006 4901931 1020978 -1238426
37774 -1238426 -635725 634187 326857 -1128439 -1758797 -528006 2040989 4671912 6014391
37765 6014391 5339676 3210726 833766 -1486235 -4232784 -6830947 -7466273 -5527102
37757 -5527102 -2804795 -1273060 -988890 -1124209 -1364053 -885946 2080006 7350520 10958124
37748 10958124 9201158 3931059 851670 2568011 6177578 8178615 8838789 10365891
37740 10365891 12958412 14457225 12928010 8564273 3707615 1177278 1522451 2127119
37732 2127119 562245 -1707028 -1347935 1519908 3470314 3642556 5221315 9163612
37724 9163612 10751941 6032966 -1488089 -5000334 -3202841 -389275 844573 1714433
37716 1714433 2273687 -9081 -4942749 -7571963 -4415046 1375294 4073689 2420080
37708 2420080 -181477 -751523 896001 3809307 7028632 9238639 9540248 8746488 8426367
37699 8426367 8828655 9112199 9175980 9582826 9949467 9271006 7895503 7308846 7596576
37690 7596576 6978478 4633118 2271009 1694972 2158721 1643857 -219723 -2241256 -4111912
37681 -4111912 -6708689 -9663346 -10506217 -7451863 -2134888 1631148 1599470 -1074370 -3386601
37672 -3386601 -3184323 -657788 2018096 2594841 927268 -922539 -1315112 -1214433 -2628144
37663 -2628144 -5357705 -7134929 -7188232 -7471347 -9116281 -9627373 -5852161 1218366 7043254
37654 7043254 8738067 7426748 5263440 2722920 7485 -1230844 101195 2006487
37646 2006487 1472714 -1019621 -1513542 2004992 6174575 6100527 1794377 -1347656 1096276
37637 1096276 7369307 11810617 11307447 7871755 5082083 3946247 3257475 2613885 3168557
37628 3168557 5397166 7612604 7456464 4322626 -152759 -3635217 -4808031 -3987061
37620 -3987061 -2587907 -1914670 -2027055 -1643862 553081 4211947 7049462 6889424 4278249
37611 4278249 2479262 4068862 7865825 10366475 10214965 9717652 11192316 13335507
37603 13335507 12861208 8996737 4433865 1778780 831457 30302 -894794 -1021618 -319880
37594 -319880 -176278 -1479304 -3017526 -2660111 -193317 1792868 652101 -2912725 -5299623
37585 -5299623 -4227753 -1393488 -20751 -718684 -1263514 -154897 1344685 1267064 -220870
37576 -220870 -1097160 -197279 1304612 1388797 -349374 -2427672 -3745881 -5108583 -7394337
37567 -7394337 -8938950 -6872102 -1490430 2935642 3152804 920671 83973 1159874
37559 1159874 1431392 -341207 -2159286 -1870524 385360 3221381 5412071 5853964 4214417
37550 4214417 2240094 2438747 4694316 6041128 4588018 1788613 -77672 -685405
37542 -685405 -727222 -195423 701256 484426 -1779799 -4595986 -5701004 -4877325 -3579190
37533 -3579190 -2466103 -956364 1121580 2977482 4041835 4672009 5523533 6713520
37525 6713520 7516699 6742250 3949231 462326 -1601996 -1591862 -813206 -680335 -1402244
37516 -1402244 -2476549 -3075781 -1948194 1207201 4067816 3684194 790240 -406015
37508 -406015 2129350 5388058 5614415 2818942 -929813 -4849625 -8227808 -8387374 -3692346
37499 -3692346 2660409 5467888 3706396 1029251 659081 2506328 4725199 5381995
37491 5381995 3211701 -561924 -1990126 1061237 5101275 5140889 1658664 -639610
37483 -639610 -361155 -729727 -2891862 -3256636 461347 5097423 6768754 6189548 6237927
37474 6237927 7079099 6890750 5439312 4063517 3486199 3799393 5142343 6604735 6264751
37465 6264751 4102590 2768129 3437161 3283993 -278002 -4988252 -6515749 -4270318
37457 -4270318 -1242778 682842 1802293 1723716 -878057 -5266310 -8309940 -7964060 -5254222
37448 -5254222 -2520932 -1297205 -1857473 -3232391 -3777749 -3094645 -2824748 -4101206 -5347940
37439 -5347940 -4742897 -3696702 -4948581 -7781951 -8438794 -5500897 -1685012 454061
37431 454061 1618101 3298860 4804335 4503741 2323754 -513547 -3010707 -4596131
37423 -4596131 -5012772 -4831153 -4894083 -4775762 -3327219 -1180063 -639313 -2142512 -3034262
37414 -3034262 -1484038 308858 -926206 -4533256 -6341030 -3928001 425319 2461019
37406 2461019 513034 -3101445 -4773385 -3301206 -647373 1039545 2065564 3485308
37398 3485308 3753242 6692 -6751810 -10887224 -8657226 -3326872 -1119370 -3418950
37390 -3418950 -5878860 -4700985 -831959 2498364 3905537 4275274 4514683 4299937 2895891
37381 2895891 648877 -682317 366427 2867242 4182129 3266067 1956865 2043053 2665956
37372 2665956 2222489 1239331 1105814 1309291 741703 740105 3397860 7190751 8099847
37363 8099847 5596626 3632708 4385195 4868819 1997529 -2414365 -4705006 -4702811 -4596475
37354 -4596475 -4467191 -2658933 447675 2468470 2364255 938265 -1342798 -4129410
37346 -4129410 -5499473 -3761179 -689046 258417 -1127780 -1889948 -817405 381903
37338 381903 1048971 2600894 4682045 4587896 2231310 1457492 3992226 6169289 4872756
37329 4872756 2889882 4208941 7212681 7664166 6543122 9445827 18451826 29152401
37321 29152401 36125113 37754112 35537768 32136005 30290448 30431913 29379130 24570658
37313 24570658 18876777 17014229 17688211 14737441 6906690 658560 938954 4578927
37305 4578927 6329326 6523482 8089724 9893082 8746967 5837587 5441050 7965309
37297 7965309 9324324 7360322 4459185 3094680 2667757 1988667 1648165 2246154 2591404
37288 2591404 1424324 -373792 -589797 1861496 5709410 8144406 7203269 3966136
37280 3966136 1531475 981555 -72895 -3344898 -6184069 -4819999 -45170 3578189
37272 3578189 3568922 1298653 -1638822 -5007728 -7571397 -7127627 -4165933 -2055611 -2040181
37263 -2040181 -1265817 2323529 6208508 6847435 4488646 1840188 73399 -1076438
37255 -1076438 -1020470 755841 2504948 1906471 -496856 -2040262 -1753634 -1039329 -713119
37246 -713119 147415 1961984 3332868 2853668 930393 -952837 -1981650 -2549938 -3552690
37237 -3552690 -5308406 -6900302 -6885221 -5095510 -3241077 -3110097 -4667187 -6503083 -7473605
37228 -7473605 -7189081 -5678762 -3463490 -1273594 1017784 4147376 7334146 7996478
37220 7996478 5241246 2177754 2393024 5038054 6147569 4467855 2879066 3524449
37212 3524449 4618687 3679894 1557387 1021413 2662983 4392955 4581224 3922825 4063404
37203 4063404 5513149 7219397 7707360 6582364 5032156 4511764 4886617 4614549 3002427
37194 3002427 1283544 865144 1537276 2337550 3189873 4319875 4762057 3231262 425259
37185 425259 -1233948 -539322 1282789 2794397 4174608 5794490 6473914 4921815 2124936
37176 2124936 411897 399020 695079 593515 955717 1942051 2132118 1143940 1047798 3208763
37166 3208763 5348408 4313584 854436 -1232215 -589612 8836 -1831648 -4536148
37158 -4536148 -4858312 -1870096 2749265 6839520 8785490 7887457 5300732 3514936
37150 3514936 3525967 3718330 2913854 2864162 5483453 8876736 9029677 5178849 778866
37141 778866 -1085385 -606007 1050598 4136724 8643820 12213000 12145291 8912817 5756608
37132 5756608 4775301 4871413 3945708 1952808 774424 1314314 1788398 -266825 -4538977
37123 -4538977 -7629962 -6761606 -2930253 481768 1428010 319865 -1764823 -4002069
37115 -4002069 -4988048 -3243607 449194 2914578 2189799 97874 -265560 1313541 2312990
37106 2312990 1323334 -239941 -542324 348697 1373633 2242895 3015880 2981239 1656004
37097 1656004 456153 1427932 4002177 4923624 2494722 -698241 -988497 1567596 3775976
37088 3775976 4112607 4199588 5047433 4718039 1512018 -2576672 -4008018 -2300987 -244529
37079 -244529 13369 -994870 -1739315 -1379789 371924 3133526 5098694 4116652 307477
37070 307477 -3665902 -5528235 -5336483 -4014823 -1624280 1707839 4429090 4800299 3096205
37061 3096205 1346276 1013330 1731608 2128758 1257942 -472603 -1289515 412173 3825693
37052 3825693 5845319 4578698 1999755 1428007 2851756 3175694 1523431 1332691 5064609
37043 5064609 9174139 7972187 1788338 -2789705 -1670426 1739906 2509369 1379562
37035 1379562 2037826 3891536 2984276 -596308 -1959531 858325 3684717 2966189 833839
37026 833839 160687 -790785 -4061128 -6070724 -2086834 5300522 8484747 5235741 819246
37017 819246 -722556 -1354773 -3408464 -4897641 -3591616 -1205759 66049 1494309
37009 1494309 4458152 6370139 4413864 1101570 1345171 5131970 7755691 7043142
37001 7043142 5760207 6043443 5695255 2158716 -2801351 -5136119 -3804141 -1603155
36993 -1603155 -1137538 -1944509 -2092221 -1349202 -1596897 -4138112 -7539820 -8888438 -6830164
36984 -6830164 -2585007 1669152 4215217 3903819 810121 -2590923 -2782002 942676
36976 942676 5245117 6549690 4788806 2088909 -641175 -3631236 -5757074 -4830172
36968 -4830172 -738964 3545100 4827924 2654774 -816371 -3062076 -3089497 -1683885
36960 -1683885 -82923 1393461 2879690 3461140 1668709 -2045812 -4997221 -5445213
36952 -5445213 -4530677 -3850321 -2908867 -794531 1307445 1739253 1378860 2369913 4489689
36943 4489689 5440884 4446139 2860604 1204134 -1625290 -5603597 -8565999 -8947194 -7586987
36934 -7586987 -5871400 -3844665 -1195216 1429986 3301005 4789338 6719855 9132996
36926 9132996 11096286 11190353 8408846 3626237 -245977 -1139620 -547094 -1409969 -3552971
36917 -3552971 -3860601 -1372706 851778 328745 -1266711 -1350239 -888798 -2576904 -5989575
36908 -5989575 -7984741 -7626279 -7332958 -8398929 -8476881 -5447828 -1578768 -975342 -3634926
36899 -3634926 -5001544 -2106387 2319527 3538673 889913 -2159565 -3139779 -2922775
36891 -2922775 -2808680 -2192636 -395110 1541795 2662297 3865141 5917909 7297672
36883 7297672 6255422 3794902 2188347 1466114 -54808 -2370844 -3647874 -3365394
36875 -3365394 -3049139 -3613946 -4190458 -3927123 -2994987 -1502087 802083 3496224 5682485
36866 5682485 7110599 7681361 6576379 3891569 2215180 3847663 6999136 7756364
36858 7756364 5530641 3318813 2682125 2127461 887044 506615 1588319 2310262 1362139
36849 1362139 -625443 -3240121 -6431014 -7957545 -4987786 538182 2771438 111796
36841 111796 -2225430 -377369 2313764 1188602 -2550205 -5025791 -6188658 -8049802
36833 -8049802 -9434939 -7944930 -5211834 -5008435 -7281993 -8624575 -7636196 -5637052
36825 -5637052 -3255386 -555229 605936 -1281925 -3808564 -3425118 -873932 261623
36817 261623 -758697 -1939109 -2943147 -4533860 -4983158 -2473087 64146 -1447579
36809 -1447579 -4621484 -3465985 1317054 2667202 -1018287 -2668464 1805485 6478366
36801 6478366 4836929 -339468 -2359956 -779179 120863 -622317 -410279 1266511 2516774
36792 2516774 3147180 4496743 6210549 6967492 7166954 7537713 6822341 4311071 2601315
36783 2601315 3947531 5974674 5357947 3667977 4449772 6135300 3837461 -2231516
36775 -2231516 -6222818 -5240760 -2770846 -2112099 -1946305 -859453 -1098954 -4157437 -6561856
36766 -6561856 -4311933 1035080 4773367 5772734 6720497 8558537 8839739 6105472 2565221
36757 2565221 1119424 1877503 2849642 2457998 226578 -3472628 -6808882 -6798523 -2289111
36748 -2289111 3637909 6223586 4287279 1129143 -281596 -709721 -1815992 -2363398
36740 -2363398 -228773 3169461 4128771 2171176 560578 743570 312689 -1799439 -2185239
36731 -2185239 1765321 6620951 7125885 3858287 2325725 5131354 9279868 11460166
36723 11460166 11924666 11886803 10544552 6914100 2498476 -166880 -774788 -1451027 -3942855
36714 -3942855 -7429882 -9100568 -6836790 -1570948 3373762 5690943 6040103 5930823
36706 5930823 5118146 2805441 207437 -586231 149314 216592 -843009 -1084614 486796
36697 486796 2433272 3530786 4498161 5846952 6071276 3686714 -160056 -2616700 -2039406
36688 -2039406 845227 3964471 5458229 4931650 3638415 2918696 2580888 1719827 720648
36679 720648 936142 2491632 4020983 4526191 3823882 1430504 -2724778 -6451851 -6848724
36670 -6848724 -4338960 -2567009 -3348684 -4389868 -3331925 -1336518 -681065 -1093827 -828217
36661 -828217 288741 1140811 1361418 1067990 -237165 -2540877 -4163129 -3581020 -1475964
36652 -1475964 570475 2177033 3346284 3063961 772151 -1979956 -3352447 -3461384
36644 -3461384 -2953587 -1080842 2291054 4458598 2892644 -640057 -2327012 -1832035
36636 -1832035 -1903201 -2976360 -2389499 532088 2724036 2094149 448540 -80868 -465230
36627 -465230 -2490035 -5481660 -7511221 -7978305 -7115613 -4829868 -2066292 -1539414 -4677049
36618 -4677049 -8905631 -10143639 -7354899 -2995436 246389 1552035 1609660 1742256 2852741
36609 2852741 4088443 3406574 505918 -2112669 -2366284 -1363274 -1200361 -1577763 -966702
36600 -966702 167487 165757 -597932 -367575 410646 -617429 -3532756 -5441807 -4825007
36591 -4825007 -3599648 -3543433 -3529367 -2236474 -1109117 -2070225 -4006706 -4283515 -2850413
36582 -2850413 -2249547 -3795604 -5925699 -6414949 -4494550 -721185 3576961 6415043
36574 6415043 6160032 3079607 -732261 -3020745 -2527138 640686 4387021 5081901 862236
36565 862236 -5237354 -7503509 -3769956 2117205 4882303 3268467 -156283 -2851669
36557 -2851669 -4035598 -3711764 -2367027 -1513844 -2452890 -4116836 -3918324 -1385885 751419
36548 751419 264297 -1230734 -426764 2848902 5060161 3569589 128969 -1221467 1303856
36539 1303856 5849140 9291771 9782137 7467426 4219942 2640170 3859461 5972481
36531 5972481 5907225 3185781 373072 -680265 -1079208 -2141968 -2510417 -402274 2565165
36522 2565165 2853421 126753 -2041467 -1210446 790578 976503 -702389 -2045228 -1900031
36513 -1900031 -1037924 -506208 -498718 -522613 78423 1384797 2487951 2640548 2708329 3935415
36503 3935415 5206532 3755150 -672851 -4706654 -5648589 -4611963 -3829782 -3230754 -1766791
36494 -1766791 114384 1765549 3931405 6270753 5574723 47259 -6449782 -8501060
36486 -8501060 -6202834 -3885276 -3029547 -1612467 15230 -1356991 -5415340 -7413094
36478 -7413094 -5803670 -5043707 -7521011 -8269675 -2726904 4586710 5426030 -406363 -5012088
36469 -5012088 -3658968 -210659 -183420 -3258296 -5151699 -3824400 -1098711 500219
36461 500219 380562 -373891 -753070 -989144 -1911576 -3259533 -3553043 -2189359 -608883
36452 -608883 -411306 -1261109 -1701823 -1047656 618794 3131220 5612001 6454432 5516513
36443 5516513 5077976 6808491 8962258 8578985 5412942 1588220 -1592592 -4159138
36435 -4159138 -5694101 -5577346 -4491640 -3426407 -1874666 631906 2166240 585112
36427 585112 -2480209 -3072697 -356809 2485242 2996662 1947300 623773 -1187561 -3478516
36418 -3478516 -4969165 -4889381 -3710881 -1666265 1024893 2330495 81658 -3803596
36410 -3803596 -4296181 139748 5225826 6801551 5658661 4280194 2287344 -1539380
36402 -1539380 -5280898 -5702355 -2773472 721057 3061011 4351455 4510064 3452383
36394 3452383 2650710 3648686 5222336 4609036 1639920 -723844 -416192 1138372 1189697
36385 1189697 -907784 -3200216 -3457562 -1542246 518080 971801 540065 1218169 3128397
36376 3128397 4299658 3815069 2982080 2554496 1255169 -1399281 -3185968 -2250404 -125669
36367 -125669 654551 110089 -601141 -2230991 -5705372 -8662740 -7623442 -3335266 -246544
36358 -246544 -252567 -434076 1939550 5265800 6238642 4398321 2017543 706859 60839
36349 60839 -660751 -1018255 -108305 1738534 2868634 2437799 1864371 2768994 3990881
36340 3990881 2997592 406939 -10457 2965715 5692746 5257361 3916367 4668370 5720001
36331 5720001 3951418 1303041 2029991 4937970 4599658 423612 -1688293 1766541
36323 1766541 6843609 8298231 6092927 3133115 632069 -1317382 -2000981 -1847788
36315 -1847788 -3000015 -5521081 -6056001 -2994131 110435 -579319 -3658898 -5234981
36307 -5234981 -4726930 -4215225 -3981133 -2640581 -576056 338242 -203954 -1014806 -1703626
36298 -1703626 -2328015 -1966761 -387632 169747 -2117305 -5205794 -5823408 -4416371 -3943793
36289 -3943793 -4570234 -3440905 303203 3867513 4647933 2961770 774085 149564 2556747
36280 2556747 6954191 9242233 6822835 2922889 2582371 5126997 5432128 2502813
36272 2502813 957957 2672532 3123755 -770242 -4719796 -3734525 -563716 -1701402
36264 -1701402 -7263848 -10748190 -8368441 -3395124 -489912 -104331 -173430 -125749 -903364
36255 -903364 -2603709 -3972533 -3806563 -2105145 -153319 481943 -432109 -1440609 -1338456
36246 -1338456 -880479 -1486185 -2823962 -3175039 -2016026 -731981 -601121 -1367361 -2144239
36237 -2144239 -2681582 -3295597 -4210650 -5248000 -5813652 -5369554 -4362982 -4209603 -5636493
36228 -5636493 -7583639 -8637509 -8882196 -9075716 -8616352 -6124214 -2049868 1067690 1519179
36219 1519179 326282 -347418 378576 1848290 3104767 3644393 3431110 2666415 1434314
36210 1434314 -222827 -1461662 -558668 3108762 7368881 9097584 7777142 5655652
36202 5655652 4278797 2796982 290665 -2238386 -3331752 -2834716 -959769 2646847
36194 2646847 7221215 9878898 8560775 5052292 2869774 2838240 3074741 2822056 3500820
36185 3500820 5662322 7552993 7703310 6849703 6109310 5008506 2680128 -345027 -2877857
36176 -2877857 -4533983 -5306224 -4754904 -2855618 -698644 888628 2511200 4762350
36168 4762350 6611359 6763081 5812987 5337279 5411474 4861449 3661405 3120887 3553491
36159 3553491 3537981 1937576 -732715 -3249273 -4641619 -4080560 -1548526 805536 -207926
36150 -207926 -5038412 -9834959 -9994876 -4845746 1940536 6000741 5667476 2438751 -850919
36141 -850919 -2315509 -2031633 -1133844 -395031 -65365 -321920 -768492 -161937 1734237
36132 1734237 2550879 -187880 -5046349 -7848519 -7318959 -6420728 -6848249 -5793616 -932929
36123 -932929 4442363 5288533 2090250 14754 1451142 3653671 4049986 3669778 3949180
36114 3949180 3768599 1874288 -349045 -872110 -34041 515682 490311 584446 505345 -600054
36104 -600054 -2345646 -3498223 -3876097 -4356650 -5070980 -4871427 -2844574 356447 2855726
36095 2855726 3027979 954613 -1358287 -1762309 -285241 942843 358079 -1279497 -2246684
36086 -2246684 -2008964 -1190882 -121319 1550053 3934170 6259044 7242892 6122965 3624274
36077 3624274 1720851 1783941 3113690 4023954 3957968 3426604 2477060 1055287 551447
36068 551447 2566884 5867932 7171700 5725919 4361685 4751274 4582089 1509394 -2799522
36059 -2799522 -5263379 -5747797 -5793132 -5001723 -2288322 693519 1318779 476038 1330186
36050 1330186 3815807 4463444 2223746 449953 1765354 4457268 5765401 5848728 6439327
36041 6439327 7765200 8735948 8555576 6769469 3356217 -151160 -1469242 -460261
36033 -460261 723505 1082326 1843139 3295162 3763810 3169817 3993156 6468550 6727917
36024 6727917 3078741 299719 2922350 7278792 6206455 1564 -3959009 -2450065
36016 -2450065 -393246 -1887112 -3697299 -1384021 3052151 4440747 2234530 142722
36008 142722 -350618 -1377363 -3868746 -5403485 -3760236 109920 3719044 5876359
36000 5876359 6996762 7707237 7852250 6536927 3309776 -359968 -1701029 253458
35992 253458 3032218 3483298 1367983 -1258327 -3329664 -5365347 -7261285 -7881165 -7101156
35983 -7101156 -6131915 -5304632 -3612049 -1243404 -435301 -2332839 -4690177 -4586997 -2405147
35974 -2405147 -1123206 -2101753 -3526483 -3247079 -1503416 -47707 381890 624931 1398202
35965 1398202 1952675 916375 -1703328 -3936679 -3745137 -1323485 1098848 1772448 964109
35956 964109 -265306 -1732360 -3577014 -4784635 -3902513 -1454558 -175649 -1898754
35948 -1898754 -5116476 -6844940 -6429779 -6030777 -7242341 -8843332 -8753692 -6873577 -4538056
35939 -4538056 -2137192 698138 2906898 2468833 -320707 -2356649 -1763088 -312153
35931 -312153 -36625 465692 3574843 7901754 9430273 7123500 4092888 2861189 2719740
35922 2719740 2638556 3453097 5432272 6527547 5237738 2980408 1521705 288178 -1459175
35913 -1459175 -2151240 -565321 1151276 617064 -372391 1271919 3758658 2009243 -4361265
35904 -4361265 -9402131 -8468675 -3415796 1467866 4665312 6193912 5001920 1172262
35896 1172262 -1841170 -968239 1944103 2739892 1013413 125492 1636248 3158927 2246484
35887 2246484 -367810 -2413159 -3033379 -3037256 -3313238 -3713202 -3066979 -479816 2813902
35878 2813902 3775850 1047605 -2719823 -3785980 -1980196 -418301 -972761 -2462760
35870 -2462760 -3491710 -4444976 -5696688 -6079620 -4663728 -2553109 -1451664 -1493943 -1702784
35861 -1702784 -1617956 -1318757 -780213 -420820 -1365326 -3707746 -5208584 -3433348 976828
35852 976828 4775913 6043819 6121987 6985839 8049962 6941024 2946917 -1687222 -4122112
35843 -4122112 -3580429 -1243349 1439267 3315528 3177905 583733 -2678471 -3446381 -474331
35834 -474331 3931159 6319072 5396310 2339787 -986432 -2941123 -2355070 305378 2482314
35825 2482314 2034882 92063 -309149 1575588 3253285 2594787 398612 -1528446 -3039259
35816 -3039259 -4894080 -6503534 -6187990 -3537293 -417351 529897 -1853802 -6055933
35808 -6055933 -8744732 -7597132 -3786218 -909386 -907476 -1941246 -1109819 1668857 3802164
35799 3802164 3585966 2122787 1405925 1627577 1178821 -1053285 -4076327 -5655555 -4555179
35790 -4555179 -1673919 1038599 2463225 2865727 2887428 2573891 1585684 85746 -923467
35781 -923467 -464418 1020928 1587829 -76453 -2604841 -3277850 -1616018 -123813 -798269
35772 -798269 -2646120 -3840810 -4377299 -4620688 -3117973 1157843 5452634 5501978 1071129
35763 1071129 -3725115 -5678969 -5163403 -3558876 -1384653 416743 650149 240131 1286709
35754 1286709 2980458 2085839 -1444200 -3556112 -2591986 -2099251 -4298348 -5409414 -1744067
35745 -1744067 3463294 4515065 1733044 13773 910609 1817074 1745154 2035405 1792696
35736 1792696 -1463363 -6249219 -7905499 -5835198 -4462901 -5683549 -6019873 -3408649
35728 -3408649 -1169368 -1987437 -3038646 -1300497 454327 -2148497 -7839511 -11658373
35720 -11658373 -12315275 -12736287 -14102638 -13938171 -10485129 -5478588 -1794622 -655972
35712 -655972 -1522878 -2923075 -3363268 -2862380 -3079338 -4600400 -5393708 -3907531 -2092397
35703 -2092397 -2419555 -3130902 -252920 5824364 9750728 8188629 3964231 1684644
35695 1684644 2218846 3660290 5137449 6663969 6822567 4126440 543477 427152 4822282
35686 4822282 9267003 9153638 5679708 3912877 5465496 6178498 2247455 -3986040
35678 -3986040 -6956828 -5211146 -2667609 -2690898 -4142485 -4405915 -3557478 -3491083 -4632705
35669 -4632705 -5638762 -5419845 -3826214 -1187003 1374540 2088007 507915 -1437686
35661 -1437686 -1670730 -276745 1630718 3888280 6275592 6941374 4322622 -116375
35653 -116375 -3418994 -4799849 -5454858 -5464016 -3732813 -777702 1343557 2029130 2308682
35644 2308682 1929244 -592968 -4481691 -6615109 -6056655 -5350705 -5660294 -4053149 1663433
35635 1663433 8180467 10207611 7207269 3392395 1915441 2074230 1883872 595218
35627 595218 -1529640 -3734597 -4774288 -4066148 -2820960 -2500309 -2481998 -1004651 1918543
35618 1918543 4437331 5368832 4723676 2296578 -1485022 -3505407 -403393 5834711
35610 5834711 8320951 3637069 -3116520 -4671222 -788568 2606224 2209796 857659
35602 857659 1845185 3837928 3524825 685278 -1950575 -2583283 -1810155 -723097 590138
35593 590138 2537584 5132825 7707289 8969888 7813846 4855469 2642234 3197902
35585 3197902 5485246 6322139 3945737 -69351 -2622891 -2376960 -1138544 -2039432 -6040716
35576 -6040716 -10324495 -11048451 -7826002 -4046690 -2222229 -1115820 908989 1988813
35568 1988813 -582750 -4991812 -6189863 -2879628 486145 -80394 -3193387 -5213426
35560 -5213426 -5256719 -4561172 -3266605 -907349 1305533 1627003 444386 -599638 -1312498
35551 -1312498 -2360012 -2820516 -1145378 1698199 2735992 840589 -2109665 -3934001
35543 -3934001 -3810062 -1378432 3072340 6989008 6769071 1885168 -3905536 -6401035
35535 -6401035 -4613027 -310384 3992758 5842736 3904780 -245153 -2897347 -2213289
35527 -2213289 -331532 -346372 -2417516 -4216388 -4244671 -3201043 -2449852 -2352104 -2258340
35518 -2258340 -1709937 -1424104 -2546937 -4485062 -4578164 -1431830 2343531 2991350 723166
35509 723166 -794953 -16109 804339 314904 803596 4171549 8189642 9445013 7808912
35500 7808912 5346843 2764961 -191121 -2398400 -2467655 -1183609 -134048 1079596
35492 1079596 3524060 5841382 5544448 2877026 485036 -337714 -216521 947818 3835610
35483 3835610 6942169 7430667 5345943 3807119 4241021 4617572 3521164 2701768 3773318
35474 3773318 5197749 4790385 3069550 1904595 1610212 1549286 2064174 3515820 4541703
35465 4541703 3496854 916120 -1310215 -2495054 -3166568 -3332367 -2633127 -1677289 -1389551
35456 -1389551 -1442794 -1088339 -1098607 -2883745 -5761525 -7115999 -5662822 -2978163 -1416356
35447 -1416356 -1930456 -4217354 -7363936 -9660734 -9266993 -6185595 -2746901 -1265480
35439 -1265480 -1813787 -2794541 -2755474 -909273 3018119 8040604 11525168 11148382 7549523
35430 7549523 3981342 2864493 3436718 3281490 1438500 -852074 -2143890 -2466248 -2750120
35421 -2750120 -3398447 -4107928 -4684953 -5168441 -5167245 -4022395 -2087890 -1052409 -2042393
35412 -2042393 -3710079 -3317290 2544 3923904 5391921 3770005 933253 -1089604
35404 -1089604 -1527307 -356617 2020048 4103040 3725541 463348 -2985473 -3213764 29825
35395 29825 3389875 3553066 604635 -2461032 -2869963 -430078 2598950 3632450 2175727
35386 2175727 289005 238467 1821250 2863009 2331281 1638286 2279856 3465698 3300727
35377 3300727 1610324 257401 742015 2458184 3510163 2791573 1189693 782543 2511516
35368 2511516 4785629 5301869 4244061 4113807 5788507 6737225 4832879 2249751 2899903
35359 2899903 6649358 9011968 7043839 3040851 1249888 2744614 4948020 5037555
35351 5037555 2485832 -1082298 -3464799 -3697809 -3036693 -3793833 -6718210 -9932649 -10848268
35342 -10848268 -8731039 -5183451 -2663132 -2688020 -4709656 -6323280 -5215656 -1398273
35334 -1398273 2790773 4954052 4371670 1688617 -1911176 -4799467 -5369263 -3462898
35326 -3462898 -864962 485788 585003 1024341 2701108 4585058 5082570 4183273 3495315
35317 3495315 3952990 4399642 3460313 2119784 2565203 4476433 4889488 2655942 454696
35308 454696 613216 1572375 1234546 1295333 4239390 7745833 7058957 2520394 -462409
35299 -462409 424712 1594982 501253 -106075 2094589 4012313 2321457 -155699 1595754
35290 1595754 6790278 9905548 8417510 4748937 1395516 -1094700 -1539640 1553902
35282 1553902 6223824 7854961 5220162 2337028 2856277 5681716 7800324 8593072
35274 8593072 9137303 9290698 7866483 4848573 1847188 743400 2412909 5912661
35266 5912661 8630875 8416912 5862132 3345807 1981641 1197857 1156757 3110187 6667934
35257 6667934 9035709 8216166 5263124 2334654 201822 -1312210 -2244878 -3126106 -5037377
35248 -5037377 -7646273 -8690296 -6903487 -4119883 -2971280 -3750851 -5086480 -6385783
35240 -6385783 -7655002 -7841255 -5585783 -1476507 2187988 3957935 4275573 4056868 3590616
35231 3590616 3067917 3060857 3862943 4794086 4616818 2799581 446065 -414902 854235
35222 854235 2173165 913462 -2525748 -4745536 -3467655 -212897 1946186 1936774 903756
35213 903756 162696 378855 1849064 3980923 4951059 3373263 240666 -1874240 -1531263
35204 -1531263 387022 1951024 1988845 928692 379417 1437397 3047420 2893909 501014
35195 501014 -1655867 -1135934 1395124 3396378 3871476 3805094 3524583 1626380 -2690686
35186 -2690686 -7363629 -8798421 -5761436 -1480905 -893436 -5111337 -9484764 -8683118
35178 -8683118 -3190827 1456632 1856191 152662 -696244 -1571377 -4393373 -7337037 -6669692
35169 -6669692 -2289768 2078897 3794544 3221697 1132802 -2186977 -4801942 -3709619
35161 -3709619 949659 4982588 5054132 2344066 -139508 -1639872 -3075953 -4195631
35153 -4195631 -3759460 -1845598 39815 988181 1403625 1709882 1375070 -530525 -4073033
35144 -4073033 -7691767 -8985638 -7027690 -3664726 -1381120 -157896 1817484 4384289
35136 4384289 4827976 1971772 -1532291 -2592779 -1347341 382242 2221602 4247541
35128 4247541 4574153 1421969 -2907440 -3674003 57763 3790989 3382711 -27486 -2433150
35119 -2433150 -2258355 -1252396 -1415603 -3080583 -5401546 -6964347 -6243987 -3076158 402550
35110 402550 1705649 910770 259769 759440 784329 -1275698 -4378567 -6011871 -5222361
35101 -5222361 -3303295 -1880510 -1428710 -1603494 -2071938 -2754833 -3721154 -4902070 -5652128
35092 -5652128 -4972277 -2760757 -468424 316036 -291038 -896661 -830369 -594434 -423993
35083 -423993 235018 1493710 2486613 2546344 1876952 713613 -968306 -2465561 -2500267
35074 -2500267 -1136236 -187459 -776191 -1777296 -1682004 -605386 704328 2267187 3798832
35065 3798832 3940329 2561869 2243816 4920722 8323113 8755780 6584839 5558499 6867684
35056 6867684 7549813 5490111 2543928 1259542 1453476 1845999 2595540 4114708 5326794
35047 5326794 5272158 5048979 6208722 8308970 9697951 9683608 8494405 6278619 3633569
35038 3633569 1911574 1396615 330886 -2549257 -5578569 -6088051 -3936851 -1354235
35030 -1354235 69119 528169 641717 462097 -458004 -2891007 -6926238 -10356383 -9834290
35021 -9834290 -5234919 -1058488 -1242408 -4073601 -4803253 -2016854 1431970 2735013
35013 2735013 1274940 -2593490 -7342854 -9310429 -5788837 643928 4405581 3822298
35005 3822298 2112014 1222152 -751057 -4645150 -7412374 -6799475 -4941563 -4345640 -3813813
34996 -3813813 -1624905 596606 1019686 1571401 4374129 6868609 5585549 2812239
34988 2812239 3737189 7890385 9513260 6578146 3247920 2230864 1051596 -1569485
34980 -1569485 -1831494 2396468 5953521 2939256 -4386447 -8741495 -7712382 -5125384
34972 -5125384 -3997260 -3766988 -4109133 -5796170 -7055784 -4443988 971782 3123170
34964 3123170 -951670 -6659817 -8361454 -6637284 -5664920 -6513222 -7179082 -7196278 -7829525
34955 -7829525 -8584415 -7466578 -4546364 -2041198 -998887 -803355 -1552954 -3635650 -5122018
34946 -5122018 -3317681 529588 1792266 -1027060 -3842185 -2917245 -136254 198948
34938 198948 -2495704 -4955915 -4661061 -2082806 739169 1823665 225516 -2820701
34930 -2820701 -4374637 -2878319 -114959 1026074 -234087 -2553777 -4224766 -3728018
34922 -3728018 -316644 4278334 6472886 5084355 3190205 3677805 5117589 4829460
34914 4829460 3711433 4098552 4557290 1644312 -3700181 -6474335 -4728974 -1662290
34906 -1662290 187612 1870465 3536421 2251282 -2550768 -5793015 -3043899 2958493
34898 2958493 6153629 5151261 3219280 2223787 1245073 394388 1380357 3901655 5268989
34889 5268989 4423263 3255769 3141333 3001439 1825239 532987 -21866 -824272 -2941196
34880 -2941196 -5410146 -6235885 -4634250 -1447189 1854964 3966825 4309775 3328074 1824623
34871 1824623 117488 -1562200 -2506896 -2585948 -3168236 -5305714 -7571001 -7745680 -6169006
34862 -6169006 -4917440 -4036243 -1853522 711293 148230 -3769171 -6025490 -3104501
34854 -3104501 1562009 2508672 2725 -1506354 -947051 -1348951 -3192189 -2540095 2435639
34845 2435639 7580606 8230419 5259585 2554652 1095089 -752882 -2720215 -2538354
34837 -2538354 -80827 2087071 2873922 4186810 7143761 9542984 8880930 5804257
34829 5804257 2572807 -243224 -3191354 -5198930 -4212010 -620009 2287607 1963580
34821 1963580 -907614 -4060838 -6056903 -6175262 -3731878 647062 3968213 3202088
34813 3202088 -1102547 -5001069 -5439947 -3249049 -1280653 -747702 -679802 -385903 -650155
34804 -650155 -1986243 -3218015 -3109746 -2537347 -3315116 -5116356 -5582644 -3984856 -2655452
34795 -2655452 -3440335 -4636158 -3618017 -1138969 -228035 -1428792 -2253033 -1543300 -1130369
34786 -1130369 -2166440 -2987032 -2398697 -2163414 -3643554 -4402186 -1407504 3926218 7280137
34777 7280137 7045707 5040096 2446206 -910979 -3194202 -1002952 5136253 9481258
34769 9481258 7829800 2886733 267801 1377531 3233813 3715206 3522458 3442246 2934622
34760 2934622 1971652 1779680 2712613 3003110 740827 -3640392 -7472791 -8154533 -5407588
34751 -5407588 -1676681 115510 -242492 -66447 2390222 5142444 5242686 3350368 2948909
34742 2948909 5112090 6910967 5894864 3463677 2033442 1063226 -1488673 -4893771
34734 -4893771 -5721934 -2390095 2457919 4830159 3395168 145990 -1890245 -1198909
34726 -1198909 1052700 2069666 488989 -1582277 -900882 2303687 3960294 1574768
34718 1574768 -1842624 -1538584 2382274 5083256 3756618 1077785 627057 1793334
34710 1793334 1781530 607933 623709 1874725 1755556 -156569 -530687 2681214 6523200
34701 6523200 6916823 4295656 2523455 3499912 5917704 8613671 11565616 13222878
34693 13222878 10501015 3235436 -3918670 -6250198 -4087693 -1260443 -28790 169116
34685 169116 127364 -72288 443554 3076815 7272277 10337013 10660891 9454235 8313621
34676 8313621 6739178 3564425 -423111 -3201282 -4292719 -4943085 -5551906 -4773650 -1847829
34667 -1847829 1572726 3011484 1870165 -388920 -2201802 -2978963 -2537944 -818222
34659 -818222 1425427 2697856 2375432 1668014 2053490 3065431 2706205 112533 -3269744
34650 -3269744 -5527493 -6239171 -5979001 -5033548 -3820021 -3660239 -5336162 -7110805 -6123566
34641 -6123566 -2190998 1453157 1897482 -499130 -3625537 -6189278 -7370298 -5837221
34633 -5837221 -1586486 2193938 1771943 -2666674 -7302459 -9242248 -8553205 -6053288
34625 -6053288 -2210657 1059765 791806 -2968679 -6039719 -5217902 -2360183 -982899
34617 -982899 -941768 324131 2786061 3844576 2867265 2007826 2247049 2121306 1167244
34608 1167244 1222979 2905567 3950085 3007291 2250842 3688711 5322367 4169697 1451129
34599 1451129 1108695 3714459 5455232 3649145 94479 -2282966 -3375431 -4462539
34591 -4462539 -4838544 -2779780 551317 1123741 -2687326 -6716450 -5398184 657728
34583 657728 4236066 211471 -7529984 -10921703 -8421145 -6554335 -9728882 -13154876
34575 -13154876 -9679214 -597843 5730503 5362279 3252036 4742509 7539627 5809629
34567 5809629 -739177 -6281008 -6472948 -2789849 953778 3082055 3897145 3677771 2808773
34558 2808773 2459676 3188020 3559102 1885902 -983642 -2355118 -1290434 197823 245135
34549 245135 -135288 1203393 4043445 5804422 4902847 2597360 1184546 1492009 2512672
34540 2512672 2591455 720346 -2426638 -4640415 -4447109 -3180117 -3209399 -4096705 -2930502
34531 -2930502 705153 3034702 1498594 -804635 532454 4204803 4800666 1006213
34523 1006213 -2379236 -1722453 379877 -201230 -2614939 -2708362 462481 3425607 3475136
34514 3475136 2104599 2290579 4202450 5183513 3591322 1277104 1287186 3475981 4115057
34505 4115057 869471 -3509481 -4683242 -2789588 -1847759 -3371030 -4413333 -2919463
34497 -2919463 -989221 -600330 177366 3308219 6115244 4737903 463437 -1831846
34489 -1831846 -715179 618915 -73779 -1587851 -2700013 -3958313 -5050537 -4193646
34481 -4193646 -1572779 53487 -208732 336726 3388212 6624854 7602509 7455580 7738930
34472 7738930 6605276 2162752 -2391364 -1719368 3940410 8242932 6678085 1726954
34464 1726954 -1114925 129478 2886012 3787528 1929620 -843049 -1991602 -947218
34456 -947218 247724 -476639 -2534146 -3764768 -3613647 -3463332 -4019449 -4435036 -4331707
34447 -4331707 -4664597 -5892767 -7097907 -7709300 -8265472 -8397695 -5958367 76620 7047219
34438 7047219 10798489 9929577 6594768 3726651 2722464 3214548 3705513 2767464 709425
34429 709425 -473765 179320 926368 -115082 -1867505 -2057831 -1296406 -2295329 -4892019
34420 -4892019 -5410206 -2456835 -82108 -2440672 -7613408 -10059747 -7871606 -4066519
34412 -4066519 -1321839 659182 2125559 1616229 -939443 -2672878 -1711770 -173807
34404 -173807 -579050 -1426018 407413 4333049 6802112 6752135 6484842 6954628 6134030
34395 6134030 3281853 1195962 2014491 3604507 2788130 97675 -1507111 -1192870 -553039
34386 -553039 -165540 1133323 3441327 4733815 3283294 -342890 -4022942 -5788623
34378 -5788623 -5028975 -3071910 -1997812 -1757979 284981 5091498 8760008 6737950
34370 6737950 472235 -3890924 -3619956 -2194233 -2921780 -4053051 -2796921 -487002
34362 -487002 54470 -181072 1865424 5349252 5782148 1709205 -2627280 -2741155 650239
34353 650239 3403131 3381951 2143837 1932706 2740994 2720598 750680 -2122639 -4088079
34344 -4088079 -4947947 -6073220 -7886345 -8812830 -7532173 -4891123 -2400647 -273073
34336 -273073 1410323 1145353 -1819662 -4717535 -3790824 442683 3519554 3207642 2303304
34327 2303304 3913303 6733357 7309979 5226610 3494794 4410808 7031065 8710988
34319 8710988 7779802 4554479 588755 -2706384 -4741590 -5203923 -3751987 -1240643
34311 -1240643 -292164 -2588504 -5858276 -5978387 -2342095 1446758 2791225 2987310 3677361
34302 3677361 3749551 2070944 364170 336963 305168 -1988593 -5224671 -6900116 -8102386
34293 -8102386 -11473674 -15460747 -15578071 -11523410 -8123962 -8100838 -8450654 -5862975 -1616281
34284 -1616281 1370558 2803089 3489855 2629562 -115560 -2172644 -1046265 1906186
34276 1906186 3766293 4524021 5902401 7012047 5121139 612278 -2504940 -1829916
34268 -1829916 533199 1389878 522534 89397 1534167 4287653 6621525 7020741 5364891
34259 5364891 3159483 2098942 2405749 3115224 3555097 3631666 3130881 1911576 497776
34250 497776 -577752 -1553845 -2456657 -2109080 293899 3254196 4498520 4091845 4105570
34241 4105570 5418716 6895583 7668281 8077512 8181041 7424067 6041312 4793750 3299256
34232 3299256 941430 -656607 881524 4251061 4936377 1373312 -2709187 -3917755
34224 -3917755 -3814525 -5332546 -7580092 -7538666 -4817458 -1473616 1080230 1781019 -1433163
34215 -1433163 -8628480 -14893297 -14831088 -9622364 -5397142 -4826000 -4997905 -4010505 -4244402
34206 -4244402 -6924986 -8298353 -4995667 -26589 711190 -3735369 -8719790 -10381116
34198 -10381116 -9338354 -7995418 -7082268 -5932701 -4551484 -4071882 -5233118 -6798186
34190 -6798186 -6139731 -2314595 1811497 2222916 -1218734 -4404981 -4304870 -2323580 -1049098
34181 -1049098 -237269 1568510 3471191 3423852 1954921 1547576 2636570 3147305 2115922
34172 2115922 973582 622434 -298768 -3164379 -7162972 -10354873 -11633832 -10944266 -8743890
34163 -8743890 -5884679 -3142471 -635290 1425221 1724908 -915410 -5383847 -8987190
34155 -8987190 -10355343 -10073506 -8716989 -6455470 -4610051 -4927996 -6609488 -6590835 -3779772
34146 -3779772 -546520 1094514 1997491 2945841 2204456 -1276681 -4548243 -3882791 -54737
34137 -54737 2632015 1766640 -1447371 -5031448 -7841711 -8856289 -7838072 -6573119 -6739770
34128 -6739770 -6879564 -4570771 -1357260 -1598610 -5590919 -7836407 -4270033 1968683
34120 1968683 4647472 1997677 -2638784 -5970023 -7478305 -7798094 -7304398 -6528459 -5988829
34111 -5988829 -5226465 -3239481 -24521 3094714 4486691 3150028 -470744 -3981852
34103 -3981852 -4749824 -3263451 -3241306 -6749144 -10845436 -11356443 -8434500 -5302349 -2668026
34094 -2668026 1518944 6771912 9086320 6807690 3478858 2387714 1874739 -531265
34086 -531265 -2433084 166869 5428745 6813736 2019386 -3928936 -5875431 -4513243
34078 -4513243 -2842300 -601337 3954935 9180212 11297298 9745465 7480902 6092135
34070 6092135 4215992 1252943 -901305 -1126835 -1044536 -1996307 -2704859 -1994385 -1458747
34061 -1458747 -2873050 -4840249 -4869812 -3400230 -2723668 -2921767 -2178959 -645608 -470305
34052 -470305 -1830228 -2440997 -1731374 -2010454 -4148591 -5485143 -4089655 -2121322 -2339473
34043 -2339473 -3719009 -3495309 -1652117 -201661 531594 1505126 1848534 -121381 -3002186
34034 -3002186 -3140846 30094 2798975 2356380 158528 -1279779 -2029737 -3027687 -3059813
34025 -3059813 -353696 3892854 6258284 5239126 2634945 693627 -325952 -1152737
34017 -1152737 -1531616 -596319 1120423 1439880 -748071 -3077487 -1688423 3697105 8287476
34008 8287476 7531384 2835356 -404279 23282 987591 -436452 -2602924 -2464924 -500344
33999 -500344 440385 -223324 -379871 953020 2138182 1594931 -159305 -1717628 -2398844
33990 -2398844 -2088416 -840626 740736 1758114 2103334 2413987 2792668 2657546 2065527
33981 2065527 1912726 2361284 2293988 987392 -788239 -2099709 -3191433 -4506756 -5346431
33972 -5346431 -4838380 -3703853 -3659767 -5162041 -6941885 -7865504 -8158814 -8545260 -9172526
33963 -9172526 -9749580 -9770763 -8163784 -3931346 1843957 5678863 4988857 1318203 -1401957
33954 -1401957 -1761053 -2120578 -4526942 -7533415 -8413783 -6704613 -3700928 -43837 3679373
33945 3679373 5126067 2315188 -2513742 -4519769 -2575029 -871949 -2818862 -6283805
33937 -6283805 -7047084 -4445781 -877748 2304397 5226968 7087217 6644918 4729641
33929 4729641 3417217 2952980 2105726 1124151 1296720 1779312 388909 -1999683 -1619150
33920 -1619150 2323693 5585852 4828748 2358183 2034585 3151009 2105691 -1374907
33912 -1374907 -3653710 -2594232 -170525 817731 -59648 -1685709 -3135565 -3583226 -2238220
$$ [...]
##END NTUPLES=NMR SPECTRUM
##END=
