##TITLE=31Pdec_SR17
 D2O, 24 sc
 7.8.2020
##JCAMPDX= 6.0         $$ Bruker NMR JCAMP-DX V2.0
##DATA TYPE= NMR SPECTRUM
##DATA CLASS= NTUPLES
##ORIGIN= UXNMR, Bruker Analytische Messtechnik GmbH
##OWNER= root
$$ XWIN-NMR		Version 3.5
$$ Fri Aug  7 10:30:25 2020 Russian Standard Time (UT+4h)  she@DPX200
##.OBSERVE FREQUENCY= 81.013821
##.OBSERVE NUCLEUS= ^31P
##.ACQUISITION MODE= SIMULTANEOUS
##.ACQUISITION SCHEME= undefined
##.AVERAGES= 24
##.DIGITISER RES= 17
##SPECTROMETER/DATA SYSTEM= spect
##.PULSE SEQUENCE= zgpg30
##.SOLVENT NAME= CDCl3
##.SHIFT REFERENCE= (INTERNAL, CDCl3, 0, 182.463)
##AUDIT TRAIL= $$ (NUMBER, WHEN, WHO, WHERE, WHAT)
$$ ##TITLE= Audit trail, XWIN-NMR		Version 3.5
$$ ##JCAMPDX= 5.01
$$ ##ORIGIN= Bruker BioSpin GmbH
$$ ##OWNER= she
$$ F:/spectra/data/she/nmr/P31/1/pdata/1/auditp.txt
$$ ##AUDIT TRAIL=  $$ (NUMBER, WHEN, WHO, WHERE, WHAT)
(   1,<2020-08-07 10:29:23.17 +0400>,<she>,<DPX200>,
      <created by zg, POWCHK disabled, PULCHK disabled
       configuration hash MD5:
       00 E9 B6 7A A2 85 ED C7 34 08 36 98 17 FE 4E 26
       data hash MD5: 32K
       19 30 FC 42 93 28 D9 4A 58 3F 5D 26 38 0E C5 F3>)
(   2,<2020-08-07 10:29:25.89 +0400>,<she>,<DPX200>,
      <Start of raw data processing
       efp BC_mod = 2 LB = 1 FT_mod = 6 PKNL = 1 PHC0 = -3618.86 PHC1 = 1841.202 SI = 64K 
       data hash MD5: 64K
       B7 E3 BB E7 5C EC 1D 8A 98 84 D8 67 B4 D7 76 C7>)
(   3,<2020-08-07 10:29:56.76 +0400>,<she>,<DPX200>,
      <pk PHC0 = 80.95398 PHC1 = 111.8 
       data hash MD5: 64K
       FF 7C 6C 49 16 25 5A 2B CA 44 F9 CF 4D 70 99 E9>)
$$ ##END=
$$ 
$$ hash MD5
$$ FC 79 67 31 60 F6 20 A2 02 44 DF 48 21 71 07 31
##$RELAX= 
##$RELAX= 
##$RELAX= 
##$RELAX= 
##$RELAX= 
##$RELAX= 
##$RELAX= 
##$RELAX= 
$$ Bruker specific parameters
$$ --------------------------
##$DU= <F:/spectra>
##$EXPNO= 1
##$NAME= <P31>
##$PROCNO= 1
##$TYPE= <nmr>
##$USER= <she>
##$AMP= (0..31)
100 100 100 100 100 100 100 100 100 100 100 100 100 100 100 100 100 100 
100 100 100 100 100 100 100 100 100 100 100 100 100 100 
##$AQSEQ= 0
##$AQ_mod= 1
##$AUNM= <au_zg>
##$AUTOPOS= <>
##$BF1= 81.014009
##$BF2= 200.13
##$BF3= 200.13
##$BF4= 200.13
##$BF5= 200.13
##$BF6= 200.13
##$BF7= 200.13
##$BF8= 200.13
##$BYTORDA= 1
##$CFDGTYP= 0
##$CFRGTYP= 5
##$CHEMSTR= <none>
##$CNST= (0..31)
1 1 145 1 1 1 1 1 1 1 1 1 1 1 1 1 1 1 1 1 1 1 1 1 1 1 1 1 1 1 1 1 
##$CPDPRG= <waltz16>
##$CPDPRG1= <>
##$CPDPRG2= <waltz16>
##$CPDPRG3= <>
##$CPDPRG4= <mlev>
##$CPDPRG5= <mlev>
##$CPDPRG6= <mlev>
##$CPDPRG7= <mlev>
##$CPDPRG8= <mlev>
##$CPDPRGB= <>
##$CPDPRGT= <>
##$D= (0..31)
0 1 0 0 0 0 0 0 0 0 0 0.03 2e-05 3e-06 0 0 0 0 0 0 0 0 0 0 0 0 0 0 0 0 
0 0 
##$DATE= 1596781762
##$DBL= (0..7)
120 120 120 11 120 120 24 19 
##$DBP= (0..7)
150 150 150 150 150 150 150 150 
##$DBP07= 0
##$DBPNAM0= <>
##$DBPNAM1= <>
##$DBPNAM2= <>
##$DBPNAM3= <>
##$DBPNAM4= <>
##$DBPNAM5= <>
##$DBPNAM6= <>
##$DBPNAM7= <>
##$DBPOAL= (0..7)
0.5 0.5 0.5 0.5 0.5 0.5 0.5 0.5 
##$DBPOFFS= (0..7)
0 0 0 0 0 0 0 0 
$$ [...]
##$SUBNAM2= <"">
##$SUBNAM3= <"">
##$SUBNAM4= <"">
##$SUBNAM5= <"">
##$SUBNAM6= <"">
##$SUBNAM7= <"">
##$SUBNAM8= <"">
##$SUBNAM9= <"">
##$SW= 369.568048894756
##$SWIBOX= (0..15)
0 1 3 0 0 0 0 0 0 0 0 0 0 0 0 0 
##$SW_h= 29940.119760479
##$TD= 32768
##$TD0= 1
##$TE= 0
##$TE2= 300
##$TE3= 300
##$TEG= 300
##$TL= (0..7)
0 120 53 12 22 120 120 120 
##$TP= (0..7)
150 150 150 150 150 150 150 150 
##$TP07= 0
##$TPNAME0= <>
##$TPNAME1= <>
##$TPNAME2= <>
##$TPNAME3= <>
##$TPNAME4= <>
##$TPNAME5= <>
##$TPNAME6= <>
##$TPNAME7= <>
##$TPOAL= (0..7)
0.5 0.5 0.5 0.5 0.5 0.5 0.5 0.5 
##$TPOFFS= (0..7)
0 0 0 0 0 0 0 0 
##$TUNHIN= 0
##$TUNHOUT= 0
##$TUNXOUT= 0
##$USERA1= <user>
##$USERA2= <user>
##$USERA3= <user>
##$USERA4= <user>
##$USERA5= <user>
##$V9= 5
##$VALIST= <valist>
##$VCLIST= <CCCCCCCCCCCCCCC>
##$VD= 0
##$VDLIST= <DDDDDDDDDDDDDDD>
##$VPLIST= <PPPPPPPPPPPPPPP>
##$VTLIST= <TTTTTTTTTTTTTTT>
##$WBST= 1024
##$WBSW= 4
##$XGAIN= (0..3)
0 0 0 0 
##$XL= 0
##$YL= 0
##$YMAX_a= 7512
##$YMIN_a= -5482
##$ZGOPTNS= <>
##$ZL1= 120
##$ZL2= 120
##$ZL3= 120
##$ZL4= 120
##$ABSF1= 0
##$ABSF2= 0
##$ABSG= 0
##$ABSL= 0
##$ALPHA= 0
##$AQORDER= 0
##$ASSFAC= 0
##$ASSFACI= 0
##$ASSFACX= 0
##$ASSWID= 0
##$AUNMP= <proc_1d>
##$AZFE= 0.1
##$AZFW= 0.5
##$BCFW= 0
##$BC_mod= 2
##$BYTORDP= 0
##$COROFFS= 0
##$CY= -3
##$DATMOD= 1
##$DC= 0
##$DFILT= <>
##$DTYPP= 0
##$F1P= 0
##$F2P= 0
##$FCOR= 1
##$FTSIZE= 65536
##$FT_mod= 6
##$GAMMA= 0
##$GB= 0
##$INTBC= 1
##$INTSCL= 5.30512e-09
##$ISEN= 30
##$LB= 1
##$LEV0= 0
##$LPBIN= 0
##$MAXI= 10000
##$MC2= 0
##$MEAN= 0
##$ME_mod= 0
##$MI= 50
##$NCOEF= 0
##$NC_proc= -9
##$NLEV= 6
##$NOISF1= 182.463
##$NOISF2= 159.3651
##$NSP= 0
##$NTH_PI= 0
##$NZP= 0
##$OFFSET= 182.463
##$PC= 4
##$PHC0= -3537.906
##$PHC1= 1953.002
##$PH_mod= 1
##$PKNL= yes
##$PPARMOD= 0
##$PSCAL= 0
##$PSIGN= 0
##$REVERSE= no
##$SF= 81.0140089999434
##$SI= 65536
##$SIGF1= 159.3651
##$SIGF2= -187.1042
##$SINO= 113.3802
##$SIOLD= 16384
##$SREGLST= <1H.CDCl3>
##$SSB= 0
##$STSI= 65536
##$STSR= 0
##$SW_p= 29940.119760479
##$SYMM= 0
##$S_DEV= 0
##$TDeff= 32768
##$TDoff= 0
##$TI= <>
##$TILT= no
##$TM1= 0
##$TM2= 0
##$TOPLEV= 0
##$USERP1= <user>
##$USERP2= <user>
##$USERP3= <user>
##$USERP4= <user>
##$USERP5= <user>
##$WDW= 1
##$XDIM= 65536
##$YMAX_p= 366538741
##$YMIN_p= -66975126
$$ End of Bruker specific parameters
$$ ---------------------------------
##NTUPLES= NMR SPECTRUM
##VAR_NAME=  FREQUENCY,     SPECTRUM/REAL,   SPECTRUM/IMAG
##SYMBOL=    X,             R,               I
##VAR_TYPE=  INDEPENDENT,   DEPENDENT,       DEPENDENT
##VAR_FORM=  AFFN,          ASDF,            ASDF
##VAR_DIM=   65536,         65536,           65536
##UNITS=     HZ,            ARBITRARY UNITS, ARBITRARY UNITS
##FACTOR=    0.456856943014862, 1,           1
##FIRST=     14782.0589164792, 0,            0
##LAST=      -15158.0608439998, 0,           0
##MIN=       -15158.0608439998, -66975126,   0
##MAX=       14782.0589164792, 366538741,    0
$$ Real data points
##PAGE= N=1
##DATA TABLE= (X++(R..R)), XYDATA
$$ [...]
40444A4365758P001069j638740M16296N289770K71683p929418o775332l021462
$$ 14365758 21366827 19728087 20144383 25434153 25705836 17776418 11001086 7979624
40436G979624r925097j9105400j2264355M885873R378597j69318j836666R915318
$$ 7979624 -1945473 -21050873 -33315228 -28429355 -19050758 -19220076 -21056742 -11141424
40428a1141424J4393843K738790n379329K566432Q567622l696336j8275454j3147520
$$ -11141424 3252419 5991209 611880 3178312 11745934 8049598 -10225856 -23373376
40420b3373376K479905M266697p160616r902763K686065J5000098J5934308J0127470
$$ -23373376 -20893471 -16626774 -23787390 -33690153 -31004088 -16003990 -69682 10057788
40412A0057788L284946l848657o740479r5633R881859J1843805O962053M950955
$$ 10057788 13342734 9494077 2753598 2657965 12539824 24383629 31345682 36296637
40404C6296637N166452o89988r041566p486595K173879M431231l664601p343925
$$ 36296637 41463089 40773101 31731535 24244940 26418819 30850050 27185449 19841524
40396A9841524j96429N240963P27743l686157N55621M820003J64217n770671l039973
$$ 19841524 19645095 24886058 25613801 21927644 22483265 27303268 27467485 21696814 18656841
40387A8656841K360431n59038q689838j1092425o442849j024470L779282R501489
$$ 18656841 21017272 20458234 11768396 675971 -5766878 -6791348 -3012066 6489423
40379F489423J2209314P911305J095473k435386n139994j0014575j0700620j411868
$$ 6489423 18698737 26610042 27705515 25270129 20130135 10115560 -585060 -1996928
40371a996928R583770R467923n26849p994522o594748P54643J0316850J6804946
$$ -1996928 7586842 17054765 16527916 8533394 1938646 2693289 13010139 29815085
40363B9815085J0693123q565870k2010902j1689678J1075177J7501282J799543
$$ 29815085 40508208 31942338 9931436 -1758242 9316935 26818217 28617760
40356B8617760j1284974m511623P510244L722011j0994649j5691266n445656M289501
$$ 28617760 17332786 12821163 20331407 24053418 13058769 -2632497 -8078153 -3788652
40348c788652K369362m594896n747599j383008Q27035j635492m142718l390213
$$ -3788652 -1419290 -6014186 -11761785 -13144793 -12317758 -13953250 -18095968 -21486181
40340b1486181j550689m20359L173438J1072315J6462305J0999950j162291o139485
$$ -21486181 -23036870 -23457229 -20283791 -9211476 7250829 18250779 17088488 10949003
40332A0949003L79545O977800M650161l01140J10991N51509o614685j4933152
$$ 10949003 11328548 18306348 22956509 22655369 22766360 23317869 16703184 1770032
40324A770032j3591070o180565l175005j748832P813606J9206511J5076217m377004
$$ 1770032 -11821038 -18001603 -21176608 -22925440 -15111834 4094677 19170894 14793890
40316A4793890j8709312j6493576p236366N4248Q561862J6787532J2509205m480963
$$ 14793890 -3915422 -20408998 -27645364 -27591116 -19029254 -2241722 10267483 5786520
40308E786520j3833905l309044J1889639J3813985Q194618P999734P209464o278373
$$ 5786520 -8047385 -11356429 533210 14347195 22541813 30541547 37751011 31472638
40300C1472638k3456549k4409265r347477L242733N688295O802331J0381890R225414
$$ 31472638 8016089 -16393176 -25740653 -22497920 -16809625 -10007294 374596 9600010
40292I600010J790432l860702m945168o473162p633101j949645P500689R425307
$$ 9600010 11390442 7529740 2584572 -3888590 -11521691 -13471336 -5970647 3454660
40284C454660L012211p97254J035487m42240p265289r010977j681883M360818
$$ 3454660 6466871 5669617 6705104 6262864 -1002425 -10013402 -11695285 -7334467
40276g334467K048998k086679k017077j456046j929145K737555J1804762J3366606
$$ -7334467 -5285469 -7372148 -9389225 -10845271 -12774416 -10036861 1767901 15134507
40268A5134507M231540j846067L364947Q139408J603114p470825q010536o630258
$$ 15134507 19366047 17519980 20884927 29024335 30627449 23156624 15146088 8515830
40260H515830j1851670j3700753j500654J0842786L672466j2984408j1828250
$$ 8515830 -3335840 -17036593 -18537247 -7694461 -4021995 -17006403 -28834653
40253b8834653P457728J6925017N433331n940197j941638L324790l792619r624936
$$ -28834653 -21376925 -4451908 981423 -4958774 -6900412 -3575622 -7368241 -16993177
40245a6993177J950549J7638975J3492306o339681j5655606n888512M810941K603932
$$ -16993177 -15042628 2596347 16088653 9748972 -5906634 -11795146 -6984205 -4380273
40237d380273m225691m046575N8896M68731j75842M436456J1080486J1278195
$$ -4380273 -8605964 -12652539 -12593643 -12124912 -12300754 -7864298 3216188 14494383
40229A4494383M979799P95343L312920P126007M789786l695861j1622232j3716971
$$ 14494383 19474182 20269525 23582445 30708452 35498238 31802377 20180145 6463174
40221F463174j0884639o550686j067810O638047J2575292Q959588m406879j5176047
$$ 6463174 -4421465 -10972151 -12039961 -5401914 7173378 16132966 11726087 -3449960
40213c449960j1553158K127459J0365852O362670j198543k654678m9941n44381
$$ -3449960 -15003118 -12875659 -2509807 3852863 2654320 -358 -50299 -594680
40205e94680l910225l843393J287887N720485L905267l660487j1858186j4700655
$$ -594680 -4504905 -8348298 -7060411 -1339926 2565341 -1095146 -12953332 -27653987
40197b7653987q571229M259439J5350240J6860047R276177J79194m305077m228584
$$ -27653987 -36225216 -31965777 -16615537 244510 9520687 9699881 5394804 1166220
40189A166220k847670k656790m586796p519641p824910k777271M678614Q319132
$$ 1166220 -1681450 -4338240 -8925036 -16444677 -24269587 -27046858 -22368244 -14049112
40181a4049112P189607P408986J2573925J6637912J1333775j809373j2684441
$$ -14049112 -6859505 549481 13123406 29761318 41095093 39285720 26601279
40174B6601279j5182251j2582820r475490m774922L224827R736271Q012168j11560
$$ 26601279 11419028 -1163792 -10639282 -15414204 -12189377 -2453106 5559062 5447502
40166E447502m465050Q30675R447148J0804637L298714m481410n253925j735996
$$ 5447502 982452 1813127 11260275 22064912 25363626 20882216 15628291 13892295
40158A3892295j803030p161658j0360593m148611Q365873J5827811J1346493N86162
$$ 13892295 12089265 4927607 -5432986 -9581597 -1215724 14612087 25958580 26544742
40150B6544742m926336j092179N173054N387366r66041p749748j0101862q455421
$$ 26544742 21618406 20526227 25699281 31086647 30120606 22370858 12268996 3813575
40142C813575o054258m893587l977085q06786M563929P324452K863291n420766
$$ 3813575 -2240683 -7134270 -11111355 -11918141 -7354212 -29760 2833531 -2587235
40134b587235p960519j393004N977361N757848J409389J639482O276946Q139726
$$ -2587235 -10547754 -11940758 -5963397 -205549 1203840 2843322 9120268 17259994
40126A7259994O082888M565984J220236j0632402k4073345j9765976N391656K5466668
$$ 17259994 23342882 27908866 29129102 18496700 -5576645 -25342621 -19950965 5515703
40118E515703J6654461q662275j7480666j274867J4619333Q812065q033687j2001841
$$ 5515703 22170164 13507889 -3972777 -5247644 9371689 18183754 10150067 -1851774
40110a851774Q43217J2804124R821398l286162j2102141r138521R34620Q638685
$$ -1851774 -1008557 11795567 21616965 18330803 6228662 -2909859 -1975239 6663446
40102F663446R202515M366963k953918j1073073j5697821j0868735J089496P731369
$$ 6663446 15865961 20232924 17279006 6205933 -9491888 -20360623 -19271127 -11539758
40094a1539758K891421k230487L932325J2246594N749143j0278697j2572618L716573
$$ -11539758 -8648337 -10878824 -6946499 5300095 11049238 770541 -11802077 -8085504
40086h085504J5883957Q969403k492958j730337K497380m793385j4932899r721467
$$ -8085504 7798453 16767856 14274898 12544561 15041941 10248556 -4684343 -14405810
40078a4405810N453226Q944167j756381p895673k048665K693698k70893M49420
$$ -14405810 -8952584 -8417 -1764798 -9660471 -11709136 -9015438 -9286331 -8836911
40070h836911J0253474J5084393M470310r813109j2397584p233002o421908p783538
$$ -8836911 1416563 16500956 20971266 11158157 -1239427 -8472429 -14894337 -22677875
40062b2677875j003827J0885250J4073685O180048J3014L202359P388414K895845
$$ -22677875 -23681702 -12796452 1277233 7457281 7470295 10672654 18061068 20956913
40054B0956913n729580o632165J876519Q932187O199775j238180l032367J199930
$$ 20956913 15227333 8595168 10471687 19403874 25603649 24365469 21333102 22533032
40046B2533032J773411n677748j2754560j0588266k366376L460209O068343Q849247
$$ 22533032 24306443 18628695 5874135 -4714131 -7080507 -3620298 2448045 11297292
40038A1297292Q598892P05551p698479m207312Q652758J4088081M993059o614086
$$ 11297292 19896184 20601735 12903256 8695944 17348702 31436783 36429842 29815756
40030B9815756q962586n785456n285540o458362n346246m388549n990443n412032
$$ 29815756 20853170 15067714 9782174 3323812 -2022434 -6410983 -12401426 -17813458
40022a7813458R12956P662717R299066Q470133Q059396L968071n246328j0782130
$$ -17813458 -16900502 -9237785 61281 8531414 16590810 20558881 15312553 4530423
40014D530423n986098K013998L731832K190672M995664R509988Q390994K959011
$$ 4530423 -1455675 558323 4290155 6480827 11476491 20986479 29377473 32336484
40006C2336484j404724o190023j3204589j4797477n376272M604888K801774l329727
$$ 32336484 30931760 24741737 11537148 -3260329 -8636601 -4031713 -1229939 -4559666
39998d559666K115028J5053011J5558383k80839j3800783j1682043j046645P194510
$$ -4559666 -2444638 12608373 28166756 27885917 14085134 2403091 1356446 8550956
39990H550956J1427085J0817755K182276p915204n499882Q437029J4741533M201792
$$ 8550956 19978041 30795796 32978072 25062868 19562986 28000015 42741548 46943340
39982D6943340p964165o603100Q20259P1315n802692n042727M15974j176389j0300868
$$ 46943340 38979175 32376075 33196334 33267649 27464957 22422230 22838204 21661815 11360947
39973A1360947j4725936p633055M638317J2265853J0928578K755412n208966o039968
$$ 11360947 -3364989 -10998044 -6359727 5906126 16834704 19590116 14381150 8341182
39965H341182j012145J756356j91311m49659K809354J236876q223519j3710839
$$ 8341182 7329037 9085393 8894082 8444423 11253777 12490653 4267134 -9443705
39957i443705n217379Q800144J3784716R301868L809246k118257j1670363j7568461
$$ -9443705 -14661084 -5860940 7923776 17225644 21034890 18916633 7246270 -10322191
39949a0322191r612121O394023J4000399R589931M944430O413782P123061J749866
$$ -10322191 -19934312 -13540289 460110 10050041 14994471 21408253 28531314 30281180
39941C0281180n417522j0041085j2402982j0191850K08928J2487386J3977167
$$ 30281180 24863658 14822573 2419591 -7772259 -7563331 4924055 18901222
39934A8901222M218031l326913k107527o73254m440103m877434L677487J0601169
$$ 18901222 23119253 19792340 17684813 17011559 12571456 7694022 11371509 21972678
39926B1972678M946523o293894r600681n882823n381256q078497n083845L405970
$$ 21972678 26919201 20625307 11024626 5141803 -239453 -8317950 -13401795 -9995825
39918i995825P236793L592071P74634K649575L168265N30451K857441J1976034
$$ -9995825 -2759032 833039 1607673 4257248 7425513 7955964 10813405 22789439
39910B2789439J4211130n84566j9823319k2815365r949862q98637m058928n903467
$$ 22789439 37000569 36416003 16592684 -6222681 -16172543 -17071180 -21130108 -27033575
39902b7033575L361177J1555855N340379m945047p55720J2220727J0248215j0078220
$$ -27033575 -23672398 -12116543 -6776164 -11721211 -12476931 -256204 9992011 -86209
39894h6209k3370691j2559589O983739J3045148P756366O037730P772299K849837
$$ -86209 -23456900 -36016489 -29032750 -15987602 -8231236 -2193506 5578793 8428630
39886H428630n316639m248899L486111K994715o049139o844643O493700J8423356
$$ 8428630 3111991 -1136908 2349203 5343918 -705221 -7549864 -1056164 17367192
39878A7367192J6165534O521600K95427l540172q168614q657353l296385k073145
$$ 17367192 33532726 40054326 40349753 36809581 28640967 19983614 16687229 14614084
39870A4614084j0634415j6986495q566257O453746J0250252J370670n764155l534128
$$ 14614084 3979669 -13006826 -21573083 -15119337 -4869085 -3498415 -9262570 -12796698
39862a2796698J766815M109204M945402N336364K959023q90254j142419K287384
$$ -12796698 -11029883 -6920679 -1975277 3361087 6320110 5429856 4287437 6574821
39854F574821M074801K815217K101101J408214m339762j3466545j5381560m719642
$$ 6574821 10649622 13464839 15565940 16974154 12634392 -832153 -16213713 -20933355
39846b0933355R700727J5616298J1607978N444526K665065K429336J836790r97130
$$ -20933355 -11232628 4383670 15991648 21436174 24101239 26530575 28367365 27370235
39838B7370235o729564j3118406j4519165p651566K083639M953614n28464m115552
$$ 27370235 20640671 7522265 -6996900 -14648466 -12564827 -7611213 -8139677 -12255229
39830a2255229K558373J2508013J1395448j379503r900905m673534K578281k340067
$$ -12255229 -9696856 2811157 14206605 12827102 2926197 -1747337 830944 -1509123
39822a509123j1633596o620889J0600627J7459014O105237l606721L125229J1022407
$$ -1509123 -13142719 -19763608 -9162981 8296033 14401270 10794549 13919778 24942185
39814B4942185N53331j7511011j7700165j194909N499413p216083j7424460o566514
$$ 24942185 25495516 7984505 -9715660 -10910569 -5411156 -12627239 -30051699 -36618213
39806c6618213J3360281K0047887J1768316L198645J534001K055973J408690J259913
$$ -36618213 -23257932 -3210045 8558271 11756916 13290917 15346890 16755580 18015493
39798A8015493P00375l817876j0637993j2959686p680406Q73842O145619N008139
$$ 18015493 18715868 14897992 4259999 -8699687 -16380093 -15506251 -9360632 -4352493
39790d352493l56788l400519J399973J0964846J4731556P249801l774865o899219
$$ -4352493 -4709281 -8109800 -6709827 4255019 18986575 26236376 22461511 15562292
39782A5562292j558452K462744j202532p997467r233284k223820P662259J2829574
$$ 15562292 14003840 16466584 15264052 7266585 -1966699 -4190519 3471740 16301314
39774A6301314J0302085L292005l778774j0077288j5414586j4708796k688688
$$ 16301314 26603399 29895404 26116630 16039342 624756 -14084040 -16772728
39767a6772728J4223678J9380596N766067j1836103j3386432J050269J2287775
$$ -16772728 -2549050 16831546 22597613 10761510 -2624922 -1574653 10713122
39760A0713122P671507m671485j0060339o138361j003988P14270Q35833n22746
$$ 10713122 18384629 13713144 3652805 -2485556 -3489544 -2775274 -1939441 -2462187
39752b462187o083746j2573642r639830O236449K2223176K1943752O287725p050315
$$ -2462187 -8545933 -21119575 -30759405 -24522956 -2299780 19643972 25931697 18881382
39744A8881382n905932L139439P484043N345595K253857j772005j0050933j7698913
$$ 18881382 12975450 16114889 23598932 28944527 31198384 29426379 19375446 1676533
39736A676533j4995871k979807N882767N265411K395754L988387N846486K922587
$$ 1676533 -13319338 -16299145 -10416378 -5150967 -2755213 1233174 7079660 10002247
39728A0002247m23837J055077K988088p16963o000062n282450r87125j282222
$$ 10002247 9578410 10633487 13621575 12904612 6904550 1622100 634975 -647247
39720f47247n768293o864200l484017j795897l020304j911705K295879M891649
$$ -647247 -6415540 -13279740 -16763757 -18559654 -21579958 -23491663 -21195784 -16304135
39712a6304135O445987J2079823J7796028J1540207o622202j9184958j4727147
$$ -16304135 -9858148 2221675 20017703 31557910 24935708 5750750 -8976397
39705h976397m242319k700148n827186n50229R711391R126491l372053j0133563
$$ -8976397 -13218716 -15918864 -21746050 -22296279 -12584888 -3458397 -6830450 -16964013
39697a6964013j705723R047593P602403q60609j486032P958339J6268682J5102029
$$ -16964013 -18669736 -9622143 -2019740 -2880349 -4366381 3591958 19860640 34962669
39689C4962669N898443o066692j5185777j5540838o638667K189532J809552l476907
$$ 34962669 40861112 34794420 19608643 4067805 -2570862 -381330 1428222 -2048685
39681b048685k069609O306377R419303J779950p014617q241456o711603r056132
$$ -2048685 -4118294 2188083 11607386 13387336 6372719 -1868737 -8580340 -17636472
39673a7636472r478192P11792J5389143J8768987O808701p882937j2779277p291603
$$ -17636472 -27114664 -26402872 -11013729 7755258 14563959 6681022 -6098255 -13389858
39665a3389858K515306J0991839J2809206N418062n022790q235548l315396L97764
$$ -13389858 -10874552 117287 12926493 18344555 13321765 5086217 1770821 2168585
39657B168585j558387k634610J477104M500249J870471O68015O549151R937751
$$ 2168585 610198 -2024412 -547308 3952941 5823412 6491427 13040578 22978329
39649B2978329m82482j6184472j7327770k137606Q948348K590920r137164q165157
$$ 22978329 22495847 6311375 -11016395 -13154001 -4205653 -1614733 -10751897 -18917054
39641a8917054L875032J1131507P299863Q60978p63522K57549Q22611K953799
$$ -18917054 -15042022 -3910515 3389348 4250326 3486804 3744353 4566964 7520763
39633G520763O299415L494074q757679j9174781j2845074P547579K1400915J5028903
$$ 7520763 13820178 17314252 8556573 -10618208 -23463282 -15915703 5485212 20514115
39625B0514115j464802r107983n105987k084220n309223m806267N839367J5595102
$$ 20514115 19049313 9941330 4835343 2751123 -2558100 -7364367 -1525000 14070102
39617A4070102J0712467m444422j2878532p815638J248328M862827N024621P466897
$$ 14070102 24782569 20338147 7459615 -356023 892305 5755132 10779753 18246650
39609A8246650J1427099J1978775P034489j881009j1393721j5983587j1118733
$$ 18246650 29673749 41652524 48687013 46806004 35412283 19428696 8309963
39602H309963l80175N510516J364433n182768m414008J480685K318193m255626
$$ 8309963 7929788 13440304 14804737 9621969 5207961 6688646 9006839 4751213
39594D751213r147716n264981K526406M482422j674279r488904j1793887o295318
$$ 4751213 -4396503 -9661484 -7135078 -2652656 -4326935 -13815839 -25609726 -31905044
39586c1905044M253980J3226230J3277536L304973q019588j0277611l220264L896675
$$ -31905044 -27651064 -14424834 -1147298 2157675 -5861913 -16139524 -19359788 -15463113
39578a5463113N237996M517300N986231O381346J439912n111113o643830m177059
$$ -15463113 -10225117 -5707817 278414 6659760 8099672 2988559 -3655271 -7832330
39570g832330l537724m214498m62252O814552R348185M571511k62560l41306j23794
$$ -7832330 -11370054 -15584552 -16046804 -9232252 115933 4687444 4424884 4083578 3959784
39561C959784l065292m047260P58937M789070Q97373n953594n612349J842364
$$ 3959784 894492 -3152768 -2393831 2395239 3292612 -2660982 -8273331 -6430967
39553f430967P320515O662455L865085J758896j264164m834311m947687m43321
$$ -6430967 889548 7552003 11417088 13175984 11911820 7077509 2129822 1686501
39545A686501M478241N507694K365699j962450l325269P0533L600408J17043q547500
$$ 1686501 6164742 11672436 14038135 12075685 8750416 8820949 12421357 12538400 3990900
39536C990900j0631330r41862R281566P656619j549184n757978l220631n86750
$$ 3990900 -6640430 -7582292 1699274 9355893 7806709 2048731 -1171900 -1758650
39528a758650K433450R799841J4533379N873891r483917j2357264K08383R823105
$$ -1758650 674800 10474641 25008020 30881911 21397994 9040730 9249113 19072218
39520A9072218M892189m822450q559966j0472101j4912978j3693722j989388P646786
$$ 19072218 23964407 19141957 10581991 109890 -14803088 -28496810 -30486198 -22839412
39512b2839412K987403p123116n687753O760926J4789949J1082369K997635n17485
$$ -22839412 -19852009 -26975125 -32662878 -25901952 -11112003 -29634 2968001 2450516
39504B450516K662374R289549J1753110K619570j3555461j9912617q275310P237198
$$ 2450516 5112890 14402439 26155549 28775119 15219658 -4692959 -12968269 -5731071
39496e731071Q549726k020010q121994l206425N447919J0972088J1652759O128925
$$ -5731071 2818655 798645 -7323349 -10529774 -5081855 5890233 17542992 23671917
39488B3671917l135778o438607K16091M764564m048337j6264471j4321748j226200
$$ 23671917 20536139 14097532 14313623 19078187 15029850 -1234621 -15556369 -16782569
39480a6782569M827270N81167M66808R099928J3643481P775754K006175L198056
$$ -16782569 -11955299 -11374132 -10907324 -1807396 11836085 19611839 21618014 24816070
39472B4816070L229208l316407p810462l743351J515263J193542P43998M647398
$$ 24816070 28045278 24728871 16918409 13175058 14690321 15883863 16627861 21275259
39464B1275259N651576j423739p833775m621916L123782O835964P872495R068785
$$ 21275259 26926835 25503096 17669321 13047405 16171187 23007151 30879646 39948431
39456C9948431N030293o040813j2412408n551733L584937J107366o418303l422933
$$ 39948431 44978724 38937911 26525503 20973770 24558707 25666073 19247770 15824837
39448A5824837P221951Q875570j43520l900396L666936Q597792R4286j2553406
$$ 15824837 23046788 31922358 31778838 27878442 31545378 40143170 40237456 27684050
39440B7684050j4607785n640315L542594N343640P8327p138399r070232j840738
$$ 27684050 13076265 7435950 10978544 16322184 16400511 9262112 191880 -1648858
39432a648858Q368750J0130399J516337o719509o337630k435125l475966p360721
$$ -1648858 6719892 16850291 18366628 11647119 5309489 2874364 -601602 -7962323
39424g962323n529338K736648Q627879O293228L04690j389297K331623N591360
$$ -7962323 -13491661 -10755013 -2127134 4166094 4470784 3081487 5413110 11004470
39416A1004470L701183j387493m005972j156319N222153J0946603J2432246P803411
$$ 11004470 14705653 13318160 9312188 8155869 13378022 24324625 36756871 44560282
39408D4560282j376080q921070q405598j034839L744969j463822j2769908j8808542
$$ 44560282 43184202 34263132 25857534 24822695 28567664 27103842 14333934 -4474608
39400d474608j2998894o6422R135752Q297967J642798j034061L785807Q838367
$$ -4474608 -17473502 -17539924 -8404172 -106205 1536593 502532 4288339 13126706
39392A3126706O674510J206521J424442N628569K641844r365894j6876683r804382
$$ 13126706 19801216 21007737 22432179 28060748 30702592 21336698 4460015 -5344367
39384e344367L783449R857523O803239K079641k021166p722550j1799251q470265
$$ -5344367 -1560918 8296605 15099844 17179485 15158319 7435769 -4363482 -12833747
39376a2833747l24919M183166L003586J081007N94595J06628J365600O602610
$$ -12833747 -13158666 -8975500 -5971914 -4890907 -4296312 -4189684 -2824084 3778526
39368C778526J0658310O837095n30215j357713K790020R2371j0958764j6465179
$$ 3778526 14436836 21273931 20743716 19386003 22176023 22268394 11309630 -5155549
39360e155549p325871P907861J6152212J4665607P274503k684717r132147n006830
$$ -5155549 -12481420 -4573559 11578653 26244260 33518763 30834046 21701899 16695069
39352A6695069M444465K170860j6434190l1321339k2948648K06498J4457025J3047705
$$ 16695069 21139534 23310394 6876204 -24445135 -47393783 -47187285 -32730260 -19682555
39344a9682555P960467N489370P27825m503683n2481J1450995J2216012k693847
$$ -19682555 -11722088 -6232718 -5504893 -10008576 -10061057 1389938 13605950 10912103
39336A0912103j3159095l080380J3761567J4078468o887o638005J085515P765215
$$ 10912103 -2246992 -5327372 8434195 22512663 22505776 15867771 16953286 24718501
39328B4718501L337146k706384p12025L093085l07031o998880q508212n764522
$$ 24718501 28055647 25349263 24637238 27730323 27423292 20424412 11916200 6151678
39320F151678l874699j439898L979102P252935L827102m70009N12440P65900o544592
$$ 6151678 2276979 837081 4816183 12069118 15896220 15426211 15938651 16704551 10159959
39311A0159959j2601288n050045Q535729R375636k272271p576818j261367P31193
$$ 10159959 -2441329 -7491374 1044355 10419991 8147720 570902 -690465 40728
39303D0728q194312j2043011j543359P052982R916p875483K418381K0081361K0230366
$$ 40728 -8153584 -20196595 -21739954 -14686972 -14677056 -22552539 -20134158 -52797 20177569
39294B0177569L184414q057668l839380L814443O347764P697679P638982o22506
$$ 20177569 23361983 15304315 11464935 15279378 21627142 29324821 36963803 36341297
39286C6341297j2952976j5435736p058480j445217k221293J974693J2062422J1163589
$$ 36341297 23388321 7952585 894105 -551112 -2772405 -797712 11264710 22428299
39278B2428299o295824j9249395r458452J0032597J3643895m66258j0329826r50048
$$ 22428299 16132475 -3116920 -12575372 -2542775 11101120 10634862 305036 -645012
39270f45012J8930719K8859161J6843189r809422k8944642k3960050k915633J0150216
$$ -645012 18285707 47144868 63988057 54178635 25233993 1273943 -1641690 8508526
39262H508526M771509o178469q675472m494994j17146M860834Q698457L032013
$$ 8508526 13280035 7101566 -1573906 -6068900 -6186046 -1325212 7373245 10405258
39254A0405258j0372683j3938566O8979J3189932P348875o320967n967504N580836
$$ 10405258 32575 -13905991 -13837012 -647080 6701795 380828 -5586676 -5840
39246e840Q326389M49746o07386R146371J2811029K244429q060001n232391K558261
$$ -5840 8320549 8770295 8162909 17309280 30120309 32364738 24304737 19072346 21630607
39237B1630607J370845p768750j3584256j0152728J53050J1251402J5032561O360457
$$ 21630607 23001452 15232702 1648446 -8504282 -8351232 2900170 17932731 24293188
39229B4293188q408628j5061898p853795M519626J1822128J2992201J0944171
$$ 24293188 15884560 822662 -7031133 -2511507 9310621 22302822 33246993
39222C3246993N750307j773180o878044o856799n221475n808278p134724n940374
$$ 33246993 38997300 37224120 30346076 23489277 18267802 12459524 5324800 -615574
39214f15574k496743L20311O02653j082773k026889n32620j81972n994228j3189763
$$ -615574 -3112317 -2792006 -2189353 -3272126 -5299015 -5831635 -6013607 -12007835 -25197598
39205b5197598q569241R189431K0902763J1848605l775710j796351J4658124J9774711
$$ -25197598 -33766839 -24577408 -3674645 8173960 4398250 2601899 17260023 37034734
39197C7034734O002336n358006m01432O140935j232932j2064735r302418J582331
$$ 37034734 43037070 37679064 37277632 43418567 42185635 30120900 20818482 22400813
39189B2400813L582889l263883n367377n75358Q88929k736431k401797L087244
$$ 22400813 25983702 22719819 17352442 16777084 17666013 14929582 12527785 15615029
39181A5615029L783475k845451n550477K696005J2641335J2062088K335874n872255
$$ 15615029 19398504 16553053 11002576 13698581 26339916 38402004 40737878 34865623
39173C4865623p482484n842398l827367N5194N564834O541893k187592j4915714
$$ 34865623 27383139 21540741 17713374 17768568 23333402 29875295 27687703 12771989
39165A2771989j8047845o302317Q822046J2866424P099808M478595Q633699Q833245
$$ 12771989 -5275856 -11578173 -2756127 10110297 17210105 21688700 30322399 39155644
39157C9155644j438643j2979686j4513579p876665j483724K843083P182807Q759299
$$ 39155644 37717001 24737315 10223736 2347071 863347 3706430 10889237 19648536
39149A9648536M378526j178324j296562J427353k30874n414308o466775j033793
$$ 19648536 24027062 22848738 21552176 22979529 22748655 17334347 10867572 9833779
39141I833779N677520R111484Q152245K111326o909927j1114630n290178L853799
$$ 9833779 15511299 24622783 32775028 34886354 27976427 16861797 11571619 15425418
39133A5425418N399143n83847m762508l575377k007946j974764P11301O145657
$$ 15425418 20824561 20240714 15478206 11902829 9894883 7920119 8631420 14777077
39125A4777077P628096K310910m074615o006894m005200J94326N915337Q978117
$$ 14777077 22405173 24716083 20641468 14634574 10629374 10823700 16739037 25717154
39117B5717154M060987n194716p558783J78125P690868N828160j943514q040192
$$ 25717154 29778141 24583425 17024642 17202767 24893635 30721795 28778281 20738089
39109B0738089j1203930j1323985l633407J1277975J9276231P987058j3075029
$$ 20738089 9534159 -1789826 -5423233 5854742 25130973 33118031 20043002
39102B0043002k1380388j0541516K625729L530659o75029M521888J6654945J9148111
$$ 20043002 -1337386 -11878902 -9253173 -5722514 -6397543 -1875655 14779290 33927401
39094C3927401N905928r539168j2702784o241823k509602m569449m509589J124453
$$ 33927401 39833329 30294161 17591377 11349554 8839952 4270503 -239086 885367
39086H85367M997402J465813l397326j209189M737924L463310p401612j7252845
$$ 885367 5882769 7348582 3951256 2742067 7479991 10943301 3541689 -13711156
39078a3711156j5586707l665378Q511423J2439770O864152k625204p892485n237146
$$ -13711156 -29297863 -32963241 -24451818 -12012048 -5147896 -7773100 -15665585 -20902731
39070b0902731N51419J764846k238218m377749m5445O651219R320656P788194
$$ -20902731 -20351312 -18586466 -20824684 -25202433 -25247878 -18596659 -9276003 -1487809
39062a487809O078797M595942l12794q651573j3276632p485123N205832J2637866
$$ -1487809 4590988 9186930 8874136 222563 -13054069 -20539192 -15333360 -2695494
39054b695494P177355m877706j0220541m099841N021496P030179J872681k890634
$$ -2695494 4481861 -395845 -10616386 -14716227 -9694731 -2664552 -791871 -3682505
39046c682505k484482R77779K745313N55535l195655k813066M505497J2661886
$$ -3682505 -6166987 -5189208 -2443895 -1888360 -5084015 -7897081 -3391584 9270302
39038I270302J1638918R83612p723878o085605J98267J661685j216046l326341
$$ 9270302 20909220 21892832 14168954 8083349 8281616 9943301 8727255 5400914
39030E400914o159256j1282134r207177Q313564K7497290K3958906j683061j9382141
$$ 5400914 -758342 -12040476 -21247653 -12934089 14563201 38522107 36839046 17456905
39022A7456905r565716J0412285J2797144k765940j5090748j4204736q321313
$$ 17456905 7891189 18303474 31100618 28334678 13243930 -960806 -9282119
39015i282119l440379L425910J0187469P465883m774698j3284402j0153653k713731
$$ -9282119 -12722498 -9296588 890881 8356764 3582066 -9702336 -19855989 -22569720
39007b2569720J139465M414498R359762P174343p664833k1864326j7462841K696365
$$ -22569720 -21430255 -17015757 -7655995 -481652 -8146485 -30010811 -47473652 -44777287
38999d4777287J8466328J9693446J4797546J1200866M095290q669390j5705073
$$ -44777287 -26310959 -6617513 8180033 19380899 23476189 14806799 -898274
38992h98274p848674N610011R508600M386048J820342L556393Q65330p130684
$$ -898274 -8746948 -3136937 6371663 10757711 12578053 16134446 16999776 9869092
38984I869092j0689699o751402l725153n008144k588383O553151J1886220N999221
$$ 9869092 -820607 -7572009 -11297162 -16305306 -18893689 -12340538 -454318 5544903
38976E544903k806597m578762k520312k714977j177090N327196P182274k703612
$$ 5544903 2738306 -1840456 -4360768 -7075745 -8252835 -2925639 4256635 1553023
38968A553023j1354341l039036J3187311J4960605J355811p278916l329400p48227
$$ 1553023 -9801318 -12840354 346957 15307562 16663373 9384457 6055057 5306830
38960E306830o389281p979544O27656N918915j069320q235417m891360j003371
$$ 5306830 -1082451 -9061995 -8434339 -2515424 -3584744 -11820161 -16711521 -17714892
38952a7714892o342385q719028N056056K1000243J6152718l614873j0120370N397109
$$ -17714892 -24057277 -32776305 -27720249 -6720006 9432712 5817839 -4302531 1094578
38944A094578K1570288J9893271O624741l465356o540912n446807j061097L773997
$$ 1094578 22664866 42558137 49182878 45717522 39176610 33729803 32668706 36442703
38936C6442703K788512m338956j0007406j0465692j0082275j0381793n958025
$$ 36442703 39231215 34892259 24884853 14419161 4336886 -6044907 -12002932
38929a2002932L660196R320544O121151J572453K208964K202962m796341j1141151
$$ -12002932 -8342736 977808 7098959 8671412 10880376 13083338 8286997 -2854154
38921b854154m851081J0953603K0298623J4489383J88657j1540853j4949855r003514
$$ -2854154 -7705235 3248368 23546991 38036374 38225031 26684178 11734323 2730809
38913B730809K780524J0313760M575342q880683j2885994r62274J1256943N650331
$$ 2730809 5511333 15825093 20400435 11519752 -1366242 -2328516 8928427 14578758
38905A4578758j2826131k1549833r921747Q424626J6109315J3119635R922228
$$ 14578758 1752627 -19797206 -29718953 -21294327 -5185012 7934623 17856851
38898A7856851Q881968M426396k646624m167278J170902L505250m545424j7570528
$$ 17856851 26738819 31165215 28518591 24351313 25522215 29027465 24482041 6911513
38890F911513k4119997j7944222j095458J7098780K3089491J0329233r572451
$$ 6911513 -17208484 -35152706 -36248164 -19149384 3940107 14269340 4696889
38883D696889j6239149m993412P743759P889826R50907j203658J461439K907674
$$ 4696889 -11542260 -16535672 -8791913 -902087 48820 -1154838 306601 3214275
38875C214275M312995Q474934R335982J297765p615493o631098o43412j939612
$$ 3214275 7527270 16002204 25338186 26635951 19020458 12389360 11745948 9806336
38867I806336q042540n507880O087420J2482766Q101979L054144L604747L258479
$$ 9806336 1763796 -3744084 2343336 14826102 22928081 25982225 29586972 32845451
38859C2845451j334152k591830K060248J949901r191075k0297549j8557877p546964
$$ 32845451 31511299 28919469 30979717 32929618 23738543 3440994 -15116883 -22663847
38851b2663847P61262L313453M976256P422409Q806061R104992P959377K635281
$$ -22663847 -21902585 -18589132 -13612876 -6190467 2615594 11720586 19679963 22315244
38843B2315244n524231r260607o108143l111819m205473k006174Q966293J9521229
$$ 22315244 16791013 7530406 1422263 -1689556 -5895029 -7901203 1065090 20586319
38835B0586319J7204657M371419n747553o497652j926508K175170K550186k059315
$$ 20586319 37790976 42162395 36414842 29917190 27990682 30165852 32716038 30656723
38827C0656723p924244p586931q96754K215946k461607m453140L739846J0318049
$$ 30656723 22732479 15145548 14248794 16464740 14003133 9549993 13289839 23607888
38819B3607888R19186j6170272j9772060o626230O464877R861681J0738510J3578217
$$ 23607888 24527074 8356802 -11415258 -18041488 -11576611 -1714930 9023580 22601797
38811B2601797J0910403N4738q018283n518859K57645Q05842l76341J804149K108909
$$ 22601797 33512200 33566938 25548655 20029796 20287441 21093283 20716942 22521091 24630000
38802B4630000m781392j1302692p289361K693278N080996k575058q958147o020857
$$ 24630000 19848608 8545916 1256555 3949833 9030829 6455771 -2502376 -8523233
38794h523233J400760M703333K612665J36490Q88960L284575K954251j930548
$$ -8523233 -7122473 -2419140 193525 330015 1218975 4503550 7457801 5527253
38786E527253p747456r180795n827757k028495K65134L828954R528941J2516340
$$ 5527253 -2220203 -11400998 -17228755 -19257250 -18992116 -15163162 -5634221 6882119
38778F882119Q852636K042272j192732J065318N391656P540923M603174l639395
$$ 6882119 15734755 17777027 16584295 17649613 23041269 30582192 35185366 31545971
38770C1545971j2009986j2552117m176728L880609K877849m654165r943869r903892
$$ 31545971 19535985 6983868 2807140 6687749 9565598 4911433 -5032436 -14936328
38762a4936328p511364l467794M190867J2741561J5128523R352185J313220l414802
$$ -14936328 -22447692 -25915486 -21724619 -8983058 6145465 15497650 16810870 13396068
38754A3396068m962537m551202p36620O101180J0461306P646978K24963n349618
$$ 13396068 8433531 3882329 3145709 9246889 19708195 27355173 27580136 22230518
38746B2230518o422729n011898l236362j969403k501332m860041m900228J719472
$$ 22230518 15807789 10795891 7559529 5590126 3088794 -1771247 -6671475 -4952003
38738d952003J1290163J3032985K374057j0277302j0136844K983821J2908308
$$ -4952003 6338160 19371145 21745202 11467900 1331056 4314877 17223185
38731A7223185P241758o389995j0493099j025402Q111222N104788m144063o324236
$$ 17223185 24464943 18074948 7581849 6556447 14667669 19772457 15628394 9304158
38723I304158j52808L751307J82314l615642k98187O874937J0391059Q787326
$$ 9304158 9151350 12902657 13084971 9469329 9171142 16046079 26437138 35224464
38715C5224464M629188k087656j0641386j3715352m760845R442963J3647516L797713
$$ 35224464 39853652 37765996 27124610 13409258 8648413 18091376 31738892 35536605
38707C5536605p207078p306020j39881L905269L479689M100146N575692K244077
$$ 35536605 28329527 21023507 20883626 24788895 28268584 32368730 37944422 40188499
38699D0188499n845247j1560000j0850327o394325q51497N479768R477831O341379
$$ 40188499 34343252 22783252 11932925 5538600 4687103 10166871 19644702 25986081
38691B5986081j469628m258809K172759J0122814R943476J126004r206170j3578231
$$ 25986081 24516453 20257644 22430403 32553217 42496693 43622697 34416527 20838296
38683B0838296q419567K404486P176786k104343j5949942j5633657J213909J5178840
$$ 20838296 12418729 14823215 22000001 19895658 3945716 -11687941 -10474032 4704808
38675D704808J1230000k314308r541604q550649n458916N23393J0401065J4107842
$$ 4704808 15934808 13620500 4078896 -4471753 -9930669 -9407276 993789 15101631
38667A5101631L903958q557883p267737K689932N094372J628614O342628J4583017
$$ 15101631 19005589 10447706 3179969 5869901 10964273 12592887 18935515 33518532
38659C3518532O646089j4775108k1750691n274996Q168181j27212j0672600j464618
$$ 33518532 40164621 25389513 3638822 -1636174 6532007 6404795 -4267805 -5732423
38651e732423J2188944M143507j5244805j3791828R838870K3995560J3677131
$$ -5732423 6456521 10600028 -4644777 -18436605 -8597735 15397825 29074956
38644B9074956j268742l291131k089517j0507977k0129327j6677657k870896Q384147
$$ 29074956 27806214 24515083 22425566 11917589 -8211738 -24889395 -27760291 -19376144
38636a9376144J1306289O852610l104836j1534517q295513L903274Q087772k084778
$$ -19376144 -8069855 -1217245 -4322081 -15856598 -24152111 -20248837 -12161065 -14245843
38628a4245843r513647R66375J7096743J6177670j325452j3781677r553904J814252
$$ -14245843 -23759490 -22793115 -5696372 10481298 9155846 -4625831 -14179735 -12365483
38620a2365483Q453298R459090P478358K546858k742749l225507J11309Q30802
$$ -12365483 -3912185 5546905 13025263 15572121 12829372 9603865 9715174 10545976
38612A0545976j409341r7640N001945N088380k823073q748005l945808O138002
$$ 10545976 9136635 9038995 14040940 19129320 16306247 7558242 3612434 9750436
38604I750436J0229252N844914j333001o857035r084717o139402J123013O196366
$$ 9750436 19979688 25824602 24491601 17634566 8549849 2410447 3533460 9729826
38596I729826L783529k596534n507614l446528l0357L588935Q349714J1242148
$$ 9729826 13513355 10916821 5409207 1962679 1932322 5521257 13870971 25113119
38588B5113119P620293k88931m461946k029621J251441M00665k135451k475836
$$ 25113119 32733412 32444481 27982535 25952914 27204355 27605020 25469569 22993733
38580B2993733k497842o081630j1284832j1559819m347190N303135J0327340Q428631
$$ 22993733 20495891 14414261 3129429 -8430390 -12777580 -7474445 2852895 11281526
38572A1281526K256389n143996j2204349j5894980j0937196L291202J6529011
$$ 11281526 13537915 8393919 -3810430 -19705410 -30642606 -27351404 -10822393
38565a0822393J5766396K319229o753033m00758J0276016P601815o057363j1365824
$$ -10822393 4944003 7263232 510199 109441 10385457 17987272 11929909 564085
38557E64085j331946Q601885N445171j781392J139796R507083Q613680k54026
$$ 564085 -767861 7834024 13279195 11497803 12637599 22144682 30758362 30504336
38549C0504336j609947P126332R414764l612229j6750426j2619686J858739N924477
$$ 30504336 28894389 36020721 45435485 41823256 25072830 12453144 14311883 20236360
38541B0236360l881244r408095J219995J5957483J6118147J619936j1022395j1594286
$$ 20236360 16355116 6947021 8167016 24124499 40242646 41862582 30840187 19245901
38533A9245901o459360n172590o259371k264160N995062Q284975j147715j4187853
$$ 19245901 12786541 7613951 1354580 -909580 5085482 13370457 12222742 -1965111
38525a965111j6978097n558516R663810J5307935R204145J774927K978273R808206
$$ -1965111 -18943208 -24501724 -14837914 470021 9674166 11449093 14427366 24235572
38517B4235572J0390247Q74983p502141l043888R254639J3400709L812875q517003
$$ 24235572 34625819 35500802 27998661 24954773 34209412 47610121 51422996 42905993
38509D2905993j2716894j0750241q824201n815012J543224Q898390R322457M143677
$$ 42905993 30189099 19438858 10614657 4799645 6342869 15241259 24563716 28707393
38501B8707393Q2868j196352k347910k592444p8521Q10772m952667j1684411q624440
$$ 28707393 28790261 27593909 25245999 22653555 22575034 23385806 18433139 6748728 -1875712
38492a875712K976420J0277773Q151184N737538R498973J1843067M320415p235482
$$ -1875712 1100708 11378481 19529665 25267203 34766176 46609243 50929658 43694176
38484D3694176j0367924l564060K569593j60284p863428r545590P4045J2283508
$$ 43694176 33326252 29762192 32331785 32171501 24308073 14762483 14836528 27120036
38476B7120036J1608447m220848j6337645o984901J3695429J8428268J120400
$$ 27120036 38728483 34507635 18169990 11185089 24880518 43308786 44429186
38469D4429186j4062754q435574N505473O796932k548060o629404l485826l013495
$$ 44429186 30366432 21930858 27436331 34233263 31685203 25055799 21569973 18556478
38461A8556478m765672N22643J0298843J1828786M660334K034554P439706Q380512
$$ 18556478 13790806 14313449 24612292 36441078 41101412 43135966 50575672 58956184
38453E8956184j401713j0574670q501399m84060L537294L488641M108449N390710
$$ 58956184 57554471 46979801 38478402 37994342 41531636 45020277 49128726 54519436
38445E4519436N303258L250810l941982j8464426k9317352j8604145J0720033
$$ 54519436 59822694 63073504 59131522 40667096 11349744 -7254401 3465632
38438C465632K8493481J3219154j7367942k8520239j2801208O596862J1639070
$$ 3465632 31959113 45178267 27810325 -709914 -13511122 -6914260 4724810
38431D724810P255842K819257k564067q572277n485682R683879K1112917J3078313
$$ 4724810 11980652 14799909 12235842 3663565 -1822117 7861762 28974679 42052992
38423D2052992n968358j3507482m526050K897771l683305j2251530n995657R291031
$$ 42052992 36084634 22577152 18051102 20948873 17265568 5014038 -981619 8309412
38415H309412J2698482m78509j1306817m871086Q903024J1269901J010322p763428
$$ 8309412 21007894 20529385 9222568 4351482 13254506 24524407 25534729 17771301
38407A7771301p904470n187279l967872j197476L310122L603595q07747j213377
$$ 17771301 9866831 4679552 711680 -485796 2824326 6427921 5620174 4406797
38399D406797O274432J2411038P797680l385908j0016230q232433k129892L865283
$$ 4406797 10681229 23092267 30889947 27504039 17487809 9255376 7125484 10990767
38391A0990767O298706K007339o379968r293657k080808O899651P685655K703521
$$ 10990767 17289473 19296812 12916844 3623187 1542379 8442030 16127685 18831206
38383A8831206K85205k52560n348564j2361482j1235334j160877O838360O439125
$$ 18831206 19116411 18863851 13515287 1153805 -10081529 -11242406 -4404046 2035079
38375B035079M007513O032505Q572229N179766k284496p349739q167948o958004
$$ 2035079 6042592 12075097 20647326 25827092 23542596 16192857 8024909 1066905
38367A066905m151362P80862M727664K946711l869872q332999m250872N129247
$$ 1066905 -3084457 -2303595 2424069 5370780 1500908 -6832091 -11082963 -5953716
38359e953716R113970J754533r478964j1682554l088646N257533O508065P014991
$$ -5953716 3160254 4914787 -4564177 -16246731 -19335377 -14077844 -7569779 -554788
38351e54788J1695996J1240059k887530j8457670j5510892K873874J2388984K858585
$$ -554788 11141208 22381267 19493737 1036067 -14474825 -11600951 788033 3646618
38343C646618p931115l425953P423101P897234J23590k376877J918285L749336
$$ 3646618 -4284497 -7710450 -287349 7609885 7733475 5356598 7274883 11024219
38335A1024219R96174q48741j572622m291892m468573L437577J1337171O462386
$$ 11024219 12020393 11171652 9599030 5307138 838565 4276142 15613313 22075699
38327B2075699o151727q106519L841111J1975594N018542o274637q541943m850799
$$ 22075699 15923972 7817453 11658564 23634158 28652700 22378063 13836120 8985321
38319H985321m273182n909657m543136j611587j68350J680161L540471k20585
$$ 8985321 4712139 -1197518 -5740654 -7352241 -7520591 -5840430 -2299959 -2520544
38311b520544p319146m797176Q903472J4000811k011918j9813050j3862196Q208976
$$ -2520544 -9839690 -14636866 -5733394 8267417 6255499 -13557551 -27419747 -19210771
38303a9210771J7343027P844155J608782P811968Q996956m475333j4283704l804217
$$ -19210771 -1867744 5976411 7585193 15397161 24394117 19918784 5635080 1830863
38295A830863J3860908J5722789J601129j0313955r702653r36508P512768Q104755
$$ 1830863 15691771 31414560 33015689 22701734 12999081 12062573 19575341 27680096
38287B7680096k532798j5067189j2753233M794952J6226634Q204427n008883o211803
$$ 27680096 25147298 10080109 -2673124 2121828 18348462 26552889 21544006 15332203
38279A5332203k072967n410942p687100M449058J8041055J0208295j1179750j5829469
$$ 15332203 13259236 7848294 161194 4610252 22651307 32859602 21679852 5850383
38271E850383J168704J2703165M656653n009049j476048L395447k691815r465342
$$ 5850383 7019087 19722252 24378905 19369856 17893808 21289255 18597440 9132098
38263I132098m980905K655125K734495J973964Q609391J3410077N446308p665384
$$ 9132098 4151193 6806318 9540813 11514777 20124168 33534245 38980553 31315169
38255C1315169j3181674j3129656j3439370p797155Q294653K0952599J6483855
$$ 31315169 18133495 5003839 -8435531 -16232686 -7938033 13014566 29498421
38248B9498421M828049L063759O824070J410248q784576p971040R23034J041949
$$ 29498421 34326470 37390229 44214299 45624547 36839971 28868931 29791965 30833914
38240C0833914p112975o692096L667443O558818k475708o478621K943035J1362476
$$ 30833914 23720939 17028843 20696286 27255104 24779396 18300775 21243810 32606286
38232C2606286O564626l157298o000032l916352k957495k258379j456563m167045
$$ 32606286 39170912 36013614 30013582 26097230 23139735 20881356 19424793 15257748
38224A5257748o830887J8823J2495933J3144310j446494j1493917l674690Q431074
$$ 15257748 8426861 8445684 20941617 34085927 32639433 21145516 17470826 25901900
38216B5901900P400270j584576l682867Q45508K609285J923466L639200K943761
$$ 25901900 33302170 31717594 28034727 28880235 31489520 33412986 37052186 39995947
38208C9995947n564202j2615551o243539P085579J0947082L784053j890212j151815
$$ 39995947 34431745 21816194 15572655 22658234 33605316 37389369 35499157 34347342
38200C4347342j96478q39880J238095L919651J027067l210950J094783J0056484
$$ 34347342 34150864 33310984 34549079 38468730 39495797 36284847 37379630 47436114
38192D7436114R246599j463147n272632L816914R556701m65011j4189682j4277395
$$ 47436114 56682713 55219566 49946934 53763848 63320549 62855538 48665856 34388461
38184C4388461m755843k019004p658447q200985Q67023Q009245M988394j126865
$$ 34388461 29632618 27613614 19955167 11754182 12621205 20630450 25618844 24491979
38176B4491979j392405O90326k964657j0036734j0780083l013933N471846R378518
$$ 24491979 23099574 23789900 20825243 10788509 8426 -3005507 2466339 11844857
38168A1844857J1804637J5422476J5961486R308724r73003q559364j1808604j1214862
$$ 11844857 23649494 39071970 55033456 64342180 63369177 54809813 43001209 31786347
38160C1786347n302621M168331Q807134M145671j659200J37488L516332k468741
$$ 31786347 26483726 30652057 39459191 43604862 41945662 42083150 45599482 43130741
38152D3130741j2770657j2042906l86641N511302K21385j389178Q973625J6400790
$$ 43130741 30360084 18317178 17930537 23441839 23663224 22274046 31247671 47648461
38144D7648461O229280j1624770j7631374j0083305j235589M525696J1372179
$$ 47648461 53877741 42252971 24621597 14538292 13302703 17828399 29200578
38137B9200578J7116898J4616062N424362j892243m690608n592247k901252N513558
$$ 29200578 46317476 60933538 66357900 64465657 59775049 54182802 51281550 56795108
38129E6795108J2391597Q579204j791071o008373q19661N474033O389072K141102
$$ 56795108 69186705 77765909 75974838 69966465 69146804 74620837 81009909 83151011
38121H3151011m850046q636107j67377J8113897K5756672R000722j4669226j6576613
$$ 83151011 78300965 69664858 69497481 87611378 113368050 122368772 107699546 91122933
38113I1122933K766635J5522830P651248n582636q161249l617020M36501O207305
$$ 91122933 93889568 109412398 117063646 111481010 103319761 99702741 100139242 106346547
38105A06346547J3570379J2443402o68431j2987444j2974360m946866K262286
$$ 106346547 119916926 132360328 131691897 118704453 105730093 100783227 103045513
38098A03045513P908756J2356278J1485232O973518Q251870J5163899J3463604
$$ 103045513 110954269 123310547 134795779 141769297 150021167 165185066 178648670
38091A78648670j922703j4223691q166696P587454J5206760J2813045J0303319
$$ 178648670 176725967 162502276 154335580 161923034 177129794 189942839 200246158
38084B00246158J0467226R257838P120972O827891O629959N884805R187755J5896947
$$ 200246158 210713384 219971222 227092194 233920085 240550044 246434849 255622604 271519551
38076B71519551J6609879R489935O132317J0002797O448800r906979j6903429
$$ 271519551 288129430 297619365 303751682 313754479 320203279 310296300 293392871
38069B93392871K892815K7772795K3709988m384427j9514278o748743J1174318
$$ 293392871 296285686 324058481 347768469 343384042 323869764 317121021 328295339
38062C28295339J4109843R370915Q415399O347245k273927q761294n695221q59041
$$ 328295339 342405182 351776097 360191496 366538741 364264814 355503520 349808299 348949258
38054C48949258l298406q974806j1138131j2293640j5314328j4406688n777263
$$ 348949258 345650852 336676046 325537915 313244275 297929947 283523259 277745996
38047B77745996K530089J470131o656199j4784420k1025172k4162614j9100362
$$ 277745996 280276085 281746216 275090017 260305597 239280425 215117811 196017449
38040A96017449o418787K085710k084698j0675362j0130877j475914J887066o021769
$$ 196017449 189598662 191684372 189599674 178924312 168793435 167317521 169204587 163182818
38032A63182818j5860431j6025858p298960j169693m818683j0821655o240472
$$ 163182818 147322387 131296529 123997569 122827876 118009193 107187538 100947066
38025A00947066P595018J2964363k15269j7547324j9227018p855378p58848q11000
$$ 100947066 108542084 121506447 121291178 103743854 84516836 76661458 75902610 75091610
38017G5091610L602124J1666993Q581644n096370q859257L267177R381643m300855
$$ 75091610 78693734 90360727 98942371 93846001 84986744 88253921 97635564 93334709
38009I3334709j8579942j2624066J431023M58114j0113764p728636P175656J2947147
$$ 93334709 74754767 62130701 63561724 64019838 53906074 46177438 53353094 66300241
38001F6300241M226081j833025K304786L716731m397041r890111m301593K199319
$$ 66300241 70526322 68693297 70998083 74714814 70317773 60427662 56126069 58325388
37993E8325388r16787p860489q848685n585501m069641l137861n34K018416K21560
$$ 58325388 57408601 49548112 40699427 35113926 31044285 27906424 27905890 29924306 30145866
37984C0145866p50738L062466O937947M696207j646306n494966m255909J0463
$$ 30145866 29395128 32457594 39395541 44091748 42445442 36950476 32694567 32705030
37976C2705030L791801L271118k258316o654787l371473L722658M740722k28039
$$ 32705030 36496831 39767949 37509633 30854846 27483373 31206031 35946753 35718714
37968C5718714o76932O299139J0258203M805631k056770k452927j345261n140469
$$ 35718714 35041782 41340921 51599124 56404755 54347985 51895058 50549797 45409328
37960D5409328q539341m324757K384516J891340m440915p818041n950966k619702
$$ 45409328 36869987 32545230 34929746 36821086 32380171 24562130 18611164 15991462
37952A5991462J298384N492685M550768l514739q544745j443755Q561787N251835
$$ 15991462 17289846 22782531 27333299 23818560 15273815 13830060 22391847 27643682
37944B7643682q752278j4615681o066850K484345P36617k456460K451857P885388
$$ 27643682 18891404 4275723 -1791127 693218 1429835 -1026625 1425232 9310620
37936I310620K858636o539419n568830N728768J2091845N185068o089109r599570
$$ 9310620 12169256 5629837 61007 5789775 17881620 23066688 16977579 7378009
37928G378009m684851J351179M498941N874570N685366J951123l772705m465826
$$ 7378009 2693158 4044337 8543278 14417848 20103214 22054337 18281632 13815806
37920A3815806L853252J3288323J0334060o221133j9738728j4623812K991768
$$ 13815806 17669058 30957381 41291441 35070308 15331580 707768 3699536
37913C699536J2170025L762780r642693j2299048m073873M359738O830768M857606
$$ 3699536 15869561 19632341 9989648 -2309400 -6383273 -2023535 4807233 9664839
37905I664839J136515k374741l061219r20652m84175l561148l626741N129118
$$ 9664839 10801354 8426613 5365394 4444742 3960567 399419 -3227322 1901796
37897A901796J5912913J5564388K622414r463244r205052M4222P079368O621437
$$ 1901796 17814709 33379097 36001511 26538267 17333215 17377437 24456805 31078242
37889C1078242K056605j385574j904172j376576k839631o681825r026100o131088
$$ 31078242 33134847 31749273 29845101 28468525 25628894 18947069 9920969 3789881
37881C789881l4500L643012L229066J957889J471201j38829k936623l895908k838463
$$ 3789881 3755381 7398393 10627459 12585348 14056549 13917720 10981097 7085189 4246726
37872D246726l140909m047572J59319R158270J3117197P050248N77533L584748
$$ 4246726 1105817 -2941755 -2782436 6375834 19493031 26543279 27120812 30705560
37864C0705560R057918L485463r438444j1630538J350079J1297054L387887j2417571
$$ 30705560 39763478 43248941 33810497 22179959 23530038 34827092 38214979 25797408
37856B5797408j6918019q687065k174533m241907o811939k505898M846313Q328388
$$ 25797408 8879389 192324 -1982209 -6224116 -13036055 -15541953 -10695640 -2367252
37848b367252P217554M132991L0982l678200l536990J162945O042973P433622
$$ -2367252 4850302 8983293 9014275 5336075 1799085 2962030 9005003 16438625
37840A6438625O545280N021478J324819m350580o721675k988409L00616m466497
$$ 16438625 22983905 28005383 29330202 24979622 18257947 15269538 15570154 11103657
37832A1103657j3084901j3646161l712803N600277N460653N77543p97023k16587
$$ 11103657 -1981244 -15627405 -19340208 -13739931 -8279278 -7701735 -8498758 -8715345
37824h715345l417031o594769n05733J1766150J3847141j373132j8120032j6208628
$$ -8715345 -12132376 -18727145 -19232878 -7466728 6380413 5007281 -13112751 -29321379
37816b9321379K585247J7598984J6586436Q119596M824745N954230L608291k149781
$$ -29321379 -26736132 -9137148 7449288 15568884 20393629 26347859 29956150 27806369
37808B7806369m391342j825231l35023k141304j921728L820737R793250Q172852
$$ 27806369 23415027 21589796 21254773 19113469 17191741 21012478 30805728 38978580
37800C8978580j295761j0287059r794318J185316J2877298J1863946m872277k3477323
$$ 38978580 37682819 27395760 17601442 18786758 31664056 43528002 38655725 15178402
37792A5178402k5970365j0255998P760125J3173121P154502O41401l46362J984576
$$ 15178402 -10791963 -21047961 -13287836 -114715 7039787 7681188 7334826 9319402
37784I319402L743314L217508N77735j797722p95329K500336K690341j926492
$$ 9319402 13062716 16280224 16857959 15060237 14264908 16765244 19455585 17529093
37776A7529093n840240m891748k556416j971564J422892J0431011J5715769P381593
$$ 17529093 11688853 6797105 4240689 2269125 3692017 14123028 29838797 37220390
37768C7220390o715078q975014J768707P774765m22297j0262776q310909n89093
$$ 37220390 30505312 21530298 23299005 31073770 30651473 20388697 12077788 11488695
37760A1488695K1474m665543l639812L432570O892638M245984K434532L776380
$$ 11488695 11510169 6844626 3204814 6637384 13530022 17776006 20210538 23986918
37752B3986918K685160k529684o274012o068911n698879n805827k213209L351660
$$ 23986918 26672078 24142394 17868382 11799471 6100592 294765 -1918444 1433216
37744A433216K596342m068327l673911R222574J9438538J0739574q684306j5411946
$$ 1433216 4029558 -38769 -3712680 5509894 24948432 35688006 27003700 11591754
37736A1591754l217558R377112O995000j892663j080102P464257P646460m647200
$$ 11591754 8374196 17751308 24746308 22853645 21773543 29237800 36884260 32237060
37728C2237060j4351486r516225J504199L722617k035283k736230L986775N038608
$$ 32237060 17885574 8369349 9873548 13596165 11560882 8824652 12811427 17850035
37720A7850035o424311j7267264j1547605O640524J8399553J4128979J904952
$$ 17850035 11425724 -5841540 -17389145 -10748621 7650932 21779911 23684863
37713B3684863o518540p870924n128958k308112l270967q358466j1149079n742415
$$ 23684863 17166323 9295399 4166441 1858329 -1412638 -9771104 -20920183 -26662598
37705b6662598K811729M211992r19130j773019L965600N676510n55370k167825
$$ -26662598 -23850869 -19638877 -20558007 -22331026 -18365426 -12688916 -13244286 -15412111
37697a5412111R613934K1809514J6211612l688957j7167800j3676740j931855
$$ -15412111 -5798177 16011337 32222949 28533992 11366192 -2310548 -4242403
37690d242403O105825O808482J135550p521308j0810645k969773P460919N384820
$$ -4242403 1863422 8671904 9807454 2286146 -8524499 -11494272 -4033353 1351467
37682A351467r066349j8551983j1864852K634488J1562621J2545365R518591L811586
$$ 1351467 -7714882 -26266865 -38131717 -35497229 -23934608 -11389243 -1870652 1940934
37674A940934j710380p2090Q568975J2207168L678134o798936p206823k706755
$$ 1940934 230554 158464 8727439 20934607 24612741 17813805 10606982 7900227
37666G900227m361783o879742L039875J9385128K0110095J487590j2469359n150916
$$ 7900227 3538444 -3341298 -301423 19083705 39193800 40681390 28212031 23061115
37658B3061115P249065J810955j4249632j4813567L633676J5904452O252538r280199
$$ 23061115 30310180 32121135 17871503 3057936 6691612 22596064 28848602 19568403
37650A9568403r074022K382061M861247n506926j2817522p684334L27268M04095
$$ 19568403 10494381 12876442 17737689 12230763 -586759 -8271093 -7943825 -7539730
37642g539730l386562j698318L903151M255031k617327q942328p688431J040244
$$ -7539730 -10926292 -12624610 -8721459 -4466428 -7083755 -16026083 -23714514 -22674270
37634b2674270J2500513K0020354J6789892K072167j4082559j8886258j1297985
$$ -22674270 -10173757 9846597 26636489 28708656 14626097 -4260161 -15558146
37627a5558146l206011m054101r073938o368652O898486J9258159J6824979j60737
$$ -15558146 -18764157 -22818258 -31892196 -38260848 -31362362 -12104203 4720776 4560039
37619D560039j4540656r452453J1340077K5888093J9819946K910227o335402n431379
$$ 4560039 -9980617 -19433070 -8092993 17795100 37615046 40525273 34189871 28758492
37611B8758492o213849j2792794j5571488q213071K803353R426788J1339289R749054
$$ 28758492 22544643 9751849 -5819639 -14032710 -11229357 -1802569 9536720 19285774
37603A9285774L417836l743219k918079M882475O315084l546602j0631690l590055
$$ 19285774 22703610 18960391 16042312 20924787 27239871 23693269 13061579 9471524
37595I471524O414221L311484o779686n706151N412293P135328n925984j5345840
$$ 9471524 15885745 19197229 12417543 6711392 12123685 19259013 13333029 -2012811
37587b012811p457124O617955R132299J19963p120744n329243J886826P840393
$$ -2012811 -9469935 -2851980 6280319 6400282 -720462 -6049705 -4162879 3677514
37579C677514P370246q00386j0074502j0041728K06583R144072Q075770J877602
$$ 3677514 11047760 10247374 172872 -9868856 -9662273 -518201 7557569 9435171
37571I435171j076982j127415j800093m05617N750131J0001777M302050p075261
$$ 9435171 8358189 7230774 5430681 5025064 10775195 20776972 25079022 18003761
37563A8003761j2126237p071633J339008O719098O988715O93605r643443j2773353
$$ 18003761 5877524 -1194109 144899 6863997 13852712 14546317 4902874 -7870479
37555g870479r3699J8026719K0645907L918068j2591871j2555541l155728q6646
$$ -7870479 -7964178 10062541 30708448 34626516 22034645 9479104 6323376 6236730
37547F236730l475134j646653P238453J1437952L384905r824465j6290294j2270406
$$ 6236730 2761596 1114943 8353396 19791348 23176253 13351788 -2938506 -15208912
37539a5208912k850244M656088N792009K028610L41919N485494J1949002R237207
$$ -15208912 -18059156 -13403068 -7611059 -5582449 -5240530 244964 12193966 21431173
37531B1431173l050394j2043329p872992K581569M791982m094109j2639651j0879295
$$ 21431173 18380779 6337450 -1535542 1046027 5838009 1743900 -10895751 -21775046
37523b1775046j304310P102663R500280P337385M674704M959810P681206O725866
$$ -21775046 -23079356 -15976693 -6476413 860972 5535676 10495486 18176692 24902558
37515B4902558k942449j5074991j5433756q506J6441879J7162121L942986p336426
$$ 24902558 21960109 6885118 -8548638 -8557144 7884735 25046856 28989842 21653416
37507B1653416p858273k463268K814520P481883Q992817R25794j4760055k3263734
$$ 21653416 13795143 11331875 14146395 21628278 30621095 31546889 16786834 -6476900
37499f476900j3710358N246422J5095603R306419k174219p770893n774654j497065
$$ -6476900 -20187258 -14940836 154767 9461186 7286967 -483926 -6258580 -7755645
37491g755645K35149j429005l122212k58710O579219R864684M173246m763220
$$ -7755645 -7520496 -8949501 -12071713 -12330423 -5751204 4113480 8286726 3523506
37483C523506o092934J406098P306273L980638l181649m057684J928300N391259
$$ 3523506 -2569428 -1163330 6142943 10123581 6941932 2884248 4812548 10203807
37475A0203807J66358p953094q302253P24554Q910796P171442k09597j363685
$$ 10203807 10370165 2417071 -5885182 -5160628 3750168 10921610 10712013 9348328
37467I348328O293639J2032022O852257m401107j0863234r708139n737831j635638
$$ 9348328 15641967 27673989 34526246 30125139 19261905 9553766 3815935 2180297
37459B180297L057117N975360L898790r5639N8280L034108J803027l651565n150992
$$ 2180297 5237414 11212774 15111564 15015925 15074205 18108313 19911340 16259775 11108783
37450A1108783n45576J093047n873834j2746179q367397M290518J2344375J0068153
$$ 11108783 10563207 11656254 5782420 -6963759 -15331156 -11040638 1303737 11371890
37442A1371890K952350l216868q103015j1097394q582260o46501N562476M373830
$$ 11371890 14324240 11107372 3004357 -8093037 -16675297 -17321798 -11759322 -7385492
37434g385492J01303J417899Q316004J0926812L690153m924187l269147N553247
$$ -7385492 -7284189 -5866290 2449714 13376526 17066679 12142492 8873345 14426592
37426A4426592O122805o567255j6959134r541505Q096904J4901773N285664n699967
$$ 14426592 20549397 13982142 -2976992 -12518497 -4421593 10480180 15765844 10065877
37418A0065877o435886k818159l238538l875404J243320O578048L763618l272938
$$ 10065877 3629991 811832 -2426706 -6302110 -5058790 1519258 5282876 2009938
37410B009938m438956j32316O76971l451692m507518R55099O914395Q209816O252288
$$ 2009938 -2429018 -2561334 -1884363 -5336055 -9843573 -8888474 -1974079 6235737 12488025
37401A2488025L027264j698699n593245m793063j465715j679594l898928N69460
$$ 12488025 15515289 13816590 8223345 3430282 1964567 284973 -3613955 -3044495
37393c044495J2065280J7776285R027353n034502r501491l721734M0938m643666
$$ -3044495 9020785 26797070 35824423 30789921 21288430 17566696 17607634 12963968
37385A2963968j0167463o946423K635446O714237p48962j0984979j0417385R86892
$$ 12963968 2796505 -4149918 -1514472 5199765 4450803 -6534176 -16951561 -15964669
37377a5964669Q154075J790326p033707k991135Q968196J0338829j218822p133358
$$ -15964669 -7810594 -6020268 -13053975 -16045110 -7076914 3261915 2043093 -5090265
37369e090265K484523J2837388Q369072l403204o468023j728144n35329k582538
$$ -5090265 -2605742 10231646 18600718 15197514 8729491 7001347 6466018 3883480
37361C883480L39833M699535L4025r168140p640250L758598O868900l562653j0128941
$$ 3883480 4223313 8922848 8956873 -211267 -7851517 -4092919 2775981 -786672 -10915613
37352a0915613k071462O363322P78555q017284k135240J2578945J5135568K396079
$$ -10915613 -12987075 -6623753 -5845198 -13862482 -15997722 -3418777 11716791 14112870
37344A4112870p743543n231323k76197l156016q440288o823677r0434M593029
$$ 14112870 6369327 1138004 861807 -2294209 -10734497 -17558174 -17648608 -13055579
37336a3055579O388075P859408O794826K15078p101660p044464j61639M440064
$$ -13055579 -6667504 1191904 7986730 8201808 1100148 -5944316 -6105955 -1665891
37328a665891J900900k449159k350010J78800j55468j470305L476005J4482558
$$ -1665891 235009 -2214150 -4564160 -4385360 -4540828 -6011133 -2535128 11947430
37320A1947430J9903792J0328557p487136j6822237j0678465P94051M174025j481788
$$ 11947430 31851222 42179779 34692643 17870406 7191941 7985992 12160017 10678229
37312A0678229o650020n366684j813335l121076r521788j3628790r038725J324641
$$ 10678229 4028209 -1338475 -3151810 -6272886 -15794674 -29423464 -38462189 -37137548
37304c7137548P201294K918525m616649l926590N610679J2085496O805556l890089
$$ -37137548 -29936254 -27017729 -31634378 -35560968 -29950289 -17864793 -11059237 -14949326
37296a4949326p023955O01472R922373J2055556P822751L949547L583766L368366
$$ -14949326 -21973281 -21371809 -11449436 606120 8428871 12378418 15962184 19330550
37288A9330550n95731o304554q003407m775174k760880n817744q297114k913775
$$ 19330550 18734819 12430265 4426858 -348316 -3109196 -8926940 -17224054 -20137829
37280b0137829P484467J3613577J2978020J0402647O944784n10036q423148q378179
$$ -20137829 -12653362 960215 13938235 24340882 31285666 30775630 22352482 13974303
37272A3974303k239249j720041q464939r856452j597517K552840n278182j0803500
$$ 13974303 11735054 10015013 1550074 -8306378 -9903895 -7351055 -12629237 -23432737
37264b3432737j404202R644536L909310r592252p558531Q945195J5722326L849733
$$ -23432737 -24836939 -15192403 -11283093 -20875345 -28433876 -19488681 -3766355 83378
37256H3378q930480p861558J394180R410696J4520953J1993065n321773k6928431
$$ 83378 -8847102 -16708660 -15314480 -5903784 8617169 20610234 15288461 -11639970
37248a1639970k7707837l044589J9011351J4498855n242607j3856295n265772
$$ -11639970 -39347807 -42392396 -23381045 -8882190 -14124797 -27981092 -33246864
37241c3246864P592491J5500017J7115120J0891623q70488p831013m840271j001759
$$ -33246864 -25654373 -10154356 6960764 17852387 16981899 9150886 4310615 3308856
37233C308856m107165o908784j357921N714317N488133L241163N560092M273682
$$ 3308856 -798309 -7707093 -9065014 -3350697 2137436 5378599 10938691 15212373
37225A5212373q246194j9597871j4089576R88226P685928O655558J0108153J3807217
$$ 15212373 6966179 -12631692 -26721268 -25733042 -18047114 -11391556 -1283403 12523814
37217A2523814L736877j3337776j4959628O86686J1128479N555229k113585j112285
$$ 12523814 16260691 2922915 -12036713 -11350027 -221548 5333681 3220096 2107811
37209B107811J474626J071157M886943J1540055O770564q828162j2798390L719623
$$ 2107811 3582437 4653594 9540537 21080592 27851156 19022994 6224604 9944227
37201I944227J7369577P660582j0711113j1952019J944954R386592L107899o678524
$$ 9944227 27313804 34974386 24263273 12311254 14256208 23642800 26750699 20072175
37193B0072175j3121594j5324271q485248P506384J6812077O511085q952049m926591
$$ 20072175 6950581 -8373690 -16858938 -9352554 7459523 13970608 5018559 91968
37185I1968J4922045K1434316K952909j8156083j9106507o402792m07909n394821
$$ 91968 15014013 36448329 39401238 21245155 2138648 -4264144 -4672053 -10066874
37177a0066874r161822m280104L589692O649450M928423L689606N233411N960882
$$ -10066874 -19228696 -23508800 -19919108 -13269658 -8341235 -4651629 581782 6542664
37169F542664K021278l651850l977554J513600M378800l50890n752065l551586
$$ 6542664 8563942 4912092 934538 2448138 6826938 6476048 723983 -2827603
37161b827603K623022L476711o00914j106530L232030L926286k911208r544048
$$ -2827603 -204581 3272130 2671216 1564686 4796716 8723002 5811794 -3732254
37153c732254p700943O05483P493876R182985P548741N174800K390479j956307
$$ -3732254 -11433197 -10827714 -3333838 5849147 13397888 18572688 20963167 19006860
37145A9006860q083200j2981009j1719863l387911N628863P679703K631036k477290
$$ 19006860 10923660 -2057349 -13777212 -17165123 -11536260 -3856557 -1225521 -3702811
37137c702811k178456K049257N268030N226292L832350L530576L720013K236924
$$ -3702811 -5881267 -3832010 1436020 6662312 10494662 14025238 17745251 19982175
37129A9982175l5100J72783J528868k499439j2204047j6183336o557978O029228
$$ 19982175 19947075 20119858 21648726 19149287 6945240 -9238096 -15796074 -9766846
37121i766846N567758m876492p905565K84361N798868L198351M227800J3041033
$$ -9766846 -4199088 -9075580 -16981145 -16696784 -10897916 -7699565 -3471765 9569268
37113I569268J4810597J784301r758537n128537M523135K750952m112018j597739
$$ 9569268 24379865 26164166 16405629 11277092 15800227 18551179 14439161 12841422
37105A2841422M715869Q16275p207854l306286P616037O957708l979968o315127
$$ 12841422 17557291 18373566 11165712 7859426 15475463 22433171 18453203 12138076
37097A2138076J973007L051071p321608j2227429n042971p77759p186377j0221304
$$ 12138076 14111083 17162154 9840546 -2386883 -7429854 -8207613 -15393990 -25615294
37089b5615294K16614J2644936J4490998J0306645P683157L706338l046734n221189
$$ -25615294 -25398680 -12753744 1737254 12043899 19727056 23433394 20386660 15165471
37081A5165471k590461o712058j8258388j9416064k491896J3431011J0282503
$$ 15165471 12575010 5862952 -12395436 -31811500 -34303396 -20872385 -10589882
37074a0589882k648959p076065l139614k50379K973015R503604R520270l257387
$$ -10589882 -13238841 -20314906 -23454520 -23704899 -20731884 -11228280 -1708010 -4965397
37066d965397j3701833n943337R336786J1100556J453166j153634N800869Q736540
$$ -4965397 -18667230 -24610567 -15273781 -4173225 -2720059 -3873693 1927176 10663716
37058A0663716M937071M273639O521891J980492n688901k188084R721979R746008
$$ 10663716 15600787 19874426 26396317 28376809 22687908 20499824 30221803 39967811
37050C9967811p385418k1472843j6764576k478387N434433N426427L558580P78852
$$ 39967811 32582393 11109550 -5655026 -8133413 -2698980 2727447 6286027 7064879
37042G064879k883831l500367j056676j540716n348056n206397m75554K93278
$$ 7064879 4181048 680681 -375995 -1916711 -7264767 -12471164 -12946718 -12653440
37034a2653440l187385J002029J4505080J9076119L416937j4710154j1431613
$$ -12653440 -15840825 -14838796 -333716 18742403 22159340 7449186 -3982427
37027c982427P533761J4511498j1149j5245228j1638009K798682P354938j404126
$$ -3982427 3551334 18062832 18051683 2806455 -8831554 -6032872 1322066 -82060
37019h2060p592001o30747J0534543J1727571L468891j862867N75449K061117
$$ -82060 -7674061 -8304808 2229735 13957306 17426197 15563330 16138779 18199896
37011A8199896m222981j1658631j0613338k792274L355476N860343Q097224Q839324
$$ 18199896 13976915 2318284 -8295054 -11087328 -7731852 -1871509 6225715 15065039
37003A5065039M668843k64138R64522M293433j275869j4275251j8840865p198801
$$ 15065039 19733882 19469744 20434266 24727699 23451830 9176579 -9664286 -16863087
36995a6863087P732146R851253J039995m112362Q73597Q029997P981937K045673
$$ -16863087 -9130941 720312 1760307 -2352055 -1478458 6551539 14533476 16579149
36987A6579149j131975J722542L292707l525862j2070167q075499Q108737J7246146
$$ 16579149 15447174 17169716 20462423 16936561 4866394 -3209105 4899632 22145778
36979B2145778P685219n914631m655009M444911P65883j3947746j7058770k479361
$$ 22145778 29830997 23916366 19261357 23706268 24472151 10524405 -6534365 -9013726
36971i013726R892410Q160665N301679J0299939Q221136j1945479l0798362k3963320
$$ -9013726 878684 9039349 14341028 24640967 32862103 20916624 -9881738 -33845058
36963c3845058J12287J2630399N959307j623978J832862Q607149J0285295R265254
$$ -33845058 -33732771 -21102372 -15143065 -16767043 -14934181 -6327032 3958263 13223517
36955A3223517Q201323M878046Q24466O32022Q80274n758057j4117895j0497288
$$ 13223517 21424840 26302886 27127352 27759374 28639648 22881591 8763696 -1733592
36947a733592L898787J0636865J342376r314604p118192N77161j36931o228978
$$ -1733592 2165195 12802060 14144436 4829832 -2288360 -1711199 -1848130 -8077108
36939h077108n054203K736344M571295k355270o519110q60683P129410Q646428
$$ -8077108 -13131311 -10394967 -5823672 -8178942 -14698052 -15558735 -8429325 217103
36931B17103O161651N965955O147327J125877n779231m405010O622853J4752215
$$ 217103 6378754 12344709 18492036 19617913 13838682 9433672 16056525 30808740
36923C0808740Q860311n412489j2356742o351385K016442J526847m846247o023003
$$ 30808740 39669051 34256562 21899820 15548435 17564877 19091724 14245477 8222474
36915H222474J46128L460701l920767j5209917j6105355k659341J2608667J4467998
$$ 8222474 8368602 11829303 7908536 -7301381 -23406736 -26066077 -13457410 1010588
36907A010588K339889r581036r071681J452576J0554864J1760055Q047978N173334
$$ 1010588 3350477 -6230559 -15302240 -13849664 -3294800 8465255 16513233 21686567
36899B1686567N269736O182738L683952m295535j2936933j3470071m864204K397940
$$ 21686567 26956303 33139041 36822993 32527458 19590525 6120454 1256250 3654190
36891C654190O55166k756667K372148J0424684P805151l250217o490061J194698
$$ 3654190 4309356 1552689 3924837 14349521 22154672 18904455 12414394 13609092
36883A3609092M118102m257872q224075K829509J2781640K846099j6941630k1871434
$$ 13609092 17727194 13469322 5245247 8074756 20856396 23702495 6760865 -15110569
36875a5110569r112146K351738L230614K222767L778727Q34042o382667n548202
$$ -15110569 -24222715 -21870977 -18640363 -16417596 -12638869 -11804827 -18187494 -23735696
36867b3735696O312311J4721199R918896J049478j478381k341496p986913j0900615
$$ -23735696 -17423385 -2702186 7216710 8266188 6787807 4446311 -3540602 -14441217
36859a4441217k230630J0097336J1969047N018458J948267M284248J676725p260827
$$ -14441217 -16671847 -6574511 5394536 10412994 12361261 16645509 18322234 11061407
36851A1061407j0230101j280669Q766469Q903730L559786K660672M774151J489461
$$ 11061407 831306 -449363 8317106 17220836 20780622 23441294 28215445 29704906
36843B9704906n899299o399943L308905J1941641Q380557l773437j2030793j0710659
$$ 29704906 23805607 17405664 20714569 32656210 41036767 37263330 25232537 14521878
36835A4521878m828900j276851k311479o287918q838945m218774Q145601J8686285
$$ 14521878 9692978 8416127 6104648 -183270 -9022215 -13240989 -5095388 13590897
36827A3590897J6380061L379739o376924n095926K21317L76380l054072l016086
$$ 13590897 29970958 33350697 26973773 21877847 22099164 22475544 19421472 16405386
36819A6405386J547452O121690P581064N123195r40267o637197o437129k286832
$$ 16405386 17952838 24074528 31655592 36778787 35838520 29201323 22764194 20477362
36811B0477362k782742q212760o928141N075195J2821925L517076j1473575j2464839
$$ 20477362 17694620 9481860 2553719 7628914 20450839 23967915 12494340 29501
36803B9501j446972L091717l076578n410536L114194J1727191J1551802P356094
$$ 29501 -1417471 1674246 -1402332 -6812868 -3698674 8028517 19580319 26936413
36795B6936413M628737J349121k356745k214366j882128r970238k0140323j3739683
$$ 26936413 31565150 32914271 30557526 28343160 26461032 16490794 -3649529 -17389212
36787a7389212R669667K4702560J4853157m318584j1019783p794079q430917j0711318
$$ -17389212 -7719545 16983015 31836172 27517588 16497805 8703726 272809 -10438509
36779a0438509l848512Q156244J2173029P370919J751835m856327j4538784j6160186
$$ -10438509 -14287021 -6130777 6042252 13413171 15165006 10308679 -4230105 -20390291
36771b0390291O04051K1292405K1125603J898037r855764k504861P654064P096065
$$ -20390291 -19786240 1506165 22631768 24529805 14674041 12169180 19823244 26919309
36763B6919309L477901M583199K844525n562334o945748P208500J9992953J1366698
$$ 26919309 30397210 34980409 37824934 32262600 25316852 32525352 52518305 63885003
36755F3885003r935402j7020657k309894J4256949J4003495O74608j0108446j0228874
$$ 63885003 53949601 36928944 34619050 48875999 62879494 63554102 53445656 43216782
36747D3216782k549881O974167J4097438J5825646J0112279k007466j4308800
$$ 43216782 40666901 47641068 61738506 77564152 87676431 85668965 71360165
36740G1360165j8128130j0633553P66850O491598O015873N356149M972135q36883
$$ 71360165 53232035 42598482 43365332 49856930 55872803 61228952 66201087 65364204
36732F5364204j1506211j7385046j3282980n591859r78733K623897P397531P824825
$$ 65364204 53857993 36472947 23189967 17598108 16619375 19243272 26640803 34465628
36724C4465628O86237n296106q41516Q609639J0435199L642204j626178j072558
$$ 34465628 35151865 29855759 29014243 37623882 48059081 51701285 50075107 49002549
36716D9002549n59280l354784m664754j446157J985526J850083O39164Q93996
$$ 49002549 48443269 45088485 40423731 38977574 40963100 42813183 43452347 44346343
36708D4346343m03156o433721j3540006j4122937n430470O567251J2069285O980633
$$ 44346343 43943187 37509466 23969460 9846523 4416053 10983304 23052589 30033222
36700C0033222k107121n433992l160702m468584j0554426q627896P853032K2676278
$$ 30033222 27926101 22492109 19331407 14862823 4308397 -4319499 3533533 26209811
36692B6209811J6267828l928033j1936697j767139M433959p108283j9269045j1895563
$$ 26209811 42477639 38549606 26612909 24845770 29279729 22171446 2902401 -8993162
36684h993162N999578J1344747K317645l021248K706588Q681571P983665O865665
$$ -8993162 -2993584 8351163 10668808 7647560 10354148 19035719 27019384 33885049
36676C3885049Q702315O581357k017235q131712o017712k052071j727663k83280
$$ 33885049 42587364 49168721 47151486 39019774 33002062 30949991 29222328 28939048
36668B8939048N059717N599335m781525j5643138j2891203O86885J0102611Q928307
$$ 28939048 33998765 39598100 34816575 19173437 6282234 6969119 17071730 26000037
36660B6000037L594080J32731j719296k657190k402760l072281m926891j584982
$$ 26000037 29594117 29726848 28007552 25350362 22947602 19875321 14948430 13363448
36652A3363448R952666J7978913Q748763j0605201j7804887o447337N245321K414825
$$ 13363448 23316114 41295027 50043790 39438589 21633702 15186365 20431686 22846511
36644B2846511o449014p469841l748422n086314p322114O5929J2491782J5058841
$$ 22846511 16397497 8927656 5179234 92920 -7229194 -7163265 5328517 20387358
36636B0387358O568018Q93990L466248L685468m851755j2634266j0402721l435074
$$ 20387358 26955376 27849366 31315614 35001082 30149327 17515061 7112340 3677266
36628C677266j37433J906534P075433Q979059O78447r246937o612758N606041
$$ 3677266 3539833 5446367 12521800 21500859 22179306 12932369 6319611 11925652
36620A1925652J0675678M009942j524720M57734q55414j0999137j4691949P64795
$$ 11925652 22601330 26611272 25086552 25544286 24688872 13689735 -1002214 -237419
36612b37419J9311983J4978265q593896k0862744q173906Q440718P624890j844921
$$ -237419 19074564 34052829 25458933 4596189 -3577717 4863001 12487891 10642970
36604A0642970p18301P619220N525532o483881r622080J575125R631394J907283
$$ 10642970 9924669 17543889 23069421 16585540 6963460 8538585 18169979 20077262
36596B0077262j0049754q917506L497831J1296680O661736l568041r352748p146035
$$ 20077262 10027508 1110002 4607833 15904513 22566249 18998208 9645460 2499425
36588B499425m07299L754221L43925p480484j0858436n932708K169649P834649
$$ 2499425 2092126 5846347 6190272 -1290212 -12148648 -18081356 -15911707 -8077058
36580h077058J1167074J2916673J0830216N814691M120714P118410O238378m071146
$$ -8077058 3090016 16006689 26836905 32651596 36772310 43890720 50129098 46057952
36572D6057952j4927625j3963454k907721N612001N555269J846903p26171k882043
$$ 46057952 31130327 17166873 14259152 19871153 25426422 27273325 26547154 23665111
36564B3665111m907784m032679N94764O003497Q816066O564195j740419j1098959
$$ 23665111 18757327 14724648 15319412 21322909 30138975 36703170 34962751 23863792
36556B3863792j1157321M82045R773584J909142j6596828k3745503j0687847P624789
$$ 23863792 12706471 13188516 22962100 24871242 8274414 -15471089 -26158936 -18534147
36548a8534147J3582288P378276P77981j44931J500599J438106j150744m262257
$$ -18534147 -4951859 2426417 3204398 3059467 4560066 5998172 4847428 585171
36540E85171m279549Q57330P490585Q836509L626559j872413k437488m02688j295256
$$ 585171 -3694378 -2837048 4653537 13490046 17116605 15244192 12806704 12404016 11108760
36531A1108760o241127j0682809q632181J765094J4380614J8400007R454290m283792
$$ 11108760 4867633 -5815176 -14447357 -12682263 1698351 20098358 29552648 25268856
36523B5268856j1405700r749145m385015K034446Q492503R694549K309379n527318
$$ 25268856 13863156 4114011 -271004 1763442 10255945 19950494 22259873 16732555
36515A6732555l607358L112563J185773p783658p666931M878289J2392854L876193
$$ 16732555 13125197 16237760 17423533 9639875 1972944 6851233 19244087 23120280
36507B3120280p722198p150704l19078r71551o388962l961683N784837J0138393
$$ 23120280 15398082 8247378 7928300 6956749 567787 -3393896 2390941 12529334
36499A2529334M534734k888142n067279k048541M349090J0511748Q635889m009577
$$ 12529334 17064068 14175926 9108647 7060106 11409196 21920944 30556833 26547256
36491B6547256j6105625j4255328j617499O932070N660422J691342J30932j071169
$$ 26547256 10441631 -3813697 -5431196 1500874 7161296 8852638 8983570 7912401
36483G912401k191448j067939j245353p138004j0967445o1577K0266909K7408949
$$ 7912401 5720953 4653014 3407661 -3730343 -14697788 -14759365 5507544 32916493
36475C2916493J1151424j1724811k0279390j3832978m587502J811619O532482
$$ 32916493 44067917 32343106 12063716 -1769262 -6356764 -4545145 1987337
36468A987337P621899K812896k910078l723931l139234p738609j4172035j2756734
$$ 1987337 9609236 12422132 9512054 5788123 2648889 -5089720 -19261755 -32018489
36460c2018489k325996Q227501J2744547J3211243J2064914P762284J29924o769197
$$ -32018489 -34344485 -26116984 -13372437 -161194 11903720 19666004 19795928 13026731
36452A3026731r641969q664237l937765M758397J2925094J2924337M472329k473224
$$ 13026731 3384762 -5279475 -9217240 -4458843 8466251 21390588 25862917 23389693
36444B3389693n67782M378791K476433m947542q260012n645243m844974o974237
$$ 23389693 22821911 27200702 29677135 24729593 16469581 10824338 5979364 -994873
36436i94873j488829J5016514K6217528J5466155q553857k1001977j3797489l035362
$$ -994873 -2483702 12532812 38750340 54216495 45662638 24660661 10863172 7827810
36428G827810j777230l246934J447379N712155P06049o628736m656998K659508
$$ 7827810 6050580 2803646 4251025 9963180 10669229 4040493 -616505 2043003
36420B043003L392243p43484J270354P343524M397948o462377p853807N174566
$$ 2043003 5435246 4691762 5962116 13305640 17703588 11241211 3387404 8561970
36412H561970J4258206N950785o609105m816279O378125Q509694o9008l939094
$$ 8561970 22820176 28770961 22161856 17345577 23723702 32233396 32164388 28225294
36404B8225294J766404L497850o438327j4516081n329366J4038960K1634278R044792
$$ 28225294 29991698 33489548 27051221 12535140 7205774 21244734 42879012 51923804
36396E1923804r264157j6143640j1580122p017807o785944m565138K873724Q367376
$$ 51923804 42659647 26516007 14935885 7918078 1132134 -3433004 -559280 7808096
36388G808096N119447k197244l797124J555830N987447L554574m371788j3155698
$$ 7808096 12927543 10730299 6933175 8489005 14476452 18031026 13659238 503540
36380E03540j7996438j4270306j758764J1542592J6252699J2329075P098263L709390
$$ 503540 -17492898 -31763204 -33521968 -21979376 -5726677 6602398 13700661 17410051
36372A7410051q64531o891151j0042963r602873r228693p442869K490949J8873794
$$ 17410051 16545520 9654369 -388594 -9991467 -19220160 -26663029 -24172080 -5298286
36364e298286K7705297J9746874M215219k498005K819040Q316943K913062j1625713
$$ -5298286 22407011 42153885 46369104 43871099 46690139 55007082 57920144 46294431
36356D6294431k3098667k0431183m857597R478505R940895N44760l326574M313920
$$ 46294431 23195764 2764581 -2093016 7385489 17326384 17871144 14544570 18858490
36348A8858490J2911741J1217884J239656p635238r834816m470745N960501J2578797
$$ 18858490 31770231 42988115 44227771 36592533 26757717 22286972 28247473 40826270
36340D0826270N647109j0165181j6085811l409172J2225220J1181453l977909
$$ 40826270 46473379 36308198 20222387 16813215 29038435 40219888 36241979
36333C6241979j4624028j1718806k480414M104304N646841K536336k943586m984276
$$ 36241979 21617951 9899145 7418731 11523035 17169876 19706212 16762626 11778350
36325A1778350r24921K834272P4566m206085j692721M880963O388198K274495
$$ 11778350 10853429 13687701 13762267 9556182 7863461 12744424 19132622 21407117
36317B1407117j027467k858752o560261q235443j682040P283048O639210j814223
$$ 21407117 20379650 17520898 10960637 2725194 1043154 8326202 14965412 13151189
36309A3151189l729769M725094J0212577K569717j1212286j7667904j0990918
$$ 13151189 9421420 14146514 24359091 26928808 15716522 -1951382 -12942300
36302a2942300N406903K0695699K0409277J654478j6467516j3497473K605407
$$ -12942300 -7535397 13160302 33569579 35224057 18756541 5259068 7864475
36295G864475O211801n552328q865127M792201J2298397j022745j3830450m332279
$$ 7864475 14076276 8523948 -341179 4451022 16749419 15726674 1896224 -2436055
36287b436055J1152926N199514j3136316j2682213P326239J5966017J613284j1354427
$$ -2436055 8716871 13916385 780069 -11902144 -4575905 11390112 13003396 1648969
36279A648969m878982N626354J543341p548102l015948J0437337J3612229L752589
$$ 1648969 -3230013 2396341 3939682 -3608420 -6624368 3812969 17425198 21177787
36271B1177787l991284j794153J974781n39542n125512m261642J637149O151948
$$ 21177787 17186503 15392350 17367131 16827589 11702077 7440435 9077584 15229532
36263A5229532N628654K826130K837678O233076P296627J385333p075325q875511
$$ 15229532 20858186 23684316 26521994 32755070 40051697 41437030 34361705 25486194
36255B5486194k528933L666995L589818L49260j546523l580970p761376j0451364
$$ 25486194 22957261 26624256 30214074 30563334 29016811 25435841 17674465 7223101
36247G223101q120205m066251k819624k392389J018062M790220L946989J48880
$$ 7223101 -897104 -4963355 -7782979 -10175368 -9157306 -4367086 -420097 -271217
36239b71217j278701o32419j846256l395165m40813M818713M814030o01440k938190
$$ -271217 -1549918 -2182337 -4028593 -7423758 -7864571 -3045858 1768172 1166732 -1771458
36230a771458J004084L857035N71703k647396J404100R182678J2103245Q343982
$$ -1771458 -767374 3089661 3661364 1013968 2418068 11600746 23703991 32047973
36222C2047973J998594m316120q514376n756786M775403J3331110R837849j084445
$$ 32047973 34046567 29730447 21216071 15459285 20234688 33565798 43403647 42319202
36214D2319202n789333j776317n07594p870419j4033894r008121J810405O362180
$$ 42319202 36529869 34753552 34245958 26375539 12341645 3333524 5143929 11506109
36206A1506109K918315j249411l068534n037849n974308j242955P213999J0613423
$$ 11506109 14424424 13175013 10106479 5068630 -905678 -2148633 5065366 15678789
36198A5678789N624209p97759k001038k02111m86145k394300k794724k501278
$$ 15678789 21302998 20505239 18504201 18302090 17815945 15421645 12626921 10125643
36190A0125643l905845m888460j506785M314161O035731K126960j208633Q44164
$$ 10125643 6219798 1331338 -175447 4138714 10174445 12301405 11092772 11936936
36182A1936936M701902M356194P85537j74083K007895J259907m547873q472301
$$ 11936936 16638838 20995032 21780569 21606486 23614381 24874288 20326415 11854114
36174A1854114m801131J065976R06187j798026L248408J3526204J2458596n786006
$$ 11854114 7052983 8118959 9025146 7227120 10475528 24001732 36460328 30674322
36166C0674322k2571283j7934516R50051R935403K685018k624214O297667J6666757
$$ 30674322 8103039 -9831477 -8881426 1053977 3738995 1114781 7412448 24079205
36158B4079205J1336905m635308j1622367k645293J0237992J4250489R111171
$$ 24079205 35416110 30780802 19158435 16513142 26751134 41001623 50112794
36151E0112794J484902m453794q057433r366696q012892l216597M512331J0385451
$$ 50112794 51597696 47143902 39086469 29719773 21706881 18490284 23002615 33388066
36143C3388066P874812k338661j0676132j0897578q430050r535683r011312J03890
$$ 33388066 41262878 38924217 28248085 17350507 8920457 -615226 -9626538 -9522648
36135i522648J0124441P599036l160776l773369P930956J1429405l313282j6063158
$$ -9522648 601793 8200829 5040053 1266684 9197640 20627045 17313763 1250605
36127A250605o562280J1672917J1131158n895427j0947472M593338J6203222O787463
$$ 1250605 -5311675 6361242 17492400 11596973 649501 5242839 21446061 28233524
36119B8233524o296987j182780J2694360J1024179o408434j7306011j1247956
$$ 28233524 21936537 20753757 33448117 44472296 38063862 20757851 9509895
36112I509895N16036P806863J1623834R650231n722041k7527717l2701215j2347648
$$ 9509895 10025931 17832794 29456628 39106859 33384818 5857101 -26844114 -39191762
36104c9191762J2340390J7597042P116183K28364K128028L380200Q63012J25769
$$ -39191762 -26851372 -9254330 -2138147 -1909783 218245 3598445 4461457 4587226
36096D587226N47020l584827q071860k554505R377236J1340585l90392r466623
$$ 4587226 5134246 1549419 -6522441 -9076946 300290 11640875 11250483 1783860
36088A783860m579067L866741K557418l188674o18370P879422R608334L636129
$$ 1783860 -2795207 1071534 3628952 440278 -178092 7701330 17309664 20945793
36080B0945793J373767N725064N591942m627058j3653696r877229L00685J972597
$$ 20945793 22319560 28044624 33636566 29009508 15355812 5478583 5779268 7751865
36072G751865n083342n649290O966491J8283493J1949923o015168j4122279m485500
$$ 7751865 2668523 -2980767 3985724 22269217 34219140 28203972 14081693 9596193
36064I596193P903631P970348p774l805600l564271q143113j6984130j9594059
$$ 9596193 17499824 25470172 25462398 21656798 18092527 9949414 -7034716 -26628775
36056b6628775j2118999k211245L641900P029972J0226407J1546941J0151141
$$ -26628775 -38747774 -40959019 -37317119 -30287147 -20060740 -8513799 1637342
36049A637342P207644J632257o606600r923278j414897J0565447J0277566j211172
$$ 1637342 8844986 10477243 3870643 -6052635 -7467532 3097915 13375481 12164309
36041A2164309n764724L316772J0118703K331022q533569o701068K341696K644456
$$ 12164309 6399585 9716357 19835060 22166082 13632513 6931445 9273141 11917597
36033A1917597n699252q466749o25046Q022917Q456246J380071p645163j2382608
$$ 11917597 6218345 -2248404 -2873450 5149467 13605713 14985784 7340621 -5041987
36025e041987q303583J052110M994686K99208k917846J693815M584414k789152
$$ -5041987 -13345570 -12293460 -7298774 -6999566 -9917412 -8223597 -3639183 -6428335
36017f428335j0486910n223375P306899J3121249J3311000J6212268J5279980
$$ -6428335 -16915245 -22138620 -14831721 -1710472 11600528 27812796 43092776
36010D3092776l42937j8718610j6470750L240148J2387806J280666q292561r40990
$$ 43092776 42749839 24031229 7560479 10800627 23188433 24469099 16176538 15235548
36002A5235548R071587N316411m656698o863137m239317n336307o498614k155947
$$ 15235548 24307135 29623546 24966848 18103711 13864394 8528087 2029473 -126474
35994a26474J384098j853913m671679p05294K109285l171591p457052j553500
$$ -126474 1257624 -596289 -5267968 -5973262 -3863977 -7035568 -14492620 -16046120
35986a6046120O479185O530751N083355J0163458J1673882j431296j6452292j4033070
$$ -16046120 -9566935 -3036184 2047171 12210629 23884511 22453215 6000923 -8032147
35978h032147r07343P20660r339918j0266569K910602J1727342O885129J721397
$$ -8032147 -8939490 -8218830 -17558748 -27825317 -24914715 -13187373 -6302244 -4580847
35970d580847N688813Q489086J371093o295498m264246J512415J727978l24792
$$ -4580847 1107966 9597052 10968145 4672647 408401 1920816 3648794 3324002
35962C324002J872526M583444K080539j368574L00352K738260j441254r266133
$$ 3324002 5196528 9779972 11860511 10491937 10792289 13530549 12089295 2823162
35954B823162j1810114p377965j553778J757956K000644p41893l259156R00391
$$ 2823162 -8986952 -16364917 -17918695 -16160739 -14160095 -14901988 -18161144 -17260753
35946a7260753J1742596J7985877J0195722m833044j1377003m746012L903169
$$ -17260753 -5518157 12467720 22663442 17830398 6453395 1707383 5610552
35939E610552K815922o479571j1987949m614242J2122984K4504915K1474078N610400
$$ 5610552 8426474 1946903 -10041046 -14655288 -2532304 21972611 43446689 49057089
35931D9057089j0349455j7138758j5274225q804760N3510P763136Q172732j96042
$$ 49057089 38707634 21568876 6294651 -2510109 -2456599 5306537 13479269 13283227
35923A3283227r753895j1832971o680682j698317j664810l828836j829710O664761
$$ 13283227 3529332 -8303639 -14984321 -16682638 -18347448 -22176284 -24005994 -17341233
35915a7341233J5414556J4411018K427007q218986n704036N148671R646841M364597
$$ -17341233 -1926677 12484341 14911348 6692362 988326 6136997 15783838 20148435
35907B0148435l87117L27489p72664o170702n448178N740684J2684502K251527
$$ 20148435 19761318 20088807 19316143 13145441 7697263 13437947 26122449 28373976
35899B8373976j3905961j4279273L33862Q404284J88914j0093209q379102r7419
$$ 28373976 14468015 188742 522604 8926888 9115802 -977407 -9356509 -9453928
35891i453928L001785K070760N384428J1126673Q772352l837702j4922823j2814138
$$ -9453928 -6452143 -4381383 1003045 12129718 20902070 17064368 2141545 -10672593
35883a0672593M0216J0405685R257538M68197n614544m803280k250040l016092
$$ -10672593 -10632377 -226692 9030846 9499043 3884499 -918781 -3168821 -6184913
35875f184913m073823L45148Q270786J0962930M671655m129990p489145n383159
$$ -6184913 -10258736 -9913588 -1642802 9320128 13991783 9861793 2372648 -3010511
35867c010511k772023p20793L960158J0691284J2654720N555096m838591q869013
$$ -3010511 -5782534 -6503327 -2543169 8148115 20802835 26357931 21519340 12650327
35859A2650327n193726r28411L53451K767607P035357M805408p078980j4525587
$$ 12650327 7456601 6528190 6881641 9649248 16684605 21490013 14411033 -114554
35851a14554k723934J8201779K1231585n36659k1793864j8688863L31526J0726103
$$ -114554 -2838488 15363291 36594876 36058217 14264353 -4424510 -4092984 6633119
35843F633119P170086M876865J1215340J5118205O712495p610455j5190014j2232921
$$ 6633119 13803205 18680070 29895410 45013615 51726110 44115655 28925641 16692720
35835A6692720m059040K720695M518801K385630J175526K975483K607960m227533
$$ 16692720 12633680 15354375 19873176 22258806 23434332 26409815 29017775 24790242
35827B4790242j0982351p771132K532992P057553K337859j610321O01806J167055
$$ 24790242 13807891 6036759 8569751 15627304 17965163 16354842 16956648 18123703
35819A8123703n206685j0030421n005171L425109M813376J613524K886457P293643
$$ 18123703 12917018 2886597 -2118574 1306535 6119911 7733435 10619892 17913535
35811A7913535N832974j757998o520856n151342l106058k740957m30734K993766
$$ 17913535 23746509 21988511 15467655 10316313 7210255 4469298 4038564 7032330
35803G032330J076684n639719p595004k026722O93998n662893j0228767p65035
$$ 7032330 8109014 2469295 -5125709 -7152431 -6458433 -12121326 -22350093 -23115128
35795b3115128J5099270J8177164M509221r856692j1837351o169407k998513k441834
$$ -23115128 -8015858 10161306 14670527 4813835 -7023516 -13192923 -16191436 -18633270
35787a8633270J02956J919619k427485q382755n098486P593923J6258553J1496804
$$ -18633270 -18530314 -16610695 -19038180 -27420935 -32519421 -24925498 -8666945 2829859
35779B829859J22041n771955m848599l633241k383648N083957J6918182J9642800
$$ 2829859 2951900 -2820055 -7668654 -11301895 -13685543 -8601586 8316596 27959396
35771B7959396N602069j2805761j5669027p00978J3190072R655704n613249j4622192
$$ 27959396 33561465 20755704 5086677 4385699 17575771 27231475 21618226 6996034
35763F996034j0362089j689415K764567M862436Q189255Q739086J981972o767190
$$ 6996034 -3366055 -5055470 -2290903 2571533 10760788 19499874 21481846 14714656
35755A4714656q241958k731574J292895P11867K88282J478526n28348n672117
$$ 14714656 6472698 3741124 5034019 5745886 6034168 7512694 6984346 1312229
35747A312229n709277K220571Q384232M571066k877000l300191K121789M735655
$$ 1312229 -4397048 -2176477 6207755 10778821 7901821 4601630 6723419 11459074
35739A1459074K705569o29093o873285j6911756j9426762k647315K2486631K9820207
$$ 11459074 14164643 13535550 6662265 -10249491 -29676253 -32323568 -9836937 19983270
35731A9983270J3228481m219254m713313m13892r287335k2875406j9642463j237007
$$ 19983270 33211751 28992497 24279184 23865292 14577957 -8297449 -27939912 -29176919
35723b9176919Q746698J250625n802440K782047J6615181J7296797M964265n482101
$$ -29176919 -20430221 -19179596 -24982036 -22199989 -5584808 11711989 16676254 11194153
35715A1194153o072032j319542K976077N226578M517656R01079j759035p48645
$$ 11194153 5122121 3802579 6778656 12005234 16522890 17423969 15664934 14916289
35707A4916289o58579o700346j3619785j0940967N28069P981166N148964Q21728
$$ 14916289 14257710 7557364 -6062421 -17003388 -16475319 -8494153 -3345189 -2523461
35699b523461L150254N806660m16440r915198r195508J648722Q192116L687634
$$ -2523461 626793 6433453 6017013 -3898185 -13093693 -11444971 -3252855 434779
35691D34779j321009L296370J1105786R507962j016841q198673n331653J669480
$$ 434779 -886230 2410140 13515926 23023888 22007047 13808374 8476721 10146201
35683A0146201M008659m2429n217258m622528M182070J4486432J4231353j61873
$$ 10146201 14154860 14112431 8895173 4272645 8454715 22941147 37172500 37010627
35675C7010627j6293028j8752979p692113L112168N333130L951279N271950P101535
$$ 37010627 20717599 1964620 -5727493 -2615325 2717805 6669084 11941034 19042569
35667A9042569N046742P23348j855292k725715l764633l960687j274943L276207
$$ 19042569 24089311 24812659 22957367 20231652 16467019 12506332 11231389 14507596
35659A4507596O026929L225294o399456j7468111j8396150m077308J2790427J4202148
$$ 14507596 20534525 23759819 17360363 -107748 -18503898 -22581206 -9790779 4411369
35651D411369K021560l120397P017685J4208806J760967j8195773k2116457r235535
$$ 4411369 6432929 3312532 10330217 24539023 26299990 8104217 -14012240 -23247775
$$ [...]
##END NTUPLES=NMR SPECTRUM
##END=
