##TITLE=31Pdec_SR167_k
 DMSO-d6, 128 sc
 20.2.2023
##JCAMPDX= 6.0         $$ Bruker NMR JCAMP-DX V2.0
##DATA TYPE= NMR SPECTRUM
##DATA CLASS= NTUPLES
##ORIGIN= UXNMR, Bruker Analytische Messtechnik GmbH
##OWNER= root
$$ XWIN-NMR		Version 3.5
$$ Mon Feb 20 16:49:24 2023 Russian Standard Time (UT+4h)  she@DPX200
##.OBSERVE FREQUENCY= 81.013821
##.OBSERVE NUCLEUS= ^31P
##.ACQUISITION MODE= SIMULTANEOUS
##.ACQUISITION SCHEME= undefined
##.AVERAGES= 128
##.DIGITISER RES= 16
##SPECTROMETER/DATA SYSTEM= spect
##.PULSE SEQUENCE= zgpg30
##.SOLVENT NAME= DMSO
##.SHIFT REFERENCE= (INTERNAL, DMSO, 0, 248.564)
##AUDIT TRAIL= $$ (NUMBER, WHEN, WHO, WHERE, WHAT)
$$ ##TITLE= Audit trail, XWIN-NMR		Version 3.5
$$ ##JCAMPDX= 5.01
$$ ##ORIGIN= Bruker BioSpin GmbH
$$ ##OWNER= she
$$ F:/spectra/data/she/nmr/P31/1/pdata/1/auditp.txt
$$ ##AUDIT TRAIL=  $$ (NUMBER, WHEN, WHO, WHERE, WHAT)
(   1,<2023-02-20 16:46:07.37 +0400>,<she>,<DPX200>,
      <continue with go, POWCHK disabled, PULCHK disabled
       configuration hash MD5:
       00 E9 B6 7A A2 85 ED C7 34 08 36 98 17 FE 4E 26
       data hash MD5: 32K
       6B 99 DF E7 B5 A7 7D 7F 0F 01 FC 5A 49 97 14 4E>)
(   2,<2023-02-20 16:48:40.03 +0400>,<she>,<DPX200>,
      <Start of raw data processing
       efp BC_mod = 2 LB = 1 FT_mod = 6 PKNL = 1 PHC0 = -11106.01 PHC1 = 373.6127 SI = 64K 
       data hash MD5: 64K
       C3 3D 48 A9 F8 D2 54 CF 6F 74 F0 6E 64 C5 EA 91>)
(   3,<2023-02-20 16:48:54.96 +0400>,<she>,<DPX200>,
      <pk PHC0 = 8.004181 PHC1 = 0 
       data hash MD5: 64K
       B8 84 45 71 73 14 17 49 D0 8F F5 53 C1 05 76 59>)
$$ ##END=
$$ 
$$ hash MD5
$$ 7E 8F 60 7A C6 18 7A D1 60 2A B0 80 40 28 15 CE
##$RELAX= 
##$RELAX= 
##$RELAX= 
##$RELAX= 
##$RELAX= 
##$RELAX= 
##$RELAX= 
##$RELAX= 
##$RELAX= 
$$ Bruker specific parameters
$$ --------------------------
##$DU= <F:/spectra>
##$EXPNO= 1
##$NAME= <P31>
##$PROCNO= 1
##$TYPE= <nmr>
##$USER= <she>
##$AMP= (0..31)
100 100 100 100 100 100 100 100 100 100 100 100 100 100 100 100 100 100 
100 100 100 100 100 100 100 100 100 100 100 100 100 100 
##$AQSEQ= 0
##$AQ_mod= 1
##$AUNM= <au_zg>
##$AUTOPOS= <>
##$BF1= 81.014009
##$BF2= 200.13
##$BF3= 200.13
##$BF4= 200.13
##$BF5= 200.13
##$BF6= 200.13
##$BF7= 200.13
##$BF8= 200.13
##$BYTORDA= 1
##$CFDGTYP= 0
##$CFRGTYP= 5
##$CHEMSTR= <none>
##$CNST= (0..31)
1 1 145 1 1 1 1 1 1 1 1 1 1 1 1 1 1 1 1 1 1 1 1 1 1 1 1 1 1 1 1 1 
##$CPDPRG= <waltz16>
##$CPDPRG1= <>
##$CPDPRG2= <waltz16>
##$CPDPRG3= <>
##$CPDPRG4= <mlev>
##$CPDPRG5= <mlev>
##$CPDPRG6= <mlev>
##$CPDPRG7= <mlev>
##$CPDPRG8= <mlev>
##$CPDPRGB= <>
##$CPDPRGT= <>
##$D= (0..31)
0 1 0 0 0 0 0 0 0 0 0 0.03 2e-05 3e-06 0 0 0 0 0 0 0 0 0 0 0 0 0 0 0 0 
0 0 
##$DATE= 1676896998
##$DBL= (0..7)
120 120 120 11 120 120 24 19 
##$DBP= (0..7)
150 150 150 150 150 150 150 150 
##$DBP07= 0
##$DBPNAM0= <>
##$DBPNAM1= <>
##$DBPNAM2= <>
##$DBPNAM3= <>
##$DBPNAM4= <>
##$DBPNAM5= <>
##$DBPNAM6= <>
##$DBPNAM7= <>
##$DBPOAL= (0..7)
0.5 0.5 0.5 0.5 0.5 0.5 0.5 0.5 
##$DBPOFFS= (0..7)
$$ [...]
##$SUBNAM2= <"">
##$SUBNAM3= <"">
##$SUBNAM4= <"">
##$SUBNAM5= <"">
##$SUBNAM6= <"">
##$SUBNAM7= <"">
##$SUBNAM8= <"">
##$SUBNAM9= <"">
##$SW= 501.771253377433
##$SWIBOX= (0..15)
0 1 3 0 0 0 0 0 0 0 0 0 0 0 0 0 
##$SW_h= 40650.406504065
##$TD= 32768
##$TD0= 1
##$TE= 0
##$TE2= 300
##$TE3= 300
##$TEG= 300
##$TL= (0..7)
0 120 53 12 22 120 120 120 
##$TP= (0..7)
150 150 150 150 150 150 150 150 
##$TP07= 0
##$TPNAME0= <>
##$TPNAME1= <>
##$TPNAME2= <>
##$TPNAME3= <>
##$TPNAME4= <>
##$TPNAME5= <>
##$TPNAME6= <>
##$TPNAME7= <>
##$TPOAL= (0..7)
0.5 0.5 0.5 0.5 0.5 0.5 0.5 0.5 
##$TPOFFS= (0..7)
0 0 0 0 0 0 0 0 
##$TUNHIN= 0
##$TUNHOUT= 0
##$TUNXOUT= 0
##$USERA1= <user>
##$USERA2= <user>
##$USERA3= <user>
##$USERA4= <user>
##$USERA5= <user>
##$V9= 5
##$VALIST= <valist>
##$VCLIST= <CCCCCCCCCCCCCCC>
##$VD= 0
##$VDLIST= <DDDDDDDDDDDDDDD>
##$VPLIST= <PPPPPPPPPPPPPPP>
##$VTLIST= <TTTTTTTTTTTTTTT>
##$WBST= 1024
##$WBSW= 4
##$XGAIN= (0..3)
0 0 0 0 
##$XL= 0
##$YL= 0
##$YMAX_a= 11124
##$YMIN_a= -2736
##$ZGOPTNS= <>
##$ZL1= 120
##$ZL2= 120
##$ZL3= 120
##$ZL4= 120
##$ABSF1= 0
##$ABSF2= 0
##$ABSG= 0
##$ABSL= 0
##$ALPHA= 0
##$AQORDER= 0
##$ASSFAC= 0
##$ASSFACI= 0
##$ASSFACX= 0
##$ASSWID= 0
##$AUNMP= <proc_1d>
##$AZFE= 0.1
##$AZFW= 0.5
##$BCFW= 0
##$BC_mod= 2
##$BYTORDP= 0
##$COROFFS= 0
##$CY= -3
##$DATMOD= 1
##$DC= 0
##$DFILT= <>
##$DTYPP= 0
##$F1P= 0
##$F2P= 0
##$FCOR= 1
##$FTSIZE= 65536
##$FT_mod= 6
##$GAMMA= 0
##$GB= 0
##$INTBC= 1
##$INTSCL= 6.047779e-11
##$ISEN= 30
##$LB= 1
##$LEV0= 0
##$LPBIN= 0
##$MAXI= 10000
##$MC2= 0
##$MEAN= 0
##$ME_mod= 0
##$MI= 50
##$NCOEF= 0
##$NC_proc= -10
##$NLEV= 6
##$NOISF1= 182.463
##$NOISF2= 159.3651
##$NSP= 0
##$NTH_PI= 0
##$NZP= 0
##$OFFSET= 248.5645
##$PC= 4
##$PHC0= -11098.01
##$PHC1= 373.6127
##$PH_mod= 1
##$PKNL= yes
##$PPARMOD= 0
##$PSCAL= 0
##$PSIGN= 0
##$REVERSE= no
##$SF= 81.0140089999694
##$SI= 65536
##$SIGF1= 159.3651
##$SIGF2= -187.1042
##$SINO= 113.3802
##$SIOLD= 16384
##$SREGLST= <1H.CDCl3>
##$SSB= 0
##$STSI= 65536
##$STSR= 0
##$SW_p= 40650.406504065
##$SYMM= 0
##$S_DEV= 0
##$TDeff= 32768
##$TDoff= 0
##$TI= <>
##$TILT= no
##$TM1= 0
##$TM2= 0
##$TOPLEV= 0
##$USERP1= <user>
##$USERP2= <user>
##$USERP3= <user>
##$USERP4= <user>
##$USERP5= <user>
##$WDW= 1
##$XDIM= 65536
##$YMAX_p= 368880297
##$YMIN_p= -502695560
$$ End of Bruker specific parameters
$$ ---------------------------------
##NTUPLES= NMR SPECTRUM
##VAR_NAME=  FREQUENCY,     SPECTRUM/REAL,   SPECTRUM/IMAG
##SYMBOL=    X,             R,               I
##VAR_TYPE=  INDEPENDENT,   DEPENDENT,       DEPENDENT
##VAR_FORM=  AFFN,          ASDF,            ASDF
##VAR_DIM=   65536,         65536,           65536
##UNITS=     HZ,            ARBITRARY UNITS, ARBITRARY UNITS
##FACTOR=    0.620285442955139, 1,           1
##FIRST=     20137.2065510682, 0,            0
##LAST=      -20513.1999529968, 0,           0
##MIN=       -20513.1999529968, -502695560,  0
##MAX=       20137.2065510682, 368880297,    0
$$ Real data points
##PAGE= N=1
##DATA TABLE= (X++(R..R)), XYDATA
$$ [...]
13930 5975775 -41531121 -105002827 -108836001 -50412167 1957220 7675767 -6249128
13923 -6249128 -11005700 -23954929 -64318141 -105533870 -107630447 -70062890 -22298149
13916 -22298149 16045588 38514797 36743608 12339058 -10336233 -10471361 623686
13909 623686 308448 -7891964 -2939607 15231190 21763902 2491766 -24037142 -24626660
13901 -24626660 13136532 60919944 68141304 15520575 -51785180 -70017305 -39036047
13894 -39036047 -24253629 -62944838 -108651797 -98641655 -42021035 922254 3553531
13887 3553531 -9139944 -14391684 -16165844 -17357240 -10116381 -296048 -6546189 -26046014
13879 -26046014 -30099503 -3813726 32805935 51402131 44084066 21421053 -330566
13872 -330566 -7545721 -1449948 -1464129 -20403341 -42840701 -49161707 -51246279 -73225787
13864 -73225787 -101886099 -94959031 -45193361 1549688 7992223 -6887630 -3426062
13857 -3426062 20992978 35911894 24473936 1742290 -7901344 4576731 26387705
13850 26387705 30481773 -3718343 -66444854 -118891654 -126794887 -91452974 -46255022
13843 -46255022 -27367132 -45206187 -74208812 -72903744 -28964147 15983226 5609962
13836 5609962 -61746245 -122458316 -117984677 -60542375 -13615422 -17239455 -50083742
13829 -50083742 -64219939 -42578721 -13207154 -9188246 -24417686 -21093354 17803913
13822 17803913 59749441 59819626 16236058 -29048227 -40747279 -23456052 -5479066
13815 -5479066 -6077465 -21475061 -32410754 -24541519 -6405902 547458 -4888662 703589
13807 703589 22410609 25672885 -12009634 -50807805 -33889568 28037468 65671385
13800 65671385 42695223 -10585086 -57432856 -92786998 -107893244 -76367077 -6611042
13793 -6611042 41887269 33891864 10224420 24062835 61809606 72687684 46663970
13786 46663970 13069829 -15615494 -45946363 -63126458 -41240087 8173781 42246607
13779 42246607 42825544 29386372 17491190 1650268 -19605546 -36363676 -47172227
13772 -47172227 -56666484 -56502260 -39544563 -25835102 -37706227 -55621486 -40814178
13765 -40814178 1498850 26727576 17602464 -2636167 -23824154 -57625599 -84707859
13758 -84707859 -60120612 3888348 27048609 -26237835 -83307550 -65326772 -1266540
13751 -1266540 24869869 596346 -17011960 -7949812 -13589538 -52862100 -85227110
13744 -85227110 -74877317 -38082330 -8011771 3451038 -6455683 -38219794 -66746931
13737 -66746931 -52013852 5669364 56651749 67588495 59034646 55976834 42607096
13730 42607096 608020 -42809041 -48922414 -27634816 -19944379 -33163411 -36765234
13723 -36765234 -19656635 -11426172 -38652192 -88864191 -127775021 -133369219 -107570075
13716 -107570075 -70566171 -47975653 -51072697 -67528297 -79074372 -81840983 -78975121
13709 -78975121 -65959480 -42145557 -25706569 -32499486 -46373188 -36936631 -5081207
13702 -5081207 15149035 1827151 -30991572 -56472920 -59684098 -37913762 -32301
13695 -32301 31451029 39839558 37283843 45902103 58261040 46306853 10265272 -16319183
13687 -16319183 -17307060 -14039181 -23519055 -33063154 -32303458 -33344762 -38667378 -26435619
13679 -26435619 6498334 24239851 6006632 -16011231 -11325257 -7616305 -42418407
13672 -42418407 -86706286 -77667588 -16085169 29501835 17802800 -19952053 -38008700
13665 -38008700 -29544581 -7314897 24089344 54287279 60414732 38361481 16162614
13658 16162614 17907354 35450947 48738870 50031126 34232676 -8580091 -70446806
13651 -70446806 -114409311 -107771411 -58532212 -8092931 3820936 -34098329 -94481830
13644 -94481830 -124117383 -89552953 -18034243 27415577 19601688 -10254931 -27426668
13637 -27426668 -38136331 -60411067 -80699076 -71156475 -36145836 -12047952 -22435451
13630 -22435451 -52664203 -70982774 -64841213 -53613836 -64735855 -94981224 -105507752
13623 -105507752 -69880916 -16080469 5305180 -11022679 -22547836 -6021383 11509566
13616 11509566 1676026 -21754487 -30582850 -24430344 -20028818 -19434785 -12915577 948789
13608 948789 16295794 29077789 34474054 29821307 24572952 26940806 21440673 -8556440
13600 -8556440 -36107701 -13971592 47144044 75830309 38867164 -8705288 -4908012
13593 -4908012 38076990 74540031 96924069 114625706 105163415 49992304 -10463535
13586 -10463535 -20804346 9702646 28124619 18756351 6265194 -1943162 -15910860
13579 -15910860 -22382807 -5691589 6007635 -20256124 -52263814 -32437212 23622428
13572 23622428 45364766 19022495 -437364 9459859 12361888 -1766118 3331509
13565 3331509 23202354 -294427 -69240345 -99650997 -51561434 -2118465 -25373779
13558 -25373779 -77508311 -76846238 -32063356 -8108018 -16473010 -23753490 -28979269 -49139173
13550 -49139173 -59933402 -32221237 744090 -5572068 -15881120 34009332 113076597
13543 113076597 121624609 42720743 -30640897 -35963751 -16501671 -26698936 -48027991
13536 -48027991 -44031626 -29543448 -33253172 -43235836 -37713993 -27792019 -26770910 -16002442
13528 -16002442 17191308 44295396 40488094 30663819 46388243 67768180 56588586
13521 56588586 23149018 8932329 17639057 13721281 -15862927 -43494812 -45496159
13514 -45496159 -27875891 -5516015 12832240 17884442 6865387 -3361622 2323640
13507 2323640 5877714 -23155481 -76432307 -109328603 -98358726 -64545735 -34223565
13500 -34223565 -10097668 7417606 2961779 -29273225 -66248710 -80068052 -65237481
13493 -65237481 -30232034 17499807 63581300 84832325 74289487 52397956 37726706
13486 37726706 24469666 4959927 -8684829 -9851618 -22578294 -67760200 -117904699
13479 -117904699 -123833187 -82880551 -42624377 -32224676 -26904320 4710676 48677168
13472 48677168 64307821 37323558 -6619980 -33304357 -30028815 -9025014 9650129
13465 9650129 20168179 35419627 62217040 78277875 53311661 -6472667 -57470616
13458 -57470616 -68783499 -51861560 -32037623 -14889040 3617906 15112157 8662091
13451 8662091 -9872974 -26376165 -36572452 -41512226 -36424336 -18583519 3348796
13444 3348796 18864243 23358000 10126883 -25532999 -64528029 -72342415 -46480752
13437 -46480752 -27961366 -41352675 -52056377 -18002989 39452303 59767260 27501742
13430 27501742 -9884068 -7294301 29907938 64023956 62824447 21305575 -28770080
13423 -28770080 -38322538 2793439 40614973 20764362 -35786301 -60556060 -31267683
13416 -31267683 7503377 13521772 -9438156 -37910189 -54364613 -44725033 -12871301
13409 -12871301 4230676 -18578995 -42128521 -12457409 43675778 45530572 -14407584
13402 -14407584 -52829247 -26033149 9651206 6143546 3774139 43738930 80291263
13395 80291263 57507331 10151459 3186036 20928746 5891291 -31684064 -38718032
13388 -38718032 -26819344 -54592224 -112856583 -127595461 -83994311 -53518448 -77403776
13381 -77403776 -108276483 -96926679 -61085489 -32226481 -2108989 35703065 49955251
13374 49955251 24384890 -821444 12275301 36363658 20850794 -31326284 -72451257
13367 -72451257 -76014162 -56071711 -34913840 -23769288 -26236002 -36202932 -39659253 -32436678
13359 -32436678 -22388278 -5902513 31557812 76964123 84024265 33409670 -26721768
13352 -26721768 -33569497 12011869 50466016 37311691 -14450702 -58744897 -59658044
13345 -59658044 -15095875 41624467 64959647 36865062 -17376235 -59457653 -75384286
13338 -75384286 -76208091 -77008284 -87584577 -109658457 -128573193 -120443492 -82351959 -42940988
13330 -42940988 -27852236 -28031455 -19967744 -4310210 -1933625 -18747061 -37017086 -41313411
13322 -41313411 -35717298 -33389779 -40907370 -53781023 -59576876 -47415179 -20856397 2737706
13314 2737706 11382111 10970135 13466886 21376279 30395963 37069547 35480362 17814464
13306 17814464 -10896213 -30047733 -29541814 -29187002 -55428127 -104008378 -142358890 -147351517
13298 -147351517 -125586852 -96320419 -70355427 -51569360 -46124358 -57303736 -73553888
13291 -73553888 -72627196 -43830706 -2667628 23843377 26606340 21651581 26646006 41187437
13283 41187437 55452833 64321846 61931372 37688129 -3237243 -27844809 -9023765
13276 -9023765 34836659 60258290 54614707 41764486 33282086 11877337 -26197260
13269 -26197260 -50425928 -41469387 -28065671 -48252423 -92228769 -115043548 -97285540
13262 -97285540 -64723877 -48788954 -50331498 -46509933 -19093126 27444626 67128807
13255 67128807 71346416 33906779 -21857474 -63734336 -76411719 -67261639 -53830228
13248 -53830228 -47337097 -41898259 -20868784 17595188 46157033 36053698 -1931275
13241 -1931275 -24845562 -10057980 20164163 33566043 26402832 16062556 14202768
13234 14202768 20795592 29782579 28482254 5759194 -28267455 -46236043 -38685879 -28316128
13226 -28316128 -35496558 -46811498 -35821178 -1494712 33424584 53082625 59107655
13219 59107655 56612077 47162155 34876118 26744948 24268420 19867673 3803298 -22054396
13211 -22054396 -34893506 -6374984 59102229 111919001 104853469 47655019 -8965166
13204 -8965166 -36121162 -43281680 -39542249 -20788203 482589 -2946309 -28254529 -41592603
13196 -41592603 -36529485 -47106001 -81053669 -91544216 -51755604 -9968686 -20357398
13189 -20357398 -55079460 -43809101 18954478 63877806 39772771 -30337365 -87031197
13182 -87031197 -91132717 -42938826 21029238 48345420 15910757 -41932850 -69200852
13175 -69200852 -48091274 -6700113 21981802 28611099 24519405 27053483 38217785
13168 38217785 31679655 -15107223 -70351671 -71294087 -15823642 20924094 -5920162
13161 -5920162 -44252704 -36081657 -16154082 -45262562 -92675837 -79037408 -11249720
13154 -11249720 25313555 3752126 -14153021 5797709 21441981 7516087 5438224
13147 5438224 38626866 59504154 32905817 3123221 19134492 50504629 41679050
13140 41679050 5425223 -5280393 10290822 2129412 -47942789 -100085783 -112793407
13133 -112793407 -86712474 -51345388 -34726021 -44232133 -59493222 -50940501 -16327518
13126 -16327518 15330528 23643808 17468353 6887799 -14151386 -41875299 -52801331
13119 -52801331 -40494612 -29762192 -32506911 -25225938 3198093 20037655 137387
13112 137387 -27222775 -24905281 -10271985 -23368836 -56996880 -70115570 -56055299
13105 -56055299 -45673404 -48712864 -41426646 -15273772 5205871 2099685 -11838814
13098 -11838814 -18671849 -19596270 -25541123 -40649056 -58472653 -64343452 -48379456 -26134462
13090 -26134462 -29190440 -59370210 -75910729 -52503145 -20351291 -19569357 -33323682
13083 -33323682 -17206237 23249293 39069804 16269659 -8395775 -14977369 -27690420
13076 -27690420 -58385162 -74919732 -54713282 -28234588 -33461715 -56027924 -52380108
13069 -52380108 -16612859 10445669 -4557466 -48312617 -77152368 -59459288 -3003188
13062 -3003188 52027105 69717464 50982804 24328431 7392696 -7352001 -28206438
13055 -28206438 -46457841 -52769693 -54923175 -65697048 -82365122 -88710051 -71879093
13048 -71879093 -33398454 7813349 22619167 -2920440 -44410008 -57729102 -28955607
13041 -28955607 9801191 23577151 15875063 12311191 19242295 20038783 4541310 -18769915
13033 -18769915 -37839950 -46524742 -39633350 -15986312 10770881 20317871 10250090
13026 10250090 -1149774 -3153912 -8323130 -27620693 -43678909 -30671508 2869011
13019 2869011 15732493 -13167148 -53687570 -61859590 -34552307 -7166778 -5409822
13012 -5409822 -22519370 -41969595 -56869835 -60903427 -44797398 -15171982 3336667
13005 3336667 1185513 1041275 21525501 40646551 23756088 -20987716 -48161082 -38158548
12997 -38158548 -22380787 -32681032 -53710420 -48830400 -15570382 13464364 19540707
12990 19540707 19241506 30778956 42214076 29045630 -9581745 -49792601 -72363993
12983 -72363993 -76811351 -68974811 -53493109 -42086063 -50067934 -73408161 -83741323
12976 -83741323 -60701859 -19351029 9149617 15616238 15259459 18819524 20441651 12848558
12968 12848558 -2603975 -21866658 -40155988 -48671037 -43084354 -33265537 -30216224 -27351851
12960 -27351851 -12012628 8829710 15377874 5250342 -5539677 -10614959 -17768477
12953 -17768477 -25469754 -21989059 -10907630 -9782143 -19396819 -23527348 -22987965 -35333597
12945 -35333597 -53443944 -44386850 -4520684 25415958 22111567 15543292 34655075
12938 34655075 58138544 56415196 44361226 46012588 39837703 -4707216 -58598978
12931 -58598978 -63979984 -25809613 -10577065 -47566547 -89015104 -86477625 -57149244
12924 -57149244 -45773874 -56808987 -57698930 -30118183 10127168 36337821 35833654 15351407
12916 15351407 -8201819 -23400175 -31710648 -37008299 -36073583 -29694144 -32261144 -52298929
12908 -52298929 -71587351 -65789486 -42272061 -35064242 -61904371 -105193133 -135297364
12901 -135297364 -135613913 -107066929 -66321957 -38176312 -33169284 -35257878 -24972707
12894 -24972707 -5582105 9739383 21894791 33779568 29854835 -1701301 -38414532
12887 -38414532 -48584394 -37039181 -30315357 -27309975 -8012952 16220629 13258599
12880 13258599 -6760069 4912937 54715025 84672121 56958142 10445819 -2327653
12873 -2327653 8653361 1967731 -20209726 -19012778 14242672 45439854 50938112 46080510
12865 46080510 53939426 72039918 79896770 64895140 33892181 6166718 -3154175
12858 -3154175 4243185 15085539 21188467 24130864 26001152 27208671 31443030 38844284
12850 38844284 37680052 20147431 1053311 -2202917 -1955601 -21250465 -45778931 -35384296
12842 -35384296 10011749 39706313 23265086 -10866400 -29970606 -44868621 -69598765
12835 -69598765 -76925005 -42437321 -1098849 -3227499 -32048613 -25105654 25387696
12828 25387696 54066461 19629147 -31121132 -28697905 22496725 53176810 25241607
12821 25241607 -18037721 -11713557 41419318 69977559 27827649 -39891955 -54216715
12814 -54216715 -9930971 20906068 -2517682 -32173111 -12330125 30016665 28971320
12807 28971320 -14711016 -35039886 -1814872 39931764 42358706 14956735 -9113731
12800 -9113731 -24155772 -39849805 -48725466 -38250896 -17509684 -4173829 2396544
12793 2396544 11499414 17556478 12067267 8603209 25302088 45804888 32145100 -14446962
12785 -14446962 -38385981 1672759 71626765 100101277 66772660 18080045 -4358733
12778 -4358733 -11522208 -27720883 -40920337 -26536829 1486035 5260690 -17622696
12771 -17622696 -29299577 -9980623 16120794 24198534 23389961 29187597 31413764 15697591
12763 15697591 -4316189 -4661959 10740123 15257607 -1719425 -20756399 -15507669 21430770
12755 21430770 70217100 93796906 68828459 17511339 -6490170 21040503 62581308
12748 62581308 65085538 23710674 -23004023 -49096425 -63197781 -77180196 -81650854
12741 -81650854 -62624681 -26191139 4048969 8707302 -11256726 -36926405 -51591131
12734 -51591131 -59911431 -79222869 -108937692 -122643078 -101282186 -62687050 -44113412
12727 -44113412 -61304212 -94561195 -108950840 -82346957 -24549532 24846872 31561195
12720 31561195 6062576 -10537292 -6422769 -15435499 -55498565 -84803887 -56670387
12713 -56670387 4655817 30075333 666268 -30400689 -17364214 19737017 34759929
12706 34759929 19795909 2519134 -741287 589493 -991846 5726998 30996885 60363881
12698 60363881 64662759 34503535 -6446212 -30361185 -37229435 -42753895 -43609662 -22205470
12690 -22205470 12692114 22941644 -7214558 -45577262 -57876422 -51233047 -46922715
12683 -46922715 -38644998 -13238521 9914729 2580979 -23673484 -37510969 -47732792
12676 -47732792 -91899226 -161373171 -190817933 -144357898 -70534609 -39716309 -53811415
12669 -53811415 -53121937 -1477955 67309380 91925857 53425665 -7917156 -40248484
12662 -40248484 -33195841 -15483608 -7730622 -924701 10616809 2935472 -43607037 -100171769
12654 -100171769 -113682260 -73686459 -26134125 -16727175 -43890858 -72746727 -75720547
12647 -75720547 -53112625 -27192760 -18793129 -22148415 -11530415 15367084 18855921
12640 18855921 -32251299 -106266959 -139343504 -114392356 -74049033 -57707986 -64386480
12633 -64386480 -81433912 -108195772 -136079644 -140441408 -113566543 -80666230 -64704030
12626 -64704030 -57092664 -40512429 -20283956 -12997221 -18073246 -20201058 -14358868 -14613730
12618 -14613730 -36422703 -72135311 -87267054 -54737926 1232540 18863647 -23628460
12611 -23628460 -70059269 -59088137 -10169844 10800620 -7113105 -15199900 2489137
12604 2489137 3153895 -31978592 -56490097 -33184821 6390408 15785259 72690 -11782857
12596 -11782857 -17850496 -22925886 -7042267 36831853 67102921 47502716 9473470
12589 9473470 7449371 35373149 45337858 31875164 33899218 57405000 59919983 21475769
12581 21475769 -23960422 -43952187 -47332927 -49783006 -42634143 -20420714 -4280074
12574 -4280074 -10181650 -19514771 -7064816 21351998 41856525 46233884 41604235 31361816
12566 31361816 17787145 12004218 20546312 30164909 24269088 6755528 -7691248 -17044527
12558 -17044527 -24194639 -15502392 22206579 63466909 58669889 1446493 -49798537
12551 -49798537 -43655431 -4586093 5127453 -23642378 -39063722 -11203182 24888392
12544 24888392 25537388 -2924733 -27993761 -39719780 -44088238 -36019823 -14964220 -4643689
12536 -4643689 -19480912 -32012169 -14527137 8052218 -3803964 -31301245 -22466555
12529 -22466555 18119920 33041980 10926217 8539588 50023336 73630488 22553636
12522 22553636 -64853231 -107175676 -85842744 -50095948 -42244256 -63136051 -93917628
12515 -93917628 -112088647 -97804964 -55582964 -18630043 -9411218 -13383052 -10393051
12508 -10393051 -5313396 -4313141 8280525 40048725 67673687 75538915 85220372 111404106
12500 111404106 123206750 92977249 51412628 43708197 57878785 50862988 23074489
12493 23074489 8561525 7876918 -8301806 -38589186 -53596854 -52515938 -58074684 -61701173
12485 -61701173 -37666645 -8785959 -26514714 -78181311 -88797743 -35955075 9496904
12478 9496904 -10067044 -58837492 -76221434 -65231188 -58953611 -48826282 -10440441
12471 -10440441 31132431 28163984 -10464029 -25605283 7348599 49583042 60443627
12464 60443627 44320920 22603474 -4404268 -43511302 -78085786 -78897195 -42836599
12457 -42836599 -2562418 8803021 -6074179 -16662153 -4966359 15631279 25872609
12450 25872609 29164578 41428045 64564713 87256424 102482955 104821891 80782044
12443 80782044 27975568 -22153999 -30996280 -2798319 20644469 17035495 3825356
12436 3825356 -4124019 -21651370 -61418480 -103810777 -120195051 -106847926 -78407660
12429 -78407660 -45457090 -14755930 5109819 14266398 23246771 31769903 23103304 -7239182
12421 -7239182 -36839512 -47540091 -52416463 -70365848 -89448289 -80855626 -41385442
12414 -41385442 1086403 20947674 14777079 -7476291 -30066494 -30881788 3237206
12407 3237206 51153076 64984237 19840460 -50815150 -86924607 -70040763 -42201210
12400 -42201210 -47798599 -75955538 -84253397 -67058779 -62256012 -85283628 -98163051
12393 -98163051 -67771409 -20956060 -6995843 -27833750 -42162072 -23322416 21623676
12386 21623676 75166286 114063093 105013448 38177253 -42898971 -84335676 -84389145 -72864857
12378 -72864857 -49360997 -1212760 33040482 -2709826 -79540289 -97844424 -29537034
12371 -29537034 33929467 15701586 -40863067 -57400969 -42169054 -50147097 -71748905
12364 -71748905 -50290976 11861289 49753741 37437715 19626801 29888669 39366696
12357 39366696 10907970 -40388831 -68238610 -51538506 -10525331 18482383 14972251
12350 14972251 -8820673 -21230049 -7402380 17712966 39297008 61536940 78722475
12343 78722475 59115467 -6546844 -66027615 -62230546 -14431864 7387747 -17805656
12336 -17805656 -43315249 -39153075 -36457721 -65594265 -99792594 -96124801 -60147662
12329 -60147662 -32550108 -29888924 -31999951 -19736448 2805021 22488028 32751601
12322 32751601 32315864 22174628 8577200 1823251 7436318 19629805 25483474 16946635
12314 16946635 -2372079 -25219364 -51373464 -79514531 -90447856 -59016981 7644482
12307 7644482 63915684 75618500 59867196 53227923 55762042 38130212 -2180359
12300 -2180359 -28120610 -14521164 17428702 32571432 26783066 20019327 18192480 5163351
12292 5163351 -27927210 -63622589 -77183796 -65734125 -46977688 -32019394 -15478272
12285 -15478272 1685712 -1314991 -36584218 -79122474 -94255323 -86132945 -85672240 -92717634
12277 -92717634 -73436927 -25891055 -610267 -27496260 -62974581 -50677465 -6074554
12270 -6074554 5490505 -39833968 -98246776 -118490468 -93563359 -54652724 -39462765
12263 -39462765 -60755814 -86735794 -68230174 -5975708 36085987 15382510 -24487547
12256 -24487547 -19566143 15519688 17860206 -14706631 -21216620 16305517 42166210
12249 42166210 20193132 -13087514 -17225440 -6667866 -4832142 3378020 29256092
12242 29256092 39620765 8523845 -29206887 -28021497 -4391709 -6296267 -33960061
12235 -33960061 -47009553 -36355312 -32334181 -44352016 -45692862 -25462549 -8926040
12228 -8926040 -11307996 -9266892 22271040 72494458 112004740 126176666 114864654
12221 114864654 77738966 19276490 -41675597 -82521687 -92619757 -72694318 -30469618
12214 -30469618 13395371 28310140 1052094 -43071342 -62458381 -45200483 -21175013
12207 -21175013 -24512841 -54683916 -81515563 -80399707 -54142638 -26475813 -22922734
12200 -22922734 -51024101 -87582898 -92702547 -53070167 -5496416 4386896 -16945142
12193 -16945142 -20928112 9587408 34857243 22778198 -224266 5141983 26451932
12186 26451932 23688290 -2483406 -13920883 2994268 24650875 35443044 39324934
12179 39324934 26928373 -17285325 -66646726 -65506408 -12830787 17460936 -26556113
12172 -26556113 -98281826 -114263162 -63059130 -7590298 4528467 -11363446 -15724303
12165 -15724303 5439428 35750826 50399317 37714272 11615616 268868 11937115
12158 11937115 21857099 8132956 -11169121 937344 47849899 90981625 94871733
12151 94871733 62132962 21008279 -4986391 -9615713 -402026 7753177 2173352 -15619000
12143 -15619000 -28331618 -18774749 10215327 34657901 33917534 16184077 10239679 27756685
12135 27756685 46452980 41419915 19459728 4051890 -1390279 -8561871 -9695244 17822637
12127 17822637 67719359 98883492 86221668 49436090 16015555 -15504649 -52446595
12120 -52446595 -73867348 -53140122 -4067865 27283382 18224679 -5842798 -7436956
12113 -7436956 18946809 47586794 57278131 54585965 58285484 68006137 62224588 31539649
12105 31539649 -2473933 -16017373 -16463536 -25907745 -43104133 -49123118 -43214265 -41084504
12097 -41084504 -40768733 -25773330 -3521295 -1936429 -21112053 -29642304 -21475638 -31911481
12089 -31911481 -74849898 -107806439 -92541831 -53795785 -37991330 -42434437 -29854531
12082 -29854531 6313104 37389326 50857131 62231326 75224096 69195206 36093737
12075 36093737 1322613 -5721696 14547802 37384514 43062622 33783277 25113143 24266416
12067 24266416 20592031 2517919 -21737031 -32570773 -23241850 14361 34068329
12060 34068329 71299286 84755077 55980205 14952804 10391595 36619884 37627365
12053 37627365 -5123340 -42182914 -34795485 -9209268 218217 8831840 38620851
12046 38620851 64214776 53724479 26201129 15871287 12238932 -10281203 -34760527
12039 -34760527 -33132534 -28504483 -62104793 -116031615 -132818821 -100943532 -60379548
12032 -60379548 -32724074 -7251940 10504146 677645 -20387756 -13631043 14532523
12025 14532523 17616146 -10670933 -22620645 3402785 27193785 12115283 -23300252
12018 -23300252 -43024714 -43587443 -45349257 -63016177 -96338182 -125727849 -120339525 -80743764
12010 -80743764 -58788345 -91372701 -133588776 -117869852 -64143736 -54558231 -101488556
12003 -101488556 -128200447 -96545897 -64502651 -81710643 -109564670 -94098470 -49966369
11996 -49966369 -18681061 -809735 17970123 25567150 20375420 40213406 100396051
11989 100396051 147684531 130459202 73705901 31427097 7760744 -17201406 -27340380
11982 -27340380 -4481708 12807833 -22253677 -80636331 -93309955 -55032701 -23264471
11975 -23264471 -24715361 -32559488 -32830558 -44210648 -64717544 -60867263 -24640382 8434216
11967 8434216 10843376 -8399040 -31984835 -49381257 -42355790 -1450405 39800314
11960 39800314 34760192 -6984386 -29346690 -14934642 -4887654 -19292299 -18558204
11953 -18558204 23976943 63945708 46370093 -11317244 -44815140 -31130737 -6162689
11946 -6162689 -2557931 -10293032 -3833183 19161542 36813691 29011639 -256344 -23095483
11938 -23095483 -14652563 16036201 31017941 6333307 -39020912 -65571257 -56626849
11931 -56626849 -29668881 -11496599 -12628712 -22980941 -24169323 -7555961 14409995
11924 14409995 18281451 -2535116 -24120648 -16378012 19421378 49718853 50141504 33715453
11916 33715453 23835361 12903305 -23045221 -70449892 -78873088 -34271347 6450334
11909 6450334 -9933176 -54740908 -62862777 -33168616 -19460243 -30226311 -14183457
11902 -14183457 40624641 72429298 46734508 19525383 45168898 82084563 59112137
11895 59112137 -8854269 -47180397 -34002318 -9820261 7041671 35669502 68306843
11888 68306843 68566420 42867813 43547353 83171636 107827817 78430202 24428187 -7999536
11880 -7999536 -13180544 -6828500 5782255 16352239 7307787 -16229489 -23432477 -7439824
11872 -7439824 -1126513 -22763510 -45285493 -43514283 -32641918 -32578464 -32385928 -20490329
11864 -20490329 -13481403 -21842689 -22513035 -1562537 10615471 -12005299 -38915411 -26403840
11856 -26403840 12433474 30971492 22988815 20231621 27235493 13569429 -27894272
11849 -27894272 -64214750 -72304165 -64877593 -57099630 -43960524 -22292647 -2951044
11842 -2951044 11339604 32005223 57152375 65066279 47031682 20842631 -826459
11835 -826459 -28620922 -66052894 -86383720 -65180346 -21197058 -115323 -22699116
11828 -22699116 -66329845 -93884090 -86566928 -50852737 -5888710 33422327 64569832
11821 64569832 87795894 91903523 63294147 13085651 -21316317 -14021062 21288357
11814 21288357 52746210 66503562 65460322 46392475 5845225 -34786486 -40045436
11807 -40045436 -4634080 36356819 52000727 48561864 44952928 39805775 26603181
11800 26603181 21591640 42917834 70210078 61558938 14928019 -20032252 -3348606
11793 -3348606 48486761 90613694 100126084 81733810 46813293 9937952 -9912500
11786 -9912500 -7297508 1940033 7793235 23304287 52993651 65471370 31781334 -21878355
11778 -21878355 -39593398 -11722701 13652290 1142124 -27433289 -33421289 -14399676
11771 -14399676 4570029 10706440 11555410 14489177 15836747 6810085 -15987278 -40120229
11763 -40120229 -40118721 -6173348 32869142 38420366 14583404 2261261 14563409 13946857
11755 13946857 -26772398 -74414068 -79048597 -45500831 -24383469 -41981286 -74057727
11748 -74057727 -87485036 -76249441 -51598943 -23920209 -4827486 -6429063 -24502052
11741 -24502052 -34387066 -16177109 21095224 47912419 43695174 14002520 -17125960
11734 -17125960 -26982546 -9098306 23952356 47083064 34702731 -21478371 -95967745
11727 -95967745 -137418055 -111426107 -40813646 10901517 6009271 -26866793 -29103492
11720 -29103492 18504306 76144571 94082575 68816551 41663704 44196789 57702638
11713 57702638 40292381 -9268629 -39348276 -12060228 39643873 51934432 16560927
11706 16560927 -11558229 3106530 27786089 15889323 -22220790 -35121003 -388054
11699 -388054 52059603 81058153 74098519 46514475 19040255 -588032 -21743856
11692 -21743856 -55294648 -91839704 -106493986 -90705261 -64526539 -48844875 -42823088
11685 -42823088 -40433351 -48342495 -68128496 -79396237 -64920679 -38574558 -23368359
11678 -23368359 -15356341 1830411 18701427 12098911 -8436140 -5212146 30436050
11671 30436050 61060112 56351761 31876984 16142613 7678451 -8325406 -21545229
11664 -21545229 -8380146 25044577 44411088 36114144 26958240 42040411 65221294
11657 65221294 63900911 40643468 30591922 45449647 50595747 16339296 -31255823
11650 -31255823 -41696736 -12622387 4766096 -22101901 -63114389 -70760749 -43168111
11643 -43168111 -16875861 -12441377 -14702106 -3632143 16957862 26040687 10977899
11636 10977899 -15916778 -26192272 -6654060 20998767 26788780 15367900 16436347
11629 16436347 31026464 25586419 -5313796 -14762849 23888549 59824682 30380445
11622 30380445 -43898468 -89081729 -86413090 -83536081 -98750760 -88412324 -32191956
11615 -32191956 16014092 3552727 -44008146 -67418697 -57434364 -44685547 -34957646
11608 -34957646 -10555328 16666693 8595691 -38910188 -82080935 -85588910 -61114021
11601 -61114021 -41044653 -41118919 -58036882 -80274446 -91906622 -84590202 -70661709 -65291639
11593 -65291639 -56432188 -21139670 24464207 28561516 -25426681 -85772802 -98711599
11586 -98711599 -79361004 -79937309 -108824794 -127045745 -115947482 -97729389 -83426999
11579 -83426999 -51196256 3394114 40806116 34204285 17027707 32976752 64578061
11572 64578061 59382891 12774740 -27025729 -34280160 -33710471 -43894818 -44711015 -25118983
11564 -25118983 -17637934 -47869445 -82438366 -71339106 -23828548 2791460 -15152646
11557 -15152646 -38972190 -27068728 11014517 35409631 28514107 8904443 3061742
11550 3061742 17603424 38017486 47100770 40995355 26685045 9380572 -7442480
11543 -7442480 -12016924 6935878 35228998 38512094 7966124 -18832091 -5325935
11536 -5325935 31453511 44936585 26667616 15132641 33781113 54160690 38533273
11529 38533273 -2973882 -22402797 4307799 45663639 51688514 13209691 -28725701
11522 -28725701 -34367475 -10655094 9876217 21871982 47410652 83625130 90014833
11515 90014833 47483888 -4215226 -18390507 -4310143 -2800685 -20446360 -30034655
11508 -30034655 -23623002 -19911570 -21598309 -8979660 18206371 30170431 8536061
11501 8536061 -30115354 -58616992 -62688275 -40730993 -7811060 4470070 -15836656
11494 -15836656 -32776465 -10470939 20782124 1481781 -56538256 -75739156 -33577236
11487 -33577236 -1309098 -25533258 -45807431 7550588 92917798 113749844 58915143
11480 58915143 3370508 -12882487 -21186364 -40353748 -42256065 -23123463 -33050870
11473 -33050870 -93534053 -144384172 -123502137 -58123170 -22020101 -28779075 -26376173
11466 -26376173 10853759 42948923 29502740 -10882982 -31316685 -18216797 5331779
11459 5331779 20441214 27748257 28830363 20167732 8125858 6517480 11950404 2200441
11451 2200441 -30159840 -62056798 -72572774 -71956251 -76844328 -74396981 -42065837 6168821
11443 6168821 29322416 16709946 697818 3093060 3050324 -23168366 -59591801 -73315805
11435 -73315805 -59772528 -38607140 -18530312 5440756 26108588 23000826 -9269136
11428 -9269136 -49826840 -73656562 -73293499 -55577099 -27311749 8549437 44261925
11421 44261925 61371677 43586407 1151254 -29485998 -26701688 -15614748 -34304201
11414 -34304201 -72092032 -75922735 -27725074 19868995 8790902 -49180284 -91298042
11407 -91298042 -81846969 -42135414 -11321074 -5809643 -18798635 -38953806 -60912349
11400 -60912349 -82743354 -95981762 -84196526 -43316356 897379 16393902 5738084
11393 5738084 -1467630 2781509 -1996501 -17541491 -16177158 5498231 9018603 -20794091
11385 -20794091 -39774366 -14497835 15167314 -3593818 -50130196 -66336894 -51406551
11378 -51406551 -50859757 -67794270 -61049357 -29882535 -24448628 -59514913 -87165415 -75355951
11370 -75355951 -49675682 -33181733 -8155651 30501234 44833449 18420001 -2034155
11363 -2034155 22710353 58246702 52948626 21051516 11584767 24662530 21233543 -1476711
11355 -1476711 -6931410 13246074 25959470 14861185 1988959 2460110 1696785 -10001060
11347 -10001060 -19245668 -19838698 -25298601 -35245920 -24557686 11893040 35556185 15101532
11339 15101532 -22636132 -27908622 -1323755 6756171 -28828422 -70812067 -74262660
11332 -74262660 -50676375 -47319880 -74416150 -89054139 -59608185 -14277593 -897453
11325 -897453 -18374230 -22037874 8072720 40126913 39831381 15423677 -3688607 -8150652
11317 -8150652 -6525847 -1304297 7499451 7868525 -8330176 -22439732 -8990508 23202855
11309 23202855 35618085 9509170 -30635878 -49083885 -36393856 -9013179 11418363
11302 11418363 10432063 -11625025 -33367208 -26149813 14071050 57479053 73464774
11295 73464774 64055116 52169981 45495888 30811598 3136937 -19971033 -22605387
11288 -22605387 -14566387 -16714914 -29872189 -34834826 -22128428 -5385813 -1112234 -9864268
11280 -9864268 -24819917 -45061901 -69009073 -86281458 -90125679 -89165982 -92395510 -91165849
11272 -91165849 -73070199 -46170393 -29526861 -24647644 -17402673 -4212662 7185697
11265 7185697 19836263 42327603 60887204 48698697 10529427 -13621759 -1566439
11258 -1566439 24811310 39657920 44988867 42527221 11647604 -51101635 -101296675
11251 -101296675 -96886030 -58490932 -37346222 -39257190 -27684632 4838055 19206730
11244 19206730 -8523927 -49529262 -60744970 -31412107 18955194 62719162 77141517
11237 77141517 60833629 42031060 45787812 54831525 35772328 824065 -2700915
11230 -2700915 28979394 41595307 8347845 -23599436 -8344448 24905002 22344778
11223 22344778 -7216490 -13380082 11497516 29729069 28076906 29134905 34791422 18974719
11215 18974719 -14183651 -22497344 5972455 29684939 22849571 16809514 38774791
11208 38774791 56438158 29432918 -19567373 -36671217 -15941721 5461121 14879472
11201 14879472 30781330 47794562 34073612 -7505461 -29463313 -10524906 10194743
11194 10194743 -4999890 -38140557 -54262991 -56244643 -61202306 -53470635 -11192003
11187 -11192003 37428710 38536929 -7132990 -37103082 -10810075 40396985 63038908
11180 63038908 46310779 16284697 -5512133 -12506645 -3074114 14316975 19355099
11173 19355099 3878406 -14988387 -22696499 -30072578 -45737415 -45977781 -6087076 49954992
11165 49954992 70016695 42263164 4921395 -15403832 -32799895 -56296622 -60260667
11158 -60260667 -31119862 -7298758 -29361943 -72039398 -73521605 -24073581 22449436
11151 22449436 27553557 9810506 -6720093 -37005636 -93996820 -137981008 -113546145
11144 -113546145 -25938140 59215782 92352546 84679974 73642269 73482096 71508784
11137 71508784 53221932 18343319 -17877930 -34106618 -23290816 -3731992 2024956
11130 2024956 -4252746 -5630660 -2028937 -8095962 -20678489 -19824096 -8064055 -13904321
11122 -13904321 -41616078 -53437341 -26929123 2457725 -9102861 -46738712 -60409414
11115 -60409414 -39824526 -21816769 -28868508 -44261688 -52090854 -61621290 -80494520
11108 -80494520 -97003773 -102848201 -106413349 -111338797 -107523419 -94765052 -88295953 -86797946
11100 -86797946 -63045813 -7254975 43561641 44938720 -402631 -48967519 -66414774
11093 -66414774 -51412803 -19718888 13583335 37716127 47525640 42970204 22955031
11086 22955031 -13657812 -56112757 -81889422 -78069137 -55458029 -35426606 -30061686
11079 -30061686 -37449438 -45317344 -37805117 -12434837 9567845 7631872 -4682156 4739057
11071 4739057 35851530 52170538 34800899 6815901 -9424480 -22276700 -38320640
11064 -38320640 -39918946 -25455503 -32826111 -80719905 -119234206 -90784099 -18187798
11057 -18187798 24386408 17024478 11959530 44981050 85708942 90633200 59561552
11050 59561552 20181680 -7262464 -12209759 7622811 32882527 34668259 13256213
11043 13256213 -1289786 3662245 7174546 -1680407 283668 29003571 58827627 57237168
11035 57237168 30331931 5310589 -13433856 -40173859 -71798689 -86653703 -77097499
11028 -77097499 -59055645 -47227637 -38960019 -26977764 -15172218 -14538790 -27769642
11021 -27769642 -43590708 -49632697 -49190794 -55738649 -66955970 -59770929 -25479977 5877480
11013 5877480 25853 -33905918 -59024505 -65031645 -71106796 -78387786 -63264538 -25643477
11005 -25643477 392228 1304184 7835272 40207290 69458628 65838364 50728195 59473346
10997 59473346 78364053 65073587 18778562 -15956347 -14419095 -942136 -4653186
10990 -4653186 -17492381 -12078375 16363772 42060941 39248449 12854646 -5734862
10983 -5734862 4294885 27541074 34436283 20649271 5226632 -2414346 -4773605 8124546
10975 8124546 43961836 66311922 19501914 -84640003 -154820127 -127658052 -45276843
10968 -45276843 8283276 5021824 -32523619 -88252205 -148184217 -174315638 -143849267
10961 -143849267 -91886700 -61882035 -41871685 -7415666 8421726 -34196278 -88180968
10954 -88180968 -69793086 5566163 35865233 -10460275 -49786852 -22938897 17724503
10947 17724503 8788217 -21786089 -16484924 12755157 15556719 -13126269 -42338067
10940 -42338067 -61821577 -74375951 -64701842 -27352836 4454792 4424739 -4557878 2939442
10932 2939442 6106973 -13899027 -20572455 20409440 68857911 67277888 39445590 51805760
10924 51805760 96700423 100462059 43051060 -15454978 -34771132 -39091419 -45985007
10917 -45985007 -30874111 8729223 26913194 6550396 -728871 41850521 85732673
10910 85732673 62957655 -15382235 -77879127 -84571747 -55596650 -28024973 -24318694
10903 -24318694 -49727141 -86572697 -100533819 -77465331 -41954317 -21754789 -15229137
10896 -15229137 -13888039 -28366446 -61802799 -83117480 -63373880 -20481786 7893295
10889 7893295 19574154 38591993 64303830 70907859 52433709 30220232 16494380
10882 16494380 4172054 -7722462 -10651636 -8013734 -8423283 512621 35995544 76367667
10874 76367667 73787959 21317716 -29164182 -31912308 2078242 37010864 62511680
10867 62511680 86367265 102293181 95284688 66373888 28896234 -8930698 -38978680
10860 -38978680 -45378782 -24549183 -1760258 -3915488 -23657255 -33165212 -25769915 -18444272
10852 -18444272 -18167405 -14684202 -7941729 -13855669 -34602323 -48122812 -39106451 -20013578
10844 -20013578 -9165928 -6870614 -5788485 -5231845 -586930 19179579 43115524 31861083
10836 31861083 -28198887 -83653087 -70949781 -8189951 19581718 -24921862 -82165619
10829 -82165619 -85284218 -50223869 -34264093 -41805491 -30038726 6862553 21836333
10822 21836333 -9168554 -48576056 -55216097 -39291853 -32770936 -37964757 -37378452 -32044280
10814 -32044280 -36840207 -49592519 -53342423 -42765388 -25399584 -3297095 24590463
10807 24590463 47451250 52142466 44870886 43419233 49863016 50261717 40189439 30865909
10799 30865909 28154817 23170480 7849902 -13517143 -31046099 -37221372 -29344291 -14973935
10791 -14973935 -10480204 -20110298 -22243620 4810752 47284027 68613375 57449466
10784 57449466 38839276 34066299 35754790 32211162 29008493 28074209 9110453 -40504993
10776 -40504993 -90658839 -94941089 -52050434 -12480973 -13627577 -30899058 -13944187
10769 -13944187 40595483 80515521 66834316 25216120 8954151 27976455 45065136
10762 45065136 37266191 24548619 28613183 39253421 42146490 47385933 60579886 54081135
10754 54081135 6127089 -51725088 -70058219 -51546656 -40048123 -49065209 -51802940
10747 -51802940 -40391665 -40189531 -57274693 -65163144 -57445323 -60726465 -77687422 -73257680
10739 -73257680 -42277180 -32288012 -63344655 -83006355 -48891853 -3250357 -6574749
10732 -6574749 -40687052 -44163799 -11277249 13738209 17245502 20621331 20936433 -1082096
10724 -1082096 -23312805 -4422429 39194638 49624658 21064928 4153006 12391115
10717 12391115 3838447 -28813019 -33279972 6803063 30738876 -1344179 -40221898
10710 -40221898 -29088948 8971651 23241302 20941905 36315917 57835720 53423379
10703 53423379 35732976 37155659 46066537 31896695 10573879 17701089 33388452
10696 33388452 5785068 -55129360 -78926318 -39455434 5591647 -31615 -38096025
10689 -38096025 -53701840 -28252052 10147557 24857454 2387023 -37788539 -59325971
10682 -59325971 -49200833 -35629393 -46582812 -65397941 -57772790 -27140127 -4189901
10675 -4189901 5425208 17084674 21107233 -5298922 -41202122 -34643662 17683685 56774395
10667 56774395 42904364 2183227 -24938925 -33159569 -30459924 -14433466 4959512
10660 4959512 2049523 -20699407 -26880338 -6988632 -137422 -28326434 -55974347 -48862259
10652 -48862259 -29461139 -34819243 -58560323 -75095516 -85676594 -99608664 -103551858
10645 -103551858 -90045906 -82655829 -92318107 -86128449 -44304874 -7783445 -16111688
10638 -16111688 -37752519 -24189822 3416269 -6266570 -38483182 -36815149 -5335639
10631 -5335639 -70477 -24469124 -21694683 21545497 49200873 31495510 5448773
10624 5448773 -3738726 -21943757 -54994830 -56844997 -11882440 22654850 5873497
10617 5873497 -22537324 -22737115 -32338972 -92639056 -153943529 -139343023 -66238773 -17761420
10609 -17761420 -15108135 -5986897 26976848 34627303 -8540331 -58874535 -73817203
10602 -73817203 -66349080 -61449447 -51671298 -27770308 -8271530 -5045484 1560587 19262375
10594 19262375 13420106 -37907093 -89424169 -80333820 -24371745 5419187 -19766331
10587 -19766331 -49558680 -38146164 -14403598 -33301065 -88956299 -122845030 -108748672
10580 -108748672 -81790247 -74221429 -67127788 -33700166 3661598 1811575 -34418390
10573 -34418390 -58037992 -50979553 -41978943 -45297581 -30579145 21663585 75412967
10566 75412967 84460483 53271791 18346389 -5642409 -24742540 -35258442 -36840451
10559 -36840451 -55674831 -106322736 -145235098 -116392697 -36059958 25563054 45343321
10552 45343321 64431484 96427046 94240987 39954999 -5090091 6923739 27740493
10545 27740493 -9022546 -73832906 -86127127 -45877707 -31293733 -69649690 -99516323
10538 -99516323 -79310612 -50779135 -57421697 -69992322 -43651169 6150531 41271083
10531 41271083 68749685 107210249 120620336 60421598 -40818891 -92056572 -62922298
10524 -62922298 -14505036 -1760529 -10353940 -10869779 -12089209 -24564995 -24164204 3497996
10516 3497996 22615890 -2242285 -46198508 -60717429 -44177004 -28609182 -18027979
10509 -18027979 8626535 46627421 68275251 69154794 64343225 46409951 -1249840
10502 -1249840 -52929942 -59007289 -21718894 2638022 -10546325 -21033820 3980961
10495 3980961 37257169 39788295 16424556 -8335122 -30599169 -50723367 -52947221
10488 -52947221 -35631206 -30119110 -55737285 -84745117 -83534037 -59098238 -33836871
10481 -33836871 -7917620 17969723 18168133 -16726781 -46800725 -38193385 -21227208
10474 -21227208 -41011426 -77794541 -76414153 -35481824 -4676538 -5518809 -17209034
10467 -17209034 -32503872 -61949038 -84828354 -63724022 -13953969 6979547 -11208658
10460 -11208658 -19089664 2254190 9945403 -17125630 -34857099 -11798284 14690785
10453 14690785 7399600 -3381549 22787054 59983533 59392741 33648078 32350529 55684906
10445 55684906 56292418 17307873 -29053483 -58420077 -78920055 -96950106 -103591936
10438 -103591936 -101286117 -106141297 -117575587 -117973792 -105169052 -93164777 -80130318
10431 -80130318 -52155659 -22827909 -28638207 -71254718 -101788085 -84896884 -48479711
10424 -48479711 -42023999 -67386223 -82320055 -61828599 -25569262 -5132191 -9365724
10417 -9365724 -27395295 -45704643 -52208209 -37837969 -6796810 22169675 34154277
10410 34154277 30834663 17820536 -7074796 -37617072 -46564964 -17880131 15979405
10403 15979405 6441265 -38299759 -56100393 -22092145 10551513 -6937562 -42211213
10396 -42211213 -38034561 -7975217 -9594386 -42412668 -46935382 -5266161 28693187
10389 28693187 14182324 -23523896 -45353794 -48243242 -41832874 -28619396 -28827813 -70694172
10381 -70694172 -131924335 -147227988 -102035258 -59692963 -62551248 -69873338 -37898224
10374 -37898224 2892693 7605982 -4156116 4501673 11590905 -20140698 -64212972
10367 -64212972 -70526447 -51720254 -53852234 -69411011 -57743746 -28481892 -23447061
10360 -23447061 -33263516 -14696143 22140700 28718458 10958384 18741711 46404070
10353 46404070 36545023 -12754355 -40341083 -33164355 -44912220 -81544532 -73258668
10346 -73258668 -357603 54494007 35242225 355547 14264280 36015507 -1089791
10339 -1089791 -66796437 -81791816 -42084019 -9023758 -6743804 -7989199 1874472 18093131
10331 18093131 52341588 108066208 140578151 108576447 47166357 22592462 31724982
10324 31724982 18327046 -23507444 -41466260 -21102929 -10134405 -30144320 -36392561
10317 -36392561 3475749 48340549 39776061 -18178965 -68570232 -67248477 -18059539
10310 -18059539 36919836 49243823 6464305 -50414992 -71763526 -58528643 -47748282
10303 -47748282 -46222757 -23365399 25878365 61724649 61661706 55028707 67264803 71724905
10295 71724905 36694934 -10569031 -14773874 24966204 48497086 13366583 -54419362
10288 -54419362 -99277815 -100631270 -81433714 -65772526 -50246785 -23034239 2840793
10281 2840793 -4688577 -52233704 -99163884 -98511345 -53417706 -13098272 -12628812 -36425942
10273 -36425942 -46723226 -29465919 27372 23776150 36877972 39428305 27183634
10266 27183634 -1662952 -33846719 -45882901 -29667161 -6653087 -1346667 -3315198
10259 -3315198 20725373 70094254 94009329 53724756 -21767013 -70842814 -73115899
10252 -73115899 -54419124 -30973329 6734993 50640812 60012062 13230454 -50864481
10245 -50864481 -69063366 -22839472 43595801 70607227 41711842 -3540421 -16295188
10238 -16295188 2291811 3689947 -37287747 -79920147 -72778856 -28465664 -627220
10231 -627220 149954 13226629 48862451 61436248 23011171 -27921982 -43853604 -32855677
10223 -32855677 -29107364 -34587874 -32162376 -28492035 -38251286 -45678491 -28136504 -3662702
10215 -3662702 -7052793 -26669630 -15978731 29809036 58399933 34768355 -12084587
10208 -12084587 -35776144 -29091596 -10395741 14179396 43521149 57342152 33183823
10201 33183823 -18411149 -60967221 -73072718 -64670608 -55445931 -55293213 -66979548 -90047825
10193 -90047825 -113610989 -117357268 -94058709 -69232622 -81835187 -132890282 -163973693
10186 -163973693 -113159105 1540194 83466127 64579933 -11831610 -49199840 -19776238
10179 -19776238 19522506 26914575 28600522 52013204 67004657 38479239 -6035156
10172 -6035156 -16492548 472232 452343 -19533107 -23356576 -8919029 -12782406 -38725635
10164 -38725635 -49568051 -43376935 -65680367 -117465472 -125024123 -51046037 29641493
10157 29641493 32098672 -12974825 -15386248 29276593 43160775 1773032 -30447455
10150 -30447455 -13439287 7500391 -12903319 -46595049 -48626549 -29799280 -24959567
10143 -24959567 -33084795 -36109367 -40482101 -52860719 -46547777 -1663162 46794647 51550116
10135 51550116 24403827 14533718 30200876 34990306 15190962 -2515631 -3157629 -3851316
10127 -3851316 -13177074 -14960487 -6221514 -10656429 -35844944 -52213925 -36755510 -9318169
10119 -9318169 -2322134 -16886588 -31671552 -37130757 -38092327 -34902242 -23419268 -7363749
10111 -7363749 4909932 11000326 11779184 6249435 -1279006 1125980 16204026 26839665
10103 26839665 15067768 -14694244 -44030220 -65760107 -84584089 -94849493 -78367460
10096 -78367460 -34204837 4863240 5101920 -23195318 -35678557 -14529005 5488554
10089 5488554 -9669328 -36997092 -28888823 9636899 23316401 -7968300 -36698300
10082 -36698300 -23554228 2479470 -1536413 -19818476 -12525629 7382990 -3681860
10075 -3681860 -35044081 -28067880 28746476 75831747 70045017 38202216 20627948
10068 20627948 15934454 12078372 20928456 42642194 40690380 -611411 -30809874 671996
10060 671996 60264038 71264828 25297425 -8717097 10869435 42851156 31380362
10053 31380362 -15165846 -43745861 -29662798 -564129 4482115 -19225877 -38565047
10046 -38565047 -20591941 25950296 53801846 30235490 -22118347 -52047792 -38528119
10039 -38528119 -3555484 25049848 37379849 31628017 11568558 -1730531 13305334
10032 13305334 39688943 30454358 -25890741 -77386933 -72035305 -25840336 4385469
10025 4385469 -1383310 -14989367 -18507155 -29252213 -57833122 -82031726 -84092223 -82210690
10017 -82210690 -96042155 -104350786 -72186743 -8499203 38471839 40722493 14756448
10010 14756448 -12096231 -26331255 -16620298 24089365 70569599 74761912 25869907
10003 25869907 -27938911 -41889220 -29197520 -24171235 -23105279 -5992520 7363325
9996 7363325 -20156683 -72013525 -88289050 -53533268 -18432891 -17661679 -21635726 1062738
9988 1062738 25147552 15728212 -7320374 -4995139 9421479 -5824398 -39872442 -35688830
9980 -35688830 18196241 62468878 54115281 27723181 36848189 73658926 89932979
9973 89932979 74016867 59073673 61156085 54841701 21137020 -15689972 -19558028 10974792
9965 10974792 48244728 72183946 79535283 66529202 29039254 -17456994 -39934528
9958 -39934528 -21457230 16820155 35105112 11365260 -43324913 -96587437 -118230600
9951 -118230600 -101033311 -63890997 -30156659 -4149701 21906956 42571409 41334683
9944 41334683 22161433 15462002 37652885 62556227 52884721 9528195 -30030640
9937 -30030640 -36765685 -16760961 3786801 5941614 -8448094 -21334938 -18321647 -6146068
9929 -6146068 -808821 2230942 25480609 68960793 97316683 84890784 50824401 26878642
9921 26878642 12132367 -12038313 -39950794 -47470590 -29737241 -3919090 17051484
9914 17051484 27728022 19111780 -7929880 -30394722 -32360055 -32537398 -53411865 -80012824
9906 -80012824 -83091784 -65672654 -49785679 -36645340 -21938496 -29110376 -76565126
9899 -76565126 -128738130 -134208072 -98866909 -67541899 -51923823 -37945732 -41645205
9892 -41645205 -83527141 -130476547 -151450128 -205347862 -355085087 -502695560 -459017372
9885 -459017372 -213997156 10086233 45570096 -17936864 -13761638 50492530 58442107
9878 58442107 3603605 -19108086 8369613 11924577 -27421204 -47669893 -28828424
9871 -28828424 -20060232 -32751578 -17341547 33119321 56050489 22380054 -20037765
9864 -20037765 -31771525 -31693857 -37129361 -29394637 -5196969 7161612 7446383 31912221
9856 31912221 78503977 91737057 49003250 -3788924 -29973266 -48261833 -69637891
9849 -69637891 -57159228 7383852 74795434 93284065 75394457 59728039 51916895
9842 51916895 44760728 52289185 78112246 87472374 56711213 19755195 21014072 46998976
9834 46998976 48329494 13867108 -15658922 -2676482 42988780 72156236 41060765
9827 41060765 -40835310 -109327671 -111676414 -66781644 -31493183 -24148044 -27418725 -48262717
9819 -48262717 -105100859 -158771580 -138746238 -54780228 -634845 -18790938 -44858703
9812 -44858703 -25594299 -4401697 -30043140 -61316176 -40387036 3108508 6052007
9805 6052007 -19089602 -15708724 12854758 17358316 -3042145 -3579253 22405963 38746946
9797 38746946 38415330 50880059 80189160 96618390 88301764 70148540 50364058 35202209
9789 35202209 46441584 80987364 82106582 17487825 -44081473 -17110092 61108040
9782 61108040 72250499 -7553219 -78504164 -76563599 -55120991 -71279148 -90386232
9775 -90386232 -62087846 -11108741 14749107 24260556 42113164 40821623 -12876674
9768 -12876674 -79789925 -90424392 -45459912 -6762635 1178980 15755749 59877706
9761 59877706 99838790 97152946 61259892 29280527 19048960 20636484 19154007 11340105
9753 11340105 5424203 11414967 30118700 52688562 71572096 84364099 85047345 65605202
9745 65605202 34285390 16647412 24061136 33479849 16015615 -22809965 -50150068
9738 -50150068 -48307536 -29979818 -11173607 8937497 31494480 39996591 19366883
9731 19366883 -13833996 -24379222 -6677171 4125876 -14086920 -29352862 -1670794
9724 -1670794 44296738 41328536 -19758277 -64455921 -36462305 21360364 30372316 -15558666
9716 -15558666 -57551050 -62842757 -49536929 -32519298 -6477296 16322331 10518723
9709 10518723 -11010623 -6768770 18598891 8337528 -52658141 -96662494 -66530657
9702 -66530657 -2726204 13713998 -27937726 -68653865 -72072098 -61202449 -64849114
9695 -64849114 -75075032 -70280537 -48915572 -24767745 -6436084 6047441 12354301
9688 12354301 8106217 -8954684 -29032249 -32941565 -16120492 -4933405 -28567566
9681 -28567566 -74613448 -98356640 -81734615 -53657839 -40802148 -31959507 -11960005
9674 -11960005 2733785 -5595436 -16397249 62298 31288386 39084771 16296070
9667 16296070 -11965994 -36254853 -68920638 -101043534 -97765081 -51738734 -5550408
9660 -5550408 893596 -20553859 -32413982 -26171569 -24075025 -37663797 -52115737 -52013386
9652 -52013386 -40227579 -24010824 511000 36216477 66617055 67521727 38591421
9645 38591421 7840666 -2866217 -3399177 -14241640 -32487634 -38773010 -30920438 -26147545
9637 -26147545 -29981134 -28711937 -18340351 -15180672 -26457727 -34368190 -24734258 -10027518
9629 -10027518 -6004131 -5160590 5668007 17926986 13972530 -6068191 -31158203 -59693591
9621 -59693591 -90414916 -105858203 -90560510 -57076663 -29722557 -11107330 10446354
9614 10446354 29784587 30124680 13429484 -3746313 -20439003 -46391222 -69646229
9607 -69646229 -63511034 -28955897 3923209 22927112 46718893 79188850 87289272
9600 87289272 46442971 -18955985 -62536363 -61984347 -20983948 47208090 112519090
9593 112519090 129429211 80710719 8419024 -28594799 -19881243 -198045 6750452
9586 6750452 7668676 7954190 -1957060 -21554046 -31777865 -22016550 -1962966 20017332
9578 20017332 43409831 52439137 20236363 -44205859 -85252673 -67540475 -28481053
9571 -28481053 -25277878 -47818488 -34182939 29089997 76200676 50847117 -17693076
9564 -17693076 -57762135 -42934507 -1862762 34870448 56681227 55132809 27552919
9557 27552919 -1634540 -142450 26863469 42061962 29916393 11892568 2671790
9550 2671790 -10255217 -29905280 -32358391 -9384438 6687192 -9456789 -34099870
9543 -34099870 -34370724 -22771036 -30528656 -47593792 -37491420 -2234492 16849771 3932941
9535 3932941 -11132749 -4557381 11072035 19463774 24952272 29144955 18408382 -7817633
9527 -7817633 -27410188 -30762073 -34387456 -43629716 -38098658 -16038549 -13852851 -49095565
9519 -49095565 -80444944 -66373294 -33366289 -35085700 -64336539 -63566951 -17613147 21100250
9511 21100250 9046007 -34765683 -66744468 -69780137 -48591675 -9870126 30738322
9504 30738322 48387662 35588692 9605038 -16423293 -44549713 -66991850 -64385770
9497 -64385770 -43040095 -36384490 -48363340 -35165912 26284540 90247005 102833843
9490 102833843 77427840 61974234 59465322 37782914 -508403 -22094774 -29225915
9483 -29225915 -54741863 -85896163 -63249337 22141036 94677698 93466436 52629241
9476 52629241 39639010 57846074 60933209 32824944 -150956 -19559841 -29364585
9469 -29364585 -28776034 -10998396 14980578 31708407 34906242 24984395 -3100375 -33255281
9461 -33255281 -20601928 46615852 104487558 88334934 30229417 16167989 56673338
9454 56673338 76672532 40532882 5580320 22892699 59650690 65108132 50843852
9447 50843852 50149082 48708636 19063368 -12925658 -3190593 30943104 31253664 -11045466
9439 -11045466 -45191578 -39665617 -17238321 -7259239 -11789395 -27779411 -58739079 -90911167
9431 -90911167 -94813431 -66067586 -36871395 -35205770 -54777884 -69789784 -57250908
9424 -57250908 -7157865 61584220 100021339 77789644 28882256 10352668 20716888
9417 20716888 9003874 -34560582 -58254254 -35136421 -6257214 -6775388 -9539462 13487781
9409 13487781 29776188 5230245 -21054360 7782277 66247551 78974789 38798675
9402 38798675 12174352 24821708 23053862 -28448862 -83199073 -86985290 -58837816
9395 -58837816 -50471640 -65772294 -70041196 -51450716 -25499822 2936118 36049443
9388 36049443 53116346 28940318 -20071536 -47792980 -39251806 -25854692 -35804528
9381 -35804528 -61482873 -82711409 -90428210 -75482809 -24463352 53293731 116296091
9374 116296091 130165871 103648866 69861258 45736066 27254944 11605487 2086839
9367 2086839 -3620712 -11521633 -20032334 -24439448 -27070109 -27746010 -11819977 30181446
9359 30181446 73934833 79420778 44826367 17309427 34409670 74390147 86424728
9352 86424728 57449063 22770393 12717812 15386547 2022197 -29878380 -55522594
9345 -55522594 -56470676 -39218531 -20729087 -8282196 1531075 11810423 20755422 25806052
9337 25806052 26474387 22402182 12507501 -2320261 -18434297 -33418242 -48481084 -63573344
9329 -63573344 -71457600 -61798254 -34211158 -5440131 616495 -26242536 -69624228 -96106384
9321 -96106384 -83058157 -40821924 -5038947 -2819607 -27122037 -47168079 -41416775
9314 -41416775 -15513011 9037851 15446861 1427846 -21343931 -34283927 -27770397
9307 -27770397 -15384688 -23626263 -60093778 -100038969 -114183484 -102598857 -88668593
9300 -88668593 -85776391 -86994316 -85753965 -85774135 -84736026 -69322151 -40857851 -27999728
9292 -27999728 -50766928 -81321480 -69019908 -7513784 49630901 53111966 16612988
9285 16612988 -8320124 -1512210 8157850 -8145430 -38098308 -45790418 -15253534 33552614
9277 33552614 63567078 50359253 4112595 -32097019 -19052927 33077680 66855176
9270 66855176 38273092 -32315045 -82976154 -76858558 -31382973 12744342 31696152
9263 31696152 26257539 7828330 -13944175 -37259007 -66442192 -99779885 -121618436
9256 -121618436 -115845574 -85134120 -46689852 -13084465 9262853 9034123 -19830014
9249 -19830014 -55927825 -63223284 -34513904 -147700 16260324 25358136 38321788
9242 38321788 32748920 -15069308 -76982849 -89953070 -31860642 46952019 80429071
9235 80429071 57962033 25138523 23548804 46331079 56502341 38869665 19180663
9228 19180663 25792093 45569547 38351930 -7062190 -56873892 -79655890 -82536847 -82765786
9220 -82765786 -70400572 -30522859 14393453 22319628 -11081612 -46665546 -55836351
9213 -55836351 -49428772 -46612518 -45858784 -39827652 -32928461 -27393634 -13149305 10296894
9205 10296894 19720211 -3320998 -41583358 -59762401 -46323904 -20476406 -2232324
9198 -2232324 6868938 12508772 11895746 -3025477 -30412860 -51680153 -45183928 -12402246
9190 -12402246 12958517 -5971562 -67607310 -128846953 -147446558 -118924464 -69755502
9183 -69755502 -27415021 -4009822 2716059 3201871 5143686 2768764 -15419240 -43852009
9175 -43852009 -56750099 -37079110 477864 25332288 22533130 21349 -26694008
9168 -26694008 -45097828 -46789950 -32054348 -14646452 -13689782 -37270173 -74815056 -104602806
9160 -104602806 -109674404 -90530826 -62004341 -35372560 -9914932 11823039 13710415
9153 13710415 -10775849 -35437471 -28836701 -1418388 6829609 -12107044 -22732828
9146 -22732828 -6677605 7182429 -3182139 -9532054 18772575 56109095 56016238 23649089
9138 23649089 3072950 4338614 -4824896 -36231958 -60573421 -56950810 -38416207 -17902891
9130 -17902891 7955441 27367892 10572096 -38961913 -70522686 -51463246 -12188702
9123 -12188702 4099628 2959807 12438395 24336378 9539974 -22984085 -31967155 -7917209
9115 -7917209 11958759 640906 -23418597 -30591832 -19378820 -5559019 3331757 4826364
9107 4826364 -7346319 -29003655 -36834500 -15560568 13980365 14693028 -20434145 -59582925
9099 -59582925 -71447804 -57047891 -36346123 -18241817 2481511 25568399 39258258
9092 39258258 36892221 28347890 28372147 39507171 51633479 52990569 37519202 9352979
9084 9352979 -13187708 -8299103 21921617 43492920 28237423 -5473393 -13216072 12653362
9076 12653362 28672647 2156513 -38058298 -37797776 10634007 62640989 83544763
9069 83544763 86401406 98901150 116735320 110109809 68210852 18188730 -4595990
9062 -4595990 4022541 15320305 4286826 -20032440 -26889110 -1760622 38938681 70490125
9054 70490125 82591178 73896938 40581593 -13895278 -67205440 -94643234 -94171842 -80267698
9046 -80267698 -58369551 -25706716 4761204 7885954 -17745470 -41647549 -44117793
9039 -44117793 -44616525 -64951530 -84098396 -65016497 -19358046 -3233713 -37233490
9032 -37233490 -69941924 -49092587 469124 10998611 -29974405 -63840399 -48781544
9025 -48781544 -17160860 -21053725 -56037375 -75663681 -61859620 -40982524 -35318643
9018 -35318643 -35966034 -30160351 -25584768 -34073663 -50033993 -57590748 -49028250 -30683198
9010 -30683198 -18644182 -26644562 -47417700 -54551748 -40634841 -39991988 -81728263 -129824970
9002 -129824970 -116426604 -40380061 18509364 5344580 -38282857 -44022708 -15183255
8995 -15183255 -5371756 -27542272 -42417685 -28039643 -7164833 -2385794 -8821593 -19167976
8987 -19167976 -37110978 -54855260 -50312571 -19526043 13837135 30432036 32862635
8980 32862635 25643989 3735709 -30645041 -63272665 -87284148 -105790829 -111994841
8973 -111994841 -92138784 -52817623 -19181541 -1406408 10159090 14789422 210445
8966 210445 -23243070 -26099816 -8799493 -6820810 -30100147 -40258515 -13342496 17031046
8958 17031046 13033982 -9507232 -17692154 -21611521 -47798166 -78056258 -71695503 -36984472
8950 -36984472 -23391786 -42420360 -50286016 -20766016 12787015 9610471 -21076878
8943 -21076878 -40394479 -32483539 -12535689 1413546 2917873 -7569180 -24216508
8936 -24216508 -35389180 -32022017 -15675800 5019579 22511325 33274130 36375013
8929 36375013 30726178 14747854 -6451940 -15610282 1525587 32523598 47307185
8922 47307185 38073134 28260401 29155352 15864227 -27405403 -63946257 -45893076 14137244
8914 14137244 54523894 44409731 11838743 -9990655 -23094955 -38382360 -44500815
8907 -44500815 -25204911 11901610 40221149 36169121 -7404256 -72158464 -117018290
8900 -117018290 -112533104 -77081502 -57580862 -71689873 -92522024 -91303938 -66281244
8893 -66281244 -26520066 19045364 48197924 37187603 588818 -15079456 4280638
8886 4280638 16802615 -12186633 -58697051 -81767487 -84013966 -91522551 -97857562 -74157685
8878 -74157685 -25031068 8975337 6511876 -10568485 -13155661 1582074 17664944
8871 17664944 19764873 338341 -35578269 -68964080 -82657686 -77991369 -65007278
8864 -65007278 -44106221 -15400434 829859 -20955963 -72272509 -108577577 -97504702
8857 -97504702 -55017506 -22112626 -15226100 -14072719 2630292 24684837 26200022 8223968
8849 8223968 3856534 30163078 55979575 42432236 832340 -24982335 -27290891 -40541917
8841 -40541917 -72788445 -82023623 -44751998 -770447 8119540 3666043 26724200 58842371
8833 58842371 48307759 -609262 -27592154 -7580537 15346139 -933825 -40962669
8826 -40962669 -67509504 -71036939 -58781551 -30526610 4765953 15960860 -12839959
8819 -12839959 -48435957 -44178300 -2119977 28533601 14726508 -22195795 -37948093
8812 -37948093 -18300890 11592203 24175144 21081421 21661859 30642910 34534669 29614055
8804 29614055 30822834 42015123 39927171 8588381 -29121934 -42281519 -40263247 -56254223
8796 -56254223 -89838851 -104499619 -84141254 -53715669 -34551697 -16400184 10200647
8789 10200647 28752877 27301533 24951131 39923381 53553782 37032114 -508572
8782 -508572 -21424579 -10249221 11764134 19803664 10470283 -4327546 -7212578 19459326
8774 19459326 75428318 126214866 127052179 73751682 15061281 2852933 38618541
8767 38618541 77544757 76583293 29446700 -35860041 -79151963 -73480982 -28668781 7383826
8759 7383826 -9172851 -64025175 -90534905 -46251936 32811867 77907351 72372214
8752 72372214 55866162 51964729 39375669 6173648 -16013378 -1653003 22513363
8745 22513363 17747509 -8649868 -23914750 -23624051 -23217964 -17801343 2712949 16234486
8737 16234486 -1824577 -25068398 -10514379 20852472 4222125 -62967336 -104472177
8730 -104472177 -75223011 -22383149 -4537043 -10279637 -1106500 15755598 11110388
8723 11110388 -5591771 -4423580 8200092 868430 -27564618 -46986986 -42552129 -27722773
8715 -27722773 -18546980 -22687593 -42744916 -65979764 -67119410 -45619161 -37175777 -58771705
8707 -58771705 -69583048 -26771422 42535222 72124960 45553225 6884016 -8910818
8700 -8910818 -9287852 -11020796 -18701644 -37342293 -65936782 -78429599 -51365545 -9799832
8692 -9799832 -2773532 -31889406 -49701486 -33278280 -10687398 -4773975 -1975306 4495922
8684 4495922 -9468728 -51718734 -85560604 -81536223 -61904675 -59392528 -63092405 -42800395
8676 -42800395 -1784608 33749838 58501519 81851079 91956667 68032430 24445686
8669 24445686 3563398 19433352 39927722 34028583 11165026 13832 6547368
8662 6547368 10727982 -1528607 -18611459 -20707143 -10250163 -12537414 -40381585 -70197561
8654 -70197561 -69012499 -37940205 -7914761 3123414 1773425 -10233165 -40154484
8647 -40154484 -69996944 -59919384 -9139188 25725974 7211218 -23880893 -10916009
8640 -10916009 28340209 34248654 10103229 20943284 81632458 120822618 88432715
8633 88432715 36164646 40110435 87321722 100495814 52454051 -6901319 -34401263
8626 -34401263 -46147413 -72129711 -104492856 -116503024 -103786256 -81592189 -59435902
8619 -59435902 -39496114 -26687932 -21744069 -14009505 3695639 21838751 28426747 25919907
8611 25919907 20425155 6215573 -20723244 -42926987 -37106903 -7078717 18742468
8604 18742468 23495456 17628371 15756382 15170414 5289426 -13040050 -26464577 -23007373
8596 -23007373 -3959892 14996887 16033766 -3123785 -27184024 -42297476 -48237909
8589 -48237909 -46134823 -29208927 1147313 26034277 34704938 43217289 62902361 68360546
8581 68360546 32559290 -19473322 -37209055 -20953277 -21384695 -56594968 -82415684
8574 -82415684 -63427523 -23307443 1804482 13382923 22250326 15214728 -11409129
8567 -11409129 -25975235 -12284873 -6895242 -37036103 -61090938 -32364797 10936985
8560 10936985 -6033734 -74231597 -108814380 -78382797 -47362115 -70763315 -116206718
8553 -116206718 -123674027 -90473922 -60463164 -63854779 -95659339 -126528261 -118101421
8546 -118101421 -57257202 13531129 34333104 5589294 -12029633 14695424 51424067
8539 51424067 59646000 47812784 33606962 7534505 -30527147 -46418662 -24956556
8532 -24956556 -5152737 -17148786 -25367580 12428594 65411597 70582221 28933312
8525 28933312 -2703637 -1169472 5401806 3432206 13108023 36083425 43345968 29503887
8517 29503887 26022480 40834120 34912259 -11928978 -54611564 -41257516 9486190
8510 9486190 31158382 -2401713 -49369278 -60774957 -37133477 -12360308 -4256472
8503 -4256472 -4182860 -8177946 -29421936 -67445850 -88256380 -63310483 -18198029 -7857158
8495 -7857158 -41141530 -66071669 -42252199 7019253 35293348 34102951 27410110 30705099
8487 30705099 42238271 52456542 39583154 -15453550 -84562203 -100437413 -46246415
8480 -46246415 1405202 -30032676 -102949144 -123906676 -77788966 -33160153 -26136354
8473 -26136354 -20952178 6837861 27280190 19191281 7497181 7798330 -5065941 -39697803
8465 -39697803 -56155943 -29842415 2357549 -420842 -24773310 -41786278 -57558241
8458 -57558241 -79660004 -78823473 -40087468 -14737985 -56712325 -130258852 -146742950
8451 -146742950 -85050715 -15110736 233042 -26307010 -45771456 -37513943 -19145610
8444 -19145610 -20164200 -56325426 -112238337 -148373973 -140382309 -103857385 -65944058
8437 -65944058 -32431066 -6041717 -9602407 -51178223 -87426854 -70700099 -21241333
8430 -21241333 -1517691 -24390477 -41486908 -25167427 -4701774 -7046018 -15494411
8423 -15494411 -10551788 -5472050 -13145578 -17161445 -5776394 -458912 -19207728 -40798194
8415 -40798194 -37700456 -19417425 -10213425 -5333337 15279814 44048828 50835564 24993705
8407 24993705 -13620940 -40120591 -41362736 -18009394 8856792 5103070 -38113259
8400 -38113259 -82827193 -85971220 -54761815 -34256876 -45052088 -62148526 -57106730
8393 -57106730 -33580631 -11726091 1514837 11886708 18101535 7496253 -25661205
8386 -25661205 -62422245 -69170295 -34534166 9402007 19781595 -4536605 -25838628
8379 -25838628 -24235183 -18488611 -18374044 2675633 55678817 93182973 67597417 11554743
8371 11554743 2545051 50749271 80326314 36778133 -37512126 -62090746 -16079589
8364 -16079589 53493219 95415353 95344177 68192678 37819623 20966341 15762147 9307995
8356 9307995 1192799 6465024 29554111 52761891 59235959 49056820 24654232 -15401455
8348 -15401455 -54750194 -59753196 -25916219 -300858 -26506354 -83232890 -111028995
8341 -111028995 -90072446 -55592171 -39398660 -34625652 -26658516 -23761220 -36599623
8334 -36599623 -50313975 -40765652 -8415152 22839302 35999011 35312052 32163360 29934603
8326 29934603 25817377 18375355 7564157 -7550528 -23896408 -29554970 -14019736 13455459
8318 13455459 26636283 12079666 -14445171 -34847258 -59832192 -108245822 -160726809
8311 -160726809 -168032449 -115151188 -46602595 -11452001 -10727946 -19132266 -28541309 -39330389
8303 -39330389 -35019104 -6772137 12838642 -14569000 -70131619 -94998034 -70783416
8296 -70783416 -37116401 -22497954 -7378347 23795248 40571056 12242162 -36206491
8289 -36206491 -53516172 -29450380 3097937 20932543 29701989 34999655 29132104 12508876
8281 12508876 1906869 7654055 20372998 28670929 35270587 46183959 54965062 49564446
8273 49564446 31485811 18644247 25483752 42632507 41913058 6516766 -46150413 -79334260
8265 -79334260 -75104853 -49918250 -31498933 -30319057 -36626906 -34163022 -11311846 29764581
8257 29764581 66619819 69020533 28857117 -27323148 -62982735 -64150501 -43669399
8250 -43669399 -22323532 -13117193 -16658456 -23886870 -26929689 -29198511 -37189906 -43245936
8242 -43245936 -31704135 -5732634 9849076 876423 -17707915 -24874633 -17358650 -896763
8234 -896763 20779156 34572189 20601278 -12974064 -22681399 14096427 57653903 55772290
8226 55772290 17184027 -6174874 1595061 6671518 -11363896 -33828976 -49045646
8219 -49045646 -72975058 -103305277 -100619749 -48072003 8101518 16416920 -10157174
8212 -10157174 -23398112 -15354981 -16393599 -29727838 -21321349 17845696 45047657 20977752
8204 20977752 -39692645 -92868499 -115199602 -109153595 -81082826 -42900539 -23434130
8197 -23434130 -46891902 -97509083 -127599002 -107577981 -54119380 -4951676 18713497
8190 18713497 17105499 -5083815 -43998695 -88825898 -121716769 -128043091 -103816399
8183 -103816399 -58234673 -14233277 3380886 -6229193 -12381394 11905152 51068577
8176 51068577 64523108 42583995 17766486 12313735 5363574 -26043773 -59765795
8169 -59765795 -56244243 -20061584 2234564 -15767467 -51557621 -69738711 -58973310
8162 -58973310 -28342813 6167769 23780963 12016674 -13471988 -23861293 -17315102
8155 -17315102 -18268633 -30843597 -26494344 7221269 40065974 44511940 35906086 38254663
8147 38254663 40266060 22987459 5516206 16711575 37617073 24338462 -15394029
8140 -15394029 -21669028 31663848 96889651 115838082 84689365 35929410 -7630763
8133 -7630763 -34608637 -31818130 -1941425 24401445 23802559 14799504 31534011 71551391
8125 71551391 93604265 64525769 -6991251 -78669850 -107408193 -84491710 -46910484
8118 -46910484 -39531681 -59932371 -63892157 -34314730 -9401022 -19642820 -35882054
8111 -35882054 -20415361 3304515 -12481360 -52740732 -53177502 1329068 54412394
8104 54412394 64241200 52059374 45841725 34381871 8997464 -1957949 17824337
8097 17824337 32483114 10364261 -15567731 2204855 41621985 37477026 -18800070
8090 -18800070 -64630580 -54529898 -11457184 21050820 33587248 39192479 40667968
8083 40667968 31199566 8465722 -24299835 -56220475 -65524857 -39872636 -1862376
8076 -1862376 10724282 -5956998 -18287325 -4999035 18580180 33962832 46029134
8069 46029134 61453948 68480549 57178139 38145859 23808420 11488303 1221758
8062 1221758 7556619 32446385 47046677 27157829 -6457383 -10746211 21565961 50743007
8054 50743007 39277190 -4176389 -35993562 -25511991 13393454 40354050 36263089
8047 36263089 21436671 19165694 20803985 10119004 3781516 28681063 67683553 75643829
8039 75643829 50847381 37219827 44915113 29876764 -21183467 -48843541 -9377696
8032 -9377696 50172602 62857247 40834975 35922435 40093656 6324015 -53321219 -77046413
8024 -77046413 -56732124 -47673687 -66417193 -61890771 -11088561 34783228 35476602 23459246
8016 23459246 36021187 47153457 20917591 -17375190 -23071315 -8208537 -15109433
8009 -15109433 -40397385 -45694977 -27839979 -19977063 -29692760 -31014369 -18876015 -20663434
8001 -20663434 -44552745 -59957859 -43451532 -9243830 20113874 42915982 62871208
7994 62871208 70927695 60934672 45053478 36751324 30756625 13502042 -14355020 -35270484
7986 -35270484 -30842652 385112 33843413 31308119 -22974693 -97773709 -140527322
7979 -140527322 -128971982 -84460169 -36978298 1499772 25222969 22184286 -8526179
7972 -8526179 -40841011 -42686338 -9947173 31534570 53912764 47747604 19583839 -17193704
7964 -17193704 -46341320 -53084974 -32919116 2501320 31080044 36557061 22729500
7957 22729500 10420883 17090095 39731263 59433862 59834600 38518048 6115756 -19134225
7949 -19134225 -21907616 -6403673 274452 -24404483 -65847376 -82734872 -57370248
7942 -57370248 -21504438 -18526243 -49569448 -75326750 -69200112 -48751594 -46797467 -67357555
7934 -67357555 -86089906 -86736188 -77411264 -68428535 -53743105 -28235682 -10054631 -22740193
7926 -22740193 -55267108 -63275461 -22615951 34300236 53902666 24543611 -16821499
7919 -16821499 -38110839 -46268681 -58826818 -66471809 -48622445 -14856834 -1217170
7912 -1217170 -21625986 -47945168 -50723402 -40208090 -47388910 -75867004 -96214543 -87164723
7904 -87164723 -60644184 -38364557 -19704700 13757345 68148454 123734777 152998905
7897 152998905 147277744 122321099 97519890 74674794 45591848 17894086 14162744
7890 14162744 35901270 49529780 30335837 2904337 5695723 27572842 22985547
7883 22985547 -10453027 -21055781 14362407 48731063 38121126 10802671 15412555
7876 15412555 35422262 15472498 -44442685 -85121290 -79381514 -67552025 -86155465
7869 -86155465 -111919946 -103971423 -64762508 -27632141 -6834727 10200566 31540461
7862 31540461 45136303 34011679 -3159463 -46701812 -71026930 -68242425 -51075830
7855 -51075830 -29100950 694744 29283433 29977697 3986157 1125165 51447506 101660891
7847 101660891 78751309 2545341 -35578865 -6464962 21551501 -2037570 -39142735
7840 -39142735 -44045382 -40440692 -63001488 -83553649 -61271657 -21160950 -14422394 -33379929
7832 -33379929 -32179950 -6690705 11839306 22526485 47645604 74027053 68905756
7825 68905756 46000058 48070810 66770453 50661148 -1430163 -28177980 -5241352
7818 -5241352 12876559 -17399665 -56994890 -44421048 16588029 71947352 86602559
7811 86602559 60514886 3934741 -62872210 -104183103 -101128427 -80846046 -85317233
7804 -85317233 -118452547 -146283294 -141836504 -110490509 -77569309 -66103438 -80062666
7797 -80062666 -98792499 -96906669 -75871410 -60542521 -58117809 -43795748 -1695092
7790 -1695092 43515486 58103493 44284163 28866882 20918312 9094729 -5720917
7783 -5720917 -5050747 15512676 31842233 19337605 -15380717 -39504504 -28268773 7873544
7775 7873544 30478826 12005052 -31071969 -52455659 -28067881 16124961 36878367
7768 36878367 24264468 5531760 3948469 11777954 8519264 -8378497 -23093641 -26054893
7760 -26054893 -24904401 -28164741 -31383756 -30214526 -36410097 -61601191 -89536137 -89981060
7752 -89981060 -65076666 -53570869 -74263191 -93543089 -74315597 -32726788 -11893342
7745 -11893342 -16620577 -15055100 3476446 17231238 19855653 33227722 59398936 61786163
7737 61786163 17910715 -41310683 -71944319 -73001224 -74845510 -88946082 -97210157 -84003542
7729 -84003542 -56455753 -33571347 -26786898 -29022980 -19405559 12108091 43359310 39245114
7721 39245114 -2992382 -46572181 -61561296 -59209846 -68157572 -93259777 -111313835
7714 -111313835 -95747513 -38390347 38346665 87761704 80396309 45545919 42116383
7707 42116383 75959653 81565218 11765948 -86257096 -122800857 -74541975 -1457431
7700 -1457431 36177809 36973552 31380518 31342075 24004445 -1379082 -34779977 -51758639
7692 -51758639 -38484282 -11327163 -436200 -7789979 -49299 41060596 80870421
7685 80870421 71483205 18049062 -25905042 -27142927 -6668260 -625684 -14976029 -30916475
7677 -30916475 -34711764 -26678360 -12052389 3609779 14324891 16423906 9614970 -4675311
7669 -4675311 -19829535 -20640488 4400757 42893521 61569707 39911411 -3269369 -27432502
7661 -27432502 -16177722 4349535 1266797 -18336231 -14429948 29236765 76589475
7654 76589475 82353235 46207775 2260825 -29279861 -48652073 -46540554 -10703293
7647 -10703293 34755275 41834464 6016728 -19442618 1177893 35003079 33943875
7640 33943875 2845303 -23256954 -38464750 -56242216 -62801352 -33174181 14667732
7633 14667732 33044015 14067459 75956 17065441 40957761 44976192 41478906
7626 41478906 52727187 68244683 58943423 20011053 -21034056 -32732509 -5664060
7619 -5664060 40884649 70037367 55217530 6042712 -39373430 -51795656 -34254034
7612 -34254034 -9205402 5257041 3852805 -8677902 -22096691 -28324514 -27259386 -21568014
7604 -21568014 -9635949 8829408 25527337 32806403 36107068 45115130 55297310 50982811
7596 50982811 27201192 -730537 -10365103 7861596 38666340 49458006 22556223
7589 22556223 -17856606 -29837155 -8894855 8289432 4912789 10227233 39654808
7582 39654808 51432436 9415638 -44114837 -39796675 12466281 36844417 8847049
7575 8847049 -12876101 12142659 42073265 24480183 -23555109 -51081390 -48138685
7568 -48138685 -38574573 -27093595 -218786 36200932 60984921 70143636 73618198 68946352
7560 68946352 47166994 16292567 -7890692 -25920113 -44616764 -53787561 -41295970
7553 -41295970 -22837058 -25366832 -43948579 -46429839 -23255605 -2116020 -4354269 -13942094
7545 -13942094 -4958408 20496022 40474133 45767130 43191521 31896525 -18764 -47861013
7537 -47861013 -77867245 -60757444 -11022402 27499438 35451665 34612806 44006599 47295378
7529 47295378 24924859 -5380463 -13058216 -5238858 -15252619 -46331842 -66109598
7522 -66109598 -59093624 -45687126 -41741488 -37820091 -30784769 -37453019 -58369294 -62774685
7514 -62774685 -31436388 14966997 48618135 64530572 61198529 30193090 -11102601
7507 -11102601 -18027896 17512228 42170965 19351085 -8395315 14862967 66372256
7500 66372256 79525208 45631738 14366238 6631340 -3364633 -20765926 -14418532 18963201
7492 18963201 36163229 13202077 -20519578 -32586036 -25960231 -10441825 16304422
7485 16304422 39209207 24978512 -24681126 -63104602 -65874910 -61806037 -70752268 -63261948
7477 -63261948 -20972860 13332915 -2623177 -39963998 -47071504 -35639191 -54471116
7470 -54471116 -99452855 -117991572 -95771944 -73635513 -74463098 -73385611 -52281661 -29915304
7462 -29915304 -20646389 -9892862 10293058 22003025 14835540 -755319 -27052625
7455 -27052625 -79704632 -135753214 -134499475 -64972920 -3126858 -14089960 -58170558
7448 -58170558 -52084345 6879320 46641640 36968614 26455607 52894184 83021721
7441 83021721 70691299 25770277 -11007914 -28193875 -42985292 -63161492 -82301951
7434 -82301951 -98216084 -109030778 -104085116 -83896530 -75500686 -98930393 -127677202
7427 -127677202 -115166539 -61081266 -20799511 -37896721 -88022300 -104866464 -53364268
7420 -53364268 33372716 88467926 78544966 34163311 9273489 15719127 16518693 -12159051
7412 -12159051 -41228966 -33581080 -4695315 -988035 -28211523 -44246944 -26515478
7405 -26515478 -4545028 -9691519 -28175713 -28014134 -6013324 17718212 31447448 32448908
7397 32448908 14151914 -19119889 -38470045 -22072243 7613288 9134506 -18583363
7390 -18583363 -33723967 -12266587 18571076 19364487 -11731942 -43317872 -49974172 -33330111
7382 -33330111 -13931288 -13771628 -39926908 -75518217 -90850233 -70874725 -30467105
7375 -30467105 -599675 -2258748 -32421935 -68395960 -85493769 -77390609 -59353633
7368 -59353633 -46273298 -33020769 -7822177 20918299 30343198 16609004 2255894
7361 2255894 3400887 8454669 51349 -19112036 -36336459 -49995004 -63631526 -70087448
7353 -70087448 -59924060 -39124724 -21618455 -9231809 4761214 16785879 15602543
7346 15602543 2841070 -5472726 501787 14751976 25837060 25390681 9580163 -13920135
7338 -13920135 -24470990 -10699191 9341434 8910610 -10650190 -26599518 -34105747 -48643207
7330 -48643207 -67891379 -67479970 -45435055 -33553836 -45367115 -49642214 -23047829 6468514
7322 6468514 5707395 -6165868 7616936 33612293 29763595 838883 -6978725 15574105
7314 15574105 28132149 13906275 5524605 19805854 24598507 -1170649 -27000653
7307 -27000653 -25618599 -20623513 -37729738 -51246139 -28553610 6625171 10044300 -8661836
7299 -8661836 -4081498 26687146 39321781 12336358 -26328842 -44368933 -37345404 -15343982
7291 -15343982 8921130 21187865 22874110 35300107 57812700 46603147 -21764642
7284 -21764642 -93143911 -100108605 -60973503 -45174138 -56994055 -38729190 12776863
7277 12776863 28932383 -11690759 -42335597 -23236569 -7092700 -36729365 -61979161
7270 -61979161 -27431560 29006052 43018501 28250047 29823164 26984127 -22773068
7263 -22773068 -81474746 -75110077 -19683429 -1468427 -38635894 -63145454 -45832704
7256 -45832704 -38212945 -66627308 -79835533 -42534676 -1334828 -9173410 -48094830
7249 -48094830 -74367507 -83234862 -81134245 -48438595 14576330 50969299 18030399
7242 18030399 -38806831 -45423820 -8629128 -1551483 -49408883 -93880990 -80171397
7235 -80171397 -27767199 5957719 -2493472 -30739216 -50050392 -54332829 -53482109 -50749919
7227 -50749919 -34107681 5240452 49547787 64766813 40126755 3414133 -12920427
7220 -12920427 -8252385 -4672601 -11807705 -14469713 7048759 49507795 77362349 47580923
7212 47580923 -40963612 -127914508 -145102712 -92138235 -35193508 -28104310 -61417089
7205 -61417089 -92939151 -95247370 -62574929 -5791342 42034524 46947329 19217369
7198 19217369 5474809 19152992 18217369 -23909680 -69942820 -78073423 -67634010 -76993528
7190 -76993528 -90170132 -62291404 3948502 63749856 96262202 110187879 99038239
7183 99038239 52896022 6892996 11705532 53344884 67286034 39666776 25094343
7176 25094343 46431841 50561087 61765 -57566367 -63688765 -38963943 -40366387 -66108304
7168 -66108304 -68546826 -40569615 -24351688 -38375525 -52651566 -43328584 -24595008
7161 -24595008 -13419985 -2105717 16149244 25916396 15751036 3098557 8512303
7154 8512303 18245344 -907281 -50188314 -86692743 -76003966 -41867778 -38782555 -75373368
7146 -75373368 -94918527 -50353298 26942468 66252626 49370462 20926813 13127868
7139 13127868 11840556 6577864 18257056 49272500 55903060 12053823 -38699152 -41848319
7131 -41848319 -10662047 5368419 2984271 15722033 40511723 41432173 22378495 26843114
7123 26843114 56242661 55772372 3890983 -44601621 -36349738 10844101 50359153 72092873
7115 72092873 86218596 83216670 55741587 29336258 27046348 28626425 6049847 -26224787
7107 -26224787 -39637089 -43749188 -60541602 -69577447 -36302610 18369031 36557353
7100 36557353 7149031 -26764408 -43076652 -61700382 -83753027 -74655421 -28191203
7093 -28191203 11633067 19653786 26018991 52991502 70114880 52808155 35010513
7086 35010513 53020863 78554984 63510742 18051943 -14828407 -35005082 -70779599
7079 -70779599 -107803577 -103096216 -65164447 -50569585 -74029474 -87939982 -65901304
7072 -65901304 -41759454 -40387488 -30802284 14431291 63915357 74644688 53679668
7065 53679668 28757010 -5143369 -58688839 -97486592 -78404202 -23922046 -2783130
7058 -2783130 -36036228 -73118403 -69538107 -42259642 -30601710 -39389669 -44929102 -33523920
7050 -33523920 -11774634 7553011 14012819 3808217 -13606961 -20974615 -10172871
7043 -10172871 14673137 49306752 88253213 111311787 93376538 37265064 -20044989
7036 -20044989 -44552858 -36610089 -19392059 -11423618 -18059722 -34308394 -46367003 -43721022
7028 -43721022 -36047529 -40815873 -48304194 -25086827 31789724 71514688 48515012 -14595890
7020 -14595890 -56070160 -53890914 -37688848 -27767604 -7420030 32729823 63526299
7013 63526299 55936679 23633016 -1332751 -16650420 -43512045 -83720822 -114803510
7006 -114803510 -125282732 -124567584 -114272512 -80918922 -31179562 -6343591 -34490577
6999 -34490577 -82884593 -89622694 -42310178 3982250 -2172779 -43810525 -62494704
6992 -62494704 -34812243 5396068 18834706 6563750 -7019758 -15012825 -30423341
6985 -30423341 -56693665 -77711240 -79613064 -67862966 -57370539 -54777382 -55235790 -50723821
6977 -50723821 -38042478 -21767085 -9065815 1443393 20178600 47602577 61832457
6970 61832457 41455173 -1762135 -33736267 -45109838 -63152066 -103765427 -135444322
6963 -135444322 -116355477 -53788588 2924342 25756093 35181583 58118655 85521804
6956 85521804 89328651 66006503 41657463 35414219 33808505 9198781 -41749661 -87697138
6948 -87697138 -95939118 -70674858 -46453138 -43701517 -47494771 -37565997 -19055347 -5294992
6940 -5294992 12015657 46613335 80638018 77549035 34474655 -8904546 -21579159
6933 -21579159 -14297609 -12659185 -24881596 -48515379 -80745951 -104437324 -90989493
6926 -90989493 -40467048 3186026 2314399 -26829690 -41142778 -27738081 -6505079
6919 -6505079 8856368 20594889 26216110 18569412 3898132 -4628574 -7402981 -10883103
6911 -10883103 -8039728 8854499 24164884 15107977 -13880452 -39392614 -53733005
6904 -53733005 -62642878 -58890273 -34887380 -15732775 -37321769 -88172518 -113256259
6897 -113256259 -83949101 -27747802 18928815 48473012 62070599 53380569 31089272
6890 31089272 22427434 34079957 40068629 25002417 7367184 4377453 8932045 17764427
6882 17764427 42502990 72578514 71692401 38539688 24170465 52871070 73558001
6875 73558001 38066902 -15481937 -17710278 25574110 48101204 25232411 -5424852
6868 -5424852 -17596191 -25962453 -39630676 -43632456 -35166523 -29468113 -23197580 1947156
6860 1947156 35399492 45831417 37617592 48026584 80130557 91914502 65042077
6853 65042077 30239918 7416679 -22001781 -58387133 -59739519 -13052262 23626918
6846 23626918 403878 -45190660 -43527431 3455336 33497385 21787124 7549756
6839 7549756 23432874 49957899 52666454 28031773 -3175690 -25039197 -35618849
6832 -35618849 -39489368 -39221056 -30671190 -9267694 16561173 29146865 24165940 14935813
6824 14935813 8225847 -4058240 -20108191 -20583247 -786325 16263888 17741274 22061917
6816 22061917 37034989 30361365 -20672863 -78156148 -88200455 -57671904 -38420986
6809 -38420986 -48930512 -63037926 -67799512 -75814674 -79748127 -54163243 -13637340 -9855279
6801 -9855279 -49071091 -69055992 -30665912 19757074 22685610 -5477406 -11388143 582092
6793 582092 -19076498 -69290649 -86434993 -42484987 5010580 -5860075 -53352336
6786 -53352336 -69510518 -41523659 -25145512 -57441793 -101976975 -101395863 -53815161
6779 -53815161 -6554666 9759016 6402314 848133 -6102919 -8651483 11027464 45564723
6771 45564723 50623835 3955023 -49643937 -55667470 -33409720 -46672675 -96251636
6764 -96251636 -108321731 -49232039 13064597 5636485 -42644025 -51413330 -14557713
6757 -14557713 -5311049 -60948379 -128054114 -138938641 -93005347 -39210526 -14923155
6750 -14923155 -25726922 -55599591 -73284435 -53429601 -13311880 -4120399 -42833420
6743 -42833420 -78947293 -58628031 1444531 40539872 35722173 14297237 -4531181
6736 -4531181 -29356412 -53741356 -45828995 -3003110 25167862 1065784 -44079519
6729 -44079519 -54043031 -27707536 -14442891 -37294040 -61456635 -46624169 -517665
6722 -517665 33675340 25682510 -16797632 -59465751 -70069341 -44249217 -8201141 8493596
6714 8493596 1053501 -14291750 -23294258 -20505263 -2536750 26139035 45311844 37580457
6706 37580457 12702310 -7037700 -22454973 -52994542 -96725463 -124576461 -121945436
6699 -121945436 -108208953 -103673071 -103058110 -94847804 -81682307 -66085114 -39650658 -2955231
6691 -2955231 25922464 37637471 42110523 39526082 13247214 -27966762 -38500616 -276006
6683 -276006 35040493 11121483 -51912204 -88642723 -79743728 -60335597 -51612634 -40838394
6675 -40838394 -24788903 -16829147 -8242893 23355628 61442266 61762262 26249661 8683588
6667 8683588 30209034 47874220 31324754 10778597 13884208 12808692 -19129481 -48960079
6659 -48960079 -37601836 -10404963 -14055480 -37342820 -40941388 -39446759 -78187151 -138759917
6651 -138759917 -146018169 -78801985 -4768480 15558145 -75693 -6766197 -1241770
6644 -1241770 -4056953 -14049648 -18618124 -20362988 -19660494 3328823 53688284 89784652
6636 89784652 65914884 -2343288 -51529267 -48086010 -21462404 -13701394 -22996795 -14593734
6628 -14593734 24335121 61212382 56948083 19198257 -1477672 24287089 63621732
6621 63621732 65786320 32919346 12524125 23234014 29269142 -648848 -48415294
6614 -48415294 -80027653 -87739429 -75023623 -37675072 6991673 10415349 -41701102
6607 -41701102 -86721220 -64860132 -15850939 -25725843 -90938847 -120483396 -82239994
6600 -82239994 -54727557 -93925922 -134978294 -95759863 -12789029 14544090 -23821950
6593 -23821950 -48456864 -28327009 -20100789 -56566926 -87053948 -65938360 -26084595
6586 -26084595 -14736537 -15165476 10884238 47182573 51025239 28178582 20170169 34882942
6578 34882942 45298712 44364256 46511327 43118993 12139620 -30367013 -43303467 -26485136
6570 -26485136 -17979680 -22704408 -7301308 21504131 5396183 -66482860 -115200416
6563 -115200416 -79122195 -6831883 18077873 -1419336 -2295782 23158742 23234026 -11342956
6555 -11342956 -27158479 -3737158 7209997 -30879983 -76873488 -79148987 -54452334
6548 -54452334 -48584191 -55248336 -32814671 15315292 35271242 -13062 -55168341
6541 -55168341 -86009525 -91018213 -90675256 -85517521 -62028538 -24751608 4434795 15047062
6533 15047062 14489010 6050225 -17965911 -53707485 -75437043 -63573275 -31857606 -8481033
6525 -8481033 3055108 22536670 53566866 71048040 57942623 33131242 26332121
6518 26332121 39988892 52681469 48197646 24191457 -15686476 -56911739 -70335354
6511 -70335354 -38637891 14062465 40309707 19370984 -26910077 -66962645 -88775960
6504 -88775960 -94558239 -86140766 -64325642 -32205346 4603694 33818168 37351249 10463794
6496 10463794 -23278371 -32714650 -14098063 8978000 17531094 12929826 4567447 168060
6488 168060 5920399 19009257 24376125 15786636 10431797 21554845 31487516 22145974
6480 22145974 15710008 41724535 74927861 61042621 5811569 -22094202 8170041
6473 8170041 45777488 40391653 10048357 -8201858 -19984132 -40054029 -46058484 -19799541
6465 -19799541 5592461 -3301787 -17645657 4215161 38074028 34529625 11324841
6458 11324841 24114934 59057114 44591404 -23059811 -56544366 -8800656 51117269
6451 51117269 39248334 -27738225 -71058199 -59314445 -24906546 440854 14164181
6444 14164181 18384899 8035991 -16256336 -44220482 -60835718 -48894635 -5735967
6437 -5735967 35401595 28939887 -25273991 -77876121 -97075360 -102655771 -113792552 -107917882
6429 -107917882 -66435518 -20778121 -6942737 -6268022 16502821 41356231 19454033
6422 19454033 -39927149 -70691917 -42276432 3478461 19275699 7750000 -7637697
6415 -7637697 -23639109 -43000077 -50682906 -32189038 2571409 33257668 51796604
6408 51796604 57935304 49652379 31212471 14220147 -671105 -24765304 -52878962
6401 -52878962 -57003613 -27443970 347606 -13182473 -55471056 -75164191 -49080020
6394 -49080020 -9239830 2338754 -17114889 -40217194 -50981262 -55745958 -56423472 -36996543
6386 -36996543 9651055 55481735 60659566 23487732 -13622138 -14933329 11566994
6379 11566994 39122282 61274793 82546431 87452826 52825475 -11182233 -62531227
6372 -62531227 -74091655 -55234988 -25891074 1606794 9363855 -22630573 -81220272
6365 -81220272 -116117344 -95918599 -48787058 -23580041 -28128299 -33434338 -24829467 -15198681
6357 -15198681 -10877588 2087333 29221837 49976090 42576439 12970550 -11793075
6350 -11793075 -11599481 10783959 35101976 42232723 33475051 30545029 48594901 72708318
6342 72708318 73943963 47019209 15843218 -61036 -5341974 -7120767 6185914 45122813
6334 45122813 88778138 97210479 57215951 613432 -29443039 -21588584 -514115
6327 -514115 4127812 -15087691 -44279967 -67257299 -79182768 -84477600 -87303643 -87544950
6319 -87544950 -84085579 -77199112 -66347752 -49299698 -26301389 -3185972 12252068
6312 12252068 16070782 9855818 196039 -1875661 12427804 36575134 47781244 31336067
6304 31336067 5196546 4715290 35668385 57038027 25933844 -48069983 -111179968
6297 -111179968 -125747020 -104363565 -82434899 -77219890 -82502191 -84940548 -71295977
6290 -71295977 -34670846 8940016 23778836 -3564287 -35099584 -22620263 25484857
6283 25484857 51620690 29777791 3443334 21327979 64857318 75093457 37433114
6276 37433114 -726403 915508 25159263 31347696 11917268 -9966213 -23620377
6269 -23620377 -42276482 -71641960 -91668173 -80637316 -44303137 -9450441 5199738
6262 5199738 2226646 -5790862 -10420569 -10556868 -9860868 -12944278 -19432208 -22923573 -21815191
6253 -21815191 -27575730 -50635845 -79032438 -87253000 -70725388 -53075037 -48698348 -38601993
6245 -38601993 -3571830 36098632 43585597 19384377 -1189658 -2795610 -5528845 -18487793
6237 -18487793 -17413561 11397696 40089755 41368989 32498525 40741741 47638234 13159040
6229 13159040 -54143345 -98416228 -91504765 -64052754 -50504781 -42865247 -20297910
6222 -20297910 7368256 14435373 -620651 -15496449 -15141858 -4798968 -159627 -16211714
6214 -16211714 -54150488 -89326613 -88938998 -55115449 -31438378 -48676174 -83702401
6207 -83702401 -95930100 -85065237 -79979035 -83705564 -70490805 -37055702 -15507491
6200 -15507491 -23243401 -35495374 -27316649 -12993328 -16884960 -27402779 -13531719 23017314
6192 23017314 46667443 40494659 28452259 33918051 43783977 36712814 28241536 53492599
6184 53492599 105828797 128294743 84600224 13112911 -18952072 -557774 19515893
6177 19515893 9933742 -4877653 3063472 15526539 1183955 -29989683 -43711092
6170 -43711092 -36539815 -34412017 -43582746 -42715837 -23747059 -2398590 16437480 44953173
6162 44953173 74157084 69794097 26523427 -9934029 -2521687 24371020 23502399 -7285185
6154 -7285185 -32032836 -36114289 -38885503 -50370644 -52478201 -31455161 -1544902 16117910
6146 16117910 20048705 21289286 20681198 6028964 -28389966 -65288593 -73791486 -41770073
6138 -41770073 4506471 25333113 12233501 -7588148 -11664608 -4702153 4074023 16459275
6130 16459275 23406467 -1223910 -58860098 -103530533 -92792300 -42927380 -2313516
6123 -2313516 11947135 16685224 20212167 17902005 17509619 26126810 21091075 -20896193
6115 -20896193 -71954327 -79328837 -42046806 -9944065 -3603202 8743875 43944367
6108 43944367 71771405 70235802 57633810 43645307 4166775 -60433857 -95451981
6101 -95451981 -65610179 -14287704 190196 -10819141 1311164 37252278 55184359
6094 55184359 41240046 19192982 3250546 -8250345 -4241149 24108436 50000942
6087 50000942 41479180 15182788 9320802 14172629 -11927306 -61673310 -78661142 -46874528
6079 -46874528 -17636896 -27513470 -45925984 -32165498 4053420 30812121 41940892
6072 41940892 43576341 27780872 -4719614 -22398498 706794 43872547 64539819
6065 64539819 50713156 24396981 5697951 -4518356 -15943833 -39209062 -75207327
6058 -75207327 -104049613 -99344813 -61993329 -21639004 2550975 19203256 35308085
6051 35308085 40045374 32826935 35718459 56427463 68464174 53314706 34181106 38499056
6043 38499056 52747037 47759518 26905540 13560347 9533429 3679327 5636077 29101798
6035 29101798 51932700 37376167 -7557076 -38423784 -40818193 -47155366 -74364625
6028 -74364625 -88035126 -54160121 4707163 36617695 26132870 2321572 -12128468
6021 -12128468 -29432516 -66849363 -110190871 -126201354 -105648572 -74970721 -59695094
6014 -59695094 -53809639 -40241827 -26013006 -30004695 -42630568 -32276487 3345368
6007 3345368 28273465 23994975 16741207 26431634 26404340 -9885121 -53901175 -60519082
5999 -60519082 -39952136 -38138593 -55572502 -43714776 11928675 60215900 55975221
5992 55975221 18646270 -7124525 -13142850 -17834769 -21944241 -11781400 5122242 1996148
5984 1996148 -28497713 -61419785 -70135079 -53281186 -25515555 4972500 38128614
5977 38128614 67072655 77168243 66681416 56037043 60786213 63022708 34285157
5970 34285157 -12818664 -28150072 7113472 47471034 43961213 8815431 -15008930
5963 -15008930 -23293444 -43981749 -76786521 -91895416 -86705206 -91219755 -108237001 -98609320
5955 -98609320 -45441283 10749090 27239306 14962646 11761608 27619542 43620835
5948 43620835 43358253 21162937 -20837373 -61748020 -68575064 -36775002 -4362123 -1959885
5940 -1959885 -9441728 9009132 44032631 50209512 10241552 -41358540 -61304681 -41319523
5932 -41319523 -5306006 18311402 14650780 -14290936 -53874348 -84571102 -89854278
5925 -89854278 -64721125 -23711430 6486677 14744246 18410269 32034781 35032991 205336
5917 205336 -51660477 -65235751 -24808357 24082934 39484461 30257516 21500183 14373024
5909 14373024 6032353 10398175 27239579 26200138 -3497851 -22475137 -30621 31249981
5901 31249981 27446176 8183217 21841000 58349489 61405209 19274422 -20488132
5894 -20488132 -29675555 -32367233 -46833642 -49008601 -16542776 30913795 57496102 49575841
5886 49575841 16848413 -18384413 -28120951 -3661495 25285941 26555897 13487331
5879 13487331 17309569 23117736 -8805602 -59488125 -60271665 -2844195 32555013 -4923446
5871 -4923446 -57359505 -47717999 7595856 38631654 31565589 27183041 34004201 15552168
5863 15552168 -38625630 -89878913 -106124786 -94741344 -72322537 -40824208 -4027988
5856 -4027988 22348600 26935443 11214839 -16590852 -39111750 -32953651 1707027 27822046
5848 27822046 15934805 -12233170 -16761218 -297675 3567474 -10531917 -18372252 -16456394
5840 -16456394 -22990830 -29159798 -3687576 44821836 63789822 33407357 -1432982
5833 -1432982 -56708 17786140 13894748 -9159291 -23667170 -20643161 -7429799 11097413
5825 11097413 21876820 3671452 -34496788 -46752281 -13620470 21167662 13458289
5818 13458289 -15961415 -22970421 -13316022 -17849739 -21169988 16198344 74027635 82499932
5810 82499932 24510053 -36312758 -47797606 -32092780 -32282525 -48798205 -60775181
5803 -60775181 -66065922 -63835746 -34130891 26940683 80712561 91455408 73683945
5796 73683945 59686779 46507397 15600357 -18403380 -27001855 -22211498 -40586878
5789 -40586878 -75903643 -79121057 -35069673 7553690 4446516 -22217146 -19482667 20370402
5781 20370402 51027306 34324778 -12651125 -39581534 -22150072 10783647 13538161
5774 13538161 -18688192 -44297501 -32625942 -6631093 -9810872 -45473436 -74999620
5767 -74999620 -70095271 -40324019 -10251023 4756442 -2029586 -27559701 -50219817
5760 -50219817 -43500970 -6915357 32164388 50772002 48358280 33614604 15056464
5753 15056464 5899032 14421904 25980325 18602909 -552159 -1905945 18175925 27025491
$$ [...]
##END NTUPLES=NMR SPECTRUM
##END=
