##TITLE=31Pdec_SR167Rrm
 , 24 sc
 20.3.2023
##JCAMPDX= 6.0         $$ Bruker NMR JCAMP-DX V2.0
##DATA TYPE= NMR SPECTRUM
##DATA CLASS= NTUPLES
##ORIGIN= UXNMR, Bruker Analytische Messtechnik GmbH
##OWNER= root
$$ XWIN-NMR		Version 3.5
$$ Mon Mar 20 15:51:34 2023 Russian Standard Time (UT+4h)  she@DPX200
##.OBSERVE FREQUENCY= 81.013821
##.OBSERVE NUCLEUS= ^31P
##.ACQUISITION MODE= SIMULTANEOUS
##.ACQUISITION SCHEME= undefined
##.AVERAGES= 24
##.DIGITISER RES= 16
##SPECTROMETER/DATA SYSTEM= spect
##.PULSE SEQUENCE= zgpg30
##.SOLVENT NAME= DMSO
##.SHIFT REFERENCE= (INTERNAL, DMSO, 0, 248.564)
##AUDIT TRAIL= $$ (NUMBER, WHEN, WHO, WHERE, WHAT)
$$ ##TITLE= Audit trail, XWIN-NMR		Version 3.5
$$ ##JCAMPDX= 5.01
$$ ##ORIGIN= Bruker BioSpin GmbH
$$ ##OWNER= she
$$ F:/spectra/data/she/nmr/P31/1/pdata/1/auditp.txt
$$ ##AUDIT TRAIL=  $$ (NUMBER, WHEN, WHO, WHERE, WHAT)
(   1,<2023-03-20 15:50:22.43 +0400>,<she>,<DPX200>,
      <created by zg, POWCHK disabled, PULCHK disabled
       configuration hash MD5:
       00 E9 B6 7A A2 85 ED C7 34 08 36 98 17 FE 4E 26
       data hash MD5: 32K
       14 0F 90 FF 77 C5 25 2F AF A3 B8 38 13 2E 6F 2C>)
(   2,<2023-03-20 15:50:24.90 +0400>,<she>,<DPX200>,
      <Start of raw data processing
       efp BC_mod = 2 LB = 1 FT_mod = 6 PKNL = 1 PHC0 = -10583.86 PHC1 = -752.39 SI = 64K 
       data hash MD5: 64K
       F6 D0 B0 17 D4 5D 6D 2C C7 68 E9 CF C9 39 55 40>)
(   3,<2023-03-20 15:50:38.65 +0400>,<she>,<DPX200>,
      <pk PHC0 = -5.324586 PHC1 = 0 
       data hash MD5: 64K
       88 FC 06 A9 FB 01 73 7E CE A5 F2 FA 1D 8C AC 3C>)
(   4,<2023-03-20 15:51:04.71 +0400>,<she>,<DPX200>,
      <pk PHC0 = -74.28016 PHC1 = 191.8001 
       data hash MD5: 64K
       81 25 40 9D 5B 88 B3 2F E8 58 4C 9E 4B ED ED C9>)
$$ ##END=
$$ 
$$ hash MD5
$$ 59 B2 34 FF 5E 84 56 06 FC 70 87 D9 70 5E DB D4
##$RELAX= 
##$RELAX= 
##$RELAX= 
##$RELAX= 
##$RELAX= 
##$RELAX= 
##$RELAX= 
##$RELAX= 
##$RELAX= 
$$ Bruker specific parameters
$$ --------------------------
##$DU= <F:/spectra>
##$EXPNO= 1
##$NAME= <P31>
##$PROCNO= 1
##$TYPE= <nmr>
##$USER= <she>
##$AMP= (0..31)
100 100 100 100 100 100 100 100 100 100 100 100 100 100 100 100 100 100 
100 100 100 100 100 100 100 100 100 100 100 100 100 100 
##$AQSEQ= 0
##$AQ_mod= 1
##$AUNM= <au_zg>
##$AUTOPOS= <>
##$BF1= 81.014009
##$BF2= 200.13
##$BF3= 200.13
##$BF4= 200.13
##$BF5= 200.13
##$BF6= 200.13
##$BF7= 200.13
##$BF8= 200.13
##$BYTORDA= 1
##$CFDGTYP= 0
##$CFRGTYP= 5
##$CHEMSTR= <none>
##$CNST= (0..31)
1 1 145 1 1 1 1 1 1 1 1 1 1 1 1 1 1 1 1 1 1 1 1 1 1 1 1 1 1 1 1 1 
##$CPDPRG= <waltz16>
##$CPDPRG1= <>
##$CPDPRG2= <waltz16>
##$CPDPRG3= <>
##$CPDPRG4= <mlev>
##$CPDPRG5= <mlev>
##$CPDPRG6= <mlev>
##$CPDPRG7= <mlev>
##$CPDPRG8= <mlev>
##$CPDPRGB= <>
##$CPDPRGT= <>
##$D= (0..31)
0 1 0 0 0 0 0 0 0 0 0 0.03 2e-05 3e-06 0 0 0 0 0 0 0 0 0 0 0 0 0 0 0 0 
0 0 
##$DATE= 1679313021
##$DBL= (0..7)
120 120 120 11 120 120 24 19 
##$DBP= (0..7)
150 150 150 150 150 150 150 150 
##$DBP07= 0
##$DBPNAM0= <>
$$ [...]
##$SUBNAM2= <"">
##$SUBNAM3= <"">
##$SUBNAM4= <"">
##$SUBNAM5= <"">
##$SUBNAM6= <"">
##$SUBNAM7= <"">
##$SUBNAM8= <"">
##$SUBNAM9= <"">
##$SW= 501.771253377433
##$SWIBOX= (0..15)
0 1 3 0 0 0 0 0 0 0 0 0 0 0 0 0 
##$SW_h= 40650.406504065
##$TD= 32768
##$TD0= 1
##$TE= 0
##$TE2= 300
##$TE3= 300
##$TEG= 300
##$TL= (0..7)
0 120 53 12 22 120 120 120 
##$TP= (0..7)
150 150 150 150 150 150 150 150 
##$TP07= 0
##$TPNAME0= <>
##$TPNAME1= <>
##$TPNAME2= <>
##$TPNAME3= <>
##$TPNAME4= <>
##$TPNAME5= <>
##$TPNAME6= <>
##$TPNAME7= <>
##$TPOAL= (0..7)
0.5 0.5 0.5 0.5 0.5 0.5 0.5 0.5 
##$TPOFFS= (0..7)
0 0 0 0 0 0 0 0 
##$TUNHIN= 0
##$TUNHOUT= 0
##$TUNXOUT= 0
##$USERA1= <user>
##$USERA2= <user>
##$USERA3= <user>
##$USERA4= <user>
##$USERA5= <user>
##$V9= 5
##$VALIST= <valist>
##$VCLIST= <CCCCCCCCCCCCCCC>
##$VD= 0
##$VDLIST= <DDDDDDDDDDDDDDD>
##$VPLIST= <PPPPPPPPPPPPPPP>
##$VTLIST= <TTTTTTTTTTTTTTT>
##$WBST= 1024
##$WBSW= 4
##$XGAIN= (0..3)
0 0 0 0 
##$XL= 0
##$YL= 0
##$YMAX_a= 660
##$YMIN_a= -791
##$ZGOPTNS= <>
##$ZL1= 120
##$ZL2= 120
##$ZL3= 120
##$ZL4= 120
##$ABSF1= 0
##$ABSF2= 0
##$ABSG= 0
##$ABSL= 0
##$ALPHA= 0
##$AQORDER= 0
##$ASSFAC= 0
##$ASSFACI= 0
##$ASSFACX= 0
##$ASSWID= 0
##$AUNMP= <proc_1d>
##$AZFE= 0.1
##$AZFW= 0.5
##$BCFW= 0
##$BC_mod= 2
##$BYTORDP= 0
##$COROFFS= 0
##$CY= -3
##$DATMOD= 1
##$DC= 0
##$DFILT= <>
##$DTYPP= 0
##$F1P= 0
##$F2P= 0
##$FCOR= 1
##$FTSIZE= 65536
##$FT_mod= 6
##$GAMMA= 0
##$GB= 0
##$INTBC= 1
##$INTSCL= 6.047779e-11
##$ISEN= 30
##$LB= 1
##$LEV0= 0
##$LPBIN= 0
##$MAXI= 10000
##$MC2= 0
##$MEAN= 0
##$ME_mod= 0
##$MI= 50
##$NCOEF= 0
##$NC_proc= -11
##$NLEV= 6
##$NOISF1= 182.463
##$NOISF2= 159.3651
##$NSP= 0
##$NTH_PI= 0
##$NZP= 0
##$OFFSET= 248.5645
##$PC= 4
##$PHC0= -10663.46
##$PHC1= -560.5899
##$PH_mod= 1
##$PKNL= yes
##$PPARMOD= 0
##$PSCAL= 0
##$PSIGN= 0
##$REVERSE= no
##$SF= 81.0140089999694
##$SI= 65536
##$SIGF1= 159.3651
##$SIGF2= -187.1042
##$SINO= 113.3802
##$SIOLD= 16384
##$SREGLST= <1H.CDCl3>
##$SSB= 0
##$STSI= 65536
##$STSR= 0
##$SW_p= 40650.406504065
##$SYMM= 0
##$S_DEV= 0
##$TDeff= 32768
##$TDoff= 0
##$TI= <>
##$TILT= no
##$TM1= 0
##$TM2= 0
##$TOPLEV= 0
##$USERP1= <user>
##$USERP2= <user>
##$USERP3= <user>
##$USERP4= <user>
##$USERP5= <user>
##$WDW= 1
##$XDIM= 65536
##$YMAX_p= 364733459
##$YMIN_p= -30504656
$$ End of Bruker specific parameters
$$ ---------------------------------
##NTUPLES= NMR SPECTRUM
##VAR_NAME=  FREQUENCY,     SPECTRUM/REAL,   SPECTRUM/IMAG
##SYMBOL=    X,             R,               I
##VAR_TYPE=  INDEPENDENT,   DEPENDENT,       DEPENDENT
##VAR_FORM=  AFFN,          ASDF,            ASDF
##VAR_DIM=   65536,         65536,           65536
##UNITS=     HZ,            ARBITRARY UNITS, ARBITRARY UNITS
##FACTOR=    0.620285442955139, 1,           1
##FIRST=     20137.2065510682, 0,            0
##LAST=      -20513.1999529968, 0,           0
##MIN=       -20513.1999529968, -30504656,   0
##MAX=       20137.2065510682, 364733459,    0
$$ Real data points
##PAGE= N=1
##DATA TABLE= (X++(R..R)), XYDATA
$$ [...]
45748 1452902 709330 -1534584 -3000048 -2316747 -509580 475248 -164037 -1795832 -3342516
45739 -3342516 -4149703 -4345289 -4578693 -5180771 -5752515 -5885109 -5773007 -5554480 -4769293
45730 -4769293 -3384047 -2573843 -3199849 -4203213 -4097124 -3470480 -4075844 -5770712 -6609391
45721 -6609391 -6015901 -5446297 -5467189 -4766242 -3053173 -2353573 -3739219 -4978455 -3612167
45712 -3612167 -758254 481114 -681100 -2347917 -3205075 -3793826 -4604275 -5032052 -4712917
45703 -4712917 -4354321 -4596244 -5013252 -4778318 -3771436 -2737283 -2600162 -3590074 -4900848
45694 -4900848 -5514401 -5423808 -5412612 -5557948 -4999997 -3571315 -2461520 -2596409 -3482684
45685 -3482684 -4338626 -5078277 -5394222 -4453393 -2668194 -2080539 -3399385 -4316571 -2775418
45676 -2775418 -373619 -76175 -1860400 -3498081 -4643076 -6726040 -9153789 -9381294
45668 -9381294 -7332400 -6119791 -7063246 -7381794 -4873386 -1896160 -1861372 -3916836 -4414294
45659 -4414294 -2544088 -1127997 -1860143 -2863787 -1976505 -152641 39035 -1962501 -4270849
45650 -4270849 -5260084 -5171539 -4851860 -4250961 -3043842 -1877592 -1657176 -1810678 -781452
45641 -781452 1375722 2445612 1117066 -724697 -311726 2244630 4215184 3783052 1537885
45632 1537885 -1267182 -3932363 -5582522 -5228177 -3358617 -2020464 -2484347 -3903156
45624 -3903156 -4821893 -4863187 -4374321 -3598098 -2868479 -2625536 -2691115 -2488342 -2288913 -3017436
45614 -3017436 -4485211 -5307269 -5107344 -5159943 -6052708 -6468036 -5450049 -4177898 -3949248
45605 -3949248 -3918622 -2727153 -1202462 -1274090 -2824494 -3729203 -2892133 -1437812 -819476
45596 -819476 -1278468 -2305927 -3232630 -3135557 -1429026 1048279 2469646 1891240 57724
45587 57724 -1705987 -2710854 -3018052 -3066575 -3288207 -3640425 -3667528 -3391289 -3583634 -4465876
45577 -4465876 -4812351 -3428475 -1024670 642664 1151525 1490690 1896951 1310515 -617387
45568 -617387 -2542303 -3287372 -3476991 -4274803 -5392377 -5609866 -4842838 -4374534 -4911382
45559 -4911382 -5533769 -5190007 -4469418 -4844540 -6262075 -6648148 -4457057 -924742 1248932
45550 1248932 1089746 52320 -355914 -281069 -520003 -1135284 -1771353 -2303506 -2473387
45541 -2473387 -1913467 -1252958 -1986352 -4234170 -5857574 -5119822 -3114260 -1989649 -1839967
45532 -1839967 -1366436 -851530 -1962888 -4550390 -6036643 -4761208 -2150468 -709053
45524 -709053 -1282954 -3118482 -5274954 -6938148 -7334216 -6414339 -5102314 -4224832 -3805811
45515 -3805811 -3856126 -4887394 -6800569 -8100227 -7409811 -5433654 -4238632 -4508298 -4604308
45506 -4604308 -2965006 -684379 -546117 -3423052 -6827419 -7865008 -6690862 -5601696
45498 -5601696 -5320050 -4347817 -2204133 -795022 -1368251 -2402295 -2375015 -2542937 -4444265
45489 -4444265 -6374329 -5598186 -3120872 -2688869 -5151467 -7304104 -6838859 -5111707 -4009093
45480 -4009093 -3246028 -2278854 -2066375 -3047404 -3705352 -3061845 -2538573 -3427762 -4470426
45471 -4470426 -4014571 -2826510 -2598864 -3209714 -3633767 -4117243 -5153892 -5612516 -4327428
45462 -4327428 -2524605 -2281098 -3471468 -4538258 -5239828 -6033320 -5747243 -3023848 341387
45453 341387 787081 -2045625 -4706647 -4786814 -3520550 -2799322 -2439074 -1737882 -1343296
45444 -1343296 -1936552 -2823472 -3260731 -3660163 -4243933 -4070402 -2740490 -1624341 -1959028
45435 -1959028 -3008172 -3546375 -3895255 -4802195 -5374563 -4135524 -1641123 -132916 -606533
45426 -606533 -1850810 -2615684 -3228521 -4361391 -5245819 -4234366 -1076098 2088208 2535253
45417 2535253 -196487 -3700187 -5290750 -4790861 -4083465 -4322338 -4816002 -4771876 -4738457
45408 -4738457 -5541614 -6785009 -7392075 -7053885 -6245897 -5240805 -4036210 -3084073 -3176831
45399 -3176831 -4363279 -5502345 -5309441 -3828289 -2597462 -3027343 -4666100 -5715720
45391 -5715720 -5516159 -5531082 -6987559 -8540379 -7898516 -5241753 -3030901 -2422313 -2019909
45382 -2019909 -726754 315783 -247360 -1829426 -3131185 -4019373 -4761248 -4807192 -3965879
45373 -3965879 -3567409 -4669281 -6077307 -5955289 -4561778 -3549608 -3353682 -3290695 -3543727
45364 -3543727 -4740953 -5949765 -5538742 -3996147 -3410922 -3937254 -3430174 -1284668 77160
45355 77160 -1102718 -3138574 -3623600 -2950147 -2965285 -3666831 -3728503 -3389667 -4180190 -5940976
45345 -5940976 -6567519 -5168931 -3457745 -3191906 -3843835 -3858898 -3068614 -2683282 -3514081
45336 -3514081 -5157623 -6574983 -6794999 -5477030 -3492925 -2557188 -3468254 -4969174 -5195386
45327 -5195386 -4078027 -3300008 -3788089 -4387705 -3576667 -1571904 76780 312190 -925098
45318 -925098 -3401193 -6523377 -8797440 -8812711 -7100934 -5772253 -5766529 -5669982 -4085078
45309 -4085078 -2000343 -1458546 -2593114 -3587651 -3434862 -3178976 -4018795 -5414584 -5853091
45300 -5853091 -4831022 -3396474 -3001202 -4162611 -5979049 -6794572 -5745643 -3826156
45292 -3826156 -2948202 -3728410 -4767107 -4502507 -3195345 -2395135 -2789406 -3472327 -3437313
45283 -3437313 -2961801 -2958045 -3420298 -3317138 -2078555 -523132 41588 -810378 -2545790
45274 -2545790 -4479792 -6009134 -6407064 -5328432 -3552298 -2409691 -2356770 -2820619 -3360349
45265 -3360349 -3926326 -3964298 -2695821 -692883 351506 93373 88812 882595 552505
45256 552505 -2072169 -4676732 -4577722 -3137235 -3755903 -6162197 -6548395 -3769209 -1455637
45247 -1455637 -2415477 -4460411 -4259855 -2481631 -1953737 -2708288 -2428627 -901990 -484453
45238 -484453 -2055841 -3574191 -3358016 -2349588 -2156737 -2821790 -3572229 -4123623 -4147550
45229 -4147550 -2922282 -760265 440784 -550106 -2427549 -3155558 -2875913 -3341197 -4835842
45220 -4835842 -5601568 -4680582 -3547795 -3870637 -4941327 -4828166 -3399702 -2486949 -3029925
45211 -3029925 -3737193 -3223596 -2075858 -1677386 -1995312 -1964351 -1514443 -1659842 -2661531
45202 -2661531 -3565404 -3782471 -3817906 -4071718 -4154346 -3888871 -3817301 -4093240 -3978718 -3142135
45192 -3142135 -2368489 -2169384 -1787087 -609476 405410 -65038 -1786360 -3396551 -4139105
45183 -4139105 -4099665 -3419447 -2502881 -2410569 -3750432 -5631161 -6873957 -7621672 -8443030
45174 -8443030 -8675366 -7447323 -5739368 -5323483 -5925663 -5711597 -4615595 -4681469 -6564822
45165 -6564822 -8245440 -8287121 -7935152 -8354260 -7988398 -4940893 -488005 2207732 2021893
45156 2021893 278257 -2002725 -4731691 -6876869 -6689381 -4405506 -2433909 -1902286
45148 -1902286 -1098123 1304663 3410594 2602385 -327299 -2052528 -1441246 -859800 -2116944
45139 -2116944 -3436787 -2138097 1169816 3230415 2419205 211179 -1722286 -3644880
45131 -3644880 -6027437 -7627683 -7090485 -5369802 -4563334 -4780613 -4176072 -2169103 -626233
45122 -626233 -1121096 -2665660 -3290178 -2725644 -2309734 -3024023 -4780509 -7015189 -8782935
45113 -8782935 -8774415 -6635937 -4118176 -3520012 -4825763 -5701263 -4748938 -3444804 -3938159
45104 -3938159 -5950826 -7190741 -6427619 -4775394 -3804592 -3657146 -3641752 -3675464 -4055469
45095 -4055469 -4299193 -3491800 -1901551 -1099530 -1889563 -2970435 -2540152 -768363 322104
45086 322104 -628433 -2828505 -4566719 -5125331 -4966665 -4569686 -3839082 -2658534 -1487362
45077 -1487362 -1102091 -1840515 -3240354 -4409207 -4698081 -4098525 -3184981 -2705826 -2933991
45068 -2933991 -3201880 -2429566 -590280 665951 -335596 -3061278 -5168942 -5397285 -4965532
45059 -4965532 -5438382 -6277636 -5747203 -3694900 -2062911 -2587290 -4959777 -7382299 -8200697
45050 -8200697 -6967358 -4652753 -2987830 -3081434 -4552683 -6210345 -7233418 -7315121 -6301039
45041 -6301039 -4509709 -2939023 -2254504 -1983584 -1574959 -1607103 -2749745 -4188725 -4676448
45032 -4676448 -4691944 -5660920 -7200228 -7343828 -5866328 -5097910 -6420744 -7919702 -6998094
45023 -6998094 -3959574 -1461530 -1266818 -2822360 -4440990 -4852926 -4063979 -3377732 -4015673
45014 -4015673 -5361248 -5549447 -4175658 -3011282 -3278025 -3783837 -3017794 -1688789 -1530348
45005 -1530348 -2563759 -3297830 -3100380 -2783754 -3088505 -3836016 -4363604 -3896758 -2011108
44996 -2011108 383753 1299888 3092 -1725851 -1868523 -807310 -267485 -572621 -792860
44987 -792860 -994871 -2265431 -4565633 -6386233 -6736367 -6051827 -5045698 -3939522 -2830756
44978 -2830756 -1695921 -279211 933804 374015 -2363116 -4746402 -4086423 -1728140
44970 -1728140 -1805090 -5505799 -9243257 -9439963 -6718447 -3982239 -2443781 -1402934 -525379
44961 -525379 -327282 -941038 -1842575 -2566322 -2861346 -2555277 -1862484 -1291027 -854762 -163694
44951 -163694 372481 -420194 -2569525 -4203315 -3665090 -1578677 66136 171791 -918199
44942 -918199 -2401958 -3674192 -4501256 -5202091 -6154512 -6734083 -5641991 -2954092 -914070
44933 -914070 -1689102 -4860281 -7935164 -8890570 -7590705 -5281757 -3418591 -2603929 -2185160
44924 -2185160 -1276424 -273063 -458217 -1907225 -3093488 -3189612 -3346749 -4667604 -6259075
44915 -6259075 -6709215 -6377828 -6500622 -6784508 -5827331 -3683403 -2135602 -2170365 -2758875
44906 -2758875 -2679363 -2266720 -2519468 -3254745 -3131034 -1482495 436264 505003 -1773138
44897 -1773138 -4235786 -4294102 -2168562 -793060 -2066337 -4432894 -5190337 -4164156 -3581771
44888 -3581771 -4742622 -6416672 -6782944 -5779864 -4969661 -5624178 -7374256 -8653361 -8399150
44879 -8399150 -7171889 -6219036 -5657109 -4559209 -2956473 -2339505 -3390181 -4546961 -4082432
44870 -4082432 -2539229 -1582734 -1296065 -473941 815887 995383 -495752 -2208227 -2831772
44861 -2831772 -2942206 -3740913 -4989805 -5219071 -3759055 -1893387 -1729711 -3909729 -6664323
44852 -6664323 -7621533 -6477172 -5044984 -4622749 -4676681 -4660614 -5380896 -7153657 -8140866
44843 -8140866 -6601933 -3893115 -2982736 -4396473 -5818214 -5569235 -4298048 -3092977
44835 -3092977 -2106489 -1566697 -2208823 -3921860 -5432024 -5915768 -5674864 -4993270 -3799692
44826 -3799692 -2644845 -2391040 -2731478 -2699138 -2671754 -3786272 -5225430 -4637634 -1898697
44817 -1898697 158515 -236045 -1650159 -2529109 -3566698 -5249759 -5905495 -4652639 -3822866
44808 -3822866 -5577529 -8156121 -8532093 -6981868 -5699953 -4554405 -2153103 -12658
44800 -12658 -1179341 -4772437 -6328971 -4370781 -2481474 -3382853 -4835759 -3764634 -1281410
44791 -1281410 -654883 -2373100 -4143189 -4558414 -4182300 -3700624 -3203751 -2963382 -3188813
44782 -3188813 -3255521 -2509974 -1479818 -1126406 -1364598 -1426877 -1184646 -1050439 -1109699 -1343965
44772 -1343965 -2085637 -3273523 -4022871 -3967101 -4068501 -4860138 -5050791 -3618268 -2194932
44763 -2194932 -3001023 -4982746 -4793769 -1869819 255179 -1182543 -4299697 -5303132
44755 -5303132 -3552080 -1833548 -2185612 -3320971 -2548429 751872 4155646 4603725 1624233
44746 1624233 -2169567 -4057291 -4072234 -4033179 -4412863 -3915136 -2172024 -797413 -933134
44737 -933134 -1559427 -1469911 -1280375 -1864844 -2270637 -1320921 -289963 -1491276 -4524688
44728 -4524688 -6443004 -5913349 -4808147 -4895415 -5234536 -4287639 -2807900 -2703796 -4053897
44719 -4053897 -5168238 -5184087 -4858885 -4806596 -4503595 -3436243 -2071078 -1141643 -775286
44710 -775286 -816607 -1348294 -2349834 -3337949 -3904764 -4274796 -4803466 -5206722 -4910294 -4055852
44700 -4055852 -3489834 -3627163 -3951226 -3967645 -4060372 -4749887 -5445251 -4832391 -2643139 -275039
44690 -275039 770591 532004 161656 263446 301392 -452095 -1940140 -3375747 -3979003
44681 -3979003 -3681094 -3289799 -3777120 -5153568 -6303245 -6240614 -5194655 -4053130 -3193840
44672 -3193840 -2523110 -2253619 -2682510 -3311393 -3198848 -2340127 -1758827 -1898947 -1801825 -468907
44662 -468907 1545899 2566089 1607567 -647997 -2617672 -3373180 -3442053 -3953438 -4981178
44653 -4981178 -5317676 -4317149 -3159597 -3265936 -4121572 -4178837 -3569321 -3979647 -5594226
44644 -5594226 -6258513 -4650892 -2502752 -2265854 -3916041 -5579935 -6227604 -6055011 -4996571
44635 -4996571 -2737818 13726 1858172 2339189 2075116 1421830 261030 -968752 -1375815
44626 -1375815 -982236 -915429 -1925147 -3475425 -4460198 -4172940 -2622720 -612512 617360
44617 617360 617384 458538 1377836 2862330 3113066 1434672 -884900 -2308366 -2745120 -3121164
44607 -3121164 -3921468 -4658846 -4615675 -3918506 -3707314 -4796126 -6217689 -6081890 -4243974
44598 -4243974 -2854051 -3421524 -4726263 -4975014 -4598069 -4932990 -5316010 -4089496 -1988005
44589 -1988005 -1709529 -3920118 -6245665 -6730436 -5915599 -4892858 -3764988 -2926584 -3392259
44580 -3392259 -4609711 -4327245 -2176565 -1082617 -3172503 -6374872 -7407612 -6373536
44572 -6373536 -5703511 -5843370 -4988135 -2541544 9513 1608392 2429555 2024671 -647651
44563 -647651 -4530926 -6188315 -3713828 533088 2518756 953422 -2016604 -3740313
44555 -3740313 -3440916 -2072842 -1049439 -1272863 -2600245 -3882672 -3927115 -2742716 -1610187
44546 -1610187 -1627473 -2411165 -2721282 -2260024 -2058828 -2815803 -3790705 -4088316 -4121110 -4581883
44536 -4581883 -4730915 -3443796 -1625598 -1519085 -3380633 -4919006 -4664370 -3813612 -3717706
44527 -3717706 -3625156 -2481656 -1206876 -1291034 -2441159 -3476762 -4368257 -5409895 -5477574
44518 -5477574 -3427844 -585148 472080 -669078 -2132771 -2796663 -3289202 -3978298 -4190322
44509 -4190322 -3821180 -3785783 -4330291 -4573165 -4234409 -4227140 -4938330 -5381767 -4748572 -3600651
44499 -3600651 -2912840 -2918441 -3311902 -3679874 -3543121 -2890553 -2559280 -2953548 -2776758 -713940
44489 -713940 1877980 2113796 -381342 -2860634 -3449285 -3323584 -3838580 -3956220 -2377335
44480 -2377335 -296262 202356 -770164 -1615985 -2163747 -3595995 -5773224 -6765390 -5406335
44471 -5406335 -2844506 -1110258 -1103465 -2262678 -3428168 -3720235 -3007055 -1723773 -291050
44462 -291050 895246 965748 -901689 -3968626 -6002793 -5733642 -4353462 -3597168 -3309499
44453 -3309499 -2326862 -1009149 -1006036 -2515514 -3508465 -2280431 356646 2074157 1518970
44444 1518970 -648816 -2673922 -3310321 -2874765 -2846467 -4116544 -5818949 -6498721 -6186124
44435 -6186124 -6252686 -7090089 -7237410 -5609411 -3519726 -3093731 -4120773 -4175933 -2228670
44426 -2228670 -507171 -1572293 -4654044 -6678809 -6529155 -6187700 -7244359 -8414756
44418 -8414756 -7858906 -6256765 -5632066 -6185900 -6459644 -6045759 -5800358 -5496299 -3762007
44409 -3762007 -859744 812788 -8468 -1677321 -2327926 -2513573 -3646972 -5329377 -6001882
44400 -6001882 -5250646 -3855551 -2365855 -1133738 -992183 -2316137 -3944275 -4461711 -4035734
44391 -4035734 -3646502 -3211886 -2132522 -1169319 -1880644 -4229256 -6383367 -6985006 -6238039
44382 -6238039 -4853191 -3451447 -2950276 -3809783 -4726965 -3869134 -1778152 -1144319 -2955505
44373 -2955505 -4803674 -4301582 -2511151 -2165832 -3580673 -4451176 -3440919 -1981236 -2051489
44364 -2051489 -3651671 -5305862 -6139980 -6498342 -6907085 -7295920 -7250412 -6475882 -4978137
44355 -4978137 -3264211 -2373443 -3056146 -4654820 -5470948 -4773816 -3822204 -4101983 -5128484
44346 -5128484 -5192877 -3999366 -3047773 -3210396 -3537396 -3159172 -2852689 -3517114 -4271030
44337 -4271030 -3615687 -1871136 -927460 -1732122 -3282358 -4169793 -4149757 -4015887 -4538181
44328 -4538181 -5600049 -6141579 -5287918 -3685653 -2904049 -3154118 -2797987 -877410 1263766
44319 1263766 2081293 2070765 2170578 1364249 -1672577 -5474330 -7203265 -6809007 -6724428
44310 -6724428 -7320583 -6129456 -2638107 -388876 -2074550 -5229402 -5655788 -3325292
44302 -3325292 -1733910 -2377707 -3203772 -2626138 -1974612 -2782998 -3916977 -3226022 -948687
44293 -948687 305047 -1166406 -4111269 -5816104 -4901575 -2273726 158745 1077923 273498
44284 273498 -1565085 -3165381 -3394086 -2363234 -1535577 -2055474 -3196138 -3226415 -1665511
44275 -1665511 227491 1195372 1167757 466772 -1037752 -3246542 -5072405 -5326047 -4191838
44266 -4191838 -3172159 -3507683 -4959449 -6187475 -6175006 -5174351 -4190355 -3737321 -3604567
44257 -3604567 -3818302 -4910783 -6772857 -8216027 -8488695 -8261880 -8071235 -6968747 -4387958
44248 -4387958 -2278568 -2994482 -5483510 -6231296 -4206090 -2227264 -2720855 -4656299 -5799902
44239 -5799902 -5621494 -4570088 -2788367 -1328538 -2432018 -6271532 -9184493 -7830433
44231 -7830433 -3932379 -2146449 -3950099 -6455836 -7047296 -6301049 -5787181 -5537023 -4946786
44222 -4946786 -4455796 -4852997 -5768393 -6052273 -5374419 -4630635 -4643140 -4864640 -3892955 -1563780
44212 -1563780 87615 -938535 -3676030 -5173202 -4610764 -4277278 -5535161 -6327793 -4674723
44203 -4674723 -2386327 -2394029 -3940731 -3851492 -1811183 -686131 -1532267 -1988933 -580540
44194 -580540 746612 2136 -1735160 -2579700 -2929817 -3963023 -4706410 -3221885 -37438
44185 -37438 1861464 511807 -3021422 -6178073 -7376664 -6896853 -6101368 -6025670 -6529695
44176 -6529695 -6804377 -6410413 -5339490 -3576119 -1671528 -1228887 -3063679 -5020370 -3893234
44167 -3893234 -63765 2207555 363158 -2900006 -3565858 -1789750 -903282 -2230144
44159 -2230144 -3777379 -3729454 -2617875 -1743125 -1536849 -1944867 -2733784 -2991243 -1847685
44150 -1847685 -107931 277721 -1208149 -3016080 -3901502 -4348752 -4896338 -4695534 -3096789
44141 -3096789 -1500709 -1936219 -4236648 -6135584 -6147173 -5065908 -4353134 -4190143 -3818147
44132 -3818147 -3075389 -2663500 -3017998 -3658849 -3835769 -3297121 -2180551 -690904 608205
44123 608205 662206 -1027636 -3308661 -4296576 -3640198 -2931880 -3390860 -4163205 -3854557
44114 -3854557 -2885208 -2885067 -4071701 -4847317 -4307629 -3669887 -4357701 -5774970 -6189625 -5216687
44104 -5216687 -4082286 -3569093 -3106460 -2316174 -2175992 -3583547 -5515032 -6009107 -4881813
44095 -4881813 -4053939 -4732887 -5584957 -4742605 -2673553 -1562376 -2178751 -2959403 -2459148
44086 -2459148 -1279722 -858576 -1447856 -2241709 -2772915 -3211638 -3759175 -4640518 -6255907
44077 -6255907 -8314143 -9131368 -7105352 -3122503 -332509 -840524 -3355494 -4892852
44069 -4892852 -4282159 -2977455 -2542749 -2593400 -1863157 -379586 619530 625172 356433 118933
44059 118933 -895835 -2862404 -4171948 -3426078 -1711806 -1184164 -1853493 -1766089 -425880
44050 -425880 126552 -1550075 -3924062 -4547959 -3210258 -1678851 -1223459 -1742175 -2716253
44041 -2716253 -3711801 -4202965 -3902507 -3127740 -2298010 -1559695 -1344177 -2336844 -4101587
44032 -4101587 -4825756 -3624320 -2137898 -2388589 -3843356 -4321942 -3334487 -2632795 -3448030
44023 -3448030 -4906725 -5558177 -5146749 -4435584 -4204079 -4644484 -5065145 -4397349 -2784722
44014 -2784722 -2054148 -3344805 -4957110 -4397618 -2194817 -1434688 -3277448 -5245219 -4827229
44005 -4827229 -2797119 -1686183 -2452572 -4017862 -5089151 -5231007 -4763114 -4402495 -4481726
43996 -4481726 -4249937 -2866696 -1189881 -1151413 -3026476 -4979803 -5825809 -6278124 -6642676
43987 -6642676 -5605050 -2896028 -985400 -1901651 -4073353 -4816128 -4512143 -5397127 -7176900
43978 -7176900 -7252380 -5279555 -4212614 -5956788 -8653239 -9467239 -7950158 -5454531 -3131240
43969 -3131240 -1814164 -2170665 -3482935 -3711139 -2262733 -1339579 -2825321 -5096656 -5122957
43960 -5122957 -2985879 -1781147 -2977127 -4399631 -3776721 -2160738 -2074755 -3558460 -4246651
43951 -4246651 -3123331 -2077892 -3017033 -5032409 -5782276 -4790710 -3744661 -3681135 -3517139
43942 -3517139 -1937632 499713 2097209 2111096 1149737 -34514 -1145168 -1964807 -2378526
43933 -2378526 -2821593 -3851640 -5069913 -5196743 -3630556 -1508534 -757417 -2083381 -4045209
43924 -4045209 -4304437 -2084240 653362 1015629 -1677413 -5207940 -7154746 -7282405 -6625551
43915 -6625551 -5481494 -3802174 -2717866 -3603575 -5648589 -6295177 -4547992 -2136061
43907 -2136061 -770132 -47618 834500 1024563 -536866 -2705313 -3220682 -1871939 -732544
43898 -732544 -1184858 -2405469 -3178383 -3574863 -3983008 -3842786 -2671256 -1516427 -1850316
43889 -1850316 -3235665 -3584105 -2001056 -31590 562949 39639 -381057 -760496 -2000780
43880 -2000780 -3656394 -4133432 -3263027 -2766988 -3499591 -4126844 -3687102 -3526390 -4807299
43871 -4807299 -5732748 -3896555 -534602 555854 -1660137 -4115732 -4238680 -3100233
43863 -3100233 -2761370 -3055729 -2891620 -2705015 -3328068 -3818251 -2798075 -1090704 -689434
43854 -689434 -1581611 -1902600 -1154849 -984696 -2322828 -3774649 -3736281 -2581045 -1708825
43845 -1708825 -1536077 -1524972 -1488368 -1754380 -2270329 -2443157 -2028637 -1657542 -2105495 -3144068
43835 -3144068 -3588681 -2870506 -2155361 -2961459 -4687055 -4859228 -2493480 114663 174073
43826 174073 -2040430 -3930574 -4132818 -3543030 -3171554 -2956846 -2841673 -3157989 -3461138
43817 -3461138 -2642068 -857465 155727 -524088 -1682316 -1956138 -1824313 -2419468 -3391945
43808 -3391945 -3366104 -2025165 -537081 -72852 -730394 -1788919 -2437746 -2387922 -2093083
43799 -2093083 -2151920 -2506387 -2833092 -3589923 -5485782 -7690606 -8068273 -5963621 -3383467
43790 -3383467 -2363236 -2493279 -2404372 -2374190 -3504896 -5119976 -5211044 -3393672 -1462310
43781 -1462310 -787100 -924402 -1209239 -1976993 -3378118 -4402500 -4177959 -3311997 -2932785
43772 -2932785 -3070252 -2932725 -2281819 -1573295 -1005937 -360118 217737 86086 -953992
43763 -953992 -2146331 -2631369 -2506748 -2539518 -2946797 -3143300 -2916653 -3051691 -4052059
43754 -4052059 -4913027 -4401107 -3227563 -3330242 -4834175 -5577784 -4384693 -2861774 -2590185
43745 -2590185 -2436853 -823108 774775 -567775 -4617636 -7826781 -7988891 -6481784
43737 -6481784 -5311886 -4441788 -3169345 -2016529 -1743430 -1998325 -2307587 -3158099 -4860040
43728 -4860040 -6423001 -6663837 -5479520 -3288548 -524153 1550253 1225578 -1259263
43720 -1259263 -3351259 -3512392 -3092861 -3355115 -2902737 -528473 1475933 272456 -2572501
43711 -2572501 -2990589 -834190 -274274 -3221436 -6349559 -6222668 -3946221 -2556450 -2597678
43702 -2597678 -2836178 -3177735 -4085236 -4570222 -3472928 -1807497 -1416598 -2077161 -2285470
43693 -2285470 -2161191 -2948574 -4043321 -3394305 -1098929 189268 -766596 -1969497 -1623110
43684 -1623110 -1076908 -2432211 -4878172 -5703476 -4148312 -2065181 -964229 -435597 154308
43675 154308 199914 -952718 -2537354 -3298883 -3322360 -3711760 -4533585 -4335290 -2294822
43666 -2294822 95067 646411 -533143 -1056310 381517 2042633 1588092 -654157 -2507835
43657 -2507835 -3353473 -4510472 -6124524 -6196459 -3918949 -1787668 -2305741 -4081091 -3765205
43648 -3765205 -1096909 827603 269760 -1146051 -1872361 -2864170 -4829921 -5723303 -3762465
43639 -3762465 -1258904 -2122132 -6080911 -8636244 -7118463 -3812028 -2053208 -1982375 -1965061
43630 -1965061 -2002552 -3199041 -4996427 -5496899 -4291240 -2885014 -2240615 -1722457 -793006
43621 -793006 -67889 -24942 -28514 509200 1008017 642002 -371557 -1268289 -1934770 -2697482
43611 -2697482 -3289775 -3015665 -1948778 -1143665 -1347926 -2005666 -1941099 -816160 501021
43602 501021 1063126 966081 1002429 1382561 1392651 486761 -890776 -2009471 -2825724 -3585803
43592 -3585803 -3930098 -3360208 -2430089 -2400540 -3531680 -4657738 -4770793 -4168600 -3638186
43583 -3638186 -3363961 -3221784 -3377619 -3820054 -3858391 -2957357 -1822197 -1899846 -3816028
43574 -3816028 -6730338 -9098362 -9759678 -8618071 -6734363 -5505711 -5298445 -5099579 -3872440
43565 -3872440 -1908842 -412036 -171630 -1225807 -3365645 -6090387 -8239021 -8626077
43557 -8626077 -7287604 -5519826 -4503878 -4301911 -4219063 -3661586 -2612810 -1772458 -2225052
43548 -2225052 -4314401 -6676052 -7100967 -4882167 -1900204 -784884 -2108427 -3937039
43540 -3937039 -4280532 -3464486 -3495867 -5168087 -6646988 -5645143 -2574264 -392523 -1066872
43531 -1066872 -3259786 -4267222 -3401447 -2282575 -2152685 -2310951 -1627868 -609042 -1009889
43522 -1009889 -3467309 -6134043 -6210894 -3039335 734319 1817101 79395 -1296515
43514 -1296515 85971 2723782 3246263 704050 -2628960 -4340263 -4165444 -3138745
43506 -3138745 -2048404 -1320819 -1264749 -1690010 -2001257 -2112590 -2531027 -3239979 -3480999
43497 -3480999 -3140802 -3329666 -4804344 -6644220 -7358037 -6646982 -5234985 -3640330 -2171316
43488 -2171316 -1622581 -2678159 -4634634 -5793285 -5363866 -4246248 -3770505 -4351792 -5556038
43479 -5556038 -6755026 -7340046 -6905326 -5788937 -5079313 -5477674 -6268236 -5993291 -4227998
43470 -4227998 -2162538 -1205528 -1537176 -2427895 -3329596 -3794550 -2873338 -110141 2791157
43461 2791157 3096729 660475 -1340611 -741242 236832 -1724349 -5575484 -6904147 -4290418
43452 -4290418 -1275135 -1027215 -2251735 -2317486 -1692231 -2437384 -4099826 -4323378 -2813646
43443 -2813646 -1700307 -2046280 -2714020 -3027516 -3975359 -5844603 -6816841 -5329900 -2461374
43434 -2461374 -629460 -760216 -1769025 -2189529 -1435947 56202 1209246 1142975 87115
43425 87115 -888334 -1244512 -1459299 -1905867 -2087958 -1568956 -969543 -1245023 -2294433 -2985981
43415 -2985981 -2496772 -1157448 60158 598360 689694 653586 48835 -1855508 -4515487
43406 -4515487 -5872727 -4590259 -1968961 -478382 -773470 -1575156 -2221990 -3396851 -4987279
43397 -4987279 -5353354 -3868108 -2422874 -2830131 -4119780 -4270680 -3501466 -3520807 -4070489
43388 -4070489 -2936736 146929 2133491 584965 -2810128 -4425087 -3347979 -1936010
43380 -1936010 -2171730 -3480718 -4480397 -5042303 -5534422 -5339492 -3771339 -1977577 -2196458
43371 -2196458 -4800782 -7447022 -7849115 -6324057 -4698400 -3675165 -2646008 -1572696
43363 -1572696 -1377314 -2260711 -3066752 -2950295 -2602196 -3006524 -3790303 -3813672 -3005067 -2601616
43353 -2601616 -3486250 -4957809 -5441646 -4196783 -2179992 -1216244 -2187820 -3976737 -4380142
43344 -4380142 -2217776 1514767 4543921 5232274 3744402 1600306 42635 -1254403
43336 -1254403 -3521055 -6747981 -8972071 -8547919 -6515423 -5369926 -5697717 -5650029 -4040195
43327 -4040195 -2240685 -2079174 -3279401 -4339295 -4950881 -5941499 -7248635 -7567329 -6202242
43318 -6202242 -4086713 -2534105 -1771046 -1220872 -773217 -1141275 -2837194 -5098762 -6322040
43309 -6322040 -5800772 -4596058 -4129100 -4336631 -4132398 -3382084 -3077012 -3449854 -3429763
43300 -3429763 -2523351 -1805819 -2171020 -2858717 -2773156 -2163770 -1846926 -1739494 -1379031 -1017882
43290 -1017882 -973297 -762096 -156342 -162286 -1473684 -2835336 -2625687 -1334114 -676443
43281 -676443 -899970 -951607 -836706 -1589137 -3006152 -3640545 -3266794 -3257282 -4082819 -4420227
43271 -4420227 -3360468 -1732957 -583153 46310 243408 -204853 -762249 -358912 637072
43262 637072 385723 -1637907 -3525807 -3614275 -2642803 -2086800 -1913421 -1401899 -896821
43253 -896821 -1244032 -2384500 -3721101 -5009522 -5876858 -5512456 -3943709 -2591790 -2459592
43244 -2459592 -2809563 -2704807 -2637998 -3318082 -4005164 -3586729 -2420217 -1632529 -1332620
43235 -1332620 -865321 -145104 427401 594815 -141946 -2336837 -4998519 -5815210 -4427989
43226 -4427989 -3606003 -5154564 -6616370 -4822227 -1099067 474531 -964773 -2508265
43218 -2508265 -2465740 -2031041 -1723028 -173180 2394665 3120694 737647 -2154731 -2967168
43209 -2967168 -2591558 -2918248 -3429223 -2824459 -2025599 -2716717 -4176057 -4245175 -2675058
43200 -2675058 -1151106 -567288 -418832 -428725 -741097 -851951 -254751 183572 -631355 -1844855
43190 -1844855 -1644993 -260362 180048 -1064899 -2322661 -2244349 -1584703 -1502866 -1851132
43181 -1851132 -2061431 -2182840 -2098005 -1213983 22515 -137483 -2147088 -3814037 -3292505
43172 -3292505 -2051744 -2553659 -3952807 -3113611 92821 1790124 -310458 -3124908
43164 -3124908 -2332132 1566556 4147655 3138508 602866 -1023190 -2187078 -4353992
43156 -4353992 -7027806 -8382981 -7820541 -6434253 -5430676 -5100862 -5024417 -4633106 -3855252
43147 -3855252 -3389751 -3760717 -4250636 -3939860 -3623668 -4799263 -6545308 -5951415 -2657532
43138 -2657532 -196284 -985013 -2745238 -2560903 -1852988 -3595468 -6550631 -6824744 -4302987
43129 -4302987 -2776305 -3569920 -3773523 -1740253 192434 139349 -337664 125880 -173323
43120 -173323 -2544960 -4801109 -4549526 -2914232 -2117040 -1866818 -1112247 -945306 -2466645
43111 -2466645 -3876005 -3143829 -1739054 -2127530 -3269774 -2526113 -659783 -637738 -2228677
43102 -2228677 -2276221 -284525 664528 -844622 -2499060 -2505830 -2130277 -2495168 -2281741
43093 -2281741 -664901 221988 -1855773 -5643738 -7724505 -6465549 -3321187 -993628
43085 -993628 -1096499 -2922267 -4214836 -3803145 -2967601 -3103069 -3225991 -1927530 -592606
43076 -592606 -1558828 -3751095 -3860699 -1853380 -1275656 -3420465 -5351029 -5071440 -4534362
43067 -4534362 -5495430 -6295233 -5389209 -4583077 -5742640 -7313173 -7268428 -6744091 -7342685
43058 -7342685 -7358009 -4473877 -281931 1700452 1058059 -42310 -959940 -2437150 -3543902
43049 -3543902 -2676116 -897063 -585131 -1359960 -1035942 -17001 -749439 -3090427 -4375765
43040 -4375765 -4127463 -4361905 -4870485 -2965210 914892 2250404 -676937 -3439621 -2093146
43031 -2093146 741694 313588 -2754535 -3938806 -2070802 -467352 -1214287 -2578530
43023 -2578530 -2785942 -2791732 -3798168 -4714107 -4103371 -2995233 -3588230 -5794325 -6991734
43014 -6991734 -5378241 -2131605 369410 1368724 1695723 1593149 263770 -2121218 -3598730
43005 -3598730 -2785441 -1054112 -871033 -2467351 -3665728 -2904778 -1066761 -171351 -1375647
42996 -1375647 -4367259 -7683308 -9531480 -9279067 -8184587 -7780717 -7771274 -6686024 -4358370
42987 -4358370 -2269602 -1420680 -1373749 -1554720 -1927296 -2036430 -1000311 895687 1974670
42978 1974670 1271570 -261261 -1271555 -1662785 -2116598 -2899263 -3717535 -4063325 -3452347
42969 -3452347 -2020204 -772707 -338456 106089 1353571 2193459 833177 -2061945 -4023043
42960 -4023043 -4368852 -4581130 -4994558 -4161009 -2208410 -1586824 -3095904 -4284076 -3595594
42951 -3595594 -2999043 -4142844 -4946185 -3167829 -842761 -1393978 -3993166 -4755522 -2739867
42942 -2739867 -950256 -1448362 -2881469 -3323737 -2770790 -2149328 -1970014 -2387457 -2914878
42933 -2914878 -2203820 127886 1976670 1216058 -930697 -1549171 -551925 -507622 -2113792
42924 -2113792 -3264059 -3103437 -3449873 -4932069 -5070632 -2215785 1283098 2144235 422740
42915 422740 -1447627 -2263476 -2585846 -2927385 -3398280 -4250782 -5155539 -4884719 -3176154
42906 -3176154 -1815155 -2320291 -3683857 -4078292 -3664787 -3797590 -4447360 -4572960 -4325811
42897 -4325811 -4590178 -4777520 -3519259 -1494737 -1041800 -2488415 -3277119 -1705816 572984
42888 572984 1140996 163653 -499669 -237446 128213 312068 760425 1077149 92071 -2172890
42878 -2172890 -4079802 -4457525 -3894746 -3330116 -2570196 -1232318 -189590 -638388 -2089310
42869 -2089310 -2687357 -1615211 -25660 607297 -43685 -1634492 -3859420 -5977722 -6669364
42860 -6669364 -5405608 -3416871 -2420940 -2788209 -3647136 -4231658 -4269058 -3569988 -2274352
42851 -2274352 -1197932 -972288 -1116518 -878205 -562088 -841203 -1148103 -344557 998290
42842 998290 781087 -1546709 -3717065 -3594214 -2161184 -2007716 -3485690 -4196824 -2573979
42833 -2573979 -396056 -617010 -3479315 -6266874 -6979648 -6705287 -7364643 -8367612 -7448422
42824 -7448422 -4506313 -2342933 -2860645 -4499523 -4760126 -3638379 -2847297 -2940565 -3285426
42815 -3285426 -4025505 -5752722 -7502615 -7308183 -4971317 -2464459 -1328762 -1305482 -1699236
42806 -1699236 -2359723 -2988037 -3107696 -3079123 -3593005 -3958989 -2706283 -240329 1080463
42797 1080463 193086 -1254567 -1581673 -1271595 -1403991 -1722038 -1700720 -2039787 -3478152
42788 -3478152 -5162529 -5683633 -5037787 -4387683 -4464528 -5074679 -5571138 -5213805 -3800627
42779 -3800627 -2289927 -1844528 -2177150 -2212448 -2289560 -3611025 -5330630 -4940849 -2405707
42770 -2405707 -895534 -1908663 -2811164 -1433817 106438 -666568 -1748922 90484
42762 90484 3228303 3099984 -706096 -4048496 -4869917 -5420899 -6947230 -6853742 -3395265
42753 -3395265 482319 883345 -1835887 -4297900 -4853158 -4539516 -4354861 -3998073 -3117029
42744 -3117029 -2122665 -1666999 -2167595 -3597146 -5129908 -5496615 -4329490 -2701365 -1838227
42735 -1838227 -1793875 -1790687 -1316083 -498301 148283 153274 -297878 -286202 650342 1499226
42725 1499226 875503 -1099921 -3121962 -4593769 -5789744 -6370864 -5546629 -3873696 -3005032
42716 -3005032 -3190573 -2927208 -1763867 -1384019 -2695084 -3778874 -2540233 -29264 930540
42707 930540 -254264 -1287495 -297388 1757543 2442146 730424 -1939539 -3241739 -2391174
42698 -2391174 -874012 -618971 -1839311 -3295461 -4234904 -4940405 -5557354 -5787658 -5864335
42689 -5864335 -6365866 -6780326 -5823987 -3679326 -2278777 -2620929 -3406679 -3257207 -2674929
42680 -2674929 -2639903 -2801603 -2506431 -2316454 -2928329 -3613593 -3298386 -2374749 -1993441 -2309639
42670 -2309639 -2781878 -3416216 -4322608 -4804308 -4306473 -3561596 -3442914 -3481233 -2921321 -2337469
42660 -2337469 -2617294 -3262174 -3432166 -3687210 -4644980 -4898382 -2852115 -62021 167132
42651 167132 -2436780 -4613384 -4343939 -3278669 -3407325 -4061398 -3897080 -3597789 -4464183
42642 -4464183 -5819941 -5994614 -5043933 -4559298 -5171677 -5834245 -5437220 -3935383 -2009801
42633 -2009801 -557674 -307982 -1110336 -1826071 -1578669 -719143 54558 852669 1960328
42624 1960328 2721948 2265293 915395 -379244 -1685902 -3653803 -5562029 -5640711 -3879207
42615 -3879207 -2752707 -3965246 -5834515 -5566731 -3313483 -1998429 -3190122 -5120951
42607 -5120951 -5490709 -4582907 -4250562 -4787178 -4472688 -2168162 938653 2623565 2010811
42598 2010811 312794 -532089 146791 1024158 307637 -1861442 -3239158 -2311808 -492045
42589 -492045 -342672 -2166826 -3884406 -4162715 -3972582 -4619880 -5737398 -6029973 -4988046
42580 -4988046 -3176940 -1610618 -1219611 -2051328 -2782496 -2106896 -692859 -337544 -1129948
42571 -1129948 -1460315 -1229863 -2463139 -5501249 -7249587 -5358536 -1976511 -761402
42563 -761402 -1908453 -3023530 -3475213 -4496175 -5752839 -5424801 -3728981 -3010066 -3816462
42554 -3816462 -3995976 -2552940 -1468583 -2377762 -3982629 -4368997 -3818250 -3622801 -3756667
42545 -3756667 -3426663 -2752577 -2398058 -2353178 -2176848 -1702859 -811550 538312 1502697
42536 1502697 797879 -1384399 -3128233 -3108349 -1935814 -721528 160694 259368 -1194321
42527 -1194321 -3651254 -5015295 -4312133 -3176410 -3444073 -4654046 -5279064 -5119568 -4980859
42518 -4980859 -5030910 -4917850 -4681652 -4353417 -3495984 -2157854 -1336706 -1601236 -2326699
42509 -2326699 -3023854 -3993344 -4861444 -4271631 -2181388 -585392 -599445 -824700 -173887
42500 -173887 -61597 -1665704 -3184896 -2435995 -371262 721321 821399 1077778 841670
42491 841670 -819018 -2089915 -686467 1794882 1736315 -835767 -2441699 -1765943 -949789
42482 -949789 -1146576 -1082798 -688691 -1833747 -4248070 -4889828 -3015408 -1872989 -3330923
42473 -3330923 -4757378 -3851878 -2898808 -4852588 -8079893 -8704776 -6294273 -3780695 -3015229
42464 -3015229 -3430513 -4150745 -4721218 -4429936 -3119294 -1973423 -1787539 -1603540 -715451
42455 -715451 -388761 -1537173 -2477084 -1544573 -348760 -1480968 -4163204 -5227212 -3659938
42446 -3659938 -1269229 548145 1835172 2424276 2167521 2375407 4065156 5182654 2835839
42437 2835839 -1785579 -4195810 -2746792 -564361 -516024 -1620498 -1894443 -1698739 -2247756
42428 -2247756 -3129138 -3357854 -3164419 -2986747 -2265823 -904482 -433361 -1945679 -4003643
42419 -4003643 -4270667 -2425969 -129355 1113303 895494 -407679 -1737337 -1868840 -832470
42410 -832470 -89768 -475227 -857454 299597 2990098 6124440 8862421 10522959 10310044
42401 10310044 8407674 6517273 6098162 6743079 7279837 7591538 8161936 8645469 8249439
42392 8249439 7009648 5530196 4023601 2719861 2529851 3948550 5804678 6520680
42384 6520680 6336723 6913077 8808015 10625897 10836582 9520607 8183471 8443181 10704313
42375 10704313 13486383 14438560 12797515 10431287 9611765 10286923 10644904 9881322 8970263
42366 8970263 8788077 8947417 8846338 8696474 8961466 9610609 10479278 11801095 13900942
42357 13900942 16666145 19544190 21765940 22548887 21651487 20069243 19780931 22157845
42349 22157845 26341436 29423448 28768312 24468835 19224553 15541488 13575040 12166870
42341 12166870 11007837 10451619 9925740 8537217 7174404 7793826 10168456 11618398
42333 11618398 10852601 9745596 9967506 10243066 8940635 7280484 7537298 9745550 12760302
42324 12760302 16970606 22882616 28181211 29607522 27250989 23807011 20116036 15036861
42316 15036861 9580919 7035116 8060448 9414766 8946008 8397559 9524765 10803346
42308 10803346 10365898 9330991 9501385 10109211 9690451 9199294 10209180 11543345 10841270
42299 10841270 8452057 6708030 6032148 4852316 3056380 2396780 3221107 3722493 3143018
42290 3143018 3108340 4680068 6302922 6129380 4734199 3954550 4119615 3966958 2813779
42281 2813779 1533960 1334753 2232817 2923584 2133154 229166 -789738 523145 3096742
42272 3096742 4364469 3193174 864124 -926131 -1878822 -2415417 -2303482 -1042320 828372
42263 828372 1889382 1457058 381187 -25629 590555 1604157 2436092 3002696 3246738
42254 3246738 3030436 2789499 3413861 4763380 5179203 3691607 2015678 2614738 5067442
42245 5067442 6452844 5528948 4134895 3663604 2786852 386833 -1671297 -1233531 440263
42236 440263 575064 -736266 -1239922 -890371 -1909187 -4298414 -4914916 -2205805 1184859
42227 1184859 2232902 1464201 1110839 1412866 1106496 268495 276389 1431970 2509768
42218 2509768 2520832 1595242 320983 -726670 -1052208 -679015 -182896 252284 1053726
42209 1053726 1933553 1530776 -522938 -2316004 -1872332 276996 2256547 3566310 4699475
42200 4699475 4944631 3189480 776783 725387 3314479 4931861 2738855 -1483198 -3901985
42191 -3901985 -3545264 -2554291 -2421533 -2337225 -1384637 -343010 -347168 -880003 -234156 2261240
42181 2261240 5189285 6396239 5209101 3142998 2291266 3109457 4133422 3921806 2716654
42172 2716654 1810975 1772770 1959210 1626390 914865 655675 1480590 3043594 3973847
42163 3973847 3023095 661868 -979000 -442051 1234422 1939727 1358596 1146991 2252127
42154 2252127 3498259 3372547 2010763 632426 -29468 91374 868536 1658156 1313001
42145 1313001 -335723 -1673956 -1260168 -73858 -360260 -2474543 -4399778 -4450727 -2974618
42136 -2974618 -1144870 380704 1048208 178709 -1814990 -3054395 -2198147 -209227 836077
42127 836077 238336 -867417 -1136966 -261052 1168767 2283904 2503220 1990662 1460739
42118 1460739 1224709 736838 -522397 -2048596 -2710011 -2020223 -674537 138540 -112959
42109 -112959 -688013 -250474 1468426 3014929 2965536 1997697 2019560 3328126 4160829
42100 4160829 3387274 1980193 1077475 263079 -1043100 -1998296 -1711220 -1080497 -1585424
42091 -1585424 -3018004 -3987217 -4020143 -3657762 -3128455 -2488959 -2437959 -3337735 -4047939 -3490622
42081 -3490622 -2717825 -3390552 -4794945 -4836347 -3771500 -4109417 -6321341 -7501869 -5578386
42072 -5578386 -2484533 -1399006 -2560712 -3704358 -3460974 -2427645 -1486017 -797104 -426692
42063 -426692 -733802 -1856754 -3333830 -4328976 -4169769 -2958204 -1625457 -900255 -406833
42054 -406833 450082 1002205 -30228 -2386844 -4167505 -4218313 -3334436 -2715651 -2548274
42045 -2548274 -2566803 -2653426 -2358515 -1247035 -267789 -1131024 -3500097 -4540082 -2499943
42036 -2499943 765720 2248074 1430230 19989 -708922 -655091 -179 690201 252076
42027 252076 -1588186 -3271518 -3504787 -3335560 -4215971 -4937923 -3078867 713001 2634669
42018 2634669 646485 -2765602 -3921709 -2375108 -640409 -646433 -1940835 -2926893 -2630979
42009 -2630979 -1288486 -46618 -198487 -2077334 -4435474 -5316108 -3972662 -1841009
42001 -1841009 -1145286 -2379973 -3690733 -3193012 -1338087 -110222 -276545 -705955 -434990
41992 -434990 15476 -120166 -545696 -588508 -251296 96068 234270 -211606 -1615598 -3367044
41982 -3367044 -4148472 -3764930 -3478974 -3937321 -4212978 -3645407 -2964384 -2612012 -1806118
41973 -1806118 -533489 -391522 -1716768 -2086964 -48369 1795275 507232 -2131834
41965 -2131834 -2097043 387723 1121879 -1285424 -3204332 -1675997 1422210 2704649 1800572
41956 1800572 499977 -322900 -831912 -908414 -534106 -320965 -391303 20597 907796 1043293
41946 1043293 250824 292095 2048148 3525539 2447253 -454221 -2461919 -2200314 -431776
41937 -431776 1491151 2488894 1949681 481181 -244723 490020 1445595 1324704 402032
41928 402032 -738475 -2386472 -4163122 -4177271 -1821670 258197 -451557 -2366763 -2206715
41919 -2206715 -344578 -243722 -2766053 -4726883 -3861064 -1865243 -1071234 -1006669 -275415
41910 -275415 395194 -607860 -2800170 -4051719 -3427731 -1956097 -991918 -1043986 -1776578
41901 -1776578 -2221959 -1577550 -551540 -955609 -3007879 -4262637 -2681825 279899 1442958
41892 1442958 -32895 -2343108 -4198907 -5889492 -7233867 -7093709 -5675352 -4958205
41884 -4958205 -5570128 -5310685 -2526640 727107 1124626 -1296773 -3251667 -2659814 -835088
41875 -835088 -11893 -590682 -1553215 -2222538 -2667813 -3081295 -3442073 -3497365 -2911768 -1779060
41865 -1779060 -810783 -508479 -556194 -704258 -1474034 -2786707 -2810856 -141352 3392597
41856 3392597 4489565 2849958 1194175 579208 -988391 -4101982 -5657332 -3415711
41848 -3415711 64005 1114418 227424 143365 624673 -638927 -2896239 -2667213 554485
41839 554485 3073958 2424632 407645 -566191 -800261 -1259549 -1191233 56515 1188881
41830 1188881 1078847 783940 1441047 2012972 1306898 563986 1588943 3499034 3797729
41821 3797729 1930013 -500568 -2452441 -4025893 -4561262 -2645129 1298034 4192326
41813 4192326 3259002 -802346 -4236647 -3817800 -17274 3444239 3536084 1141466 -518614
41804 -518614 -263130 78221 -743406 -1297295 -251206 1054173 928402 450553 1677286
41795 1677286 3936320 4770370 3995030 3835370 4906708 4941082 2424003 -784944 -1780939
41786 -1780939 -72324 2455193 3961733 4010634 3230819 2508827 2233691 1981438 1215926
41777 1215926 234181 -132081 386147 1368460 2461203 3440760 3734048 2863459 1362932
41768 1362932 388171 389243 818509 937863 275339 -1202254 -2535482 -2146950 36592
41759 36592 1679166 868032 -975918 -1195850 -308108 -1364686 -4577432 -5829676 -2263361
41750 -2263361 3151476 5109397 2641811 -226277 9404 2469793 3870278 2661666
41742 2661666 326967 -718692 226163 1623578 1654351 444372 -147293 993306 2700102
41733 2700102 2958303 1359243 -512250 -934501 253085 1801617 2492206 2183008 1500656
41724 1500656 925371 769026 1912845 5378846 10482380 14502555 15445261 14360266 13438804
41715 13438804 12589867 10055954 6199392 4053234 5297015 7914639 9134720 8837710
41707 8837710 8503600 8436921 8043577 7777749 8655428 10280481 11277713 11556063 12412669
41698 12412669 14316047 16188459 17181024 17716065 18294235 18563829 18238464 17822293 17587427
41689 17587427 16779198 14925857 13269149 13501674 15195152 15934617 14507200 12676866
41681 12676866 12760827 14485791 15896746 16822528 19136972 23137654 26084241 25801480 23655692
41672 23655692 21789898 19247397 14010017 7858744 5256049 7001609 8770469 7296361
41664 7296361 4568514 3855475 4739788 4976773 4754733 5662012 7136808 7592573 8027830
41655 8027830 10753971 14925666 17090262 16374397 15436805 15563970 14573443 11146887 7854660
41646 7854660 7551103 9370544 10827446 11758248 13338457 14713645 13738458 10550850 7717339
41637 7717339 6784467 6785883 6291547 5138526 3915744 3207880 3502283 4611713 5254444
41628 5254444 4431874 2988605 2470605 2813908 2793621 2405659 2773330 3747968 3908617
41619 3908617 3329566 3902862 5982461 7122173 5718737 3882291 4706813 8170323 11741694
41610 11741694 13797771 14291645 13100938 10243484 7298894 6169183 6406068 5934513
41602 5934513 4505348 4143131 5737593 7490299 7701694 7162116 7591799 9310919 11707065
41593 11707065 14583827 17604520 19487472 19224374 17388815 15074137 12353638 9035251
41585 9035251 6109891 4903524 5181781 5471369 5042830 4388617 3986065 3796838 3843487
41576 3843487 4112509 3967862 2813913 1346873 1022840 2158278 3559585 4135484 3871580
41567 3871580 3121387 2101181 1429360 2012219 3708323 4936703 4373856 2512382 882175
41558 882175 180389 -88024 -364748 -294581 515316 1538650 1711234 758648 -371680
41549 -371680 -756001 -803311 -1679000 -3535912 -5109342 -5242632 -4066469 -2388939 -703293
41540 -703293 780165 1861616 2574564 3003739 2652378 1068989 -550208 55105 3106210
41531 3106210 5875949 6252514 5583356 6047776 6746421 5139191 1543799 -848075 -415728
41522 -415728 1260416 2491764 3349900 3785016 2833144 1030157 936785 3413103 5610936
41513 5610936 4803574 2329888 1313755 1969509 1986725 771990 323018 1744579 3492797
41504 3492797 3907357 3537754 3789687 4533658 4319377 2415633 -300325 -2279742 -2532233
41495 -2532233 -1105540 1049575 2586254 2610026 1441616 425770 591991 1550177 2235073
41486 2235073 2689338 4081715 6504418 8015945 7055680 4785712 3393834 2837817 1366258
41477 1366258 -1063303 -2311147 -1289226 660173 2216043 3549377 4451236 3558304
41469 3558304 1059858 -104768 2080761 5523011 6737367 5410732 3969896 3715082
41461 3715082 3856918 3745335 3650834 3577640 3349838 3609112 4812156 5665894 4666748 2792758
41451 2792758 2272053 2888073 2277089 190839 -566323 1400839 3489339 2959627 1243183
41442 1243183 1792348 4758178 6596516 5053329 2225761 1649063 3724539 5447301
41434 5447301 4305969 1177945 -1073487 -1037864 93952 474734 -398817 -1753592 -2519258
41425 -2519258 -1815494 473299 2945996 3520300 1840189 -122967 -694366 -457868 -446997
41416 -446997 61904 1970405 3803221 3361131 1446156 1166489 3348917 5315068 4918285
41407 4918285 3320102 2616946 2897700 3178763 3502226 4339512 5083598 4801825 3782986
41398 3782986 3043795 2902455 3028929 3164936 2898446 1677237 67374 -114543 1713479
41389 1713479 3315289 2267915 -537213 -1981516 -995121 353191 232419 -608415 -714267
41380 -714267 -284026 -198946 34556 1523773 3663650 4441655 3332556 2348179 3459279
41371 3459279 6108295 8251251 8986406 8928352 8615007 8116812 8030801 9041280 10096405
41362 10096405 8907544 5363349 2806751 4151447 7735183 9067073 6349260 2262826
41354 2262826 104269 79608 253762 -307849 -704627 32266 1500137 2477672 2448106
41345 2448106 2143460 2408496 2876267 2467169 1100725 -190772 -1048943 -2142961 -3015648
41336 -3015648 -1528586 2793994 6523734 5975360 2174886 -553624 -472903 113935 -660558
41327 -660558 -1602822 -1325414 -849263 -1697234 -3490314 -4979782 -5721868 -5429616 -3492525
41318 -3492525 -518690 1480312 1916546 2757417 5191926 7171835 6410258 4056278 2853909
41309 2853909 2993878 2525805 991328 -161393 -350738 -354556 -142962 1176659 3002457
41300 3002457 3254031 1356414 -792429 -1425588 -646020 938649 3258043 5494086 5695028
41291 5695028 3267877 665796 931084 4024283 6871715 6874994 4361454 1567359 129135
41282 129135 24661 466143 1006469 1487432 1551331 1081079 903107 1894370 3234028 2919387
41272 2919387 623779 -1412829 -1383306 -364349 -288572 -825773 -352862 894020 1090062
41263 1090062 -43754 -809198 -395180 162217 380677 1393877 3629342 5415988 5253068
41254 5253068 3991602 3423745 3872616 4472538 4867002 5287698 5573052 5295449 4550667
41245 4550667 3864827 3712182 4573473 6685040 9094683 9871471 8195826 5587302 4151699
41236 4151699 4190646 4454095 4203877 3970093 4512382 5897350 7451875 8023240 6663074
41227 6663074 3798947 1405166 1195491 2795450 4381598 4930013 5080584 5846713 7235250
41218 7235250 8359961 8462605 7572233 6322222 5289428 4648584 4528658 5281215 6814957
41209 6814957 7989029 7671385 6430333 6062651 7192840 8566346 9171257 9603067 10400124
41200 10400124 10486652 8815170 6585235 6073168 7694881 9802131 11119721 11871983 12632989
41191 12632989 13544037 14694443 15956197 16498622 15815938 15030396 15492271 16212834 14888572
41182 14888572 11921004 10960672 14078282 18413334 19561683 16931465 13661478 12158789
41174 12158789 12029891 12161863 12531483 13375982 14263455 14855750 15527775 16458285 16846034
41165 16846034 15760565 13444042 11350109 11008816 12773123 15299244 16476097 15512205
41157 15512205 13953104 13901988 15449204 16851183 17095813 16920369 17042150 16919514 16132322
41148 16132322 15755980 17122426 19894945 22486501 23953365 24559844 24959058 25806712 27765352
41139 27765352 30813063 33796403 35672797 36950536 38868951 41453295 43655867 45311563
41131 45311563 47519653 50901555 54925903 59402738 65196515 72681367 80811389 88819370
41123 88819370 97807070 109435720 123896350 140562919 159960180 183350316 210562789
41116 210562789 240012728 270983714 303630097 335288887 358406923 364733459 352135605
41109 352135605 326133166 294489094 261567843 228434707 196491042 168503563 145990859
41102 145990859 127684326 111658622 97734344 86582891 77531043 69024509 60976474
41095 60976474 54910949 51445823 49029714 45777447 41516214 37395175 34325812 32409226
41087 32409226 31149236 29633242 27147623 24108358 21725299 20386723 19281201 18085666
41079 18085666 17846381 19251157 21055992 21470377 20418369 19188532 18393888 17587175 16525138
41070 16525138 15472461 14406914 13162255 12275164 12473642 13321853 13568703 12933748 12375118
41061 12375118 12412534 12369848 11629108 10571421 9848148 9663748 10195387 11739926 13818787
41052 13818787 14935867 14008880 11676798 9677459 9172092 9931932 10871973 11213131 11318688
41043 11318688 12257438 14258823 16113227 16836120 17333087 19141956 21854601 23449197
41035 23449197 23326584 23218705 24407154 25740735 25616668 24630684 24747128 26526704 28565037
41026 28565037 29417049 29019035 28305177 28162257 28724718 29367544 29653637 30302724 32435036
41017 32435036 35732418 38546686 40289279 42335028 45779119 49822691 53586209 57972883
41009 57972883 63992410 70534441 75964556 81065085 88082891 97415055 107695410 118880340
41001 118880340 132532046 148860163 166327998 184892463 206683741 231951233 256814765
40994 256814765 276887336 290917490 298678030 297511959 284444965 261150770 233863123
40987 233863123 208135696 185686176 166087170 148910694 133641001 119728178 107728065
40980 107728065 98787463 92279517 85651838 77593472 69827966 64635248 61938674 60110627
40972 60110627 58487383 57607158 57731607 58528887 59742894 61083107 62007437 62587944 63820460
40963 63820460 65991519 67717469 68006514 68174458 69766824 71548002 71179990 69475318
40955 69475318 69807083 72727200 74390626 71902730 67411565 64545025 63090565 60354178
40947 60354178 56424847 54363923 55016747 54959529 50982964 44427621 39342325 37521540
40939 37521540 36955511 34746803 30329031 25716815 23202894 23024491 23251648 21973304
40931 21973304 19294044 16822244 15617655 15456569 15934377 17197564 19196071 20944959
40923 20944959 21102549 19166256 16085371 13858751 14095646 16361300 18335716 18396266 17567243
40914 17567243 17813741 18937265 18898668 17218715 16049612 17145040 19528067 21275035
40906 21275035 22077975 22604584 22628782 21692911 20940030 22307648 25914324 29868263 32888668
40897 32888668 35646113 38950816 41843031 42502490 40600271 37909264 36493340 36650858
40889 36650858 36859820 35706437 33511539 31620823 30352205 28625186 25898157 23325150
40881 23325150 22068498 21358031 19595128 16935921 15162679 14864824 14375610 12304237
40873 12304237 9874024 9442605 11231772 12869003 12292118 10049554 8225502 7859488
40865 7859488 8245936 8387316 8081739 7459017 6515645 5716157 6140902 8022046 9754337
40856 9754337 9642157 8341868 8146123 9831917 11746741 12335550 11951892 11467200 10709582
40847 10709582 9449761 8576128 8848766 9507561 9553268 9431440 9841465 9860085 8326757
40838 8326757 6498507 6916821 9569743 11525817 10983244 9565371 9591842 10926842 11955930
40829 11955930 12301616 12882988 14002986 14931207 15192982 15152200 15398149 16382226 18490667
40820 18490667 21613069 24630662 26109325 25762465 24795438 24580794 25256867 25868572 25811935
40811 25811935 25853992 27418552 30878279 35045378 38681426 42025153 46198422 51462732
40803 51462732 56954778 62118720 67556665 74297626 82906724 93456953 105702748 119075825
40795 119075825 133104694 148076149 164878876 184093231 205341508 226844416 244831857
40788 244831857 254287767 252140588 239922382 221936226 200846390 176811307 151005060
40781 151005060 127326386 109005755 95225564 82936756 70910275 60231618 51723439
40774 51723439 44954830 39549433 35621537 32695509 29596928 25822291 22120638 19446986
40766 19446986 17905652 16734619 14927746 12178538 9598775 8847810 9974359 11031915
40758 11031915 10696719 10136997 10903336 12045541 11319320 8687424 6411422 5735316 5693785
40749 5693785 5522083 5981305 7391309 8304255 7476036 5820355 5135351 5872108 7223201
40740 7223201 8480350 9249741 9182642 8571602 8468709 9161444 9265332 7511334 4859719
40731 4859719 3554909 4353903 5863563 6518786 6125314 5361097 4735386 4427285 4590886
40722 4590886 5393151 6757934 8037282 8082815 6263366 3647386 2422370 3568671 5761136
40713 5761136 7245243 8037717 9202615 10537804 10527760 8782763 7230581 8142556 11546531
40704 11546531 15181471 16797242 16156831 14861762 14468149 15012584 15551573 15821500 16585710
40695 16585710 18204077 19818013 20593521 20995122 21944557 23296415 24173718 24487406 25138185
40686 25138185 26857345 29577871 32595832 34616448 34327730 32083363 30346149 30939372
40678 30939372 32401314 31950329 29705639 28517003 29347292 29561442 26973709 23140593
40670 23140593 20843991 20326106 20162863 20129385 20530864 19883312 16389907 11495091 8994354
40661 8994354 10105963 11946718 11682800 9879541 8610850 8345828 8295355 8299208 8658872
40652 8658872 9073170 9161261 9206398 9194945 8170772 5934510 4279475 4767663 6156137
40643 6156137 6072416 4628977 4037884 4870095 5353507 4814541 5072776 7160013 9076540
40634 9076540 8753030 7444135 7892421 10293830 12479549 13414353 13997345 14520189 13881710
40625 13881710 11907846 10268913 10096912 10430415 10117016 9678439 9937558 10159384 9256631
40616 9256631 7953799 7942377 9304539 10533413 11052941 11982781 13968472 15727300 15627269
40607 15627269 13819926 11915885 11000288 10737233 10330108 9811473 10139293 12035475 14912456
40598 14912456 17387623 18995795 20663538 22852778 24041438 22400218 18690530 15844640
40590 15844640 15345493 15661222 15098378 14614981 16220928 19554206 21998733 22114132 21263934
40581 21263934 21462366 22998876 24888788 26555761 28034921 29139803 29554236 29660335
40573 29660335 30403528 32181581 34464279 36657189 38775624 41046371 43451221 46109497
40565 46109497 49579563 54101411 58910002 63186778 67545416 73488073 81204626 89135301
40557 89135301 96373178 104346906 114979582 128021771 141678354 155479617 170961740
40550 170961740 189429994 210335188 231853234 251539648 266127295 272365657 269050355
40543 269050355 257406831 239264770 216284309 191244616 167805413 147490942 128616847
40536 128616847 109885050 93302507 81249095 72221522 62723728 52781363 45951896
40529 45951896 43318041 41036215 35612842 28762184 24481143 23233715 22014477 19293628
40521 19293628 16838150 16335112 16696638 15778793 13199893 10274639 8056920 6492496
40513 6492496 5049658 3394082 1689190 754794 1577526 4040814 6391194 6704597 4909155
40504 4909155 2735853 1606384 1328039 1198054 1504026 2951644 4982887 5858660 4681733
40495 4681733 2496344 1018149 984577 2128707 3958743 5870998 7083526 7235214 6741858
40486 6741858 6067537 5158820 4102788 3555492 3707269 3669234 3013814 3082486 5196499
40477 5196499 8161402 9479534 8872827 8470127 9189335 9207176 7054785 4270285 3392106
40468 3392106 4635885 6188489 6878430 6924366 6605804 5813044 4841102 4399937 4731833
40459 4731833 5473984 6273592 6921273 7200106 7234919 7548512 8122829 8030930 6840634 5690676
40449 5690676 5859847 6838742 7124057 6536682 6296332 6907664 7474716 7346458 7085609
40440 7085609 7300922 7581034 7182991 6056530 4749905 3871956 3863917 4671741 5509633
40431 5509633 5652186 5558897 6413032 8425025 10471693 11558601 11638288 10810912 9050648
40422 9050648 7331381 7622998 10521031 13769617 14567944 12936027 11433523 11686133 12629373
40413 12629373 12533005 11456425 10767482 10945076 11002992 10081039 8686260 7888989 7813196
40404 7813196 7643317 7047049 6773885 7367412 7855379 6632099 3693440 1191653 1265554
40395 1265554 3665284 5998383 6213646 4459251 2487911 1641380 1779658 2095105 2369391
40386 2369391 2829588 3022957 1927650 -274094 -1483603 52903 3147827 4737759
40378 4737759 3686040 2114918 2353061 3919548 4709374 4151179 3550573 3715996 4044231
40369 4044231 4178401 4842332 6211447 6888563 5775714 3990805 3462436 4273757 5058091
40360 5058091 5631894 7138431 9291348 9738718 7376880 4445638 3557015 4003287 3161879
40351 3161879 698907 -1097487 -986135 -314715 -518905 -1330365 -2164962 -3147318 -3774754
40342 -3774754 -2674944 -74640 1429200 280090 -1565803 -1543963 -292970 -184119 -1271539
40333 -1271539 -1527693 -581330 -343419 -1735095 -3306440 -3630109 -2974247 -2081397 -1196689
40324 -1196689 -758886 -1160003 -1432513 -231156 1479144 1151656 -1162528 -2104598 39238
40315 39238 2338642 1422617 -1495861 -2570418 -785277 1528495 2746636 3379941 3630695
40306 3630695 2628165 762982 162813 1632625 3055664 2178265 -417049 -2404931
40298 -2404931 -2706213 -2085533 -1474150 -978385 -351493 461788 1266204 1663974 1358217
40289 1358217 736442 774696 1895894 3209304 3364139 2024753 203008 -654254 325249
40280 325249 2901828 5661499 6768742 5484100 3015940 1380702 1341207 1955534 2221949
40271 2221949 2376653 3001741 3567321 3051670 1913532 2031738 4003504 5696633 4814736
40262 4814736 2262748 1289307 3210247 5624104 5598921 3338529 1528321 1799636 3144628
40253 3144628 3678701 2873512 1721205 1248849 1293075 839687 -382181 -1013444 461608
40244 461608 3336592 4887671 3570344 1039391 29238 1013605 2192567 2239220 1568814
40235 1568814 1012393 789174 1153450 2672680 5052477 6595066 5773905 3024641 397547
40226 397547 -374851 761055 2329098 2597545 1207954 -200588 423661 3007571 5133054
40217 5133054 4938181 3457684 3051248 4039260 4358171 2675531 377625 -341540 668885
40208 668885 1683676 1525852 645813 62740 433352 2081652 4612258 6330542 5580509
40199 5580509 3247612 2325920 3936486 5409313 4019326 1163660 336437 1774726
40191 1774726 2164942 -169394 -2881113 -3432107 -2485337 -1711799 -627893 1917602 4688289
40182 4688289 5173807 3087140 558558 -669696 -324362 1445301 3949892 5167029
40174 5167029 3476346 315262 -1088765 73368 1379102 983308 -22676 73660 1063667
40165 1063667 1920436 2721009 3897816 4822502 4753565 4406330 5096401 6717952 7732371
40156 7732371 6968492 4727168 2489256 2067121 4382594 8353088 11512187 12335449 11405962
40147 11405962 9942276 8274703 6597832 6054953 7571603 10062707 11166103 9773932
40139 9773932 6978918 4623259 3649030 3741755 3940321 3638509 3269531 3649418 4518331
40130 4518331 4594767 3464095 2270784 1795495 1154577 -372773 -1509117 -739379 996426
40121 996426 1422066 254888 -732102 -814905 -1172991 -2307351 -2889339 -2067675 -970290
40112 -970290 -744934 -751669 -39307 787620 722599 323775 877281 2212311 2889893 2283259
40102 2283259 1165883 372453 -16272 -232214 -486317 -967026 -1408818 -959184 662330
40093 662330 2205846 2087625 339395 -1542104 -2341770 -1672444 712691 4552388 8068713
40084 8068713 9050018 7420005 5359219 4469281 4292883 4114301 4383662 5286030 5643544
40075 5643544 4814562 4237028 5174816 6089517 4530155 959792 -1710962 -2110520 -1412228
40066 -1412228 -385747 1635589 4105085 4566987 2285743 91110 450336 1820060
40058 1820060 1568120 755928 2502111 6262682 7578654 4299843 -118652 -1131879
40050 -1131879 1384344 4000434 4480124 3608312 3132830 3838915 5609949 7989024 10270789
40041 10270789 11616872 11398568 9597022 7207209 5912250 6376598 6964775 5523769
40033 5523769 2640255 1430551 3386500 6205858 6983470 5918742 5183268 5503087 5946247
40024 5946247 6183670 6763119 7614874 8321477 9483244 11744873 13781028 13488379 11071555
40015 11071555 8658093 6973041 5119501 3809533 5403186 9485606 11704612 9290103
40007 9290103 5164485 3896795 5634571 7115717 7183375 7716200 9503660 10614524 9448973
39998 9448973 6851399 4460512 2981996 2683929 3681647 5027930 5216564 4283769 3885413
39989 3885413 4731799 5564794 5306157 4529232 4006503 3503254 3032944 3689367 5963075
39980 5963075 8523965 9810808 9601057 8143455 5489753 2954626 3199084 6804062
39972 6804062 10413931 10676398 8643735 7587238 7743479 6663648 4189159 3134056
39964 3134056 4448330 5436515 4245905 2881621 3699618 5578057 6034969 5113188 4566200
39955 4566200 4689369 4546421 4237896 4433032 4515412 3688890 3202227 4836041 7640410
39946 7640410 8923686 8287775 7815208 8247222 8282572 8339122 11376775 18009445 23716598
39937 23716598 23633391 18334507 12394218 8693339 6773242 5717850 5686522 6705999 8366335
39928 8366335 10895365 14557472 17859377 18314662 15426241 11369338 8428908 7164134
39920 7164134 7136073 7736158 8021204 7381571 6679913 7097055 7734076 6458525 3521606
39911 3521606 1833245 2622191 3384325 1832640 -480061 -773913 678420 1620925 1724383
39902 1724383 2371337 3373032 3142030 2009693 2239564 4287828 5893972 5646577 4769928
39893 4769928 4339943 3397774 1392307 115105 1160760 3266203 4292365 4390731 5017686
39884 5017686 6053910 6333233 6179085 6832734 7762607 7199356 5442569 4979063 6632881
39875 6632881 8075677 7413798 6107970 6540913 8340142 9418851 9802928 11819444 16198389
39866 16198389 20179088 20613426 17578099 13588215 10125929 6603086 2636750 -295536
39858 -295536 -257481 2870946 7142821 10070264 10132758 7670527 4892458 4092860 5054351
39849 5054351 5184075 3168134 1106336 1346493 2682765 2450351 1437589 2946102 6742063
39840 6742063 8182435 5067384 1418636 1564925 3830672 3947408 2180504 2377602 5256086
39831 5256086 7628340 8274183 9810869 13630569 17083110 17465969 15564522 13375507
39823 13375507 11114434 8449476 6328595 5557959 5396025 5134535 5190815 5308446 3984236
39814 3984236 1320088 -9385 1313623 2754459 1821224 220225 1188716 4474505
39806 4474505 7133217 7956799 7857641 6922546 4580594 2193318 2016142 3534154 3938692
39797 3938692 2454442 1209623 1401102 1529767 269749 -1415906 -1943490 -903879 1301405
39788 1301405 3626737 4076197 1680798 -1021800 -316003 3374264 5562672 3972453
39780 3972453 1446126 1156115 2265683 2524456 2092524 1966846 1172008 -1224210 -3200773
39771 -3200773 -2294403 271958 1303422 552183 524829 1864591 2453553 1356393 367809
39762 367809 763968 1306239 714148 -136376 72478 854727 808656 -332763 -1624576
39753 -1624576 -2088727 -1273076 582351 2452046 3362235 3542924 3864807 4194950 3636022
39744 3636022 2404617 1714888 1419795 -209134 -3375611 -5364664 -3816509 41496
39736 41496 3117428 4209947 4179204 3426141 1637211 -209811 -92096 2126745 3923769
39727 3923769 3310606 1380752 475199 931363 1220106 793047 1002722 2766704 4717662
39718 4717662 4827857 3290414 2448363 3658217 5382245 5232501 3215721 1753293 2533054
39709 2533054 4444171 5023805 3192919 117718 -2082809 -2134098 -651444 332438 -550441
39700 -550441 -2299750 -2814382 -1937638 -1719150 -2982270 -3523035 -1428322 1365758 1399562
39691 1399562 -1125887 -2424235 -634066 1648825 1513111 -94323 -245698 1639264
39683 1639264 3524478 3887599 3095525 2068709 1317294 1203533 1742794 2107757 1394411
39674 1394411 -189306 -1732836 -2850296 -3581249 -3618436 -2793622 -1821905 -1295870 -514071
39665 -514071 1171965 2436937 1414745 -1108519 -2131304 -434568 1909231 2665241
39657 2665241 2074066 1385055 654775 -508278 -1375375 -908395 597060 1944965 2555593
39648 2555593 2588217 2168733 1406518 671759 139412 -456852 -1191739 -1763053 -2179223 -2606910
39638 -2606910 -2343765 -449362 2111996 2767794 745887 -1571049 -1919375 -1002662 -582974
39629 -582974 -593765 -146117 222976 -336810 -891799 -206015 690180 -30913 -1762549 -2350573
39619 -2350573 -1590106 -1073895 -1004219 -142169 1172987 1066487 -477539 -1267079 -550519
39610 -550519 -75079 -663512 -722827 546116 1294075 139560 -1275255 -852508 747647
39601 747647 1458225 854692 -19783 -668170 -1322199 -2091573 -3164370 -4721218 -5688278
39592 -5688278 -4195475 -528718 2144218 1616394 -410906 -989462 26386 587458 -248258
39583 -248258 -1744156 -3128200 -3781294 -2840205 -639548 549909 -641050 -2283249 -1980587
39574 -1980587 -839993 -1634279 -3921534 -4524265 -2700002 -1148047 -1272294 -1066637 872491
39565 872491 2500149 1668796 -190092 -303674 1158863 1611556 -33444 -2308146 -3698208
39556 -3698208 -4208597 -4361254 -4242128 -3942802 -3927991 -4572456 -5791916 -7088745 -7584018
39547 -7584018 -6426947 -3857530 -1498262 -754403 -1112675 -841674 721401 2406245 2757325
39538 2757325 1596922 -54692 -941127 -370842 1179432 2048174 782034 -2007942 -3874250
39529 -3874250 -3209589 -1148076 -143908 -1144993 -2943067 -3887830 -3275968 -1321682 1080584
39520 1080584 2524738 2167680 876601 291980 606575 519161 -384663 -845437 -193755
39511 -193755 375979 -9745 -160412 1056601 2374775 2015494 692724 331020 764565
39502 764565 483214 14303 1320615 3798143 4281836 1843769 -634621 -1036653 -1132679
39493 -1132679 -3155898 -5846623 -6477300 -5092267 -4084384 -4450968 -4814733 -3939725 -2507900
39484 -2507900 -2211843 -3787087 -5854739 -5876804 -3209114 -725011 -1459695 -4010468 -4286569
39475 -4286569 -2088100 -1924946 -5641103 -8499483 -5927228 -694087 953621 -2002442
39467 -2002442 -5129515 -5599940 -4702390 -3773694 -2272444 -447328 22791 -959788 -1419582
39458 -1419582 -648320 -166923 -668089 -880752 -309768 -309540 -1393369 -2043792 -1334856 -413305
39448 -413305 -278759 -329758 -242366 -1084277 -3223858 -5095805 -5489413 -5423121 -6319454 -7617873
39438 -7617873 -7506206 -5167828 -1547809 1264950 1214650 -1826135 -5096241 -5394266 -2785663
39429 -2785663 -349587 -127969 -1203710 -2056044 -2626519 -3212245 -3155133 -1725775 747546
39420 747546 3066958 3654734 1446660 -2217796 -3745751 -1793513 -350819 -3704911
39412 -3704911 -9194360 -9821682 -4409734 281108 -667720 -3843285 -3938730 -1779833 -1406639
39403 -1406639 -2803912 -2833351 -1398809 -1554312 -4101244 -6336193 -6222147 -4576303 -3092032
39394 -3092032 -2714596 -3669582 -4942703 -4490928 -2047651 -420711 -1595205 -3226530 -2138076
39385 -2138076 278323 51975 -2943454 -4853636 -3979068 -2728518 -2847628 -2859676 -1647730
39376 -1647730 -919720 -2107743 -3675634 -3661166 -2734300 -2670445 -3419844 -3608926 -2831201
39367 -2831201 -1851719 -1279997 -1155005 -1241070 -1094137 -501487 -63434 -387520 -770538 -87196
39357 -87196 1039255 748338 -1136385 -2642508 -2597419 -2047922 -2062553 -2229542 -2321297 -3281837
39347 -3281837 -5128331 -5850580 -4198533 -1964230 -1581805 -2801328 -3733703 -3987863 -4496086
39338 -4496086 -5070552 -4626788 -3561987 -3511412 -4570560 -4966504 -3957090 -2965354 -3025292
39329 -3025292 -3060773 -1936055 -529289 -135658 -112431 901684 2229600 1902441 51942
39320 51942 -774972 668613 2357395 1893155 -357393 -2536832 -4169285 -5702291 -6268835
39311 -6268835 -4478030 -1217575 804628 646516 54287 336358 655831 342425 542777
39302 542777 2043853 3420407 3133229 1832401 727339 -704536 -3136200 -4926439
39294 -4926439 -4011141 -1590859 -1135014 -3697163 -6662152 -7450279 -6266844 -4649202 -3291667
39285 -3291667 -2184694 -1436518 -1109352 -1193735 -2094018 -4105098 -6279901 -7094774 -6501749
39276 -6501749 -6043963 -6568101 -7030412 -6074912 -3863543 -1916581 -1737216 -3558939 -5796314
39267 -5796314 -6164555 -4261492 -2327706 -2193958 -2555997 -1338298 232525 -1026324 -4917861
39258 -4917861 -7248346 -5513408 -2207666 -948119 -1903218 -2931445 -3001812 -2338750 -995737
39249 -995737 488366 494804 -1426953 -3018128 -2195841 -239908 217967 -802302 -1300837
39240 -1300837 -1037586 -1507451 -2507924 -2044968 -162686 283721 -2031348 -4408533 -3775394
39231 -3775394 -933855 787262 -183409 -2630110 -4905455 -6376031 -6877190 -6475011 -5884841
39222 -5884841 -5863695 -6073061 -5589208 -4539380 -4069650 -4537962 -4970535 -4722795 -4438713
39213 -4438713 -4606832 -4339276 -2825221 -1174001 -1180656 -2480307 -2655063 -557200 2046639
39204 2046639 2997199 2548659 2350177 2627848 2134489 589629 -634532 -595037 -36841
39195 -36841 82183 17388 206382 -117463 -1861959 -4106857 -4743626 -3296464 -1848887
39186 -1848887 -2523221 -4919484 -6913377 -7397466 -7062170 -6534543 -5079576 -1917039 1976413
39177 1976413 4479863 4564723 3022315 1040530 -905879 -2528243 -3229175 -2896283 -2420493
39168 -2420493 -2484341 -2304838 -650492 1983031 3292420 1712150 -1561495 -3674308 -3117683
39159 -3117683 -1203933 -393722 -1459480 -2853684 -2983218 -2297491 -2327491 -3249865 -3768148
39150 -3768148 -3383291 -3229973 -4090870 -5004342 -4855591 -4218922 -4342955 -5058715 -5011905 -3566126
39140 -3566126 -1367748 629751 1731646 1541210 459334 -286817 -115333 -32767 -989117
39131 -989117 -2041311 -1746733 -797699 -1166166 -2639990 -2562772 127373 2672584 1924514
39122 1924514 -1305193 -3274665 -2274577 -631877 -1232961 -3539223 -4460404 -2705845
39114 -2705845 -561629 -666091 -2396131 -3028722 -1813161 -802136 -1453512 -2579750 -2646639
39105 -2646639 -2168291 -2242013 -2222599 -850130 1187066 1822070 445677 -1417828 -2131187
39096 -2131187 -1462698 -383343 -280835 -1777682 -3491381 -3007728 -116638 2331464 2177003
39087 2177003 832421 494767 441137 -1047457 -2696171 -1838120 765697 1586727 -200897
39078 -200897 -1664336 -990131 236858 522902 699999 1326860 1100700 -469146 -1657698
39069 -1657698 -1503410 -1512211 -2619756 -3105995 -1598951 245250 298432 -901161 -1808062
39060 -1808062 -2691645 -4340218 -5584266 -4760624 -2687215 -1889025 -3391779 -5883921 -7379380
39051 -7379380 -6560932 -3579632 -606968 -184910 -1944795 -2703475 -992004 704548 -145942
39042 -145942 -2368487 -3481753 -3634992 -4376257 -5266249 -4775885 -3386380 -2897808 -3484681
39033 -3484681 -3995606 -4238495 -4442889 -3570952 -1000763 1098708 174217 -2601652 -3765007
39024 -3765007 -2630015 -1672960 -2079639 -2356683 -1689006 -1339193 -1889387 -2039479 -1171192
39015 -1171192 -512261 -696087 -570568 415158 841875 -398346 -2314085 -3474813 -3820424
39006 -3820424 -3837501 -3565788 -3359940 -4004791 -5115466 -5041393 -3358549 -1833342 -1815816
38997 -1815816 -2334217 -2138531 -2066930 -3570823 -5906161 -6741204 -5296697 -3337282 -2881371
38988 -2881371 -3948882 -4901567 -4472827 -3074122 -2075630 -2021222 -2117475 -1712449 -1378506
38979 -1378506 -1656650 -1619617 -212411 1468945 1153097 -1238578 -3094699 -2586211 -961066
38970 -961066 -432038 -1159969 -1597158 -998969 -318755 -787507 -2404670 -3941133 -4236908
38961 -4236908 -3483134 -2951997 -3191159 -3116816 -1692937 132786 467984 -867751 -2198487
38952 -2198487 -2458017 -2229088 -2079474 -1490117 -135836 1092881 1256346 641313 59422
38943 59422 -411042 -1187742 -2141690 -2508564 -1791059 -469103 253512 -379030 -1635019
38934 -1635019 -1904644 -620427 1148339 2386121 3240914 3647260 2380429 -879285 -3826710
38925 -3826710 -4067362 -2554565 -2121100 -3136871 -3296464 -1616910 156888 540628 83980
38916 83980 -462061 -1203747 -1546537 -194385 2159952 2695877 521410 -1491735 -757819
38907 -757819 1240316 1378723 -545805 -2005071 -1428027 435810 2163838 2851631 2187006
38898 2187006 894602 612594 1964315 3318187 2788748 870708 -327573 -14226 573428
38889 573428 246589 -588106 -652151 594320 2171362 2327545 483150 -1671882 -1952594
38880 -1952594 -496556 579048 425087 439241 1418153 1974155 1101674 216711 783534
38871 783534 1681825 1109908 -339565 -908523 -847374 -1723149 -3194414 -3155182 -1011355
38862 -1011355 1555791 3201169 4114883 4437317 3680732 2250259 1577112 2021875 2294244
38853 2294244 1621886 902351 944397 1126387 809124 710536 1584537 2481199 1736638 -657049
38843 -657049 -2810116 -3059266 -1560491 338547 1682633 2412705 2482603 1240044 -1535681
38834 -1535681 -4218413 -4284627 -1360493 1767169 2290786 659146 -665019 -904872 -1435752
38825 -1435752 -2803922 -3604447 -2948516 -2000589 -1956679 -2245713 -2174371 -2758988 -4880394
38816 -4880394 -6674527 -5311187 -1323212 1239875 -283265 -4019408 -6373466 -6310225
38808 -6310225 -5334710 -4561709 -3861459 -3327052 -3462266 -3844842 -3460584 -2636864 -2809135
38799 -2809135 -3905392 -3965575 -2243631 -639270 -701293 -1253354 -883959 -799268 -2531556
38790 -2531556 -4367220 -3441308 -682175 16660 -2266592 -4055970 -2965423 -1096083
38782 -1096083 -1155027 -2262773 -2153190 -1230170 -1514562 -2959948 -3675750 -3166383 -2840764
38773 -2840764 -3467697 -4195130 -4207660 -3777623 -3517781 -3714934 -4344845 -4868889 -4393695 -2940184
38763 -2940184 -1959649 -2492668 -3436646 -2956929 -1188215 -151943 -1119191 -3211060 -4581709
38754 -4581709 -4115350 -2120665 -124972 265125 -1042597 -2542797 -3128270 -3369867 -4058506
38745 -4058506 -4493238 -3505546 -1529888 -262498 -505096 -1449830 -1931918 -1526434 -618418
38736 -618418 -64607 -511399 -1623291 -2444579 -2644870 -2491606 -1622252 490377 2507313
38727 2507313 1854999 -1568245 -4527364 -4744433 -3765211 -3670126 -3462413 -1544660 344843
38718 344843 -751707 -4169730 -6473607 -6511773 -6171928 -6418924 -6103012 -4939119 -4395402
38709 -4395402 -4981820 -5418942 -5064180 -4650502 -4289629 -3361899 -2652909 -3741189 -5821154
38700 -5821154 -6130463 -4227472 -2790734 -3210647 -3504559 -2006211 -191663 -54419 -1153337
38691 -1153337 -2086491 -2749624 -3423463 -3575859 -3112035 -2936107 -3010166 -2007087 -118450
38682 -118450 375424 -1064408 -1640399 370346 2323706 1090382 -2103819 -3889552 -3946415
38673 -3946415 -4492410 -5804664 -5901452 -4337649 -3012848 -2955597 -3043106 -2410264 -1870604
38664 -1870604 -2286187 -3201381 -3633217 -3052661 -1491947 233178 637565 -877559 -2865381
38655 -2865381 -3440726 -2647763 -1945013 -1834180 -1533188 -718412 -22601 199405 276559 321213
38645 321213 -28548 -952052 -2294160 -3826914 -5019907 -5110354 -4141441 -3216903 -2941962
38636 -2941962 -2525137 -1325691 -185207 -91727 -666255 -1232892 -2115198 -3347823 -3425398
38627 -3425398 -1274355 1481812 2133368 47634 -3295004 -6294821 -7603793 -6037762
38619 -6037762 -2386286 55126 -687171 -2165180 -996130 1923434 3056826 1945667
38611 1945667 1266272 1658164 922180 -1222287 -2004263 -473382 516985 -1034089 -3207328
38602 -3207328 -3777420 -3587249 -3937361 -3610725 -1366420 910668 552272 -1932814 -3868238
38593 -3868238 -4173958 -3771370 -3256991 -2414552 -1429214 -844484 -844246 -1687254 -3798244 -6364729
38583 -6364729 -7305871 -5925804 -4020804 -3004405 -1867330 226129 1411720 -286400
38575 -286400 -3423178 -4923229 -4293136 -3368363 -2788806 -1612608 -24030 361478 -968796
38566 -968796 -2752691 -3859933 -4069135 -3250634 -1671840 -711131 -1285509 -2057115 -1332592
38557 -1332592 -146152 -912419 -3357197 -4581207 -3247426 -979048 628587 1526587
38549 1526587 1274495 -1303266 -5340606 -7596787 -6515297 -4348235 -3637404 -3754081 -2809913
38540 -2809913 -1072314 -247114 -696575 -1522516 -2465571 -3697915 -4426142 -3680708 -2141981
38531 -2141981 -1402502 -1574362 -1295713 -181914 343822 -783245 -2447594 -2572968 -705866
38522 -705866 1376139 1740878 525016 -454220 -251138 -19505 -1033203 -2439230 -2419957
38513 -2419957 -1089089 -346357 -761523 -667356 887408 2201809 1305401 -1095009 -2592979
38504 -2592979 -2167923 -916889 -278734 -744126 -1962065 -3126978 -3457246 -2861306 -1794412
38495 -1794412 -350907 1494150 2542970 987562 -2674606 -5069447 -3898258 -1071263
38487 -1071263 8354 -898339 -1250886 -3972 1229102 1332513 1368115 2304815 3223310
38478 3223310 2972964 1975785 1048736 -268748 -2629957 -4910120 -5055200 -2894536 -727454
38469 -727454 -649071 -2221786 -3450034 -3395967 -2846254 -2600581 -2357265 -1806738 -1669516 -2442623
38459 -2442623 -2839042 -1150216 1890179 3320928 1547182 -1704601 -3705258 -3704678 -2811504
38450 -2811504 -2146272 -2106407 -2475867 -2388356 -1134041 356381 153827 -1785405 -3073712
38441 -3073712 -2407608 -1754519 -3267717 -5758320 -6519814 -5324922 -4117740 -3766135 -3745219
38432 -3745219 -4242399 -5764206 -7119279 -6627220 -5082547 -4681591 -5236837 -4624263 -3016135
38423 -3016135 -3046394 -5015254 -5622240 -3062345 -80293 211107 -1216298 -1543454 -605775
38414 -605775 -423320 -1638256 -2936666 -3221753 -2427860 -912823 415994 284934 -1232859
38405 -1232859 -2281371 -1869220 -1583221 -3004425 -4859111 -4857268 -3258496 -2303636 -2810763
38396 -2810763 -3618759 -3994234 -4333342 -4533293 -3746154 -2030430 -601966 -161197 -288867
38387 -288867 -596559 -1201642 -1972291 -2467437 -2712167 -3070800 -3450860 -3547759 -3596063 -3888118
38377 -3888118 -3902484 -2950067 -1300638 307841 1653119 2411546 1480564 -1422578 -4168984
38368 -4168984 -4184961 -1757165 451084 951725 549256 53440 -837272 -1942121 -2042946
38359 -2042946 -838144 192690 -172566 -1249235 -1579190 -594551 1377409 3558829 4666638
38350 4666638 3708489 1444973 -136231 -322882 -382924 -1313630 -2446245 -3034990 -3585164
38341 -3585164 -4461219 -4655914 -3377035 -1693743 -1087051 -1270723 -971468 -116693 352699
38332 352699 297161 334175 235971 -978316 -3246802 -5174882 -5830598 -5704918 -5623464 -5739868
38322 -5739868 -5912508 -6102471 -5965659 -4827937 -2498853 421201 3163078 5014955 4973197
38313 4973197 2404766 -1443018 -3804095 -3256553 -1443153 -953787 -2205639 -3573970
38305 -3573970 -3972599 -3792044 -3549345 -3281053 -3405633 -4477870 -5604812 -4861260 -2217253
38296 -2217253 -405924 -1507548 -4061983 -5231193 -4612517 -3871975 -3533034 -2624403 -1214063
38287 -1214063 -714054 -1370653 -1791817 -1476414 -1509731 -2061544 -1684921 -267430 -144361
38278 -144361 -2421203 -4372563 -2919285 804146 2875484 1639160 -1037306 -2892944
38270 -2892944 -3278399 -2345135 -564048 773102 469579 -900093 -1742591 -1840292 -2326246
38261 -2326246 -3265361 -3186989 -1545801 22066 -222632 -1881515 -3056750 -2616216 -1343943
38252 -1343943 -1126919 -2943349 -5370092 -5717896 -3343523 -933232 -1277274 -3631804 -4942521
38243 -4942521 -4014922 -2430260 -1612367 -1286423 -1151816 -1863221 -3445954 -4442600 -3757113
38234 -3757113 -2273206 -1753988 -2821728 -4479206 -5014725 -3348233 -288408 1739605
38226 1739605 1234827 -476788 -1136795 -744302 -992517 -1940139 -1694555 297621 2063456
38217 2063456 1992061 791691 -330383 -1370362 -2312237 -2239443 -1102590 -626813 -1831364
38208 -1831364 -3085168 -2354728 -290168 626433 -749899 -3401846 -5849520 -7232292
38200 -7232292 -7096041 -5449009 -3081436 -1107173 -204263 -472020 -1494193 -2349124 -2309944
38191 -2309944 -1766482 -1683724 -2164870 -2652170 -3421983 -5225478 -7250728 -7413486 -5386439
38182 -5386439 -3460241 -3412177 -4293863 -4465576 -4045353 -3878852 -3643872 -2676072 -1542349
38173 -1542349 -1215279 -1528285 -1686486 -1430492 -732205 502212 1490492 795887 -1388143
38164 -1388143 -2773189 -2106936 -1066898 -1503459 -2635569 -2924646 -2952356 -4039448 -5440051
38155 -5440051 -5526575 -4718713 -4617577 -5038953 -4538239 -3276766 -2707206 -2780190 -2087639 -630789
38145 -630789 78789 -326455 -683757 -534880 -376579 244387 2272546 4596150 4663160
38136 4663160 2205960 -153500 -672267 -387825 -501533 -455720 240290 703025 580344
38127 580344 1013846 2187915 2171483 78120 -1739017 -1008816 642711 -42042 -2873449
38118 -2873449 -4250853 -2076713 1812600 4320698 4179749 2126458 -117181 -649074
38110 -649074 1034812 2712128 1400225 -2636419 -5594084 -4852039 -2179393 -712811
38102 -712811 -534231 329006 1706564 1287491 -1202747 -3096078 -3054390 -3168500 -4877289
38093 -4877289 -5604955 -2529038 2182206 3652294 1128235 -1322128 -1235447 -1026755 -3394045
38084 -3394045 -6767718 -7764926 -5986756 -3802283 -2699225 -2276881 -2157987 -2702192 -3848904
38075 -3848904 -4728253 -4558580 -3266545 -1561198 -775084 -1765017 -3484107 -3770891 -2132928
38066 -2132928 -427706 -192823 -985142 -2144897 -4059003 -6276239 -6583623 -4021919 -989048
38057 -989048 -55592 -311103 612827 2353609 2537798 710374 -1348661 -2616738 -3393131
38048 -3393131 -3421810 -2300805 -1443189 -2699721 -5001559 -5205391 -2587131 123769 608392
38039 608392 -594669 -1945966 -2802476 -2863609 -1943643 -950532 -1119781 -1822493 -1158412
38030 -1158412 891656 2070984 1098871 -807986 -2158214 -2760781 -2590538 -1427604 -331030
38021 -331030 -1101415 -3359794 -4447024 -3229487 -1698009 -1651203 -2206277 -2092215 -2039583
38012 -2039583 -2898493 -3363290 -1911918 320909 911839 -375603 -1516703 -1240550 -377850
38003 -377850 -237839 -975625 -1807197 -2096354 -1974131 -2019917 -2334994 -2294049 -1664013 -1298681
37993 -1298681 -1690667 -1570659 366282 2748194 2617871 -627584 -4347661 -6007030 -5516351
37984 -5516351 -3944567 -2026942 -609021 -584699 -1519406 -1937243 -1532587 -1418493 -1863480
37975 -1863480 -1841216 -1288204 -1528644 -2736828 -3269481 -2385880 -1355779 -965168 -318646
37966 -318646 839190 1110399 8799 -904795 -772660 -832280 -1680360 -1842254 -737855
37957 -737855 -303899 -1655539 -2850531 -2264456 -1522054 -2444746 -3614210 -2967430 -1596840
37948 -1596840 -1764210 -3024425 -3637552 -4170925 -6118334 -8103636 -7128964 -3190174 460488
37939 460488 1460340 234711 -1767692 -3333438 -3513799 -2612250 -2506122 -4091331 -5568562
37930 -5568562 -5253914 -4378464 -4608702 -4791858 -3370882 -2107038 -3485158 -5900670 -5768454
37921 -5768454 -3422181 -2314653 -2937527 -2498667 -696952 -613827 -2923596 -4233784 -2846508
37912 -2846508 -1533360 -2412702 -3380959 -2371572 -1327081 -2633145 -4641503 -4312762 -2196589
37903 -2196589 -1326933 -2466339 -3511640 -2941293 -1375481 -55269 386874 -104592 -1031530
37894 -1031530 -1679230 -2033797 -2575800 -2936690 -2210710 -892849 -561353 -1103688 -549657
37885 -549657 1492547 2769230 1938656 495591 -399886 -2038484 -4871970 -6098583 -3704677
37876 -3704677 -538853 -650714 -3210724 -4018707 -2101192 -680035 -1674383 -3219199 -3398910
37867 -3398910 -2984435 -3163691 -3389070 -3059700 -3124345 -4344356 -5587076 -5370167 -3907972
37858 -3907972 -2391015 -1314783 -658370 -719944 -1564818 -2340871 -2222014 -1564096 -1287246
37849 -1287246 -1551932 -1767789 -1505838 -783150 138498 675273 113864 -1483990 -2942023
37840 -2942023 -3144671 -2261429 -1293016 -788243 -634999 -759373 -1218557 -1722483 -1866449
37831 -1866449 -1891464 -2449898 -3433015 -3822651 -3142634 -2339499 -2494237 -3170099 -3038928 -2003540
37821 -2003540 -1538239 -2541200 -3878582 -3896146 -2703099 -1878109 -2170043 -2645690 -2304007
37812 -2304007 -1516233 -1298368 -1807956 -2249385 -2031654 -1533199 -1774465 -3505369 -6399185
37803 -6399185 -9022508 -9951482 -9113443 -7665133 -6427344 -5092872 -3367066 -2053390
37795 -2053390 -2029309 -2639403 -2415787 -1398890 -1324241 -2947493 -4514032 -4036884 -2165368
37786 -2165368 -1251117 -1974718 -2633061 -1915445 -616816 95173 451752 915751 668875
37777 668875 -1024858 -2898260 -3097030 -2038780 -1800389 -2799775 -3338202 -2766471 -2692132
37768 -2692132 -3991884 -4830606 -3370409 -826372 161962 -892453 -2422865 -3721436
37760 -3721436 -5451383 -7337209 -7631858 -5685614 -3426466 -3085223 -4284389 -4588650 -2780864
37751 -2780864 -542288 -308230 -1974538 -2895989 -1578113 -82033 -1227563 -4182224
37743 -4182224 -5232017 -3184649 -1324791 -2621950 -5357467 -5764692 -3347922 -874913
37735 -874913 2449 233902 601187 228754 -1393643 -2970084 -3080322 -2067391 -1375311
37726 -1375311 -1766136 -2718128 -3070845 -2110596 -456730 361018 -260624 -1162743 -1213223
37717 -1213223 -1090689 -2009674 -3428929 -3737776 -2868897 -2444872 -3291516 -4369912 -4365312
37708 -4365312 -3065747 -1087216 647826 1253912 736174 128044 -242461 -1715471 -4950010
37699 -4950010 -7646206 -6928275 -3470455 -751989 -398543 -873461 -869810 -1146371 -2266526
37690 -2266526 -3081436 -2617961 -1559679 -940049 -1021395 -1959025 -3687439 -4774913 -3588790
37681 -3588790 -1100567 -173621 -1458497 -2563832 -2060792 -1397445 -1610575 -1224320 647774
37672 647774 1934847 821985 -955207 -728035 976554 1691985 1065139 848135 1584729
37663 1584729 1896844 941132 -366536 -651098 535490 2340873 2986663 1430736 -771021
37654 -771021 -763562 1623000 3089207 1326131 -1780601 -3093962 -2371467 -1432847 -1073049
37645 -1073049 -1169524 -2226796 -4261865 -5524229 -4886822 -4181678 -5410536 -6891236 -5350977
37636 -5350977 -1124743 1959097 1712484 -275489 -1644889 -1747325 -949449 156682 562154
37627 562154 -236039 -1194243 -1309419 -1528218 -2910544 -3909749 -2458717 -113869 -599046
37618 -599046 -4146928 -6840924 -6231187 -4207611 -3265886 -3242378 -3279990 -3937997 -5276296
37609 -5276296 -5405792 -3325759 -1290012 -1936485 -4391062 -5516026 -4222226 -2486552
37601 -2486552 -2395196 -3772890 -4771081 -3869068 -1312157 1049402 1645079 888902 251903
37592 251903 -127442 -1422739 -3552419 -4522482 -3270256 -1608234 -2015281 -4490955 -6833261
37583 -6833261 -7373827 -6373407 -5101957 -4354149 -3776226 -2445652 -361426 979693 326988
37574 326988 -1393604 -2188858 -1766490 -1520462 -1823125 -1433806 -73159 620938 -231195
37565 -231195 -1080902 -403992 767418 443894 -1313640 -2664258 -2579650 -1683021 -882230
37556 -882230 -403806 -95155 93057 -88223 -1069868 -2752360 -4051291 -4086176 -3693885
37547 -3693885 -4367004 -5629704 -5286479 -2808382 -547704 -580133 -2083679 -3112315 -3400280
37538 -3400280 -3915105 -4859474 -5585365 -5582937 -4481902 -2182281 72393 229898 -1781071
37529 -1781071 -3388387 -2861295 -1683769 -1788449 -2438915 -2230228 -2340525 -4624249 -7559388
37520 -7559388 -7606672 -4479183 -1796585 -1964996 -3241504 -2849725 -695507 1220621 1430562
37511 1430562 6194 -1853112 -2607103 -1803382 -918334 -1574362 -3078471 -3407687 -2477410
37502 -2477410 -2207990 -3113070 -3391705 -2273633 -1662415 -2896052 -4172240 -3313333 -1344898
37493 -1344898 -901946 -2201441 -3087485 -2527333 -1647680 -1312049 -878844 121185 820514
37484 820514 321502 -985033 -2076720 -2450588 -2171926 -1555745 -1210672 -1687054 -2677588
37475 -2677588 -3193214 -2881789 -2543882 -2977284 -3955737 -4801903 -5334234 -5621465 -5296804
37466 -5296804 -3923602 -1938774 -602597 -867453 -2504048 -4270399 -4830374 -3809828
37458 -3809828 -2177013 -1248574 -1141120 -790478 182820 586283 -460733 -1676203 -1235795
37449 -1235795 178485 -59115 -2628353 -4969850 -4800685 -3059384 -1909840 -1469520 -552091
37440 -552091 524505 377613 -635221 -629574 530303 559074 -1832404 -4862599 -6170602
37431 -6170602 -5793756 -5386542 -5694893 -6107631 -5864139 -4602782 -2416277 -251832 494437
37422 494437 -417547 -1654950 -2134330 -2212207 -2388115 -2238839 -1695888 -1830612 -2852717
37413 -2852717 -2833620 -436402 2322095 2456079 343142 -986763 -523983 -368461 -1888259
37404 -1888259 -3623771 -3963614 -3487147 -3336528 -3230356 -2550248 -1824042 -1678541 -1619283
37395 -1619283 -1234472 -1424888 -2959546 -4709951 -4738513 -2566090 636221 3323591 4150789
37386 4150789 2404270 -863312 -3094732 -2976757 -2091234 -2586364 -4283647 -5592584 -6071333
37377 -6071333 -6104490 -5170020 -2959356 -1501814 -3219440 -6913702 -8664492 -7130322 -4937538
37368 -4937538 -4041423 -3095607 -1116764 -388461 -2794110 -5783077 -5604423 -3080062 -2328384
37359 -2328384 -4312332 -5581125 -3873754 -1304328 -606058 -1276626 -1416506 -974070 -799843
37350 -799843 -224582 1769028 3885281 3629103 922189 -1612426 -2236404 -2059227 -2824013
37341 -2824013 -4350679 -5200765 -4852443 -4073525 -3536849 -2999262 -1914647 -342810 998146
37332 998146 1508477 1362155 1162981 974022 181207 -1366067 -2604668 -2328009 -776261
37323 -776261 554578 656147 -76168 -692996 -813680 -722641 -853433 -1421296 -2266982 -2931355
37313 -2931355 -3090273 -2893973 -2671718 -2483176 -2274386 -2220574 -2473780 -2807580 -2965449 -3029143
37303 -3029143 -2926052 -2149362 -889073 -852204 -3413820 -6964775 -7853057 -4701084 -370856
37294 -370856 1473308 639853 -223150 166219 126029 -1962219 -4678541 -5063240 -2583551
37285 -2583551 -20276 109945 -1266850 -1472543 -153670 420499 -616202 -804213 1920288
37276 1920288 5384823 5561194 1983630 -1883661 -3611070 -4380545 -5896652 -7301588
37268 -7301588 -6769981 -4505049 -2460102 -1985827 -2934345 -4269912 -4663147 -3395689 -1459999
37259 -1459999 -737584 -1420154 -1563458 18674 1999409 2725327 2408374 1703302 -67655
37250 -67655 -3231470 -5794000 -5558959 -3319258 -1714777 -1693511 -2277987 -2957612 -3793679
37241 -3793679 -3817040 -2115336 -241753 -710304 -3085358 -4425458 -3813604 -3376675 -4184978
37232 -4184978 -4364746 -2617941 -707928 -627780 -1682388 -2274636 -2436133 -2537441 -1486887
37223 -1486887 1332837 3779000 3141238 -172546 -3280864 -4498298 -4409113 -3925963 -3355509
37214 -3355509 -3145172 -3697632 -4397216 -4195293 -3052561 -1674373 -252245 1281766 2302932
37205 2302932 2239118 1781329 1820446 1626274 -194443 -3149193 -5039041 -4744490 -3246975
37196 -3246975 -1793985 -655474 65017 -14863 -674106 -1046152 -944886 -1145641 -1995737
37187 -1995737 -2822827 -3041040 -2793381 -2243323 -1346698 -603008 -839518 -1825540 -2205814
37178 -2205814 -1279203 155805 1122871 1591625 1840135 1709943 999290 -236336 -2022042
37169 -2022042 -4097731 -5118921 -3687769 -655888 1145053 303523 -1440257 -1820981
37161 -1820981 -964550 -362121 -221129 391227 1467894 1919111 1367956 640333 355072
37152 355072 109381 -763795 -2355496 -4098179 -4986946 -4189016 -2130586 -633065 -1087847
37143 -1087847 -2632763 -2971152 -1044362 1723672 2913829 1488443 -1241899 -2844982
37135 -2844982 -2234979 -944830 -1311279 -3379454 -4756656 -3950192 -2411051 -2221907 -3055751
37126 -3055751 -2978142 -1427457 260506 836696 153773 -1394958 -2974024 -3233685 -1720647
37117 -1720647 -93055 -309372 -1810630 -2250244 -968318 160498 -379908 -1813238 -2560881
37108 -2560881 -2134541 -1022235 -40230 -145826 -1500593 -2533861 -1573734 433195 839233
37099 839233 -713270 -1616713 -472792 653774 -255755 -1789052 -1444562 461975 1708886
37090 1708886 1684606 1437900 1078265 -256120 -2119010 -2810856 -1870748 -696122 -539554
37081 -539554 -1329038 -2361276 -2820752 -2000281 -461686 -354753 -2793892 -5566803 -5637192
37072 -5637192 -3445721 -2150734 -2738975 -2869230 -1142832 480991 -103664 -2007530 -3101916
37063 -3101916 -2945532 -2275893 -1346686 -562937 -1176608 -3348378 -4807080 -3563046 -1022443
37054 -1022443 -295992 -2071393 -4213102 -4956915 -4389321 -3019925 -1101711 424574 305344
37045 305344 -1193844 -2411105 -2618083 -2654342 -2906033 -2523129 -1431427 -1252318 -2835034
37036 -2835034 -4311475 -3351112 -543249 1197486 300048 -1898359 -3248423 -3139963 -2499238
37027 -2499238 -2412105 -3085048 -3631968 -2958116 -1442167 -1204752 -3409026 -5647134 -4082320
37018 -4082320 1204295 5140114 3517254 -1696518 -5060563 -4558729 -3028675 -3002466 -3393507
37009 -3393507 -2450466 -1135854 -1243967 -1941738 -940368 1576753 2845010 1481557 -705152
37000 -705152 -1548968 -1318016 -1571007 -2567032 -3258288 -3297898 -3694017 -5281294 -7352516
36991 -7352516 -8317431 -7516452 -5903423 -4756694 -4212392 -3708762 -3422197 -3928949 -4408604
36982 -4408604 -3051977 -159839 1099850 -1187707 -4406849 -4698480 -2404615 -1230555
36974 -1230555 -2432476 -3289171 -1913605 -202218 -480218 -2002595 -2775313 -2685002 -2710057
36965 -2710057 -2720708 -2134404 -1408230 -1047549 -497445 252334 -363985 -2802520 -4411778
36956 -4411778 -2793322 191076 741655 -1531530 -3741849 -4497105 -5001124 -5528092 -4572102
36947 -4572102 -2207628 -776383 -1017896 -777872 868334 1402475 -1039732 -4167823 -4842801
36938 -4842801 -3644065 -3114015 -3182519 -1804110 687225 1398632 -741469 -3368083 -4152149
36929 -4152149 -3526639 -3054896 -3101126 -3318301 -3925201 -5102198 -5954154 -5282421 -3126733
36920 -3126733 -878319 2519 -788721 -2104008 -2269234 -805568 873240 1066583 -213030
36911 -213030 -1691240 -2817926 -3917793 -4602433 -3900697 -2306887 -1739560 -2638297 -3043135
36902 -3043135 -1813255 -781206 -1783189 -3270098 -2509382 -117000 613351 -1347358
36894 -1347358 -3511466 -3944977 -3640725 -3849347 -3850340 -2998752 -2540000 -3269531 -3379697 -1130365
36884 -1130365 1777198 2168606 -147559 -2521233 -3503549 -4010774 -4522074 -3890288 -1627896
36875 -1627896 807360 1900808 1689315 930146 145239 -130146 351291 737105 63775
36866 63775 -1002532 -1253303 -1444541 -3084231 -4782068 -3345102 584260 1934655 -1573160
36857 -1573160 -5298696 -4080143 220851 1728806 -839146 -3183163 -2312393 72597
36849 72597 1425507 1595750 1179164 -52237 -1637493 -1939397 -611506 502268 145528
36840 145528 -545390 -121101 1086182 2069695 2665155 2782856 1665251 -801260 -3216677
36831 -3216677 -4198957 -3828852 -2926427 -2112966 -2117291 -3429375 -4891924 -4333671 -1594548
36822 -1594548 768921 917058 81867 112802 552387 84744 -698040 -345219 667457
36813 667457 660230 -267641 -370279 738616 1496446 1114095 792430 1466406 2048120 1039032
36803 1039032 -1202850 -2955675 -3341725 -3045382 -2930938 -2739074 -1603540 320822 1408973
36794 1408973 380300 -1694077 -2263820 -510224 1390479 1002589 -1259121 -2873051
36786 -2873051 -2517028 -1367581 -1198325 -2290532 -3468582 -3499587 -2226179 -704203 -254615
36777 -254615 -1137825 -2374072 -3078532 -3430678 -3860444 -3960165 -3092373 -1670998 -830485
36768 -830485 -916682 -1185035 -1005365 -536252 -64628 533829 1270912 1500601 498435 -1376856
36758 -1376856 -2497167 -1470175 956069 2062855 27398 -3634433 -5563042 -4551210
36750 -4551210 -2799392 -2777932 -4195555 -4988792 -4176607 -2511811 -1082721 -520998 -1047274
36741 -1047274 -2094239 -2308260 -1107159 105245 -526387 -2777373 -4499249 -4183079 -2271693
36732 -2271693 -25125 1727514 2584688 2453752 1843457 1515461 1486866 910075 -798478
36723 -798478 -3072693 -4587615 -4390854 -2780599 -1176823 -777448 -1256892 -1384596 -967805
36714 -967805 -1120026 -2272007 -3299310 -3426190 -3543862 -4418152 -5029594 -4355294 -3480358
36705 -3480358 -3813640 -4242132 -2645524 229399 1195447 -853590 -3427096 -4111512 -3444481
36696 -3444481 -3098035 -3190954 -2801509 -1811596 -933697 -679642 -1122184 -2011046 -2695201 -2681893
36686 -2681893 -2424423 -2661551 -3115293 -3079567 -3007339 -3773111 -4520903 -3467218 -1101759
36677 -1101759 -114332 -1354314 -2338963 -1035029 1200745 2087647 1742226 1580239 1588895
36668 1588895 823256 -505940 -1301869 -1105968 -57339 1500015 2271500 640863 -2492026
36659 -2492026 -3594991 -1240494 1225325 394539 -1919199 -1529341 1578734 3557095
36651 3557095 2747588 1199305 200612 -1367959 -3409595 -3475299 -919063 1252760 661189
36642 661189 -1176827 -1797205 -1304102 -824133 -24370 1345556 1672574 -144 -1494364
36633 -1494364 -440649 1769251 2056030 587055 274989 1774339 2429189 668656 -1604442
36624 -1604442 -2135277 -1441039 -1376975 -2253896 -2889415 -2603035 -1943807 -1769814 -2181435 -2212127
36614 -2212127 -790219 1381209 1532662 -2129116 -7325647 -9490588 -6984139 -2806533
36606 -2806533 -608082 -891878 -2127827 -3602496 -5288923 -6216317 -5261721 -3231547 -2216675
36597 -2216675 -2733435 -3077820 -1897596 -57873 750184 317276 -44473 629047 1808594
36588 1808594 2263039 1596434 701032 606419 1081453 825825 -774199 -2529392 -2583532
36579 -2583532 -546186 1924630 2708681 1175806 -1409519 -3207742 -3434322 -2689556 -1824403
36570 -1824403 -997871 -268764 -510706 -2552892 -5374953 -6498960 -4870704 -2359111 -1514595
36561 -1514595 -2602286 -3805467 -3717322 -2540744 -1236022 -545111 -618589 -729393 267871
36552 267871 2263582 3224329 1484514 -1642005 -3034998 -1534249 916216 2035121
36544 2035121 1639849 923784 692008 979072 1376207 1187439 185313 -467486 772784
36535 772784 3439080 4941440 3543951 331409 -2448782 -3763679 -3725807 -2545236 -802952
36526 -802952 270163 104644 -358337 -217014 -125977 -1039730 -2312820 -2503018 -1467473
36517 -1467473 -280455 410619 614144 143975 -1019663 -1978810 -1968710 -1732899 -2404458
$$ [...]
##END NTUPLES=NMR SPECTRUM
##END=
