##TITLE=31Pdec_SR167RTFA
 CDCl3, 64 sc
 19.4.2023
##JCAMPDX= 6.0         $$ Bruker NMR JCAMP-DX V2.0
##DATA TYPE= NMR SPECTRUM
##DATA CLASS= NTUPLES
##ORIGIN= UXNMR, Bruker Analytische Messtechnik GmbH
##OWNER= root
$$ XWIN-NMR		Version 3.5
$$ Wed Apr 19 16:25:48 2023 Russian Standard Time (UT+4h)  she@DPX200
##.OBSERVE FREQUENCY= 81.013821
##.OBSERVE NUCLEUS= ^31P
##.ACQUISITION MODE= SIMULTANEOUS
##.ACQUISITION SCHEME= undefined
##.AVERAGES= 64
##.DIGITISER RES= 16
##SPECTROMETER/DATA SYSTEM= spect
##.PULSE SEQUENCE= zgpg30
##.SOLVENT NAME= CDCl3
##.SHIFT REFERENCE= (INTERNAL, CDCl3, 0, 248.564)
##AUDIT TRAIL= $$ (NUMBER, WHEN, WHO, WHERE, WHAT)
$$ ##TITLE= Audit trail, XWIN-NMR		Version 3.5
$$ ##JCAMPDX= 5.01
$$ ##ORIGIN= Bruker BioSpin GmbH
$$ ##OWNER= she
$$ F:/spectra/data/she/nmr/P31/1/pdata/1/auditp.txt
$$ ##AUDIT TRAIL=  $$ (NUMBER, WHEN, WHO, WHERE, WHAT)
(   1,<2023-04-19 16:25:10.79 +0400>,<she>,<DPX200>,
      <continue with go, POWCHK disabled, PULCHK disabled
       configuration hash MD5:
       00 E9 B6 7A A2 85 ED C7 34 08 36 98 17 FE 4E 26
       data hash MD5: 32K
       8F AB 71 E0 DC A9 20 93 F7 B0 BF 07 AB 48 99 E6>)
(   2,<2023-04-19 16:25:12.78 +0400>,<she>,<DPX200>,
      <Start of raw data processing
       efp BC_mod = 2 LB = 1 FT_mod = 6 PKNL = 1 PHC0 = -10973.29 PHC1 = 84.28488 SI = 64K 
       data hash MD5: 64K
       CF 0F 87 34 27 B6 79 73 30 6A FD E8 2F EC E7 5B>)
(   3,<2023-04-19 16:25:24.68 +0400>,<she>,<DPX200>,
      <abs ABSG = 5 
       data hash MD5: 64K
       53 4C CE A8 9D E9 A9 71 37 10 E4 19 C9 4E 28 50>)
$$ ##END=
$$ 
$$ hash MD5
$$ 09 9E CD 4A CC A3 24 E8 CB FA A4 9A 27 62 90 A5
##$RELAX= 
##$RELAX= 
##$RELAX= 
##$RELAX= 
##$RELAX= 
##$RELAX= 
##$RELAX= 
##$RELAX= 
##$RELAX= 
$$ Bruker specific parameters
$$ --------------------------
##$DU= <F:/spectra>
##$EXPNO= 1
##$NAME= <P31>
##$PROCNO= 1
##$TYPE= <nmr>
##$USER= <she>
##$AMP= (0..31)
100 100 100 100 100 100 100 100 100 100 100 100 100 100 100 100 100 100 
100 100 100 100 100 100 100 100 100 100 100 100 100 100 
##$AQSEQ= 0
##$AQ_mod= 1
##$AUNM= <au_zg>
##$AUTOPOS= <>
##$BF1= 81.014009
##$BF2= 200.13
##$BF3= 200.13
##$BF4= 200.13
##$BF5= 200.13
##$BF6= 200.13
##$BF7= 200.13
##$BF8= 200.13
##$BYTORDA= 1
##$CFDGTYP= 0
##$CFRGTYP= 5
##$CHEMSTR= <none>
##$CNST= (0..31)
1 1 145 1 1 1 1 1 1 1 1 1 1 1 1 1 1 1 1 1 1 1 1 1 1 1 1 1 1 1 1 1 
##$CPDPRG= <waltz16>
##$CPDPRG1= <>
##$CPDPRG2= <waltz16>
##$CPDPRG3= <>
##$CPDPRG4= <mlev>
##$CPDPRG5= <mlev>
##$CPDPRG6= <mlev>
##$CPDPRG7= <mlev>
##$CPDPRG8= <mlev>
##$CPDPRGB= <>
##$CPDPRGT= <>
##$D= (0..31)
0 1 0 0 0 0 0 0 0 0 0 0.03 2e-05 3e-06 0 0 0 0 0 0 0 0 0 0 0 0 0 0 0 0 
0 0 
##$DATE= 1681907037
##$DBL= (0..7)
120 120 120 11 120 120 24 19 
##$DBP= (0..7)
150 150 150 150 150 150 150 150 
##$DBP07= 0
##$DBPNAM0= <>
##$DBPNAM1= <>
##$DBPNAM2= <>
##$DBPNAM3= <>
##$DBPNAM4= <>
##$DBPNAM5= <>
##$DBPNAM6= <>
##$DBPNAM7= <>
##$DBPOAL= (0..7)
0.5 0.5 0.5 0.5 0.5 0.5 0.5 0.5 
##$DBPOFFS= (0..7)
0 0 0 0 0 0 0 0 
$$ [...]
##$SUBNAM3= <"">
##$SUBNAM4= <"">
##$SUBNAM5= <"">
##$SUBNAM6= <"">
##$SUBNAM7= <"">
##$SUBNAM8= <"">
##$SUBNAM9= <"">
##$SW= 501.771253377433
##$SWIBOX= (0..15)
0 1 3 0 0 0 0 0 0 0 0 0 0 0 0 0 
##$SW_h= 40650.406504065
##$TD= 32768
##$TD0= 1
##$TE= 0
##$TE2= 300
##$TE3= 300
##$TEG= 300
##$TL= (0..7)
0 120 53 12 22 120 120 120 
##$TP= (0..7)
150 150 150 150 150 150 150 150 
##$TP07= 0
##$TPNAME0= <>
##$TPNAME1= <>
##$TPNAME2= <>
##$TPNAME3= <>
##$TPNAME4= <>
##$TPNAME5= <>
##$TPNAME6= <>
##$TPNAME7= <>
##$TPOAL= (0..7)
0.5 0.5 0.5 0.5 0.5 0.5 0.5 0.5 
##$TPOFFS= (0..7)
0 0 0 0 0 0 0 0 
##$TUNHIN= 0
##$TUNHOUT= 0
##$TUNXOUT= 0
##$USERA1= <user>
##$USERA2= <user>
##$USERA3= <user>
##$USERA4= <user>
##$USERA5= <user>
##$V9= 5
##$VALIST= <valist>
##$VCLIST= <CCCCCCCCCCCCCCC>
##$VD= 0
##$VDLIST= <DDDDDDDDDDDDDDD>
##$VPLIST= <PPPPPPPPPPPPPPP>
##$VTLIST= <TTTTTTTTTTTTTTT>
##$WBST= 1024
##$WBSW= 4
##$XGAIN= (0..3)
0 0 0 0 
##$XL= 0
##$YL= 0
##$YMAX_a= 2451
##$YMIN_a= -6667
##$ZGOPTNS= <>
##$ZL1= 120
##$ZL2= 120
##$ZL3= 120
##$ZL4= 120
##$ABSF1= 248.5645
##$ABSF2= -253.2056
##$ABSG= 5
##$ABSL= 3
##$ALPHA= 0
##$AQORDER= 0
##$ASSFAC= 0
##$ASSFACI= 0
##$ASSFACX= 0
##$ASSWID= 0
##$AUNMP= <proc_1d>
##$AZFE= 0.1
##$AZFW= 0.5
##$BCFW= 0
##$BC_mod= 2
##$BYTORDP= 0
##$COROFFS= 0
##$CY= -3
##$DATMOD= 1
##$DC= 0
##$DFILT= <>
##$DTYPP= 0
##$F1P= 0
##$F2P= 0
##$FCOR= 1
##$FTSIZE= 65536
##$FT_mod= 6
##$GAMMA= 0
##$GB= 0
##$INTBC= 1
##$INTSCL= 6.047779e-11
##$ISEN= 30
##$LB= 1
##$LEV0= 0
##$LPBIN= 0
##$MAXI= 10000
##$MC2= 0
##$MEAN= 0
##$ME_mod= 0
##$MI= 50
##$NCOEF= 0
##$NC_proc= -10
##$NLEV= 6
##$NOISF1= 182.463
##$NOISF2= 159.3651
##$NSP= 0
##$NTH_PI= 0
##$NZP= 0
##$OFFSET= 248.5645
##$PC= 4
##$PHC0= -10973.29
##$PHC1= 84.28488
##$PH_mod= 1
##$PKNL= yes
##$PPARMOD= 0
##$PSCAL= 0
##$PSIGN= 0
##$REVERSE= no
##$SF= 81.0140089999694
##$SI= 65536
##$SIGF1= 159.3651
##$SIGF2= -187.1042
##$SINO= 113.3802
##$SIOLD= 16384
##$SREGLST= <1H.CDCl3>
##$SSB= 0
##$STSI= 65536
##$STSR= 0
##$SW_p= 40650.406504065
##$SYMM= 0
##$S_DEV= 0
##$TDeff= 32768
##$TDoff= 0
##$TI= <>
##$TILT= no
##$TM1= 0
##$TM2= 0
##$TOPLEV= 0
##$USERP1= <user>
##$USERP2= <user>
##$USERP3= <user>
##$USERP4= <user>
##$USERP5= <user>
##$WDW= 1
##$XDIM= 65536
##$YMAX_p= 222826355
##$YMIN_p= -177953817
$$ End of Bruker specific parameters
$$ ---------------------------------
##NTUPLES= NMR SPECTRUM
##VAR_NAME=  FREQUENCY,     SPECTRUM/REAL,   SPECTRUM/IMAG
##SYMBOL=    X,             R,               I
##VAR_TYPE=  INDEPENDENT,   DEPENDENT,       DEPENDENT
##VAR_FORM=  AFFN,          ASDF,            ASDF
##VAR_DIM=   65536,         65536,           65536
##UNITS=     HZ,            ARBITRARY UNITS, ARBITRARY UNITS
##FACTOR=    0.620285442955139, 1,           1
##FIRST=     20137.2065510682, 0,            0
##LAST=      -20513.1999529968, 0,           0
##MIN=       -20513.1999529968, -177953817,  0
##MAX=       20137.2065510682, 222826355,    0
$$ Real data points
##PAGE= N=1
##DATA TABLE= (X++(R..R)), XYDATA
$$ [...]
##PAGE= N=2
##DATA TABLE= (X++(I..I)), XYDATA
12137d6810517j2469405J2910700L2313771K8321180J1440866J568200j694928
12130B5579867j2212315k7368328k6607606l791137J8612792K0002987J0628872
12123D845132J0992705J4401102j245730k7359819k6508809Q356532L2639131
12116A6120244J2332469k4136301l0217103j0515038j894309m912850J1314730
12109c1908158M1087068L7936020r397582m9546836l9830809j592660K1226042
12102c2026915K0048503R935296m676322k0178377j9122681K022431J5458384
12095b8539681K851578j1842865j659452J7839282J7679718M773398K491480M763532
12087H356990o765807j8938497p737795J2013282P770814j0184603l120175K5073362
$$ y = [-46810517, -59279922, -46369222, -14055451, 14265729, 25706595, 27274795, 25579867, 13367552, -14000776, -40608382, -44399519, -25786727, -5783740, 4845132, 15837837, 30238939, 28993209, 1633390, -24875419, -16518887, 16120244, 28452713, 4316412, -25900691, -36415729, -38310038, -43222888, -31908158, 9178910, 47114930, 37717348, -11829488, -51660297, -53252957, -32026915, -11978412, -2043116, -6719438, -26897815, -46020496, -43998065, -28539681, -25688103, -37530968, -39190420, -21351138, -3671420, 1101978, 3593458, 8356990, 1591183, -17347314, -25085109, -13071827, -5301013, -15485616, -18605791, 6467571]
12079F467571K8321131m011538k6135951q668252J8327808J8280431O41415o194620
12071B7027995J218556J0639560J6878610J2696228j2320484m2186098l8139504
12064b4185137K029283K4760772m240566m0552001k3447318K8116476L9735310
12057B216819o118905m2027875j3361492M5941648O4306507K6213004j9954590
12050E7215116l1484707j4233037K822231O587712J872110o961036j8396442k4493329
12042b7071382j6414788j51501P373593J319741n515514m793282l978561o904463
12034e6136157j891885J5185018K4399363J0369981q528129o311350R110374J2412315
12026a390470O760166J3691003K3852590N621854l2744188m0777886l067664K9567276
$$ y = [6467571, 34788702, 30777164, 4641213, -4027039, 14300769, 32581200, 33222615, 27027995, 28246551, 38886111, 55764721, 68460949, 56140465, 13954367, -24185137, -22155854, 2604918, -1635648, -42187649, -65634967, -37518491, 2216819, -3902086, -45929961, -59291453, -13349805, 50956702, 77169706, 57215116, 25730409, 11497372, 14319603, 20907315, 22779425, 15818389, -2578053, -27071382, -43486170, -43637671, -36264078, -34944337, -40459851, -45253133, -49231694, -56136157, -58028042, -42843024, -18443661, -8073680, -16601809, -22913159, -13802785, -1390470, 5369696, 19060699, 42913289, 48535143, 15790955, -24986931, -28054595, 1512681]
12018A512681J4289560k1027640k5511534n22639J4985081Q538155o16514l654061
12010a2006911p138452o435738O199761J4420644k866042k9778956k9671868j761059
12002f9038621J7299528J1551727O041341J8802188K9794796J6834621o697018
11995B4588562j3881525m909457j611480j0814139j4792156J008165K4667098
11988D255068K9874262R135646j3422735j1409815O479621P415935j4549964k5384229
11980g606211m129171J9989151J2337792r989194o021605K0203546K6648542M335931
11972E5768781j0366908j819752j277837k6414975m2459706j7292647K1348966
11965b2514078K4513600n539148k3462004r849964P784277L294344j1916998j0535595
$$ y = [1512681, 15802241, -5225399, -30736933, -31259572, -16274491, -7736336, -8352850, -12006911, -19145363, -25581101, -19381340, -4960696, -7826738, -37605694, -67277562, -69038621, -51739093, -40187366, -34146025, -15343837, 14450959, 31285580, 24588562, 10707037, 5797580, 4186100, -6628039, -21420195, -20412030, 4255068, 34129330, 43264976, 29842241, 18432426, 24912047, 32327982, 17778018, -7606211, -11735382, 8253769, 20591561, 10602367, 4580762, 24784308, 51432850, 55768781, 45401873, 43582121, 42304284, 15889309, -26570397, -43863044, -22514078, 1999522, -3539626, -27001630, -36851594, -29067317, -25772973, -37689971, -48225566]
11957d8225566J3404056L9406635M3252272J9985419j1003619k4034867j3204478
11950A9579852L777778R434055M635998j058465m322898n263675k336819k57720
11942B4188106j0391278l0679580l7429174j3551143K3260432L7854354J9447818
11935A2699535q616473j9081728q021916Q016819J2335809M148305j788238O527360
11927F219473K0744689K1705495P165560m730099m177048l489320j2339913j9312662
11919A1786175j4187927r358957j7151027k2576267o354085J6693860J4338599
11912b6809629j2188264k6850229j1346033J2184652J9890547J8460682K2806748
11905c851526K5750835J2509572q887604j5197304j695873J0991957O037777p426559
$$ y = [-48225566, -34821510, 4585125, 47837397, 67822816, 56819197, 32784330, 19579852, 23357630, 32791685, 37427683, 36369218, 32046320, 26782645, 24445826, 24188106, 13796828, -16882752, -54311926, -67863069, -44602637, -6748283, 12699535, 4083062, -14998666, -23020582, -15003763, -2667954, 1480351, -307887, 6219473, 26964162, 48669657, 55835217, 51105118, 46928070, 43438750, 31098837, 11786175, -2401752, -11760709, -28911736, -51488003, -57842088, -41148228, -26809629, -38997893, -65848122, -77194155, -65009503, -45118956, -26658274, -3851526, 21899309, 34408881, 25521277, 10323973, 8628100, 19620057, 25657834, 18231275]
11897A8231275q105399Q353639K2925741J6880408n435957k4284684k9578278
11890a013255k5497265j2798429J2492405L6882987L1769722m031803k8285621
11883I518741r695755K2218588J8503205j3465912k3241036j278926O898269j7951867
11875h494693l2002950l119303L0297733K1047032q078869m825201K1254888J4677107
11867C0755744k8402455m7172182j1144956L3048846L4181482N461903j0879349
11860E849033p541734l581685k362408K776974K196317j2650658k1419523k186910
11852c8920594K5488334K4124574k144429j2842200M658732J8714218Q584848
11845B7663483n805850n527710n362275j9737890k8372111q803834J9151656J7869465
$$ y = [18231275, 10125876, 18479515, 41405256, 58285664, 52849707, 28565023, -1013255, -26510520, -39308949, -26816544, 10066443, 41836165, 37804362, 9518741, -177014, 22041574, 40544779, 27078867, 3837831, 2558905, 9457174, -8494693, -40497643, -43616946, -13319213, 7727819, -351050, -5176251, 16078637, 30755744, 2353289, -44818893, -55963849, -22915003, 11266479, 16728382, 5849033, -1692701, -5274386, -7636794, -4859820, -2663503, -15314161, -36733684, -38920594, -13432260, 10692314, 8547885, -4294315, 364417, 19078635, 27663483, 21857633, 16329923, 10967648, -8770242, -37142353, -45946187, -26794531, -8925066]
11837h925066j0303630k4682920m126881K6634515L3490739J2755543j3136040
11830A1706260k3256934j3694324M119535J4880051J4203901J1607958J4566700
11823C4133147J6131220O691488r649294k1151658k3255645j6880698k678702
11816a6660142J0501391N935684j4576058k1123546L468017L0050950K2191274
11809A9787570o091978j2007403O293869J0416661q359121j4140284P142448K1319984
11801B4361746Q159274l517870N758628N074783k6501990m6936742j4732686L2641831
11793a5693026K9330853j4414268k8433103O803233L6435366K2449007p035038
11786B9443024j5823106r705656n246442L004513J6991681J6528710n994633k4055439
$$ y = [-8925066, -19228696, -43911616, -48038497, -21403982, 12086757, 24842300, 11706260, -11550674, -25244998, -21125463, -6245412, 7958489, 19566447, 34133147, 50264367, 56955855, 47306561, 26154903, 2899258, -13981440, -16660142, -6158751, -223067, -14799125, -35922671, -32454654, -2403704, 19787570, 13695592, 1688189, 7982058, 18398719, 10039598, -4100686, 3041762, 24361746, 32521020, 29003150, 34761778, 39836561, 13334571, -33602171, -48334857, -15693026, 13637827, -776441, -29209544, -22406311, 14029055, 36478062, 29443024, 13619918, 3914262, -1332180, 1672333, 18664014, 35192724, 29198091, 5142652]
11778E142652j5349484N180616J1998186L406345q827527j8711114j9055273k712650
11770c8928249J4930273O401191j9702238j8988894J8707354M1844437J2759563
11763A7023437k9016429k3379495K1000476M4426459K3991925p539334k1419547
11756B5087492k2614033k0114765j0632867K065647N282048M5067j486143q79366
11748b3246920p853509j3128650J068812K4168761K5258870J812386j3181314
11741e101564j158530J5824983J1039282j0533486k5408434k1892195n909822
11734d3139766R157870J2011781L952772p49862M268896O391725j11779L885052
11726d333311K6422943L3032287m883052m8213352l5200972J8702714L5338265
$$ y = [5142652, -10206832, -5026216, 6971970, 10378315, 1550788, -17160326, -36215599, -38928249, -23997976, -17596785, -37299023, -56287917, -37580563, 4263874, 17023437, -11992992, -35372487, -14372011, 30054448, 54046373, 46507039, 25087492, 2473459, -17641306, -28274173, -26208526, -20926478, -20881411, -22367554, -23246920, -31100429, -44229079, -43160267, -18991506, 6267364, 8079750, -5101564, -6260094, 9564889, 20604171, 10070685, -15337749, -37229944, -43139766, -33981896, -21970115, -18017343, -18767205, -14498309, -8106584, -8218363, -4333311, 22089632, 55121919, 50238867, 2025515, -33175457, -14472743, 20865522]
11719B0865522m346993l0095042l88191K8978057L945766l2794305j6933370K4067310
11711f701246J9064675k1522960k3312666K2618237M3761272R080249k1386250
11704B1601311J012913L7665980L1953307n211765k7057169k3335282j3453650
11697B3175645k074892J2103576J0701049j6346811l9154744k7308791j177333
11690d0082301N98649j2914948j979354L0932428M0624146J4237907p237299K454802
11682B6634030J3463849o812597l8065525l8784128q187327J7904965J8707881
11675a5138852N305629o201397j0527373m277048J4264507L2513588K9372447
11668D5311501J342734k7925563l1552347q667775J4715426J4040236o138994
$$ y = [20865522, 16518529, -13576513, -13964704, 15013353, 18959119, -13835186, -30768556, -6701246, 12363429, -9159531, -32472197, -9853960, 33907312, 42987561, 21601311, 22614224, 60280204, 92233511, 87021746, 59964577, 36629295, 23175645, 21100753, 33204329, 43905378, 27558567, -11596177, -38904968, -40082301, -39483652, -52398600, -54377954, -23445526, 17178620, 31416527, 24179228, 26634030, 40097879, 33285282, -4780243, -43564371, -51751698, -33846733, -15138852, -9833223, -16034620, -26561993, -30839041, -16574534, 15939054, 45311501, 46654235, 18728672, -12823675, -21491450, -6776024, 7264212, 1125218]
11661A125218j7221378k694298J8882785J8979132k21596j1268056n507717l383398
11653a309308j3512154j3465561R399235K7340773J1829385j8598388k4888458
11646b3204476o431022M639493r51415q33310J2875787J9411374Q604585k301006
11638A1810010k075861k622857j0197066j1221512j055845L845314k034554n14370
11630a4066741J3232866J4074845r295711k6395759j0385575J6884081J8674450
11623B722456j652223j4537721j2112397n089287R013031L3009047M0370229M925808
11615E6648943m6044301n5415056j5354494K0669423J3255971j5396585k3208133
11608f4844232l584896J9111877K5273767J4739916J094692K5983J1749970J6727664
$$ y = [1125218, -16096160, -18790458, 92327, 19071459, 18849863, 7581807, 2074090, -1309308, -14821462, -28287023, -18887788, 8452985, 20282370, 1683982, -23204476, -29635498, -24996005, -25947420, -26780730, -13904943, 5506431, 14111016, 11810010, 9734149, 7111292, -3085774, -14307286, -15363131, -11517817, -13552371, -14066741, -833875, 13240970, 3945259, -22450500, -32836075, -15951994, 2722456, 1070233, -13467488, -25579885, -30669172, -21656141, 11352906, 51723135, 56648943, 10604642, -44810414, -60164908, -39495485, -26239514, -41636099, -64844232, -68429128, -49317251, -24043484, -9303568, -8208876, -8182893, 3567077, 20294741]
11600B0294741L973515o609154N391933K1184440Q821385k0770557k7774766r721177
11592e209640l304057j6444779j4741738J0242935J8162598q248583k5455932
11585d4999196q74795K9594964K2457143j052581J026479J3664372l967597l5656948
11577a9808159k7321951K0266929M6431682K3004721r420618j1231967M146296
11570B6066933Q418083L035481L34338m419951j6389820k3227559j6149015p419405
11562b9750915q566836j1150616n343343J681387J403729Q5853M999267J1348412
11554c5293062J5012723K0234604K3390379J0451619j5235482k5554859p011357
11547a4005435J3991099Q576185j0936311j2897104K468082O457598r201306k0061424
$$ y = [20294741, 24268256, 17659102, 23051035, 44235475, 53056860, 32286303, 4511537, -5209640, -8513697, -24958476, -39700214, -29457279, -11294681, -19543264, -44999196, -45873991, -16279027, 6178116, 5125535, 6152014, 19816386, 15848789, -19808159, -47130110, -26863181, 19568501, 42573222, 33152604, 21920637, 26066933, 34485016, 37520497, 37854835, 33434884, 17045064, -6182495, -22331510, -29750915, -38317751, -49468367, -54811710, -53130323, -51726594, -51640741, -46641474, -35293062, -20280339, -45735, 23344644, 33796263, 18560781, -6994078, -14005435, -14336, 8561849, -2374462, -15271566, -12803484, -6345886, -15547192, -35608616]
11539c5608616r312447Q237088J2389032N187555m34573k427869n494816o685485
11531c4150131L99329J2755441K0303347J7395813M773280j3943569k9407678
11524b1874168k7395703m986601J7945736J7658101k803523j5930462n838755
11517d3225375J2615262J8068794J1517363P617121P764108J11102j6421049k5825349
11509b7778023j6427969L613766J6566694J2408970n701378k3952025k4914341
11502f6184306k967235K4874231L4101901K1051946M931523k33747q82914n660159
11494I031240q091104L87466J1473175Q891171p920584k0629471j2847210J1123030
11486h582287K8746868K1363885l138619j5357569r81272J6222043O017985k0592239
$$ y = [-35608616, -44921063, -36683975, -24294943, -19107388, -19541961, -21969830, -27464646, -34150131, -33750802, -20995361, -692014, 16703799, 21477079, 7533510, -21874168, -49269871, -54256472, -36310736, -18652635, -21456158, -37386620, -43225375, -30610113, -12541319, -1023956, 6593165, 14357273, 14468375, -1952674, -27778023, -44205992, -40592226, -24025532, -11616562, -17317940, -41269965, -66184306, -69151541, -44277310, -10175409, 10876537, 15808060, 15574313, 14691399, 9031240, 940136, 1327602, 12800777, 21691948, 13771364, -6858107, -19705317, -8582287, 20164581, 41528466, 38389847, 23032278, 22051006, 38273049, 44291034, 23698795]
11478B3698795k3260830O617370K9921943J7506332q741058j4875322o125350
11471B4741880q081506j7888802j1469420J0041689J7760124K01970j9005059
11464c699124j5530536M928112J8019867R531066j1264226j9588391p4926K9286427
11456A1608269K9822935q395676m5118553l8772833l185905J2289045q475416
11449e0228134l1237825k3971822L603764K2183795K1125272J1644119O467428
11442d0413403P984983J0122301O338100j907800o854244p061096r214359j2182183
11434e3187701m298733J3086723J8042115R94578j4140302m892456J2114279P707597
11426b4573900j0774125j1555183R102618K2367230J2649130m988510j4185126
$$ y = [23698795, 437965, 7055335, 36977278, 54483610, 45742552, 30867230, 24741880, 16660374, -1228428, -12697848, -2656159, 15103965, 15305935, -3699124, -19229660, -14301548, 3718319, 13249385, 1985159, -17603232, -17678158, 11608269, 41431204, 33035528, -12083025, -50855858, -54041763, -41752718, -50228134, -81465959, -105437781, -101834017, -79650222, -58524950, -46880831, -40413403, -32428420, -22306119, -15968019, -17875819, -24730063, -31791159, -41005518, -53187701, -57486434, -44399711, -26357596, -25363018, -39503320, -44395776, -32281497, -24573900, -35348025, -46903208, -37800590, -15433360, -2784230, -7772740, -21957866]
11419b1957866j4831403j0040988j544578K582329j041878J495013J7766767K4883668
11411b688936J962229k6012890j8446831J4778543K4788581J17746j8195062m535484
11403b8232104J6605668J6814385J401009j3375343k1822516j6144232Q684175
11396c6068958K8576836J1663867k5038579k7803042J2651814M3197277K8872739
11389C6051954j038443j0166663n943148n657179k088685N910299l584785l0282320
11381a6798970l6697840r592951J3614710J1369976J4067753L6289852L6806172
11374D9058702l548432k8646042M124486M1608087J7838475l2408301l0204972
11367A7822003J6828653L4466066P504122j0209815o6483J28038k0322075k6944926
$$ y = [-21957866, -36789269, -46830257, -48374835, -45792506, -46834384, -45339371, -27572604, -2688936, -726707, -26739597, -45186428, -30407885, -5619304, -5501558, -23696620, -28232104, -11626436, 5187949, 6588958, -6786385, -28608901, -44753133, -36068958, -7492122, 4171745, -20866834, -48669876, -36018062, 7179215, 36051954, 35013511, 24846848, 18903700, 13246521, 11157836, 17068135, 13483350, -16798970, -53496810, -63089761, -49475051, -38105075, -24037322, 12252530, 49058702, 45510270, 16864228, 20988714, 62596801, 80435276, 48026975, 17822003, 34650656, 69116722, 76620844, 66411029, 66344546, 66472584, 46150509, 19205583]
11359A9205583j2664681q642639j4488586M005517L7490486L3736536q652404
11352D9989812k7774912j705161J6255126n047326k2438675l561297J2464612
11345A8182179r187819l0594449q390491K6589065K1450179j0535770j8646581
11338a1133687P14068J0691153K373417j991901Q96775m979650j4899716r624472
11330b7954013N537868R181513L856203Q319120J6753086N984914j8734638k3840805
11322b0896752K139475L0180452L0369799O292150j6547346j9248383k976659
11315I312736J3357232R524196j2192043k5769645j4246775O637656J0681443
11308b695200m206233j8841595j9719085p879508Q979395J8667463R569197j2510562
$$ y = [19205583, 6540902, -2101737, -16590323, -12584806, 24905680, 58642216, 49989812, 22214900, 20509739, 36764865, 31717539, 9278864, 5717567, 18182179, 8994360, -21600089, -29990580, -3401515, 18048664, 7512894, -11133687, -10419619, 271534, 2644951, 653050, 1549825, -3429825, -18329541, -27954013, -22416145, -13234632, -9378429, -1059309, 15693777, 21678691, 2944053, -20896752, -18757277, 11423175, 41792974, 48085124, 31537778, 12289395, 9312736, 22669968, 32194164, 20002121, -5767524, -20014299, -13376643, -2695200, -6901433, -25743028, -45462113, -53341621, -44362226, -25694763, -16125566, -28636128]
11300b8636128k4528596j6106595l889118k211295K06917J4478125K4308360J2332075
11292b4046255m315540J867911K1100837J9661912l783858j3592388O339195K6959030
11284C0190844J8581906p040914j7782773n360791J0804415J3323352L413583
11277D6129622q090274j3332635j0882489m507849j98110p28667k331720M93417
11269F551295N427246J199629j7560776l4868005k4625012J4618206M7517007
11262a740410M0202594L685951k0515429j4613339o54427j80281m466636K913133
11254D631156J5681716J5107948j502505j7975926j8928684l721040J3615352
11247F908017J5622669J46416j4688937j5421121j4192484k4425592k7635558
$$ y = [-28636128, -53164724, -69271319, -73160437, -75371732, -75164815, -60686690, -36378330, -24046255, -28361795, -26493884, -5393047, 14268865, 10485007, -3107381, 3231814, 30190844, 48772750, 41731836, 23949063, 18588272, 29392687, 42716039, 46129622, 38039348, 24706713, 13824224, 9316375, 9118265, 8389598, 6057878, 6551295, 11978541, 13178170, -4382606, -39250611, -63875623, -49257417, -1740410, 38462184, 42148135, 21632706, 7019367, 6364940, 6184659, 1718023, 4631156, 20312872, 35420820, 33918315, 15942389, -2986295, -6707335, 6908017, 22530686, 22677102, 7988165, -7432956, -21625440, -46051032, -73686590]
11240g3686590J269331M2028374M7259000J6074587j605676J2192452J3759478
11233E7290956k0969610m4540874j4906672K6771473J7747974k3872924k9550848
11226c2030525Q133259K9210903P012925j7327863j1368919K354718k562498j2924511
11218b9502511r392786k80383L248619R566417K1591096K2568889P793556j371018
11210B4221879M756825N119482j1670723k1511521n848086J2901943P655778r094359
11202F531218j0871484l329399q009063j8456242j1933982O478800J0923075P97764
11194b7869313J345001J7253720K2561759M759245j3873775j2355695r56845J884671
11186g251232K52932P651552J8416378J4835854l216243j5412096q563199O592037
$$ y = [-73686590, -72417259, -30388885, 16870115, 32944702, 31339026, 43531478, 57290956, 36321346, -8219528, -23126200, 3645273, 21393247, -2479677, -32030525, -23897266, 5313637, 12326562, -5001301, -16370220, -14015502, -16578000, -29502511, -38895297, -39175680, -35927061, -26360644, -4769548, 17799341, 25592897, 24221879, 28978704, 34098186, 22427463, 915942, -4932144, 7969799, 15625577, 6531218, -4340266, -7669665, -15678728, -34134970, -46068952, -39590152, -28667077, -27869313, -26524312, -9270592, 13291167, 18050412, 4176637, -8179058, -9135903, -7251232, -6998300, 653252, 19069630, 33905484, 30689241, 15277145, 6713946, 13305983]
11178A3305983R803631n236239k4885669k9426986j2506748J1263546K0321514
11171a7360968R819208l628419m617077J463516M86794o393928o363854K27211
11163b6367517j355071j2146163j1652281Q955688K5297493J2450026j4785954
11156a9603779k0799233j433907J2268687L498683p464282P33558J8537701K4933455
11148A0670883J7603013O505408n144295j5636534j5629986k969094N948160j821972
11140d74417j3844873j1477049j24758J013517q418038r926555M516705K2694088
11132a6041380L0158350K2554868L825532j3486088j3195076L270732J0171716
11125B7258654q614263l0462172k4431548n81676M360127j3670893k0352614k378781
$$ y = [13305983, 23109614, 17873375, -7012294, -36439280, -48946028, -37682482, -17360968, -7541760, -11170179, -15787256, -14323740, -13836946, -20230874, -26594728, -26367517, -27722588, -39868751, -51521032, -42565344, -17267851, -4817825, -19603779, -40403012, -41836919, -29568232, -26069549, -33533831, -32800273, -14262572, 10670883, 28273896, 34779304, 29635009, 13998475, -1631511, -4600605, 1347555, -474417, -14319290, -25796339, -25921097, -24907580, -33325618, -43252173, -38735468, -16041380, 14116970, 36671838, 40497370, 27011282, 13816206, 17086938, 27258654, 18644391, -11817781, -36249329, -36831005, -32470878, -46141771, -66494385, -68873166]
11117f8873166Q959015p532778k2254056m78259L7884348M3504239J0343872j7265705
11109a5712490j1123806N681213M051125l909925Q728753L0524232K2973157j6589469
11101B4622790m1557271k0731742J5320302J9729864k859911j1139603M203767
11094a2411804J1913380l51864o078672P771285J4943918N7028q646498J0040020
11086A7236793K5651356M529935k8878146k8810356k760815N327074q358796o287196
11078b2350151J9009536L1084236J3786835n313405q561673j3584329k6964476
11071a2893427k2750186O981009K5578855Q071661j4718843m430065K4464155
11064A0303159L1554040J3198462j915017k979403l371499o882083n160016m491249
$$ y = [-68873166, -59914151, -67446929, -89700985, -90179244, -52294896, -8790657, 1553215, -15712490, -26836296, -21155083, -17103958, -21013883, -12285130, 18239102, 41212259, 24622790, -16934481, -37666223, -22345921, -2616057, -5475968, -16615571, -12411804, -498424, -850288, -6928960, 842325, 15786243, 15843271, 7196773, 17236793, 42888149, 47418084, 18539938, -10270418, -13031233, -7704159, -16062955, -22350151, -3340615, 27743621, 41530456, 36217051, 27655378, 14071049, -12893427, -35643613, -28662604, -3083749, 4987912, -9730931, -14160996, 10303159, 41857199, 55055661, 53140644, 50161241, 46789742, 39907659, 34747643, 30256394]
11056C0256394j9509754l8702937k9952984R920046L9477615K3663024j8341825
11049c190421l7246759j6959236R045964P639012r441730p903677J5798011L0602450
11041a1656386J9429971J479897l501774k513221l595062M738579K2029642J7273192
11033D3684838k0955310m7753189k3827447J4643907R151657k1439459j0958271
11026e7453274L4279483L5959759k3280294o0429747k1673204L4406690L6601263
11019b1589324Q473804Q383752K4452729Q605340k7900281l4466601j0540211
11012d4580792R73936o606368j499708J8708061K3436484R145432K091561L837755
11004E506361p362814k2429049q367093K7258914L6700293N717250k5779347k6835185
$$ y = [30256394, 10746640, -27956297, -57909281, -47989235, -8511620, 15151404, -3190421, -40437180, -57396416, -48350452, -40711440, -50153170, -58056847, -42258836, -11656386, 7773585, 9253482, 5751708, 3238487, -356575, 4382004, 26411646, 43684838, 22729528, -25023661, -48851108, -34207201, -25055544, -46495003, -57453274, -23173791, 12785968, -10494326, -70924073, -92597277, -58190587, -21589324, -13115520, -4731768, 19720961, 28326301, 426020, -34040581, -44580792, -43606856, -50213224, -51712932, -33004871, -9568387, -422955, 1668606, 5506361, -1856453, -24285502, -32652595, -5393681, 31306612, 37023862, 11244515, -15590670]
10996a5590670j0310574M456736J5510051J5345314p249841l1525633j9726373
10989d9090990J9947100L5258055R475910j3375136k822844J2339390J422523
10982A3154008j5924453j2381528m454175j7858049l4926653k2508085R860516
10975h5038419K3394962R438599k379255R308903L1753765L8036449J5476288
10968C9991292k2054755m1178943j9718890K2645310M1280524K0556683j0807338
10961C0713883k4107351k1071975j0300753J0502417L0090956J9264433k1016020
10954A4075590m2067575j3272872K5647377K0195242j6593516k6871659K210926
10947c6676487K5155339J3658618n424025l52397J8456246K2506169P823032q721561
$$ y = [-15590670, -25901244, -21444508, -5934457, 9410857, 2161016, -29364617, -49090990, -29143890, 6114165, 15590075, 2214939, -607905, 11731485, 13154008, -2770445, -15151973, -19606148, -37464197, -72390850, -94898935, -85038419, -61643457, -52204858, -54584113, -45275210, -13521445, 24515004, 39991292, 17936537, -23242406, -42961296, -20315986, 20964538, 41521221, 30713883, 6606532, -14465443, -24766196, -14263779, 15827177, 35091610, 14075590, -27991985, -41264857, -15617480, 4577762, -12015754, -38887413, -36676487, -11521148, 2137470, -3286555, -3638952, 14817294, 37323463, 45146495, 36424934]
10939C6424934j7588047k0489295j6188445j180673J6379659J7062759q176411
10932F244481m0156388m4779169j0362831L4899785N3185137L8427925J2550541
10925E0009481j1032078l3647404m4028574k1426595K2973858M4079153K3185599
10918C0113440k645524J931937J5772764j71911l5589017m5614280j8155239J6129663
10910c8228167L3210576L4986517K4070606p28274k3584844k3057734o135350
10903E33330K380538K592030J4076218K9397052J8005931j7201068l4230702j6765272
10895a211943K120282Q59278N095347L1643835M4326546J1330531l0789399k6017944
10887C7356533J2179996K1505316r785990k8003547n041205J7533512k85620l3428671
$$ y = [36424934, 18836887, -1652408, -17840853, -19021526, -2641867, 14420892, 6244481, -33911907, -78691076, -89053907, -54154122, -968985, 37458940, 50009481, 38977403, 5329999, -38698575, -60125170, -37151312, 6927841, 30113440, 27467916, 29399853, 45172617, 45000706, 9411689, -36202591, -54357830, -38228167, -5017591, 29968926, 54039532, 53311258, 29726414, 6668680, 533330, 2913868, 5505898, 19582116, 48979168, 66985099, 49784031, 15553329, -1211943, 908339, 1767617, 6862964, 38506799, 82833345, 94163876, 63374477, 37356533, 49536529, 71041845, 61255855, 33252308, 28211103, 45744615, 45458995, 12030324]
10879A2030324l6401150j3045151J790942L997814J5403342L0714591K0111990
10872C4602702j3622380k8175771n438330J9325049J3442145n089664n402444
10865I641307K214492r744503k9596146k1428103J1263324K5473738O920445q152349
10857a3407795N171815J9834363M674846k2060789k2326950J685166J4975504
10850a1453840N623142k950106N813113J7732399J2483520q525684k6058585k3627161
10842c0963202k278957J7943425J5452656o963683k2740925j6242108k267020
10835d8059814J820991M430516J8638883L0484980J8341422p142216j5790338
10828B724424n460625k048231j1958813j1508776Q357670K2675503J3800374Q13448
$$ y = [12030324, -24370826, -37415977, -35625035, -31627221, -16223879, 14490712, 34602702, 20980322, -7195449, -12633779, 6691270, 20133415, 15043751, 9641307, 11855799, 2111296, -27484850, -48912953, -37649629, -12175891, -5255446, -13407795, -8235980, 11598383, 16273229, -5787560, -28114510, -26429344, -11453840, -5830698, -8780804, -2967691, 14764708, 27248228, 18722544, -7336041, -30963202, -33242159, -15298734, 153922, -6809761, -29550686, -45792794, -48059814, -46238823, -41808307, -23169424, 7315556, 25656978, 18514762, 2724424, -2736201, -4784432, -16743245, -28252021, -19894351, 2781152, 16581526, 17394974]
10820A7394974N222242J2457427l983491l4875330m2311390j2867257K1051067
10813c7911758K1570726p076672k4479311n284635K8598046L6944597J4245620
10806B6606613o776577o145555k896957j4753701k1293580Q65123K8646498K1384936
10798B5636800j2037589k3047709K30162J6937650L456613j1675599l449276P416686
10790C467738j248014r280796O542951K4759381J5020283o018162k955629J4126008
10782D4413760N882298k5848302l7400124j4352516P719657M536790j526924J2189542
10774d385819K6478001J3692734j3923874k1387056k293789J5310200R381644
10767B2872041j1856325k6148457k1755617l117654J7331216K8354378K5270445
$$ y = [17394974, 22617216, 35074643, 31091152, -3784178, -46095568, -58962825, -37911758, -16341032, -23417704, -47897015, -53181650, -24583604, 12360993, 26606613, 19830036, 13684481, 10787524, -3966177, -25259757, -24394634, 4251864, 25636800, 13599211, -9448498, -9218336, 7719314, 11175927, -499672, -3948948, 3467738, 2219724, -7061072, -518121, 24241260, 39261543, 33243381, 30287752, 44413760, 50296058, 24447756, -12952368, -27304884, -19585227, -15048437, -16575361, -4385819, 22092182, 35784916, 21861042, 473986, -1819803, 13490397, 22872041, 11015716, -15132741, -36888358, -40006012, -22674796, 5679582, 30950027]
10760C0950027J0351480r653554k5260795k7639235j6244000j454402O358252
10753c2592227Q531412J2407480J7054710J4358681L765285m340410k591497L507256
10745B0100690K740378q958853k3446616k5658982p349193K0444839L4463941
10738A2336204K4793111N864302n795222j3429222k5472802l0791753j1921812
10731d4417194K0688651L3657715J4544799j1984582j9638250j0688778J80217
10724a7657422J0989232K4320484L0348795J8902784j12319p425311j360762K070204
10716F0075685o359263j8937498k4633880k0815401j1537309l717576l466311
10709b9391553p786437m230316J1131226K1964346J2435503n881250o860519J2601343
$$ y = [30950027, 41301507, 31647953, 6387158, -21252077, -37496077, -38950479, -32592227, -24060815, -11653335, 5401375, 19760056, 23525341, 19184931, 16593434, 20100690, 22841068, 13882215, -9564401, -35223383, -42572576, -22127737, 12336204, 37129315, 42993617, 37198395, 23769173, -1703629, -32495382, -44417194, -23728543, 9929172, 24473971, 12489389, -7148861, -17837639, -17657422, -6668190, 17652294, 48001089, 66903873, 66791554, 59366243, 58005481, 60075685, 53716422, 34778924, 10145044, -10670357, -22207666, -25925242, -29391553, -37177990, -41408306, -30277080, -8312734, 4122769, -1758481, -8619000, 3982343]
10701C982343K9636033L0942167K5560630J6244159j0597097m8869277n8323000
10694a1424042j7928977K9597398K7751522j2430556k8329794l53827K3257706
10687A0139430R063765r815210L740352K5400910J4081840j3996318j3306651
10680B5308118J0807190J2147843j4733210k7163646j2059110n688617j9986319
10673c1367751j5110080K3277927M1891032K989753m2328413k5584434L0788915
10666a5443051M6237137M444433k9390019j3900244J4167692R471290j4374979
10659A212259j7379722N260823K6206673K7111945J1008473j0570299k3852936
10652A8997216j8789069k018193P306031J643160q540887j4837083j7909704j2283270
$$ y = [3982343, 33618376, 64560543, 90121173, 106365332, 95768235, 46898958, -11424042, -29353019, 244379, 27995901, 15565345, -12764449, -13118276, 10139430, 19203195, 9387985, 13128337, 38529247, 52611087, 38614769, 25308118, 36115308, 48263151, 33529941, 6366295, -5692815, -11381432, -31367751, -46477831, -23199904, 18691128, 21680881, -20647532, -46231966, -15443051, 30794086, 35238519, 5848500, -8051744, 6115948, 15587238, 1212259, -16167463, -10906640, 15300033, 42411978, 53420451, 42850152, 18997216, 208147, -1810046, 5495985, 7139145, -1401742, -16238825, -34148529, -46431799]
10644d6431799J0276173L5460592L2838350R8237k6507428k1953911n449529l306382
10636b4975697n929618R544731L4032995L7316515J4504382q657780j4281817
10629D1553711j1179733j4366098k4855587l2125065k4955545j828722K1282106
10622d6474933K1957186R0569j6794992r956346M345126L199818n084054K442037
10614d6275589K1140140K4547613P950745n384739l130640J217688j307301J086675
10606a55408J4466401K1200824N772045j8568411k6337466j2341561O590260J4698760
10598E325444J0254362P71517n353611n258218m160873p795952j2086187q168349
10590b6471867K545348R249679Q245782N656764K759185n175053j2312068m271673
$$ y = [-46431799, -36155626, -695034, 32143316, 32241553, 5734125, -16219786, -21669315, -24975697, -30905315, -21360584, 12672411, 49988926, 64493308, 55835528, 41553711, 30373978, 16007880, -8847707, -40972772, -65928317, -67757039, -46474933, -24517747, -24427178, -41222170, -51178516, -46833390, -43633572, -48717626, -46275589, -25135449, -587836, 7362909, 1978170, -1152470, 65218, -1242083, -155408, 14310993, 35511817, 41283862, 22715451, -3622015, -15963576, -9373316, 5325444, 15579806, 16351323, 10997712, 5739494, 1578621, -6217331, -18303518, -26471867, -23926519, -14676840, -6431058, -774294, 1984891, -3190162, -15502230, -19773903]
10582a9773903J5139805J9874283j782951k5498118k3939375m674522P158892
10575c3495889Q829766J4103670J7848802K101902k2823360k1442805J1074570
10568b3803344L1911644J1632255j8454129j2182431K0405929K8726981q07790
10561C7429115k7352594k1120873l905530n295795j4222655m232745J7309412
10554b1391665K0460399Q57743j6909284j8814843j2654862j468171K1188417
10547b8732266M4634196M2605948J3538090r935841q011299k834422j8799861
10540C2464545l8476394k8250190P294439K9297030J8307844m627694j2020378
10533C989202j372069J2199700J6500952R858631N58422N71966R840463J0732603
$$ y = [-19773903, -4634098, 15240185, 13457234, -12040884, -35980259, -40654781, -33495889, -24666123, -10562453, 7286349, 9388251, -13435109, -34877914, -23803344, 8108300, 19740555, 1286426, -10896005, 9509924, 38236905, 37429115, 10076521, -11044352, -14949882, -20245677, -34468332, -38701077, -21391665, -931266, -73523, -16982807, -35797650, -48452512, -49920683, -28732266, 15901930, 58507878, 72045968, 62110127, 54098828, 51264406, 32464545, -6011849, -34262039, -26967600, 2329430, 20637274, 16009580, 3989202, 2617133, 14816833, 31317785, 41176416, 41734838, 42306804, 52147267, 62879870]
10525F2879870q309863l0083798k9147020j0638569l929454j6560594k2065710
10518e7855138k527913K2793696K7233680J4156425M803186L920254l23865j0195761
10510B004564j3482698l804377R546018J3159357J772570j8501390l1195536k0015722
10502f0517214J0472079L1311160K1217282k528820m006069K0684472L4742528
10495E1375418J1330820k7367634l9501615j8518621M982376J1749156J5828142
10488I878042K9226819L1987753K519193l7726467m3795963j1628127J1530933
10481h007817n261713l0233668j7040507K4395753M3260538K3586088J350026
10474C2048700J774880L307876j5929609l3448327j7900317J5387041K4727408
$$ y = [62879870, 54570007, 24486209, -4660811, -15299380, -19228834, -35789428, -57855138, -60383051, -37589355, -10355675, 3800750, 8603936, 12524190, 12200325, 2004564, -11478134, -15282511, -5736493, 7422864, 9195434, -9305956, -40501492, -60517214, -50045135, -18733975, 2483307, -45513, -4051582, 16632890, 51375418, 62706238, 35338604, -4163011, -22681632, -17699256, -5950100, 9878042, 39104861, 71092614, 73611807, 35885340, -7910623, -19538750, -8007817, -13269530, -43503198, -60543705, -36147952, 7112586, 30698674, 32048700, 33823580, 37131456, 21201847, -12246480, -30146797, -14759756, 9967652]
10467I967652O890076p28758J5154203J8995946j4866304n2351971m1511888J0988412
10459d7462632M1525023J1491754m1366223n0747464m565480M3621808M4006134
10452c497080P956240j6099087p499133R593602J0632287M012096O677199R402298
10444B1178422o567888k8400234k0710426J8558618M2875455J7555344k7934260
10437A6555031l7453660n394174J9104205O004205j5161782o283360J9027124
10430c602411J8393633j2040076l0987900j3373886J5619588K0378667K487653
10423c124732j0758598p720954N8462K576558K121004J571279l40360j183582
10415a6800923L538604R260800N496075p018872j3435037l593898J4418335K4076934
$$ y = [9967652, 16857728, 16128970, 31283173, 50279119, 35412815, -16939156, -58451044, -47462632, -5937609, 5554145, -35812078, -86559542, -91125022, -47503214, -3497080, 4459160, -11639927, -19139060, -9545458, 1086829, 5098925, 11776124, 21178422, 14610534, -13789700, -34500126, -15941508, 26933947, 44489291, 16555031, -20898629, -26292803, -7188598, -1184393, -16346175, -22629535, -3602411, 14791222, 2751146, -28236754, -41610640, -25991052, -5612385, -3124732, -13883330, -21604284, -21545822, -18969264, -16848260, -15276981, -15617341, -16800923, -13262319, -4001519, 1494556, -5524316, -18959353, -22553251, -8134916, 15942018]
10407A5942018J8467878N159010l985523o249587j1097622k5823400l8406332
10400d5993558k6587657Q888472L4714511K4840262k014183p782171R222826J3979125
10392I267627p981247k6457361j4305897J0307381J4236321O02782j534860J2412110
10384c453144J6870738J618502r824676J30208J1666390j747433k7140844k5361775
10376c7242034J0603743L8697348K2356977j8483274l4182386j3044307P830569
10369b3463364K369452o762952R577861L3610141K4113932j7881657m5410370
10362b3846957l0902469k50040J1023209N199784N702641J6382556K2523549J8591091
10354B4423364J1346945L221412p318525j4684174j3274298j0544771j6383864
$$ y = [15942018, 34409896, 39568906, 35583383, 29333796, 18236174, -7587226, -45993558, -72581215, -63692743, -28978232, -4137970, -6152153, -13934324, -4711498, 9267627, 1286380, -25170981, -39476878, -29169497, -14933176, -14330394, -15865254, -3453144, 13417594, 15036096, 5211420, 5341628, 17008018, 15260585, -11880259, -37242034, -26638291, 12059057, 34416034, 15932760, -18249626, -31293933, -23463364, -21093912, -27856864, -18279003, 15331138, 39445070, 21563413, -23846957, -54749426, -54999466, -43976257, -38776473, -33073832, -16691276, 5832273, 24423364, 35770309, 38991721, 31673196, 16989022, 3714724, -6830047, -23213911]
10347b3213911k4171742j8682293Q58497K0606911L0796644L0084145J7121621
10340C3399872n006574k0526420j6037317j713463R30230r393000j4160109o263801
10332c8770582J424738J629793L758586J2029983J4509020N598929j0125R023558
10324I193900J9038941J1072372r070642j9236577j2996025m689091l932528k632220
10316a3251870P931886J9995993J8296385R44561j6988901k1294538j4174249
10309a8540733p536919m460497L003371J5502639J8480331L199906j4065303j0381428
10301a4798633J0577702K2189678J2115644l454857p228485l126024k255266l958065
10293A0061694k980483j443893j302851K181625P271850P34812j8564717k6242971
$$ y = [-23213911, -47385653, -66067946, -65209449, -44602538, -13805894, 16278251, 33399872, 28393298, 7866878, -8170439, -9883902, -8953672, -18346672, -32506781, -38770582, -37345844, -35716051, -31957465, -19927482, -5418462, 180467, 170342, 9193900, 28232841, 39305213, 30234571, 10997994, -1998031, -6687122, -10619650, -13251870, -5319984, 14676009, 32972394, 33916955, 16928054, -4366484, -18540733, -26077652, -30538149, -27534778, -12032139, 6448192, 9648098, -4417205, -14798633, -4220931, 17968747, 30084391, 26629534, 19401049, 16275025, 14019759, 10061694, 7081211, 5637318, 4334467, 6516092, 13787942, 14522754, -4041963, -30284934]
10285c0284934m122820K5621181K3887939j1396636m0103977l1188919K755729
10278f4832437K7735903K6578865P934439p864646n577003R959808J3072741j3502484
10270f494814m7337759m5341481r59753M0487193L7789514N176705j1593720M794988
10262b3479127K9564759L3223622J1049310k0179583l6288870k0833832J5856966
10255a1086755L7413892K0372322j2628266k0973757k817475N565200j1154418
10248D690743k3830449q579498J2996649R749650p630993n587849J5719817K3124604
10240B0652674O364623m769360R198190K2581214L427589l3766021m3403066j0101233
10232b9815390L1937864M3929848K5341725K494399q720830j2950558j6696956
$$ y = [-30284934, -34407754, -8786573, 15101366, 3704730, -36399247, -67588166, -64832437, -37096534, -10517669, -2583230, -10447876, -16024879, -6065071, 7007670, -6494814, -53832573, -99174054, -100133807, -59646614, -21857100, -16680395, -28274115, -23479127, 6085632, 39309254, 50358564, 30178981, -6109889, -26943721, -11086755, 26327137, 46699459, 34071193, 13097436, 10279961, 15845161, 4690743, -19139706, -27719204, -14722555, -4972905, -12603898, -18191747, -2471930, 20652674, 27017297, 22247937, 31446127, 54027341, 57454930, 23688909, -19714157, -29815390, 2122474, 46052322, 71394047, 73888446, 65167616, 52217058, 35520102]
10225C5520102j7696690j4379824j2080832j3789372j3553436n453134P165098
10218c4268088J6654975J8594959R658484j1715283l3482025l1012657K843594
10211f2726041L6642828L2298029k667323k0649533Q76052K6552209J4261392
10204B4587613k2467469l2904256k314446K6044270J1731594k4798573k7916505
10197d8037772J6780760N7595793M0704953j7157944m6146213j4071720L1132226
10190B0800083K8971556j0787137k9570045r059292J0025455P51604j0857084
10183B75140o88735P129134j4469554m0260432k8371021J1589472L2525035J9372811
10175a2898150P39863k112002L697282R632412J4441362P383312j8561074l7814441
$$ y = [35520102, 17823412, 3443588, -8637244, -22426616, -35980052, -41433186, -34268088, -17613113, 981846, 10640330, -1074953, -34556978, -65569635, -62726041, -26083213, 6214816, 3547493, -17102040, -16225988, 10326221, 24587613, 2120144, -30784112, -33098558, -7054288, 4677306, -20121267, -48037772, -31257012, 26338781, 67043734, 49885790, 3739577, -10332143, 20800083, 49771639, 38984502, 9414457, 355165, 10380620, 11132224, 275140, -413595, 6715539, -7754015, -48014447, -76385468, -64795996, -32270961, -12898150, -12158287, -14270289, -10573007, -940595, 13500767, 20884079, 2323005, -35491436]
10167c5491436j7779153K4897483L7721605R149558j3741610J232145K5235988
10160C1224580J9304300p415155j9844000q842771P666606J4912169R478885n513190
10152D0971424j6808882j0809506K251685k051384j9645787j7517889J0201894
10145a3408445K4006021r9930k9498632k5926305l036308M351874j077025N904878
10137c8783872K1272736K0211433M985581J706410J4516546K0323304Q114498
10130E2346636p413325j1437509l912584Q512396J5768442O673195j4023581k2340309
10122B4173361o545606J3663846J7462889J1260729O078757o456823k8185631
10115C1451522l3929783j1334468Q186991j975220j5097924J191908K0684789
$$ y = [-35491436, -53270589, -28373106, 9348499, 18498057, 4756447, 5988592, 31224580, 50528880, 43113725, 23269725, 14426954, 22093560, 37005729, 46484614, 40971424, 24162542, 13353036, 15604721, 13553337, -6092450, -23610339, -13408445, 10597576, 10497646, -19000986, -44927291, -47963599, -43611725, -44688750, -38783872, -17511136, 2700297, 7685878, 9392288, 23908834, 44232138, 52346636, 44933311, 33495802, 29583218, 38095614, 53864056, 60537251, 46513670, 24173361, 17627755, 31291601, 48754490, 60015219, 66093976, 59637153, 31451522, -2478261, -13812729, -5625738, -7600958, -22698882, -21506974, -822185]
10108h22185K490827k7251362j0710210L8257915M6414055j066946l6242280j8889312
10100g819498O360692n614370k8622864k0081395Q902351K4410524K5303031K3217966
10092B6056437O901151k7565231m5306048j9598353J6657024J4791758j4503042
10085d2566304j9073153J2998725L7961320K3522131r192249k0768760k607859
10078a9726149K1447619K6646615J0478458r442941j5375974n972690Q454256
10071A6509194K0005788K2614166P234178k2780961l9821037k2890394M781074
10064a4347992K694328k3665929k7237384O780628L6615730K9735256Q332566
10057A8907203L630476N779714p099695k3163481j7541794M470504J8641394J8010764
$$ y = [-822185, 1668642, -25582720, -36292930, 1964985, 48379040, 47312094, 11069814, -7819498, -1458806, -7073176, -35696040, -55777435, -46875084, -22464560, 2838471, 26056437, 32957588, 5392357, -39913691, -59512044, -42855020, -28063262, -42566304, -61639457, -48640732, -10679412, 12842719, 3650470, -17118290, -19726149, 1721470, 28368085, 38846543, 29403602, 14027628, 8054938, 16509194, 36514982, 59129148, 66363326, 43582365, 3761328, -19129066, -14347992, -11653664, -35319593, -62556977, -55776349, -19160619, 10574637, 18907203, 22537679, 28317393, 21217698, -1945783, -19487577, -15017073, 3624321, 21635085]
10049B1635085J0062174l075682j6097387j3137486O125572J5410545J379833
10042B2302654j1400843j680705J0889566J023605j7754322j9969700j2593807
10035b9183552j3169690r616912J3675635L2815299J7050791j3256154j3592891
10028a5277474J2172135K0666199L602314l561669J0772073J4902479o327272
10021C6948785k3687451j4231216L835276Q133201O294799J0334199R392716o679061
10013C0341248k1739509j6492497J04173M070056j0325552k6419226k6292950
10006f6754257o721014J8266743K7143664J2901027n412325o192296L840779J676700
9998b1250979j2165075j1896693J0767611K7873783J2359190k3417502m0517599
$$ y = [21635085, 31697259, 28621577, 12524190, -613296, 5512276, 20922821, 22302654, 10901811, 9221106, 20110672, 21134277, 3379955, -16589745, -29183552, -42353242, -51970154, -38294519, -5479220, 11571571, -1684583, -15277474, -3105339, 17560860, 21163174, 17601505, 28373578, 43276057, 36948785, 13261334, -969882, 2865394, 10998595, 17293394, 27627593, 37020309, 30341248, 8601739, -7890758, -7786585, -3716529, -14042081, -40461307, -66754257, -73475271, -55208528, -28064864, -15163837, -20576162, -26768458, -22927679, -21250979, -33416054, -45312747, -34545136, -6671353, 5687837, -17729665, -58247264]
9991e8247264j7112854K8175792N2975977L2216592j2790514l4304407j4930054
9984b4016732J0971737P867333r913118o528438J3688293J4457908q130318j5692737
9976a7296072R701149L5191965K7544720r46699j9055136k0363954j5861329o320307
9968g405663J0469144K0662568R453059j3219842k4438041j9892293j3694592
9961c8065660j1323963m286858P066301O318679j3284763k9899727j6091321K2678512
9953g6888800M9098910L8837770R652881o465801o684475j1287828k2578978k0167752
9945d6484073K93369J6049702J5826335J7233768K8377237K5485003m822456l1852559
9937B0106326k3944389J71853K833015j0167304m190628J9704671K4487296R48423
$$ y = [-58247264, -75360118, -47184326, 5791651, 38008243, 25217729, -9086678, -24016732, -13044995, -5177662, -15090780, -21619218, -7930925, 6526983, -1603335, -17296072, -7594923, 27597042, 55141762, 54195063, 35139927, 14775973, -1085356, -7405663, 3063481, 23726049, 33179108, 19959266, -4478775, -24371068, -38065660, -49389623, -53676481, -46610180, -40291501, -53576264, -83475991, -99567312, -76888800, -27789890, 11047880, 20700761, 14234960, 7550485, -3737343, -26316321, -46484073, -46190704, -30141002, -14314667, 2919101, 31296338, 56781341, 51958885, 20106326, -3838063, -3666210, -833195, -11000499, -15191127, 4513544, 29000840, 29949263]
9929B9949263j5263888n34767K1647868J8617760o529032k4664775j8450525J466905
9921F238809J0641964q42517j2574244J174201K7432465K3527469j6258665m1292523
9913a953041k0373314N781435o799647k5942835K714145N3071020M9308986j1903431
9905D3903318n1962573k9050254J0975424J9830829J1441482J3437733J5276566
9898C3852525m12024j9731959k1096916n211631J4217591K1267101J078778l2098532
9890h135067k8638014K0888320L3708459n6215260j60321859j24453869L9649870
9883b83517420J46038561R4342772l20552m794507M0854559L2949008j2123936
9876A3428485j5187440J0305303J57869k2811822O343263N3099551K8968774m4455537
$$ y = [29949263, 14685375, 14150608, 35798476, 54416236, 47887204, 23222429, 4771904, 6238809, 16880773, 16038256, 3464012, 4638213, 32070678, 55598147, 39339482, -1953041, -22326355, -16544920, -23344567, -49287402, -46573257, 6497763, 55806749, 43903318, -8059255, -37109509, -26134085, -6303256, 5138226, 18575959, 33852525, 33440501, 13708542, -7388374, -12600005, 1617586, 22884687, 23963465, -8135067, -36773081, -15884761, 17823698, -38391562, -198713421, -323167290, -283517420, -137478859, -43136087, -43456639, -48251146, -7396587, 25552421, 13428485, -1758955, 8546348, 8704217, -14107605, -7764342, 45335209, 74303983, 29848446]
9868B9848446n8936448j174059K9631694l149483k0149068K0094938M5410823
9861D1576843K784949m6701566l4340056O956427J3067458n879694m896963Q928302
9853a8504300K070030j4362735n911172K0906235L0919452J5732275o333820k3833182
9845F82783l0107680j3050500J9307135K9922290K845338k5075036j6259427J1302239
9837b0432858J5923450m470877j9204215j5793881o815424O01629Q825103J2781397
9829b8585676O355436k502811l700437r65954M09688N641686J4160062J1142512
9821A954506o707238j8190991r622625K599316J749086j179988P365578J4825303
9813g207053O361319m736253J50224J0995627P707991m596781q639770p053884
$$ y = [29848446, -29088002, -30262061, -630367, -3779850, -23928918, -3833980, 41576843, 44361792, -2339774, -36679830, -29723403, -16655945, -22535639, -27432602, -18504300, -16434270, -30797005, -36708177, -15801942, 15117510, 30849785, 24515965, 682783, -29424897, -42475397, -23168262, 6754028, 9599366, -15475670, -31735097, -20432858, -4509408, -8980285, -28184500, -43978381, -50793805, -50192176, -41367073, -28585676, -22230240, -24733051, -28433488, -29399442, -28989754, -23348068, -9188006, 1954506, -4752732, -22943723, -32566348, -29967032, -28217946, -29397934, -22032356, -7207053, -845734, -5581987, -5431763, 5563864, 13271855, 8675074, 35304, -7018580]
9805g018580j0993240j2034769K169843J6960897R351602j0756421j1342837J3473493
9797a0190012L5671535L2640487R713080j4259251k2946408r525091J3077576
9790C4181916J7743448k694896k1515873j8933759j4508666k8351989l5263263
9783f9343082l002490M1461522M0340694m534431k9424073n730975K0301126P215180
9775b716529j8119545j2560442J3198242K1006716Q580454p27769p660958k6826808
9767b5826639m1020439j8058203K8209034M3559056J0253737k5287449j9794218
9760d7965121R372393J9870385P611669P39962P775861Q136027q245630k2833529
9752b5537983j7330031J103138J3819706J5184201J2069680Q500667K540900m723529
$$ y = [-7018580, -18011820, -30046589, -27876746, -10915849, -1564247, -12320668, -23663505, -10190012, 25481523, 58122010, 67835090, 53575839, 30629431, 21104340, 34181916, 51925364, 49230468, 27714595, 8780836, -5727830, -34079819, -69343082, -72345572, -30884050, 9456644, 4922213, -24501860, -30232835, -9931709, -2716529, -20836074, -33396516, -20198274, 808442, 9388896, 8661127, 1000169, -25826639, -66847078, -84905281, -56696247, -13137191, -2883454, -28170903, -47965121, -38592728, -18722343, -11110674, -10370712, -2594851, 5541176, -2704454, -25537983, -42868014, -41764876, -27945170, -12760969, -691289, 7809378, 10350278, 5626749]
9744E626749o265928K726174J6372247J9934756L640279k2675699l3578826j4221609
9736b8441857J9713481L6981817K4880589q04220j8703780k1939572j3569224
9729a882766K472251J7509451J7823271N04110j7400774j6828550l0245J2611655
9721A4778403O144935j4546352l0054184k2414468P345533L3759671K9193150
9714B4206688k154144k4590716j4794900P977647J0192816r193746k0638184p453651
9706c6448190J4281042K1651076J3088623L488824K226521M421808J076139o678684
9698A7107159o867223N734393J5727211M440885j8601659k1989942J542790J8648140
9690A5741754K524856k5051665k4814287K894455K2995978J8532429O193372J793741
$$ y = [5626749, -639179, 2086995, 18459242, 38393998, 42034277, 19358578, -14220248, -28441857, -8728376, 28253441, 53134030, 52329810, 33626030, 11686458, -1882766, 589485, 18098936, 35922207, 36426317, 19025543, 2196993, 2166748, 14778403, 20923338, 6376986, -23677198, -46091666, -38746133, -4986462, 24206688, 22052544, -2538172, -17333072, -9355425, 837391, -8356355, -28994539, -36448190, -22167148, -516072, 12572551, 16061375, 18287896, 22709704, 23785843, 17107159, 10239936, 15974329, 31701540, 36142425, 17540766, -4449176, -2906386, 15741754, 18266610, -6785055, -31599342, -28704887, -5708909, 12823520, 19016892, 20810633]
9682B0810633J966690K651980O493858O664286r081186l1080789l1380870m891798
9674c7847196J7995081J2882655o876398j5016475r112725l986087k975903L239552
9666d1697496J4687705J6787164r8017k4281839l1096589r034322K3742831L5615679
9658a5374884J6886010j0247809k1322393j5024024j014022J7662534L3545116
9651E110528K7206664m240084k8696436j8243088Q932903J7771323J0471255J1853289
9643C0166354J6029652k613601l2009630l1095999N02112J6539790j051779j5894302
9635a9427403l162128J2116683P584466K883408J4750123J9660324j903181k4763713
9627G738579k0968060n528815j728185K835106K2991908L3298666P342640k7655659
$$ y = [20810633, 22777323, 25429303, 31923161, 38587447, 29506261, -1574528, -32955398, -37847196, -19852115, -6969460, -13845858, -28862333, -37975058, -41961145, -44937048, -41697496, -27009791, -10222627, -10320644, -34602483, -65699072, -74733394, -50990563, -15374884, 1511126, -8736683, -30059076, -45083100, -46097122, -28434588, 5110528, 32317192, 28077108, -619328, -18862416, -9929513, 7841810, 18313065, 30166354, 46196006, 43582405, 11572775, -19523224, -19021112, -2481322, -3533101, -19427403, -22589531, -10472848, -2888382, -4974, 14745149, 34405473, 32502292, 7738579, -13229481, -18758296, -20486481, -17651375, 5340533, 38639199, 45981839, 18326180]
9619A8326180k6597213L040307J6474785K496302j0138230p575224m553393p051431
9611a5577917m187973L127757K528656k093313L337494J2647450P734384o753852
9603G62686r322415J711232Q403892N315855J553549k810671j2270490j6239639
9595b2896001n200535L904948p263566j9474378j391421L4876952M6599527K4516730
9587E3672256J016233m290119l784936n555730j620957K866104r633842l2740021
9579g1012l9446412k6115481j4263778p432457R353345K5625184J2826272j6758604
9571e6282943j4693787K3897399M2870645J2444579k2460182j6121851Q054923
9564b2291217N747545j4568858j7435520o224052q462128j7416177k848391K9772908
$$ y = [18326180, -8271033, -5230726, 11244059, 13740361, 3602131, -3973093, -8526486, -15577917, -19765890, -16638133, -14109477, -16202790, -12865296, -217846, 7516538, 762686, -8559729, -6848497, 1555395, 6871250, 8424799, 5614128, -6656362, -22896001, -28096536, -24191588, -31455154, -50929532, -52320953, -17444001, 29155526, 53672256, 54688489, 50398370, 46613434, 41057704, 39436747, 42302851, 32669009, -71012, -39517424, -65632905, -79896683, -87329140, -77975795, -52350611, -39524339, -56282943, -70976730, -47079331, -4208686, 8235893, -14224289, -30346140, -22291217, -16543672, -31112530, -48548050, -54772102, -63234230, -80650407, -83498798, -53725890]
9556e3725890M0460265J5530002j2673356j2233171J1355870K9663726K2431838
9549D0809284p087552l3736788l1763767n245311J3923783Q350084l762669l383794
9541b1896730j84911n093897k100009J9677840L1217963K806257l9679714m4566414
9533e9819615j1576357R498896l029690j5244553J502469K7449638L1716761J6707754
9525b794697K465168n864422j2952406j7030658j7515753k0403985k1498436n342672
9517a00937861K4187572L6622815J8048956k894435K474031J7413959R497557
9510D412594j2573459j2546814J1198900K1459121M018834j0039371Q46004J1806230
9502A8582039l639133k4387509j4197337J6637847K3026090p900061m0242457
$$ y = [-53725890, -13265625, 2264377, -10408979, -22642150, -11286280, 18377446, 40809284, 33721732, -15056, -31778823, -37024134, -23100351, -14750267, -18512936, -21896730, -22081641, -27175538, -29275547, -9597707, 21620256, 24426513, -15253201, -59819615, -71395972, -61897076, -64926766, -80171319, -78668850, -51219212, -19502451, -2794697, -329529, -6193951, -19146357, -36177015, -53692768, -74096753, -95595189, -100937861, -76750289, -40127474, -22078518, -24972953, -22498922, -5084963, 4412594, -8160865, -20707679, -9508779, 11950342, 15969176, 5929805, 6775809, 18582039, 14942906, -9444603, -23641940, -7004093, 16021997, 8121936, -32120521]
9495c2120521m3215443k6698113j2086985J495326K2537500M0406700L6479392
9488a3202144J2682177q505421r094803Q365590K4942962K1514030j324699j9275761
9480A6101931j3099357J183751p340597l3922496l9162746r452219J9422321J8502562
9472d7766850Q844568J8239189K9268049J2652755j4348639j3318922Q049260
9465A619410Q557576j3180432j5229046J2485103K5713295k558800l6024709k8375032
9457d6992635J2068324L9415478K8800393m353573k7012803j7233898J4055409
9450a253305K6788627r47751l3690118k1352009K2571078L4612949q97936k6510055
9442f78520n288682K1800878J0185603j3793659n593390J7227280J0455943j5473393
$$ y = [-32120521, -75335964, -102034077, -114121062, -112625736, -90088236, -49681536, -13202144, -519967, -9025388, -18120191, -9754601, 15188361, 36702391, 35377692, 16101931, 3002574, 4186325, -3154272, -37076768, -76239514, -85691733, -66269412, -47766850, -38922282, -20683093, 8584956, 21237711, 6889072, -6429850, 1619410, 10176986, -3003446, -18232492, -5747389, 19965906, 17407106, -18617603, -46992635, -34924311, 4491167, 33291560, 28937987, 1925184, -15308714, -1253305, 25535322, 24587571, -9102547, -30454556, -7883478, 26729471, 25831535, -678520, -5967202, 15833676, 26019279, 12225620, 6632230, 23859510, 34315453, 18842060]
9434A8842060j8223287n022190j8419191m9254026l8879371K2305493O6993542
9427b1656970M5882826n091610k4235943p464564N036575l339605j0127057L737495
9419a7258853K4839623K3855085q885580m6271164m7187635m118080M1332267
9412c3694337M6231590J8482433j890306j632986j069184q138811o289674P005064
9404A9003789R537895n797790j6749730j1542706o966840j0094908r54573K3100871
9396d63992K6518189o166849k8341767N192549N9382134N9529038m91797m8459867
9388F6697638l6417657J300078J0365320j0075855k5014943j9488732l061957
9381a5696108J7560710L6027982L2887914k89431l2900292k6800582P488056K1855451
$$ y = [18842060, 618773, -4403417, -22822608, -72076634, -110956005, -88650512, -21656970, 24225856, 19134246, -5101697, -12566261, -7529686, -10869291, -20996348, -17258853, 7580770, 31435855, 22550275, -23720889, -70908524, -75026604, -33694337, 12537253, 31019686, 29129380, 27496394, 26427210, 18288399, 11998725, 19003789, 28541684, 22743894, 5994164, -5548542, -12515382, -22610290, -23564863, -463992, 26054197, 19887348, -8454419, -3261870, 56120264, 115649302, 115157505, 66697638, 30279981, 31580059, 41945379, 31869524, 6854581, -12634151, -15696108, 1864602, 37892584, 70780498, 70491067, 37590775, 10790193, 18278249, 40133700]
9373D0133700O45830j8048476l698531K0309355J5911558j1927188k7521279j6950359
9365a145390K523366J4428877J5242828K759911j8593109k7083736q100408J6129840
9357c837821J3472452o326208n122247J8641671K3360907p175993l4274272k3982124
9349b5243635M527615J6198826R426784p3605j0286750j7181899k153708L0679322
9341E892950L9080801L715946l0112590j7365159J4769041J4666767o566545k929503
9333B1151708J6311103L233533l2781552l1041276J3280009L3948347M963524
9326B9065396j7648247K133388J9177230m310939k5928746j372627L0101452J2528344
9318D3745251k6781523k5434685N246200O879585j6217424o533149L5773413M4845457
$$ y = [40133700, 40779530, 22731054, 19032523, 39341878, 55253436, 43326248, 15804969, -1145390, 1377976, 15806853, 31049681, 33809592, 15216483, -11867253, -19967661, -3837821, 9634631, 3308423, -1813824, 16827847, 40188754, 33012761, -1261511, -25243635, -20716020, -4517194, 4909590, 4835985, -5450765, -22632664, -24786372, 5892950, 44973751, 48689697, 18577107, 1211948, 15980989, 30647756, 24081211, 21151708, 37462811, 40696344, 7914792, -23126484, -9846475, 24101872, 29065396, 11417149, 13550537, 32727767, 28416828, 2488082, 1115455, 31216907, 43745251, 16963728, -8470957, -3224757, 3654828, -12562596, -19095745, 16677668, 61523125]
9310F1523125K318248k8785486q829387J8085139N589967k1380069k0827411m910037
9302B784089m861482j0033818K860537J5122492k041724k7507459k0774275N981391
9294c8470249P258606j4338247j0527061K6058767M2915526J3703767j6438650
9287A0162459l849777K5205607K1637326q530346k2585225j3063831q877383j5899136
9279a5800306r251356J3051934J8005389p250783l0110495k2841669l035097J273094
9271e5959289l709690J453100Q420080j969118j7314859q307480J9850364L0584289
9263b6952603J3613169P85164J2366015K3451021N848546k4945100l3111185j4462734
9255d3407707M669884R765261R534367R290433K760280o365788k473993J2822197
$$ y = [61523125, 63841373, 35055887, 26226500, 44311639, 49901606, 28521537, 7694126, 2784089, -2077393, -12111211, -9250674, 5871818, 3830094, -23677365, -44451640, -38470249, -31211643, -45549890, -56076951, -30018184, 12897342, 26601109, 10162459, 6312682, 31518289, 53155615, 44625269, 22040044, 8976213, 98830, -15800306, -25051662, -11999728, 6005661, -1245122, -31355617, -54197286, -57232383, -55959289, -59668979, -58215879, -49795799, -51764917, -69079776, -77387256, -57536892, -26952603, -13339434, -12554270, -188255, 23262766, 29111312, 4166212, -28944973, -43407707, -38737823, -28972562, -19438195, -10147762, -7387482, -13753270, -16227263, -3405066]
9247c405066J4288439q620904k7865616j3296232K0882306L2814930J1288048
9240B6085905j0884196o563154R214782P043459j2962721k6195107k0656908o599391
9232d1517331N496883J4236166J5249895K137314j5910763j7841050o19134J2427830
9224b6340190L984300j2597860j4637628k660713M771774J7720o483883m491224
9216e8437704L827004R254006N334934n234000j0865816l940999N957137M343862
9208d9761576j424995J1498460M0737259M9991369J8840292k2444717l2676928
9201A4759164j4596614j023743k803034m009175K190560P940075J3901407K3359364
9193C9718004J9700229j1932414m4726703l5797526N807298K3534820l463628
$$ y = [-3405066, 10883373, 2262469, -25603147, -38899379, -18017073, 14797857, 26085905, 15201709, 8638555, 17853337, 24896796, 11934075, -14261032, -34917940, -41517331, -36020448, -21784282, -6534387, -4397073, -20307836, -38148886, -38768020, -26340190, -22355890, -34953750, -49591378, -52252091, -47480317, -47462597, -53946480, -58437704, -54610700, -45356694, -40021760, -45255760, -56121576, -60062575, -54105438, -49761576, -51186571, -39688111, 1049148, 51040517, 69880809, 47436092, 14759164, 162550, -861193, -3664227, -7673402, -5482842, 2457233, 16358640, 39718004, 59418233, 47485819, 2759116, -33038410, -27231112, -3696292, -7159920]
9186g159920k9216692j3675713J8319323K1910229j36334j1792692j309247J2031376
9178a1029670J4101970Q055051n22153p137713n614548J763064L581162N29831
9170C726994P176117J9808837J1178341k2145920l9688120j5434130J4423992
9163b0953889L303655l0641371l0795994R875868L9797309K7015328k943380j5778632
9155b1121106j1161529k378370R087098J9797001J5275423n540694k0045198j3611026
9147b9698401j138750q44530o068430j465319Q781790R137274p64450o602023
9139b8662839k102143M300697N498079O302699J3265244K0097009J2072167j1428453
9131A9342460k6703603j1611122K0116808L0172617O981440j7531844j5723114
$$ y = [-7159920, -36376612, -50052325, -31733002, -9822773, -9959107, -21751799, -23061046, -11029670, 3072300, 11127351, 10605198, 3467485, -2147063, -383999, 3197163, 3726994, 10903111, 30711948, 41890289, 19744369, -19943751, -35377881, -20953889, -17650234, -48291605, -79087599, -69211731, -29414422, -2399094, -5342474, -21121106, -32282635, -34661005, -25573907, -5776906, 9498517, 3957823, -16087375, -29698401, -30837151, -31681681, -37750111, -39215430, -30433640, -21296366, -22060816, -28662839, -30764982, -26464285, -20966206, -14663507, -1398263, 18698746, 30770913, 19342460, -7361143, -18972265, 1144543, 31317160, 38298600, 20766756, 5043642]
9124E043642k660391l484714q301355M749429K0719555P310382k4927367l0595189
9116c2146008j065679J9590596K840435k4835563l0251812j9699199j0402231
9109i5969461O284407L8046706N7102465L3408585j3323054l2768374q771644
9102a5990370K6333960L8908130K7542379Q791630o566795j7094346k4961061
9095C6963527l1183478l1292143j9878666l446664L007276n83477M454474K4371012
9087a7588139L6871317K3469800m80656r818927o031197l948508L74841J5516587
9079C8365118K2419169k929528l9625697l9274574J225985K8795060J1450271
9072B0425804j6164437j0940266J2450974J1913101j0757088j4845894J1118522
$$ y = [5043642, 2383251, -1101463, -9402818, -4653389, 16066166, 23376548, -1550819, -32146008, -33211687, -13621091, -10780656, -35616219, -65868031, -85567230, -95969461, -89685054, -51638348, 5464117, 38872702, 25549648, -7218726, -15990370, 10343590, 49251720, 76794099, 85585729, 79018934, 61924588, 36963527, 5780049, -25512094, -45390760, -48837424, -45830148, -46413625, -41959151, -17588139, 19283178, 42752978, 42272322, 32453395, 26422198, 22473690, 22848531, 38365118, 60784287, 57854759, 18229062, -21045512, -19819527, 8975533, 20425804, 4261367, -6678899, 5772075, 17685176, 6928088, -7917806, 3200716]
9065C200716L0527059J5183270j5089770k5740551j4956051o691843j1074022
9058b4641192j4167727l817587J2071430J7327926Q059138m241445o966505M63457
9050a5912505Q725664J1679301J2338072J3151341O889598j2926828l4623889
9043a0679246l5029512q688184K0970256K8451122J5518368L556724M314128J1134953
9035B9548609J4188020R878199k386884j7637270k0884070k788053J8891651J3991057
9027D2801259j7198952l6991698j9450089J2615548J9008835l739461k2886161
9020b5840719j6669601L016488J4643567J2590709M300101k304192l061900O45500
9012a2680047K344620M23613L686762J5494452J9101919k540661l5257440m4192540
$$ y = [3200716, 33727775, 48911045, 33821275, 8080724, -6875327, -13567170, -24641192, -38808919, -42626506, -30555076, -13227150, -5168012, -9409457, -16375962, -15912505, -7186841, 4492460, 16830532, 29981873, 36871471, 23944643, -10679246, -45708758, -54396942, -33426686, -4975564, 10542804, 14099528, 18413656, 29548609, 43736629, 53614828, 51227944, 33590674, 12706604, 9918551, 28810202, 42801259, 25602307, -11389391, -30839480, -18223932, 784903, -2954558, -25840719, -42510320, -39493832, -24850265, -12259556, -7959455, -10263647, -13325547, -12680047, -10335427, -9911814, -6225052, 9269400, 28371319, 25830658, -9426782, -53619322]
9004e3619322j8932910J3295569K5519356K0319533J1388819j451415k0339876
8997b3820246k9251220j0506456K3242922L5622478J0289414k5559718l0530467
8990e0513293K788211L8308589L9226603J3314026J056030J6975899K5370656
8983H6526721o992059n3425396n6521495r045776L3577479K9645127J813080p979546
8975A7598135L24605m28263j3499032j8743420j1957395q323321j0541590n548970
8967e1119251O163697P638146l252762p219491K663535O384458q979952k2412509
8959g0134129p285684K6616885M2767579K5980711l07127q469709n59440K724506
8951A1333592n252651j1316323o102012K928052O144750N565694N483931Q90759
$$ y = [-53619322, -72552232, -59256663, -33737307, -13417774, -2028955, -3480370, -23820246, -53071466, -63577922, -40335000, -4712522, 5576892, -19982826, -50513293, -47725082, -9416493, 29810110, 43124136, 44180166, 61156065, 86526721, 79534662, 26109266, -30412229, -39458005, -5880526, 23764601, 25577681, 17598135, 17922740, 17494477, 3995445, -14747975, -26705370, -35028691, -45570281, -51119251, -44955554, -37317408, -40570170, -47789661, -45126126, -38741668, -47721620, -70134129, -77419813, -50802928, -8035349, 17945362, 17638235, 9168526, 8609086, 11333592, 6080941, -5235382, -11337394, -8409342, -2264592, 3301102, 8785033, 9675792]
8943I675792j2280088k3500768j8824525j571420J1461230J1132326J354309j0925832
8935c3478976j7584074r218798R836652J6483055P28725r960845J0691378L6460000
8927C957117J9878463k8021472m3046637m637529K9831916J4540968j6646819
8920b4143993j3441761R309801R231624l241425J1425413M1293565L6368660n330871
8912F1471013l2133668k1053031k688580L330752J3985491K8437718J2446197
8905F3795892l4394669n4799380j6703989K9447153K2993069j7215534k8175193
8898c5052651K89835K0883640Q475570j0264143q856088K892489N758930l6505
8890a5908923o391310j2646575j5990646n510760K0242111M1584698L6050863
$$ y = [9675792, -2604296, -26105064, -44929589, -46501009, -35039779, -23907453, -22553144, -33478976, -51063050, -60281848, -50445196, -33962141, -33233416, -43194261, -32502883, 3957117, 23835580, -4185892, -47232529, -51870058, -22038142, -7497174, -24143993, -37585754, -28275953, -19044329, -22285754, -10860341, 30433224, 66801884, 61471013, 29337345, 8284314, 5595734, 8926486, 22911977, 51349695, 63795892, 29401223, -25398157, -42102146, -12654993, 10338076, -6877458, -35052651, -34762816, -13879176, -5403606, -15667749, -24523837, -21631348, -15872418, -15908923, -22300233, -34946808, -50937454, -56448214, -36206103, 5378595, 41429458]
8883D1429458M061476l0168680m1389081k5433022r27458J1060164Q856876O950000
8875b5560267J1427769J0453106m139879j7823192r874355J6298694L3581372
8868A4363248K2976798m877664k3328004j9049501l198635N781348N205193P131214
8860E003997J5166457J5713109P91220j4599341j4461116q433478j2699184j5159663
8852b8677999O491279L5508458K7784357j6914924m0375222q050266L4630126
8845A0395809K6666047j8645540l6782704p947507K3045705K1539530O435913
8838B4707253N075726Q213381m067052k1405251j8862024J791431J4307193O097602
8830A5858259q190210j1341136m003249L954253R250876J4252067J7615978J5221399
$$ y = [41429458, 45490934, 15322254, -26066827, -51499849, -52427307, -41367143, -32510267, -25560267, -14132498, -3679392, -7819271, -25642463, -35516818, -19218124, 14363248, 37340046, 32462382, 9134378, -9915123, -13113758, -7332410, -2127217, 5003997, 20170454, 35883563, 36674783, 22075442, 7614326, -819152, -13518336, -28677999, -22186720, 13321738, 41106095, 24191171, -16184051, -24234317, 10395809, 37061856, 18416316, -18366388, -26313895, -3268190, 18271340, 24707253, 29782979, 37996360, 33929308, 12524057, -6337967, -4546536, 9760657, 15858259, 7668049, -3673087, -7676336, -3722083, 5528793, 19780860, 37396838, 52618237]
8822E2618237Q320436K281923l134126j2695759k1725253j5791828N415935J6379576
8814C1669141l342151l4064420l6605617p388676J5238839P023368r380181m138078
8806d0987775J4162220J7902648N748968j005594L852808O731288K345188m41561
8798H308190j71000n766260j5495279j4340160K319060J8622560J6983985l650618
8790F810478k8496255l6392998j3705763K8189405N5314274M5849261J5623972
8783G3192374o618161j7436654k8826521l2691421j0766702K1942337K3997444
8776B2792696j0733372l5074952j3552593K5437408L1387918K683275j9590737
8769C349643j6982692j3172778k4377776k7585769K00861L5296802L2433256r014610
$$ y = [52618237, 60938673, 63220596, 60086470, 47390711, 25665458, 9873630, 15289565, 31669141, 28326990, -5737430, -42343047, -49731723, -34492884, -27469516, -36849697, -40987775, -26825555, -8922907, -3173939, -4179533, -326725, 6404563, 8749751, 8308190, 8137190, 2370930, -13124349, -27464509, -25145449, -6522889, 10461096, 6810478, -21685777, -58078775, -71784538, -43595133, 11719141, 57568402, 73192374, 66574213, 49137559, 20311038, -12380383, -23147085, -1204748, 22792696, 12059324, -23015628, -36568221, -11130813, 20257105, 22940380, 3349643, -13633049, -26805827, -51183603, -78769372, -78568511, -43271709, -10838453, -19853063]
8761a9853063l7284132j7612967J9785736K5933608M801732k24734J8157148J9686644
8753A3389972r502089k4701058M395929L5187018J5118573l1080134l7335268
8746c4527057j09229K0816192K411267j0546202J0817107L0900033J5781147q437803
8738B7105455n428927P879304l660384k7296297k3621137N088290J8626370L250774
8730A943448j3650070j3193373q155117r885696p339659P993942K2190241J8669258
8722a427026J703913j1393976j1647325m737313j903706p182295j1103654j571607
8714d9262989J5723767J9301371K976233r574968L192123K7022863L0385517P944899
8706D7708816j5682142k0167506p313010J0631322K0384894R756662j8762011
$$ y = [-19853063, -57137195, -74750162, -54964426, -29030818, -24229086, -24453820, -6296672, 13389972, 3887883, -20813175, -16417246, 18769772, 33888345, 2808211, -34527057, -34636286, -13820094, -11408827, -21955029, -11137922, 19762111, 35543258, 27105455, 21676528, 29555832, 25895448, -1400849, -25021986, -19933696, -1307326, 1943448, -11706622, -24899995, -33055112, -42940808, -50280467, -42286525, -20096284, -1427026, 276887, -11117089, -22764414, -27501727, -29405433, -36587728, -47691382, -49262989, -33539222, -14237851, -11261618, -20836586, -17644463, 9378400, 39763917, 47708816, 32026674, 11859168, 4546158, 15177480, 35562374, 45319036, 26557025]
8699B6557025l9874083l1719919o464528P035876N365552Q210189J7819172J4837378
8691A766662j279272m152557J3539942K0631976l136741k7938882j5679874J8923681
8683B674935K5943906p675124l9122991k8936558Q575075K8438172J1688816j7747972
8675a6161741k6776436r685670J1415876J5065963K549518q727603p672236J331729
8667c8660600R431110J3965057J5365116J1940617L724925l822866n269376k96857
8659F377126R575506K2339874K9418875J8395580q588886k7979321k0721404m34365
8651B8382985J407030k0836690l6453357j9528470J4952703L0274931J4117026
8644A2316158j0507529j7405820n319129P582923N258501j3107973l1876116k9084844
$$ y = [26557025, -13317058, -45036977, -51501505, -44465629, -39100077, -30889888, -13070716, 1766662, 487390, -3665167, 9874775, 30506751, 27370010, -568872, -16248746, 2674935, 28618841, 20943717, -18179274, -47115832, -38540757, -10102585, 1586231, -16161741, -42938177, -52623847, -41207971, -26142008, -23592490, -32320093, -39992329, -38660600, -29229490, -15264433, 100683, 12041300, 15766225, 11943359, 6673983, 6377126, 15952632, 38292506, 67711381, 86106961, 77518075, 49538754, 28817350, 28382985, 29790015, 8953325, -27500032, -47028502, -32075799, -1800868, 12316158, 1808629, -15597191, -20916320, -13333397, -8074896, -21182869, -53058985, -82143829]
8636h2143829J222186L4608718L7698095R209737j5432438r597002J0587803J3104027
8628g42703l447429j2765000l209754P939751M361742o981227j0456458k963822
8620b8264900O936149J0590917N864700Q0007M440496J5761334J2172962j5127096
8612A2454569l6035135j6181036K7383596M1683454J2874862j5080280j0209084
8605A6890946K789568o033269j7369413q5867K7740664K3507589j1307359l4453871
8597A678988k6350160n986152J1849661L0263388M0044312K0769366j8612445
8590E3656958m0020212k9378170j3792672j3114888j1011309P961048K6961133
8583a8738112K5744307J2417746K308958r535294k8909282l7705587j7710255
$$ y = [-82143829, -80921643, -46312925, -8614830, 594907, -14837531, -24434533, -13846730, -742703, -4190132, -16955132, -20164886, -12225135, -7863393, -14844620, -25301078, -28264900, -21328751, -10737834, -4873134, -4793127, -352631, 15408703, 27581665, 12454569, -23580566, -39761602, -12378006, 29305448, 42180310, 27100030, 16890946, 19680514, 13647245, -3722168, -3808035, 23932629, 47440218, 36132859, 1678988, -24671172, -30657324, -18807663, 11455725, 51500037, 72269403, 53656958, 13636746, -15741424, -29534096, -42648984, -53660293, -45699245, -18738112, 7006195, 19423941, 21732899, 12197605, -16711677, -54417264, -72127519]
8576g2127519J5695473L0832518K1099113O346609J796866O339954J3835544J7149699
8568D0968257Q431409q362489j5019811m889034K509553p944710j7699062k811115
8560d817002K0954962J5447485k0409508m3770074k7651728L475077J2183307
8553d4587481k379832j2296446k051084J7272234K6641548J6921487o515386k5326230
8545c2321190j9750180R619454L5368665L0548240J293460j9338956j1560142
8538f140649Q563108J2447266m529619k0749289j9003202o570554q57373n341672
8530d2181984q887220l780557N858444J2546496J2927906O003923o979514j7834917
8522d2327423j4948045K616203J9253854J7047975m830071k7363103k8621857
$$ y = [-72127519, -56432046, -25599528, -4500415, 1846194, 3643060, 9983014, 23818558, 40968257, 49399666, 41037177, 26017366, 21128332, 23637885, 15693175, -2005887, -4817002, 16137960, 31585445, 11175937, -32594137, -60245865, -56770788, -44587481, -46967313, -59263759, -61314843, -44042609, -17401061, -479574, -6994960, -32321190, -52071370, -42451916, -7083251, 23464989, 24758449, 5419493, -6140649, 2422459, 14869725, 10340106, -10409183, -29412385, -35982939, -36840312, -42181984, -51069204, -54849761, -48991317, -36444821, -23516915, -17512992, -24492506, -42327423, -57275468, -54659265, -35405411, -18357436, -23187507, -50550610, -79172467]
8515g9172467n175595K1745529K5641045M603875j4077154p026887J4550223K1070172
8507a7841259O802272l862135M716402J5317602M904756j9431961k8795770j0649312
8499d8839405J6477943K6324179J2519402r401362k1210548j8718634r703552
8492e2551977K00871J1421809J8729013Q878969j8188623l6832149k3430600R172426
8484h2600261K6782410K0623639J3235736J6153706J2588240o281791j7804749
8477a7303070k177321K2055395K2444155j198021j9665098j5542362L05708R803758
8469a276856P536524N08800o52571P172677J1750203k018970k6389707l2935584
8461c6305484j0229398J7488055K2167228N389658j3834874k4845376k1914853
$$ y = [-79172467, -84348062, -62602533, -36961488, -32357613, -46434767, -53461654, -38911431, -17841259, -11038987, -14901122, -10184720, 5132882, 10037638, -9394323, -38190093, -48839405, -32361462, -6037283, 6482119, -2919243, -24129791, -42848425, -52551977, -52351106, -40929297, -22200284, -13321315, -31509938, -68342087, -91772687, -82600261, -55817851, -35194212, -21958476, -5804770, 6783470, 501679, -17303070, -19480391, 2575004, 25019159, 23821138, 4156040, -11386322, -11080614, -1276856, 6259668, 6768468, 6115897, 13288574, 25038777, 23019807, -3369900, -36305484, -46534882, -29046827, -6879599, -1489941, -15324815, -40170191, -62085044]
8454f2085044K190987L5793078M3525457J1514716k1705233j3211066K1516794
8447A7539689L2079879P258469j7530152k1262029j9219558k0294192q565874
8440b9993768J8905600L5675759K5389954N057572p392759j6446658k2614083
8433H581617p975130K6226974L9612736N133409m0508272l7971852J2481857M7265346
8425E2846685K1197535l6600634o0543255k4956935L1371334N1395260J9845705
8418E4555695k6010304m0659503j6112679J9440209L6540742K6050075m083484
8411D9720751l4748061m2564879k0741878P679031J5323294O053534M082166J2487813
8403b708229J1305190k884698q466319K712473J0708021L440632l473829K460083
$$ y = [-62085044, -59894057, -24100979, 19424478, 30939194, 9233961, -3977105, 17539689, 49619568, 56878037, 39347885, 18085856, -1133702, -21427894, -29993768, -11088168, 24587591, 49977545, 55035117, 47642358, 31195700, 8581617, 606487, 26833461, 66446197, 71579606, 31071334, -6900518, 5581339, 52846685, 74044220, 37443586, -23099669, -48056604, -16685270, 34709990, 54555695, 28545391, -12114112, -28226791, -8786582, 27754160, 53804235, 49720751, 14972690, -27592189, -48334067, -40655036, -25331742, -19278208, -15196042, -2708229, 8596961, 5712263, -2754056, -41583, 10666438, 14107070, 10633241, 13093324]
8395A3093324R970473J0688733J5712182K6067551J8578295j4082436l9734334
8388D0293788l1886239j0392591n933658j2177465q930082m967823j5010005j8450614
8380f7454689R083440M1017141L1925711n560050j4802432J4666957L2141951
8373D1018029J0832540j3057721q153941K557613o703651j3862624O379622K6847867
8365D5857734P718299l3622474m4538233j5465449J3384187J8851628J9678615
8358A1864307K8754274K6054357j885328k9772099k6427363N51167J7066498Q311796
8350C4517609q383214j1878061j900432N469857k185176j9556375k7478644j4475877
8342d5870313N712869Q360811p612421j4609602L723276K4283468J6860062p054985
$$ y = [13093324, 23063797, 33752530, 49464712, 75532263, 94110558, 80028122, 40293788, 8407549, -1985042, -7918700, -20096165, -29026247, -33994070, -49004075, -67454689, -58371249, -17354108, 14571603, 9011553, -5790879, 8876078, 41018029, 51850569, 38792848, 30638907, 33196520, 26492869, 12630245, 19009867, 45857734, 53576033, 19953559, -24584674, -40050123, -26665936, -7814308, 11864307, 40618581, 66672938, 64787610, 35015511, 8588148, 9139315, 26205813, 34517609, 26134395, 14256334, 12355902, 17825759, 15640583, -3915792, -31394436, -45870313, -40157444, -31796633, -39409054, -54018656, -50295380, -26011912, -9151850, -16206835]
8334a6206835p693491K1256993L8065453J3704714k2922018k5884699L124697
8327C444814K3268104J5568601p32577j0398281k2227693l7123005l2025335K343444
8319e7881928L3945759K7225743o856791k5483524j0643848J3977080K0630221
8312e087288R297622k393593m358193j157769j647604p297026j0265624m063254
8304b6972729N282815O184031l22075j469505N463382Q102153K137578R89416
8296f04934J0628378J3808329l149078k4282488k5407401q465184O841382J3641898
8288a6989098J7307957J5536440M389873m458564J281463R406257J52793j8098704
8280H528417j9460695k957950O768616N42751m848573N96296P304196R612161
$$ y = [-16206835, -23900326, -2643333, 35422120, 49126834, 26204816, 320117, 3444814, 26712918, 42281519, 41548942, 31150661, 8922968, -28200037, -60225372, -57881928, -23936169, 3289574, -3567217, -29050741, -39694589, -25717509, -5087288, 4210334, 1816741, -2541452, -3699221, -5346825, -12643851, -22909475, -26972729, -21689914, -15505883, -15827958, -17297463, -11834081, -3731928, -1594350, -604934, 10023444, 23831773, 20682695, -3599793, -29007194, -37472378, -30630996, -16989098, 318859, 15855299, 20245172, 15786608, 17068071, 26474328, 26627121, 8528417, -10932278, -13890228, -7121612, -6578861, -11427434, -10831138, -3526942, 6085219]
8272F085219J2255159J0311673n635949k0878663r030643J9706842K2054856j2700814
8264B2167680m0122350k4480783J1569519K7025074J8922755Q689683J221779
8257B4993357q790484j2497049k634741M113440p969738k2405176j4918339N924129
8249c4184601J3499596N180817j400350k052362m854551o165112J100957N408769
8241b3466837n890387j7311464o272381J6482848K2141212J0336753L539387L765644
8233C324775l944019j1325118L578365K7983989K5051729k380917j1061895Q258446
8225C9485355J1318333k2263034m7046693k2894635J9130702K6345473K664181
8218F739682j1514832q983108j2460546j9974670q111190J6285209J8771672n173564
$$ y = [6085219, 18340378, 28652051, 23016102, 2137439, -6893204, 12813638, 34868494, 22167680, -17954670, -42435453, -30865934, -3840860, 15081895, 23771578, 24993357, 16202873, 3705824, 1071083, 5184523, -2785215, -25190391, -40108730, -34184601, -20685005, -15504188, -16904538, -18956900, -23811451, -29976563, -28875606, -23466837, -29357224, -46668688, -52941069, -36458221, -14317009, -3980256, -440869, 3324775, -619244, -11944362, -8365997, 19617992, 44669721, 42288804, 31226909, 39485355, 50803688, 28540654, -18506039, -41400674, -22269972, 4075501, 6739682, -4775150, -13758258, -26218804, -46193474, -54304664, -38019455, -19247783, -24421347]
8210b4421347k0382748q216370P796298N595667k091159L451415J3626468R700191
8202a4941585o123776j6187583j1383429L814213J8976892K1277374M886508j4984988
8194a4666374j3047625J1693125K9663268K0778334K591145J480884J2244993
8187E0737750R583540r791325k2241921j4043399j040464m791667k2992257l1643079
8179d6222822j1725614K7998428N2599190L1991956k2044255n8592911m0651030
8172f6647058J1268985M4194823L4552507M594368j7613408k6139251k1459686
8165c7248720J758876L4958398M8661655K7004516p643169k4638882k3122616
8158A9730058j8717587j0894715O846830J8608580M209922k0311152j8412351
$$ y = [-24421347, -44804095, -53020465, -45224167, -39628500, -41719659, -38268244, -24641776, -14941585, -21065361, -37252944, -48636373, -44822160, -25845268, -4567894, 318614, -14666374, -27713999, -16020874, 13642394, 34420728, 37011873, 38492757, 50737750, 60321290, 50529965, 28288044, 14244645, 13204181, 8412514, -14579743, -46222822, -57948436, -29950008, 22649182, 54641138, 32596883, -25996028, -66647058, -55378073, -11183250, 23369257, 27963625, 10350217, -15789034, -37248720, -35489844, -531446, 48130209, 75134725, 67491556, 42852674, 19730058, 1012471, -9882244, -3035414, 15573166, 19783088, -528064, -18940415]
8151a8940415R877526K5296803J0148990q527908r610798r472024k0268485j8475571
8143c9971882J0133708L0223413P215087k8317629j9636663K6753084M7623138
8136C4022256J8372452j5088581j2628700N224304M402159n927161Q5801J4214625
8128D2677155J0469984p572941j4655738p853250o231904j1795481o449522R982727
8120H571030J2205125r558518k8170554j5823258J6212708L1953041J5582244
8113C0971818j2861354k2565806k231469L1478913M7118825K3762953k6285281
8106F9388599o0981963m6991744Q02728K9606584Q636041l0712776l2232802J1036115
8098e1449218M5335495K8086192j5023466k9028144o484062J0816699Q86788r525273
$$ y = [-18940415, -9062889, 16233914, 26382904, 17854996, 8244198, -1227826, -21496311, -39971882, -29838174, 385239, 7600326, -20717303, -40353966, -13600882, 34022256, 52394708, 37306127, 24677427, 29901731, 34303890, 28376729, 28462530, 42677155, 53147139, 45574198, 30918460, 23065210, 16833306, 5037825, -1411697, 8571030, 20776155, 11217637, -16952917, -32776175, -16563467, 15389574, 30971818, 18110464, -4455342, -6686811, 24792102, 71910927, 95673880, 69388599, 8406636, -38585108, -37782380, -8175796, 460245, -30252531, -62485333, -51449218, -6113723, 21972469, 6949003, -22079141, -28563203, -17746504, -16859716, -26384989]
8090b6384989M241793K3143776J7849306l950168j3326826n163131K828422M202180
8082C440363O254617N394376q312065k3127965j4078492J4856406K7186966N679131
8074A7293337j8127960o395706L0284259M4620159J3554432l3272615m9746282
8067a790376k5055902Q920323J7833245L143444n991736N380213J8900377J2735006
8059C4074594m240537o252400Q598388J4533645k515475k3537486k4237032p340297
8051a0916600O194213O676456J766918q58389l052867q518957j4500296j3607698
8043c6817220j803518J5015703K3593314J7004799M436483N4193L373056J147256
8035B6004066j0775353k0570252j9006670j1184471l562729O262740J7168694
$$ y = [-26384989, -22143196, 1000580, 18849886, 14899718, 1572892, -3590239, -761817, 3440363, 9694980, 15089356, 6777291, -16350674, -30429166, -15572760, 11614206, 17293337, -834623, -7230329, 23053930, 67674089, 81228521, 47955906, -1790376, -26846278, -17925955, -92710, 3050734, -2941002, 2439211, 21339588, 34074594, 29834057, 23581657, 32180045, 46713690, 44198215, 20660729, -3576303, -10916600, -4722387, 1954069, 3720987, 2862598, -190269, -8709226, -23209522, -36817220, -38620738, -23605035, -11721, 16993078, 21429561, 21483754, 24856810, 26004066, 15228713, -5341539, -24348209, -35532680, -39095409, -32832669, -15663975]
8028a5663975J6272124k295925k1017380j8353400J588098J4952505R664570m881543
8020a9734926j6484550k0832405j4149825N351441K4430622K2159103p87594j6876713
8012c6924847p927580Q691761O967554p266573o382926J3398990K4192634J0580364
8004E329377m841325K854822K0383649J7206346m505354j2097117N463355J9619170
7996D9412923P316321j4670150k0507895j6747362k4869199l7968388k8626722
7989h6660472M351777L0313350L1816638K4654303K3216103J5429956r764685
7982C3356970l4046776l3324762j5012376o407938j2909990j2388721P826750
7975g2906843K9154744K5887071K66728j7230099l063190K9092007M0717152J4600414
$$ y = [-15663975, 608149, -1687776, -22705156, -41058556, -39470458, -24517953, -14853383, -19734926, -36219476, -57051881, -71201706, -65850265, -41419643, -19260540, -20048134, -36924847, -44852427, -36160666, -29193112, -36459685, -42842611, -29443621, -5250987, 5329377, 488052, 3342874, 23726523, 40932869, 36427515, 24330398, 29793753, 49412923, 56729244, 42059094, 21551199, 4803837, -20065362, -58033750, -86660472, -82308695, -51995345, -20178707, 4475596, 27691699, 43121655, 33356970, -689806, -34014568, -49026944, -55434882, -68344872, -80733593, -72906843, -43752099, -17865028, -17598300, -34828399, -37891589, -8799582, 31917570, 46517984]
7967D6517984k1510488l0300341j4447374p423324j8648958k0787371K06509J8522766
7959d7870597J2762093L072844J3014934K3770660P302041j7159135r343317K1096939
7951F646462K4570301p225535k6583796q945597Q901414m467036k1184753n399880
7943c3688420K2607405K0956791l762437j1817241J558406N418059o373672o034787
7935a1135896J2107686J5752493r231664k9105272j3382696J7249648K3952070
7928F206369P398088o48355Q934806J1183092r412189l1365038k4498937Q230097
7920b3972067L1547958J9419425j3243207k7423325p569349J8642961J6882406
7913A4284802p764766k0147182o735381P895782L386599m822980M525897J9015272
$$ y = [46517984, 25007496, -5292845, -19740219, -27163543, -45812501, -66599872, -66393363, -47870597, -35108504, -32035660, -19020726, 4749934, 12051975, -5107160, -14450477, 6646462, 31216763, 23991228, -2592568, -11538165, -2636751, -7103787, -28288540, -33688420, -11081015, 9875776, 6113339, -5703902, -4145496, 1272563, -5101109, -11135896, 971790, 16724283, 7492619, -21612653, -34995349, -17745701, 6206369, 13604457, 12956102, 21890908, 33074000, 23661811, -7703227, -32202164, -23972067, 7575891, 26995316, 13752109, -13671216, -21240565, -2597604, 14284802, 6520036, -13627146, -20362527, -12466745, -9080146, -13903126, -9377229, 9638043]
7905I638043J1852061j1370723j8142421k17899J2814571m98883k2347785k6006381
7897d4279417j3943552m552306J584285J6047648L2495349L0344021Q706500q761914
7889A7640614q918648n789247j1041527j0228607J1001224L2733633K1351663
7882D6749105j8371236m0316935j5938235K6232929L7566488J1340418j4674719
7875C2587815j2523213L347095M195215j2012569k3064471j6232849k156299M797089
7867b1062187N564882Q863077J2961106O088240j3867465k8873677j8831006J0982183
7859c8174847L1240902K3294185K709981m146147J161171m938069k3945966k5401670
7851c8200460N138484L4443961K4680086r504110k1210865n80428J5228120M328200
$$ y = [9638043, 21490104, 10119381, -8023040, -8240939, 4573632, 4074749, -18273036, -44279417, -58222969, -62775275, -61190990, -45143342, -12647993, 17696028, 26402528, 17640614, 8721966, 2932719, -8108808, -18337415, -7336191, 25397442, 46749105, 28377869, -11939066, -27877301, -1644372, 35922116, 47262534, 32587815, 20064602, 23411697, 27606912, 15594343, -7470128, -23702977, -25859276, -21062187, -15497305, -6634228, 6326878, 12415118, -1452347, -30326024, -49157030, -38174847, -6933945, 16360240, 19070221, 14924074, 16085245, 11147176, -12798790, -38200460, -33061976, 1381985, 26062071, 16557961, -4652904, -5233332, 9994788, 14322988]
7843A4322988q723684l7755J2935943N112249j1593082j1397499r52333m341362
7835d674535j5418128o531115J9486359K7738314O419293j4838380j2317391J131833
7827I96250O922628Q571759J0094389j102015k5361194l4212704j2224221J0726090
7819c5589018L992535j0367591P135630M0099347L2565580j9390088m8462344
7812c0015949j0752798M6846143N0787056J069520l7287324k8191669k617096
7805a0162117O99081j0309822p134099Q458224J1242807k372503q925159P12286
7797a7791302M362782j3361995k9880849j5438556J8685359L1829257J0821677
7790a0773627j4418993j7496948q147087m247311O70576J7695000L1560708K0455410
$$ y = [14322988, 5599304, 5561549, 18497492, 23609741, 12016659, 619160, -333173, -4674535, -20092663, -26623778, -7137419, 20600895, 27020188, 12181808, -135583, 996250, 7918878, 16490637, 26585026, 25483011, 121817, -34090887, -46315108, -35589018, -31596483, -41964074, -34828444, 5270903, 37836483, 18446395, -30015949, -40768747, 6077396, 56864452, 57933972, 20646648, -7545021, -10162117, -9463036, -19772858, -26906957, -18448733, -7205926, -9578429, -18503588, -17791302, -13428520, -26790515, -56671364, -72109920, -53424561, -21595304, -10773627, -25192620, -42689568, -50836655, -55083966, -54413390, -36718390, -5157682, 15297728]
7782A5297728m778125j3441465k289612K551224p950290j1288966N031910J9523113
7774B655517J2324320j482718J943573J4851700J1269759j0045238k4295102j9765362
7766a2543551j1883269j3349257j3015885L234912K5645134L0349251J0560946
7759A8998281j4895199k4131322j4070869K217155J2385521J3604353Q669834
7752B777754O28972p878969j4460491j7364592j3364985K293422K6297043L9168910
7744A8097064K0836548j9221198m1525278k0682085J9162436L1176694M619194
7737A2463375k3342088j7428481J3739231L5214128K9865992R873342p633841
7730E2751658j8906230k5722338k2809073l937813K1729956L0641603J0461859
$$ y = [15297728, 10519603, -2921862, -5211474, -2660250, -10610540, -21899506, -16867596, 2655517, 14979837, 13497119, 15440692, 30292392, 41562151, 31516913, 7221811, -12543551, -24426820, -37776077, -50791962, -47557050, -21911916, 8437335, 18998281, 4103082, -20028240, -34099109, -31881954, -19496433, -5892080, 2777754, 3406726, -4472243, -18932734, -36297326, -49662311, -47368889, -21071846, 18097064, 38933612, 19712414, -21812864, -42494949, -23332513, 7844181, 12463375, -10878713, -28307194, -14567963, 20646165, 50512157, 60385499, 52751658, 33845428, 8123090, -14685983, -18623796, 3106160, 33747763, 44209622]
7723D4209622j9919460k8163836p493596J5472538J7136667N637297J615770N405580
7715C3900582K202251r827627j8242361j8837751j8746847j8633348j1414201
7708e9599302J374845R970061J2329701J2601095P812432l851882q225114N282630
7700b2305534J6124628j337050k7801530j8380271K2635608L6646384j18710l3587777
7692b8124252j3221241K9132661L1316161j838163j2938622J3176833L1682857
7685D9186234J5656068n862424k802282J0220539O601010r248104j7701035j7551613
7677B8498393j8480402j7407923o103408Q204341J0081208j597087j3239048j4786827
7669b4830753p286196L841465J3118623J4632543N217686j1316086k5624018k7776507
$$ y = [44209622, 24290162, -3873674, -11367270, 4105268, 21241935, 26879232, 28495002, 33900582, 36102833, 26275206, 8032845, -10804906, -29551753, -48185101, -59599302, -58224457, -48254396, -35924695, -23323600, -15511168, -19363050, -27588164, -22305534, -6180906, -7517956, -35319486, -53699757, -31064149, 5582235, 5463525, -28124252, -41345493, -12212832, 19103329, 17265166, 4326544, 17503377, 49186234, 64842302, 58979878, 56177596, 66398135, 72999145, 63751041, 46050006, 28498393, 10017991, -7389932, -13493340, -5288999, 4792209, 3195122, -10043926, -24830753, -32116949, -28275484, -15156861, -524318, 4693368, -6622718, -32246736, -60023243]
7661f0023243j2756142J2777698K9664764K1343940o195756k6477760k0225480
7654f1891979L022031J6727981R075903m039523j478300J3105378J5251511l478924
7646a3705922j8143216m819347J9893823J9353077o973140k0127020j903623J5974991
7638a0450377L017667k0484628j6072262J2496921K7964531J6899350Q81783o542351
7630G710634j7491538l7518055m6252909k5097162J3361953L6852718K7644286
7623d0790073N45945j1188077P491792L0211879J8666874k0249092l5346802n630483
7615e6288037K2150919M419817k6187807j1844834L1543960L5125644r807949
7608a0888287l4933088n502561K5543158Q114124k4320121j4655097K4635093
$$ y = [-60023243, -72779385, -60001687, -30336923, -8992983, -15188739, -41666499, -61891979, -58869948, -42141967, -33066064, -37105587, -38583887, -25478509, -10226998, -13705922, -31849138, -36668485, -16774662, 2578415, -4394725, -24521745, -26425368, -10450377, -7432710, -27917338, -43989600, -31492679, -3528148, 13371202, 14252985, 7710634, -9780904, -47298959, -93551868, -118649030, -105287077, -68434359, -40790073, -40244128, -51432205, -43940413, -13728534, 4938340, -15310752, -50657554, -56288037, -34137118, -29717301, -55905108, -67749942, -36205982, -1080338, -10888287, -45821375, -51323936, -25780778, -17666654, -41986775, -56641872, -32006779]
7601c2006779L6223630P481477k0756612k1245386p182732L129822P637243O522446
7593b0196891j020247n835797J69018O101660r92139r230357L99356J6224806
7585a4380591P771547k4522414m2462702j9994063K4609661N4843012N4412607
7578D0277057L1532275K542501j8005990k2341750j4289725m656130P26104L474821
7570A9259163M833329L344199l10826l425443n489080o701487m923292K51164
$$ y = [-32006779, 4216851, 11698328, -9058284, -30303670, -37486402, -34356580, -26719337, -20196891, -21217138, -27052935, -26883917, -20782257, -21774396, -31004753, -30605397, -14380591, -6609044, -31131458, -73594160, -93588223, -68978562, -14135550, 40277057, 71809332, 74351833, 56345843, 34004093, 19714368, 15058238, 15784342, 19259163, 24092492, 27436691, 27125865, 23700422, 18211342, 11509855, 6586563, 6837727]
$$ [...]
##END NTUPLES=NMR SPECTRUM
##END=
