##TITLE=31Pdec_SR167R3TFA
 CDCl3, 64 sc
 20.4.2023
##JCAMPDX= 6.0         $$ Bruker NMR JCAMP-DX V2.0
##DATA TYPE= NMR SPECTRUM
##DATA CLASS= NTUPLES
##ORIGIN= UXNMR, Bruker Analytische Messtechnik GmbH
##OWNER= root
$$ XWIN-NMR		Version 3.5
$$ Thu Apr 20 14:20:34 2023 Russian Standard Time (UT+4h)  she@DPX200
##.OBSERVE FREQUENCY= 81.013821
##.OBSERVE NUCLEUS= ^31P
##.ACQUISITION MODE= SIMULTANEOUS
##.ACQUISITION SCHEME= undefined
##.AVERAGES= 64
##.DIGITISER RES= 16
##SPECTROMETER/DATA SYSTEM= spect
##.PULSE SEQUENCE= zgpg30
##.SOLVENT NAME= CDCl3
##.SHIFT REFERENCE= (INTERNAL, CDCl3, 0, 248.564)
##AUDIT TRAIL= $$ (NUMBER, WHEN, WHO, WHERE, WHAT)
$$ ##TITLE= Audit trail, XWIN-NMR		Version 3.5
$$ ##JCAMPDX= 5.01
$$ ##ORIGIN= Bruker BioSpin GmbH
$$ ##OWNER= she
$$ F:/spectra/data/she/nmr/P31/1/pdata/1/auditp.txt
$$ ##AUDIT TRAIL=  $$ (NUMBER, WHEN, WHO, WHERE, WHAT)
(   1,<2023-04-20 14:19:48.50 +0400>,<she>,<DPX200>,
      <continue with go, POWCHK disabled, PULCHK disabled
       configuration hash MD5:
       00 E9 B6 7A A2 85 ED C7 34 08 36 98 17 FE 4E 26
       data hash MD5: 32K
       74 95 43 A2 4D 5D 15 BE 95 06 42 42 60 D9 EB 57>)
(   2,<2023-04-20 14:19:50.25 +0400>,<she>,<DPX200>,
      <Start of raw data processing
       efp BC_mod = 2 LB = 1 FT_mod = 6 PKNL = 1 PHC0 = -10973.29 PHC1 = 84.28488 SI = 64K 
       data hash MD5: 64K
       7A 1C 9C F4 58 85 BA 74 8E DE 29 AE 2D 7B 29 74>)
(   3,<2023-04-20 14:20:03.85 +0400>,<she>,<DPX200>,
      <pk PHC0 = 2.445001 PHC1 = 0 
       data hash MD5: 64K
       F5 4F DE DB 52 98 9E E0 F4 64 1D 4D 98 E5 75 56>)
(   4,<2023-04-20 14:20:09.82 +0400>,<she>,<DPX200>,
      <abs ABSG = 5 
       data hash MD5: 64K
       77 F5 D0 FC C0 03 41 BE F5 CB CC 0B 14 CC 08 9A>)
$$ ##END=
$$ 
$$ hash MD5
$$ DC 0F 2A FD 63 88 DD 40 EE 40 9D DF FD 99 1B CD
##$RELAX= 
##$RELAX= 
##$RELAX= 
##$RELAX= 
##$RELAX= 
##$RELAX= 
##$RELAX= 
##$RELAX= 
##$RELAX= 
$$ Bruker specific parameters
$$ --------------------------
##$DU= <F:/spectra>
##$EXPNO= 1
##$NAME= <P31>
##$PROCNO= 1
##$TYPE= <nmr>
##$USER= <she>
##$AMP= (0..31)
100 100 100 100 100 100 100 100 100 100 100 100 100 100 100 100 100 100 
100 100 100 100 100 100 100 100 100 100 100 100 100 100 
##$AQSEQ= 0
##$AQ_mod= 1
##$AUNM= <au_zg>
##$AUTOPOS= <>
##$BF1= 81.014009
##$BF2= 200.13
##$BF3= 200.13
##$BF4= 200.13
##$BF5= 200.13
##$BF6= 200.13
##$BF7= 200.13
##$BF8= 200.13
##$BYTORDA= 1
##$CFDGTYP= 0
##$CFRGTYP= 5
##$CHEMSTR= <none>
##$CNST= (0..31)
1 1 145 1 1 1 1 1 1 1 1 1 1 1 1 1 1 1 1 1 1 1 1 1 1 1 1 1 1 1 1 1 
##$CPDPRG= <waltz16>
##$CPDPRG1= <>
##$CPDPRG2= <waltz16>
##$CPDPRG3= <>
##$CPDPRG4= <mlev>
##$CPDPRG5= <mlev>
##$CPDPRG6= <mlev>
##$CPDPRG7= <mlev>
##$CPDPRG8= <mlev>
##$CPDPRGB= <>
##$CPDPRGT= <>
##$D= (0..31)
0 1 0 0 0 0 0 0 0 0 0 0.03 2e-05 3e-06 0 0 0 0 0 0 0 0 0 0 0 0 0 0 0 0 
0 0 
##$DATE= 1681985912
##$DBL= (0..7)
120 120 120 11 120 120 24 19 
##$DBP= (0..7)
150 150 150 150 150 150 150 150 
##$DBP07= 0
##$DBPNAM0= <>
##$DBPNAM1= <>
$$ [...]
##$SUBNAM3= <"">
##$SUBNAM4= <"">
##$SUBNAM5= <"">
##$SUBNAM6= <"">
##$SUBNAM7= <"">
##$SUBNAM8= <"">
##$SUBNAM9= <"">
##$SW= 501.771253377433
##$SWIBOX= (0..15)
0 1 3 0 0 0 0 0 0 0 0 0 0 0 0 0 
##$SW_h= 40650.406504065
##$TD= 32768
##$TD0= 1
##$TE= 0
##$TE2= 300
##$TE3= 300
##$TEG= 300
##$TL= (0..7)
0 120 53 12 22 120 120 120 
##$TP= (0..7)
150 150 150 150 150 150 150 150 
##$TP07= 0
##$TPNAME0= <>
##$TPNAME1= <>
##$TPNAME2= <>
##$TPNAME3= <>
##$TPNAME4= <>
##$TPNAME5= <>
##$TPNAME6= <>
##$TPNAME7= <>
##$TPOAL= (0..7)
0.5 0.5 0.5 0.5 0.5 0.5 0.5 0.5 
##$TPOFFS= (0..7)
0 0 0 0 0 0 0 0 
##$TUNHIN= 0
##$TUNHOUT= 0
##$TUNXOUT= 0
##$USERA1= <user>
##$USERA2= <user>
##$USERA3= <user>
##$USERA4= <user>
##$USERA5= <user>
##$V9= 5
##$VALIST= <valist>
##$VCLIST= <CCCCCCCCCCCCCCC>
##$VD= 0
##$VDLIST= <DDDDDDDDDDDDDDD>
##$VPLIST= <PPPPPPPPPPPPPPP>
##$VTLIST= <TTTTTTTTTTTTTTT>
##$WBST= 1024
##$WBSW= 4
##$XGAIN= (0..3)
0 0 0 0 
##$XL= 0
##$YL= 0
##$YMAX_a= 3242
##$YMIN_a= -3579
##$ZGOPTNS= <>
##$ZL1= 120
##$ZL2= 120
##$ZL3= 120
##$ZL4= 120
##$ABSF1= 248.5645
##$ABSF2= -253.2056
##$ABSG= 5
##$ABSL= 3
##$ALPHA= 0
##$AQORDER= 0
##$ASSFAC= 0
##$ASSFACI= 0
##$ASSFACX= 0
##$ASSWID= 0
##$AUNMP= <proc_1d>
##$AZFE= 0.1
##$AZFW= 0.5
##$BCFW= 0
##$BC_mod= 2
##$BYTORDP= 0
##$COROFFS= 0
##$CY= -3
##$DATMOD= 1
##$DC= 0
##$DFILT= <>
##$DTYPP= 0
##$F1P= 0
##$F2P= 0
##$FCOR= 1
##$FTSIZE= 65536
##$FT_mod= 6
##$GAMMA= 0
##$GB= 0
##$INTBC= 1
##$INTSCL= 6.047779e-11
##$ISEN= 30
##$LB= 1
##$LEV0= 0
##$LPBIN= 0
##$MAXI= 10000
##$MC2= 0
##$MEAN= 0
##$ME_mod= 0
##$MI= 50
##$NCOEF= 0
##$NC_proc= -10
##$NLEV= 6
##$NOISF1= 182.463
##$NOISF2= 159.3651
##$NSP= 0
##$NTH_PI= 0
##$NZP= 0
##$OFFSET= 248.5645
##$PC= 4
##$PHC0= -10970.84
##$PHC1= 84.28488
##$PH_mod= 1
##$PKNL= yes
##$PPARMOD= 0
##$PSCAL= 0
##$PSIGN= 0
##$REVERSE= no
##$SF= 81.0140089999694
##$SI= 65536
##$SIGF1= 159.3651
##$SIGF2= -187.1042
##$SINO= 113.3802
##$SIOLD= 16384
##$SREGLST= <1H.CDCl3>
##$SSB= 0
##$STSI= 65536
##$STSR= 0
##$SW_p= 40650.406504065
##$SYMM= 0
##$S_DEV= 0
##$TDeff= 32768
##$TDoff= 0
##$TI= <>
##$TILT= no
##$TM1= 0
##$TM2= 0
##$TOPLEV= 0
##$USERP1= <user>
##$USERP2= <user>
##$USERP3= <user>
##$USERP4= <user>
##$USERP5= <user>
##$WDW= 1
##$XDIM= 65536
##$YMAX_p= 415388645
##$YMIN_p= -270060638
$$ End of Bruker specific parameters
$$ ---------------------------------
##NTUPLES= NMR SPECTRUM
##VAR_NAME=  FREQUENCY,     SPECTRUM/REAL,   SPECTRUM/IMAG
##SYMBOL=    X,             R,               I
##VAR_TYPE=  INDEPENDENT,   DEPENDENT,       DEPENDENT
##VAR_FORM=  AFFN,          ASDF,            ASDF
##VAR_DIM=   65536,         65536,           65536
##UNITS=     HZ,            ARBITRARY UNITS, ARBITRARY UNITS
##FACTOR=    0.620285442955139, 1,           1
##FIRST=     20137.2065510682, 0,            0
##LAST=      -20513.1999529968, 0,           0
##MIN=       -20513.1999529968, -270060638,  0
##MAX=       20137.2065510682, 415388645,    0
$$ Real data points
##PAGE= N=1
##DATA TABLE= (X++(R..R)), XYDATA
$$ [...]
43066c2545414J5158458J4870478J193853J470733Q036449l809110k4322554j8635555
43058c8582662J3051734K7563027L819320k2738241j4404708J1794810J4062488
43051e434232q828374k0541767o501248Q239678L074067r580862r950346J013298
43043d8509786J1834276J8161461J7917247P007549p892414r541243M142158J1818793
43035D938041j2027j6056543j9018358j6371718j7528486o632720K7344771N0281440
43027F944400J9462698m1981076n8944755p320604M5997029L5626773j2583996
43020a2799531k8076039j98131J9625148O583867p479924O01373O334974j2092374
43012b7500637k9373033j3501258K0007058L1403097J4910250j862593m144819
$$ y = [-32545414, -17386956, -2516478, -1322625, 148108, 8184557, 4375447, -19947107, -38582662, -25530928, 2032099, 5851419, -16886822, -31291530, -19496720, -5434232, -14262606, -34804373, -41305621, -33065943, -29991876, -39572738, -49523084, -48509786, -36675510, -18514049, -596802, 6410747, -1481667, -11022910, -6880752, 4938041, 4926014, -11130529, -30148887, -46520605, -64049091, -70681811, -43337040, 6944400, 26407098, -15573978, -74518733, -81839337, -35842308, -215535, -12799531, -40875570, -41073701, -21448553, -14864686, -22344610, -21743237, -15408263, -27500637, -56873670, -70374928, -50367870, -18964773, -4054523, -5917116, -10061935]
43005a0061935j013902K915624J2811206K1273187J1765606j1787641k5471158
42998D30987j9697410q477213j447329O524004J3289361O929634n845564n49823
42990h843353K1663052K4826567n553867l0008310j1342095K4075659K3101016
42983C7918669j3353775l3711482j5422041O925765J739073j5079701j5095096
42976d6078588j517856O871941R441550J3648209J0724663r154022k9381969k3845765
42968f9291837L381703K1580316J6192383L817823J030961J614692n086323j1816156
42960c8576438m866763J2440089K3651178K3385923K3231612L0196704L1030236
42953A00492541R269468k5376000l9739334j7750804J3204236J3735243j4508044
$$ y = [-10061935, -11075837, -8160213, 4650993, 25924180, 37689786, 25902145, 430987, -19266423, -27743636, -29190965, -22666961, -9377600, -2447966, -8293530, -8843353, 12819699, 37646266, 32092399, 2084089, -9258006, 14817653, 37918669, 24564894, -9146588, -24568629, -17642864, -15903791, -30983492, -46078588, -47596444, -40724503, -31282953, -17634744, -6910081, -16064103, -45446072, -69291837, -65910134, -44329818, -28137435, -24319612, -23288651, -21673959, -26760282, -38576438, -43443201, -31003112, -7351934, 16033989, 39265601, 69462305, 100492541, 109762009, 84386009, 44646675, 26895871, 40100107, 53835350, 39327306]
42946C9327306l0809283j4681511M703316m269934k5207613k1500604K856282
42939d9582041J0901202l669927n908781J7958520L2693741J2410218j2918383
42932A884549n079542J8907676J5668842j1364923j8006561P055087K5246072
42925C4311200J1465430j2207624k1077516k2590916k4107402p148657L3074518
42918h280967N6377069K7802259k3356296l9784556j8178730o706758k3101321
42911c5229300k7670280O176524M0983564K8590263j4749639k8549111N211454
42904b5236525L6103635J6759929l0269446m2895048l064967M1868748M5610984
42897C8877310J9612399K094260m109169k3875698m9868084l9696027J4392687
$$ y = [39327306, 8518023, -6163488, -1460172, -5730106, -30937719, -52438323, -49582041, -38680839, -42350766, -48259547, -30301027, 2392714, 14802932, 1884549, -3194993, 15712683, 31381525, 20016602, 2010041, 9065128, 34311200, 45776630, 33569006, 12491490, -10099426, -34206828, -41355485, -8280967, 48096102, 75898361, 52542065, 12757509, -5421221, -12127979, -35229300, -62899580, -56723056, -15739492, 12850771, -1898868, -30447979, -25236525, 10867110, 27627039, -2642407, -45537455, -48602422, -6733674, 38877310, 58489709, 60583969, 56474800, 32599102, -17268982, -56965009, -42572322]
42890d2572322N8189193M5700016Q11232k5044221k5092791k5133375k5655209
42883c8797477p798534J7292059J9388866M820899P598508K4179044J3702764
42876D0386129k7013180m6529022j7837816J8628054J9428725j791002j1306257
42869b6034369r174568r177843l418890J3263659J7481886l476756j8741949k353595
42861d1632425J8075448Q614476p795057P499162L2047845J4173140l3805749
42854b823160m6928535j1029058J7290501N403868j0093078L224223J8355217
42847b6600022L324495k0058770j4470707J2318062K5864957J7558600K642112
42840E78727j2356315k6827784k8482081r148603J5258165K4895637K1462258
$$ y = [-42572322, 15616871, 61316887, 62128119, 37083898, 11991107, -13142268, -38797477, -46596011, -29303952, -9915086, -5094187, 2504321, 26683365, 40386129, 13372949, -33156073, -50993889, -32365835, -12937110, -14728112, -26034369, -35208937, -44386780, -47805670, -34542011, -17060125, -20536881, -39278830, -41632425, -23556977, -14942501, -22737558, -15238396, 16809449, 30982589, -2823160, -49751695, -60780753, -43490252, -38086384, -48179462, -44955239, -26600022, -23275527, -43334297, -57805004, -45486942, -19621985, -2063385, 578727, -11777588, -38605372, -67087453, -76236056, -60977891, -36082254, -14619996]
42833a4619996J3734494j229584j9327723j6575409J4369418L7305472J8622961
42826C2279633j7702943k2403449M615194J8542298M138685m670575J1115797
42819B5914640K0544618m403298l9116902m1864018j4075257Q435119R660514
42812c4904584N509136P393990N560926o593878j6868450j3622312l506776J843304
42804e5188644M177797J1042362J9002237J8886167J3065382J2144514J4450278
42797C7580093M683748k0625947l9460119k8204890O659929L2445043K5198861
42790A8276718o670506l2669018k8246268M425305L6048083L3531971o115091
42783A8581194m5716821m2828812K635226M5897743M7263419J4830607j1185445
$$ y = [-14619996, -885502, -2115086, -21442809, -38018218, -23648800, 13656672, 32279633, 14576690, -7826759, -3211565, 15330733, 19469418, 14798843, 25914640, 46459258, 42055960, 2939058, -38924960, -53000217, -44565098, -34904584, -29395448, -22001458, -16440532, -23034410, -39902860, -53525172, -57031948, -55188644, -51010847, -39968485, -20966248, -2080081, 10985301, 23129815, 37580093, 42263841, 21637894, -17822225, -46027115, -39367186, -6922143, 18276718, 11606212, -21062806, -49309074, -44883769, -8835686, 24696285, 18581194, -27135627, -69964439, -67329213, -21431470, 25831949, 40662556, 29477111]
42776B9477111r276573K169927m128318k5659729l4838153j8790408J922629L024815
42768e6098699p747836k873808K1244145L5755488K0668967o975231j9659756
42761a5686730j5329267q203520j99380J3248874J9834185L377152k1962934k1674242
42753d6595862Q773866L2298057K1237505n385030j3352179p16887R370921Q474041
42745A4104432Q076139J0342592J665675j9135156k9212675j1690850J7557915
42738h291928K9390951J9113777O429009J206970p675675k2763430k1935962P413296
42730B887008L5808166K4486091j5155769l0409880j497893K8897938J7900133
42723F2915794j7889741l2517759j6013934M022183J0995949J3723285J7442319
$$ y = [29477111, 20200538, 22370465, 18242147, -7417582, -42255735, -61046143, -59123514, -56098699, -63846535, -66720343, -45476198, -9720710, 10948257, 3973026, -15686730, -31015997, -39219517, -39418897, -26170023, -6335838, -2958686, -24921620, -46595862, -37821996, -5523939, 15713566, 10328536, -3023643, -3740530, 5630391, 14104432, 22180571, 32523163, 34188838, 15053682, -14158993, -25849843, -8291928, 21099023, 40212800, 46641809, 47848779, 40173104, 17409674, -4526288, 2887008, 38695174, 63181265, 48025496, 17615616, 16117723, 45015661, 62915794, 45026053, 12508294, -3505640, 516543, 11512492, 25235777, 42678096]
42716D2678096J2993436k448499j7823733k3913648j9745973o874190O638559
42709h495952N968856p734491q598535J5263366L2008675R480756k7854086l0047768
42701b0009179K1391J2248220o904284j4879636R193662K6494561O946052j7117272
42693d006485o115012K0108660J8189713o509099j4178018R98412O939963p738094
42685G690040j6979937l575910J4928123J6767676M689836p190277j4319721j7544318
42677a5534488j3052117O65954J3391696J2040623j512271q968004K885965K1800588
42669A1717946K0971860n732689l1505572l0104920q997641P511041J4985052
42662b1154923K3985342K8959959J4769564q417277j2144907M411318J0803098
$$ y = [42678096, 55671532, 53223033, 35399300, 11485652, -8260321, -15134511, -8495952, -2527096, -10261587, -18860122, -3596756, 28411919, 37892675, 10038589, -20009179, -19987788, -7739568, -14643852, -29523488, -20329826, 6164735, 13110787, -4006485, -10121497, 9987163, 28176876, 21667777, 7489759, 8488171, 15428134, 7690040, -9289897, -12865807, 2062316, 18829992, 23519828, 16329551, 2009830, -15534488, -28586605, -27920651, -14528955, -2488332, -4000603, -12968607, -10082642, 11717946, 32689806, 26957117, -4548455, -34653375, -43651016, -36139975, -21154923, 2830419, 31790378, 46559942, 38142665, 25997758, 30409076, 41212174]
42655D1212174m074375j3627409K38370J6854777J1704164q162140k3493087l0485494
42647i833020k9255479j1384927J8746791L3756744J7605953q467169j4275260
42640c106367J515497J7655762J8042880J511534j9199657k2324180j176960J7032210
42632I950719M438546k0274133j7390987O250080Q509519q930846K18982L6163383
42624A8935263L8435757q859250l7048208m074711L1764709J0040614l1572754
42617A7621420k8712512J301043N350072n432448Q679190K5848115L978180k4739583
42609C893477k025432M1336743K5739132l7376247n6386088q907290K8542289
42602e183416J1700818j4363609j0442629J174922L124678J5359976L2556248
$$ y = [41212174, 37137799, 23510390, 23748760, 40603537, 52307701, 44145561, 20652474, -9833020, -39088499, -50473426, -31726635, 2030109, 19636062, 11168893, -3106367, -1590870, 16064892, 34107772, 35619306, 16419649, -5904531, -7081491, 9950719, 14389265, -5884868, -23275855, -17025775, -8516256, -17447102, -17228120, 18935263, 57371020, 48511770, 11463562, 7388851, 39153560, 49194174, 17621420, -11091092, -9790049, -4439977, -9872425, -1193235, 24654880, 28633060, 3893477, 1868045, 43204788, 68943920, 31567673, -24818415, -33725705, -5183416, 6517402, -7846207, -18288836, -17113914, -13989236, 1370740, 33926988]
42595C3926988J5117249k8026819l3400357R089445K9941435k757512l0810829
42588f920400j3879371L232085j3908430j8932222K1391820M9011585J2277678
42581C2272745l3915865j7254286K6887952J9641136k2700317k2510781J8893448
42574A314032K6615203j2707837k9158498O329674L3214722N681410l3908987
42567b620281k6707231J5556863L8801022K4117725k296647j5133249j4104033
42560A7614169j0190732p746231j196504J4527721L0612599K9250188P715130
42553H0586340j4274502k0199265j5519419j1033947n726183J127775R44291o322586
42545I582504o364281L045188M261655o475058p286130Q160116J1723538j0957253
$$ y = [33926988, 49044237, 21017418, -12382939, -3293494, 26647941, 23890429, -6920400, -20799771, -17567686, -31476116, -50408338, -29016518, 19995067, 32272745, -1643120, -18897406, 7990546, 27631682, 4931365, -17579416, 1314032, 27929235, 15221398, -13937100, -7607426, 25607296, 31288706, -2620281, -29327512, -13770649, 25030373, 49148098, 46851451, 31718202, 17614169, 7423437, -322794, -1519298, 13008423, 43621022, 72871210, 80586340, 66311838, 46112573, 30593154, 19559207, 13833024, 14960799, 15905090, 9582504, 3218223, 6263411, 10525066, 4050008, -3236122, 4923994, 16647532, 5690279]
42537E690279k8331157j2141864J4244981J5173472L35130K70326J0445056O237648
42529A1923871o979181o139700L185032q10963j0968588m566213R695253N259057
42521E98568j0231422m285342K2780368L5625360J9780942k110515j1559800j3395610
42513C7202549j2364823o361671l610596j3374725k1509967q099626J5102948
42506a3015911J9085153L571292p039095o452766o699458l345612J6350711L5198871
42498C7653185K1946865j4456676l1644417j7470649k211298l127553k983734
42491a2294277P470806J0294468l052566j4744857j2779780n700341K660879J7629364
42483a0516304K7933992J4407975j0729303j4968342l91698q80228j8201829j4667345
$$ y = [5690279, -22640878, -34782742, -20537761, -5364289, -5029159, -4758833, 5686223, 11923871, 4944690, -1195010, 1990022, 1179059, -9789529, -14355742, -4660489, 598568, -9632854, -13918196, 8862172, 44487532, 64268474, 62157959, 50598159, 37202549, 24837726, 18476055, 14865459, 1490734, -20019233, -28118859, -13015911, 6069242, 9640534, 2601439, -3851327, -10550785, -13896397, 2454314, 37653185, 59600050, 45143374, 13498957, -3971692, -6182990, -9310543, -12294277, -4823471, 5470997, 2418431, -12326426, -25106206, -30806547, -28145668, -10516304, 17417688, 31825663, 21096360, 6128018, 5736320, 4856092, -13345737, -28013082]
42475b8013082J6135387K8475089m05671k8629916j7134071R811887J1529579
42468h230798l787518n497236K148842l071983j2035180M14208K6081059L2810309
42460B8831703J4987277k624349o762188r066589j8924688k8902174k8280496
42453e0741504j4214806Q278921K6690698K9067360J9136108J0418087J536529
42446C0171393j9531810m0622277k8807459J4395720L7981784R675260l4431340
42439c1168729m3259027k1916828o236004N099833L6649732P0087519N5918495
42432F5174991m320909m6054829k9717453Q374503J7853119L578127o25407O970293
42424B1232435L638945q920760p684947N693432L746020j7046309k3788271K00359
$$ y = [-28013082, -11877695, 16597394, 16191723, -12438193, -29572264, -19760377, -8230798, -12018316, -17515552, -15366710, -18438693, -30473873, -30059665, -3978606, 28831703, 43818980, 41194631, 34432443, 25365854, 6441166, -22461008, -50741504, -64956310, -56677389, -29986691, -919331, 18216777, 28634864, 30171393, 10639583, -29982694, -58790153, -44394433, -6412649, 3262611, -31168729, -74427756, -96344584, -102580588, -97480755, -60831023, 9256496, 65174991, 60854082, 14799253, -14918200, -6543697, 11309422, 14887549, 14262142, 21232435, 24871380, 15950620, 8265673, 13959105, 17705125, 658816, -23129455, -22929096]
42416b2929096K3706845J3882236j1914574j4554746L377532M217216j8888542
42409b3103129k8505458n665850J8266964J5100769M340918J0802732J4372637
42402E609583j1928802m0884747k4046002K6957174N0535765K6492279j20814
42395C2614436L492066J2308186l165219k7075829l0982150j7518491k379420
42388c2706421J3127514K3658583Q400418l0126135m7774152j5526828L2043722
42381d8903299M2655265J7701347j889429k041194m104810j7191942k4560209
42374c8334271j7118587n931494R07238O718240J1443303J1721291J2948481J9538902
42366A893103J9519020K277277j6387612j3703207K561981N230835q355010j4800419
$$ y = [-22929096, 777749, 14659985, 2745411, -11809335, -8431803, -4214587, -23103129, -51608587, -57274437, -39007473, -23906704, -19565786, -8763054, 5609583, -6319219, -47203966, -71249968, -44292794, 6242971, 32735250, 32614436, 36106502, 48414688, 45249469, 18173640, -12808510, -30327001, -32706421, -19578907, 4079676, 12480094, -17646041, -65420193, -80947021, -48903299, -6248034, 11453313, 9563884, 7522690, 3417880, -13774062, -38334271, -55452858, -61384352, -60477114, -53758874, -42315571, -30594280, -17645799, 1893103, 21412123, 23689400, 7301788, -6401419, -3839438, 1391397, -6963613, -21764032]
42358b1764032n859994J309420j109043J568174J5297837K1090511M749577j8071984
42350b789534k2153729m596724J5813989K1827258J1690385l459194j1084064
42343E248387r929146j0034104j5543140j5084817M85877J9328198K2292988Q994874
42335E759117m757335r133196m946513N127384J2921728L218230k2963524l5090124
42327d9864233j0019232K7152380L0943428p43565k5351328j7812586K684374
42320d3010762J2979287J5494668J6444412R964631o88013J422712J3812772R455749
42312C5875456j6379854k8232548m181282K5186475K2330247j728386j2628335
42305B0241773q003808p759853r543254J931403J4720397M666976j6960320j7109298
$$ y = [-21764032, -27624026, -26314606, -27423649, -25855475, -10557638, 10532873, 15282450, -2789534, -24943263, -29539987, -13725998, 8101260, 19791645, 16332451, 5248387, -4680759, -14714863, -30258003, -45342820, -44856943, -25528745, -3235757, 5759117, 1001782, -8131414, -13077927, -7950543, 4971185, 8189415, -14774109, -49864233, -59883465, -32731085, -1787657, -2531222, -27882550, -45695136, -43010762, -30031475, -14536807, 1907605, 11872236, 11184223, 12606935, 26419707, 35875456, 19495602, -8736946, -12918228, 12268247, 34598494, 32870108, 20241773, 12237965, 4478112, -5065142, -3133739, 11586658, 16253634, -706686, -17815984]
42297a7815984J062701K402771j5733255j4982734J6389298L8730292K4856992
42290C4910081J019047l204650q57471r981172j3447594J806682N536534k4424619
42282h643162m6132447j1200317M5958566M8304210m312887l2752611k219065
42275a0997713K9960304J4892949j3441823p065861J4807899Q874938j4338842
42268B2691851j6114424j175074l251119j9643544j8166150K815414J5214372
42261a7628674J3923303J7126680K0284100K832784k1332403j4972473J6648799
42254A6882116K5567548k813304k6619068j6501984L870114Q436762J0607827
42247A9430011K5190790L1963293J1940499j4730390k1201292j4749885j3350372
$$ y = [-17815984, -16753283, -14350512, -30083767, -45066501, -28677203, 10053089, 34910081, 35929128, 32724478, 31867007, 21885835, 8438241, 10244923, 15781457, -8643162, -54775609, -65975926, -20017360, 28286850, 23973963, -8778648, -10997713, 18962591, 33855540, 20413717, 13347856, 28155755, 37030693, 22691851, 6577427, 5402353, 2151234, -17492310, -35658460, -32843046, -17628674, -3705371, 13421309, 33705409, 36538193, 15205790, 233317, 16882116, 42449664, 39636360, 13017292, -3484692, 385422, 8822184, 19430011, 44620801, 76584094, 88524593, 73794203, 52592911, 37843026, 24492654]
42240B4492654j0099354N548576J7105559O552204j1623121j5630879j4129045
42233B216594k3694607k9415476p849437K5515434L3069892J2036670l422453
42226H456617N574807K1861033K3465713P206196j8190973l7958299l3828678
42219b3413584m543713K1627278J8553545j543498q904655k425725l606543j2978507
42211a7235402r783050O258539J0855189j608922o484994Q163586J9151487N860268
42203A5176701j5088929j3808937R756718K6601226J6774699p383668j7754755
42196A4273055n020863R144102J153415j8248775j6393472R647812K2237852l83980
42188A6409146k7213496k1532818K766516Q658575l177636n312442J340695o309613
$$ y = [24492654, 14393300, 19941876, 37047435, 43599639, 31976518, 16345639, 2216594, -21478013, -50893489, -58742926, -33227492, -157600, 11879070, 8456617, 14031424, 35892457, 59358170, 66564366, 48373393, 10415094, -23413584, -27957297, -6330019, 12223526, 10680028, 1775373, -650352, -4256895, -17235402, -27018452, -20759913, -9904724, -11513646, -17998640, -9835054, 9316433, 15176701, 87772, -13721165, -3964447, 22636779, 39411478, 32027810, 14273055, 9252192, 18396294, 19549709, 1300934, -15092538, -5444726, 16793126, 16409146, -10804350, -32337168, -29570652, -20912077, -24089713, -29402155, -28061460, -34371073]
42180c4371073k0925807j1798674J5799631K2172540M27469j1466639K392051
42173c7770502J1215123j718644q170644Q612438J9024987L344927o055907J8124000
42165F605778M1553435K0112634k4511600l6619277j1985966M746930l840001
42158c938067j0148765J443887J1157442N332646j874550o06948l012013j4588546
42150a6234914j8328784l650380J3011966J2776265J246080l558049L533081J3590332
42142B385597J7434619J2183079J946272l690806j06386K786240p485099k4371886
42134A081630k6790869p985849J3567039J6856668J391267j5931820j8086024
42127c5897958j247070J9769758K1433532j092788k0353339p630818K4873929
$$ y = [-34371073, -55296880, -67095554, -51295923, -29123383, -28695914, -40162553, -37770502, -26555379, -28274023, -36444667, -27832229, -8807242, -5462315, -11518222, 6605778, 48159213, 68271847, 43760247, 7140970, -4844996, -98066, -3938067, -14086832, -12642945, -1485503, 3847143, 1972593, 1365645, -1646368, -16234914, -34563698, -38214078, -25202112, -12425847, -11179767, -14737816, -11204735, 2385597, 19820216, 32003295, 33949567, 30258761, 30152375, 32938615, 25453516, 1081630, -25709239, -33695088, -20128049, -3271381, -1880114, -17811934, -35897958, -37145028, -17375270, 4058262, 2965474, -17387865, -25018683, -144754]
42120a44754L5689855J0890996j6734466j6236682o10189n11384j6235061k2656511
42112b6548196j1136374J547187L761042L017905O131452P645391N402278Q703145
42104a476170K0284641K4989969R111631j8488232l5595136l0198974p286486
42097c8658757J8877918L1036282J8462679q291743k2165192j1714169K783486
42090i669496P72472n609807N051376J9156806M077025l1864263l8456813J021941
42082e5520759L4060998J0646193l9711500m5950052M571928N0814870M3658770
42075B570448L605080k0818048j6665632m838099J118736N473962R363422N650522
42067a4539609l939499n355639P345615J9724309J4311515n343385j8618105j5804974
$$ y = [-144754, 35545101, 46436097, 29701631, 13464949, 12854760, 12343376, -3891685, -26548196, -37684570, -36137383, -32376341, -29358436, -23226984, -15581593, -10179315, -1476170, 18808471, 43798440, 52910071, 34421839, -1173297, -31372271, -38658757, -19780839, 11255443, 29718122, 21426379, -738813, -12452982, -9669496, -8897024, -14506831, -9455455, 9701351, 13778376, -18085887, -56542700, -55520759, -21459761, -10813568, -50525068, -96475120, -91903192, -41088322, 2570448, 6175528, -14642520, -31308152, -36146251, -35027515, -29553553, -20190131, -14539609, -18479108, -23834747, -16489132, 3235177, 17546692, 12203307, -6414798, -22219772]
42059b2219772r937932j3462059j5631245l24615K1175011K0607926k644042j6468777
42051c8905505n800131L669040q348981j8062361K625999L2948607L1782877M001782
42043C911327q136350N616971J1124053q439285k5376492j6168246L512966J1366110
42035b2588946J1004042J1884790Q180534j809140m122528L450838J891503j1565270
42027c674177r494452J7584907L3508013R422557k6201614k8759801l461475J1643862
42019E67820Q384760Q669069J4812000O920794j3539692k1171189j0081668j778543
42011g216649n693101o998557J014665N540453J666030O43141M707029K880348
42003c456641l259568J79463R157752M597765r322673p090629Q774985K654397
$$ y = [-22219772, -32157704, -45619763, -61251008, -61575623, -40400612, -19792686, -22436728, -38905505, -44705636, -41036596, -49385577, -67447938, -64821939, -31873332, -90455, 3911327, -4225023, 1391948, 12516001, 4076716, -21299776, -37468022, -33955056, -22588946, -11584904, 299886, 8480420, 6671280, 2548752, 5999590, 7891093, -3674177, -13168629, 4416278, 37924291, 47346848, 21145234, -7614567, -11076042, 567820, 8952580, 17621649, 32433649, 39354443, 25814751, 4643562, -5438106, -7216649, -12909750, -19908307, -18893642, -13353189, -11687159, -11044018, -6336989, -3456641, -6716209, -6536746, 2621006, 7218771, -2103902, -9194531, -419546, 2234851]
41995B234851l1279649m4479710l962759M9100994N1633016O118595k6976166
41988B389172j2366518K4756302M3667857L2888751N953458j9507603l0658943
41981D7122476k5861663j6939910j3222418p243011Q895275K1436761J1699242
41974B5886752j0121056j4134703N351929K0956354J2441101q252124k0262498
41967A1865755j9784286j2384499J22599J2554487J4028279N729364M436605J5521703
41959C2090007K0347742O232126r473285o075994N327354j219940k4331941l6509443
41951a3613374k3453343J833249K1687237K7626009J4548096j3437502l1894791
41944a6704419j7820442J4934846K9171601J6217702L222390L041920n052580
$$ y = [2234851, -29044798, -73524508, -77487267, -28386273, 23246743, 29365338, 2389172, -9977346, 14778956, 58446813, 91335564, 97289022, 77781419, 47122476, 21260813, 4320903, -8901515, -16144526, -7249251, 14187510, 25886752, 15765696, 1630993, 6982922, 27939276, 40380377, 32128253, 11865755, -7918531, -20303030, -20180431, -7625944, 6402335, 12131699, 16568304, 32090007, 52437749, 58669875, 49196590, 43120596, 48447950, 47228010, 22896069, -13613374, -37066717, -35233468, -13546231, 14079778, 28627874, 15190372, -16704419, -34524861, -19590015, 9581586, 25799288, 29021678, 32063598, 27011018]
41937B7011018k8912778l7791071j1502181J9194796J8038685R82615N449273
41930g529643K3514278J6190574j5947084k9596814q252728J4927270J4073202
41923G379055M718512M939999M636850m837485q088829J996536L055804j7228221
41915c427779l0586155r371930K6464873L7616855K1048415L480719m173789j0604869
41907C0446340j4852340r102313k713561r192019j5724237p65492K2831200K0486558
41899B1414136p949320k4144399j0047982Q051814P052968J122066P593467J1792336
41891A4885086n604683k9589546l0290478p590322J2698121J9202111K3535824
41884b753887L0308296K5277810P19341k6249679l2072499j4290986P957005J6179501
$$ y = [27011018, -1901760, -39692831, -51195012, -32000216, -13961531, -12978916, -7529643, 15984635, 32175209, 16228125, -13368689, -21621417, -6694147, 7379055, 12097567, 17037566, 21674416, 16836931, 8748102, 10744638, 13800442, -3427779, -34013934, -43385864, -16920991, 20695864, 41744279, 45224998, 41051209, 30446340, 15594000, 6491687, 3778126, -5413893, -21138130, -21903622, 927578, 21414136, 13464816, -10679583, -20727565, -12675751, -5622783, -4500717, 3092750, 14885086, 9280403, -20309143, -50599621, -58189943, -45491822, -26289711, -2753887, 27554409, 52832219, 53551560, 27301881, -4770618, -19061604, -11104599, 5074902]
41876E074902Q821000k471816p311956n656289m527765q507898j4660883j5549220
41868d4789925o335778R187514J9055244J3846150q22666q136140n82328J0037529
41860h540400R687348J898084L13042P081589J1471496P683224J327188j913961
41852B9007610l080921m928388q981645j5809552j9757814r504394J3417690K4591900
41844D954486M601677k8090463l5981840j3316916Q769969J0976400Q893265J6747115
41836b2446307K0177283N677118j0228705p674323K480241M90485m765749O301970
41828i987987K2113933J4228605j1950201k0601444k330826J1586609K096533
41821E155222q024782L920070K1847865J9625677K950524o241322p908586j5550251
$$ y = [5074902, 13895902, 11424086, 4112130, -1544159, -6071924, -14579822, -29240705, -44789925, -51125703, -41938189, -22882945, -9036795, -9859461, -17995601, -18577929, -8540400, 1146948, 3045032, 3358074, 10439663, 21911159, 29594383, 30921571, 29007610, 25926689, 20998301, 12016656, -3792896, -23550710, -33055104, -19637414, 4954486, 9556163, -18534300, -54516140, -67833056, -59063087, -48086687, -39193422, -22446307, -2269024, 3408094, -6820611, -14494934, -12014693, -11524208, -16289957, -9987987, 12125946, 26354551, 14404350, -6197094, -8527920, 3058689, 5155222, -2869560, 1050510, 22898375, 42524052, 45474576, 39233254, 31324668, 15774417]
41813A5774417k3301952j4293695M748167R912017L27938J78877J5829036K1788668
41805C0963473J031723k7067685l4768300k1066871k994131R396472J2752398
41798c1752921L498440r386133j923099L1167597N5154804L5533811j0578831
41791G1713668l4183198k0556446k195833m201340j2287456o527231N244420P002388
41783D008972K665600K773274J786586q798845j8497979j1105536R034734K2658795
41775D525601J9869907M018064j7643480l1321617j8691989J7502096M2130126
41768B0388708K6282094j2085721l1441204k1614592o131500K874458J5159278
41761f568479K6678394J4114293k0766249l7351961j0616349K7689827L0198505
$$ y = [15774417, -7527535, -21821230, -17073063, -7161046, -6833108, -6654231, 9174805, 30963473, 31995196, 4927511, -29840789, -50907660, -53901791, -44505319, -31752921, -28254481, -37640614, -39563713, -8396116, 46758688, 82292499, 71713668, 37530470, 16974024, 14778191, 10576851, -1710605, -8237836, -2993416, 4008972, 6674572, 9447846, 11234432, 2435587, -16062392, -27167928, -18133194, 4525601, 24395508, 28413572, 10770092, -20551525, -39243514, -21741418, 20388708, 46670802, 34585081, 3143877, -18470715, -24602215, -21727757, -6568479, 20109915, 34224208, 13457959, -23894002, -34510351, -6820524, 23377981]
41754B3377981k166127k6887960k0227136j297420L805470l442673m304023P142970
41746b3998918J6294945Q195590j1419627k0950045j0657714K608988j090823
41739d1017604j3665156j0306070R697470J8319269K229984j4765565q414383
41732e7922055R639028J4376644Q091069J0919846K1578797J7863941m758711
41725A9788559k2034324j4391355P918687K0471712J2610208n048736j2098457
41718G216294L083237K8157057L4659182J1734916j5711262j8474297m227482
41711D6437645m273276k3332140l1292593j0245076J8191799K5828477J5379892
41704C6694728P422046P071125L671082o688761j7137877k3009130k3404934j4090793
$$ y = [23377981, 21211854, -5676106, -25903242, -27200662, -23395192, -26837865, -31141888, -23998918, -7703973, 491617, -10928010, -31878055, -42535769, -39926781, -41017604, -54682760, -64988830, -55291360, -36972091, -34742107, -49507672, -57922055, -48283027, -33906383, -25815314, -14895468, 6683329, 24547270, 19788559, -2245765, -16637120, -8718433, 11753279, 24363487, 19314751, 7216294, 10299531, 38456588, 73115770, 84850686, 69139424, 50665127, 46437645, 42164369, 18832229, -12460364, -22705440, -4513641, 21314836, 36694728, 44116774, 51187899, 54858981, 48170220, 31032343, 8023213, -15381721, -29472514]
41696b9472514O362510K5385133K5845045Q877112m001457L237445J9937536K0364740
41688G6535550m221710l1346053l1363934m405905J7188454Q813955j5567023
41681A5633334k4557505j0648783P904057J8332813K1815436J4314675j0095645
41674C2698382l2082662j7659742K8273388N1404208J6839791l7573744m9114681
41667g215060j3125252J8290825J1466460j2352154j7581356P71707K2171355
41660B426525K8186032J5188852o632379k1274427k2200718j7466653j2310533
41653c4083301J190920K2825134K9890131Q576506j5992830j2664838O056555
41646E798277N432055j0736722p753730J4116616J5308902j2192149k5088250
$$ y = [-29472514, -23110004, 2275129, 28120174, 36997286, 32995829, 36233274, 56170810, 76535550, 72313840, 40967787, 9603853, 5197948, 22386402, 31200357, 15633334, -8924171, -19572954, -11668897, 6663916, 28479352, 42794027, 32698382, 615720, -17044022, 11229366, 62633574, 79473365, 41899621, -7215060, -20340312, -2049487, 9416973, -2935181, -20516537, -19744830, 2426525, 30612557, 45801409, 39169030, 17894603, -4306115, -21772768, -34083301, -32892381, -10067247, 19822884, 28399390, 12406560, -258278, 5798277, 11230332, 493610, -7260120, 6856496, 22165398, 9973249, -15115001]
41639a5115001j062152K1949620R673945j3510492j1942390K170048J959153K73474
41631e603795J8874082L3677277Q570775l5756798m5435069j5309371R316790
41624c1666109P843505N097935J5396338K0686280J3218432J0057389J3276517
41617E3910287K383215k0264208k2581463J794757J5616806l350249k6919568
41610E89577k3632766l851888Q053306J2663456J9471946K1102374R564328o182953
41602C7777380j8146776k7697929k2936286J3551680N6425660M6234413k1794410
41595F3413732o8172864l4633333K7055611L1173852j5253904l4777755n828476
41588c7023137J5168348k205357j5750703J0180552M4106532M0078093M369150
$$ y = [-15115001, -16177153, 5772467, 15446412, 1935920, -10006470, -7836422, -5877269, -5603795, 13270287, 46947564, 55518339, 19761541, -25673528, -40982899, -31666109, -23822604, -18724669, -3328331, 17357949, 30576381, 40633770, 53910287, 56293502, 36029294, 13447831, 15242588, 30859394, 27509145, 589577, -23043189, -26895077, -18841771, -6178315, 13293631, 34396005, 43960333, 37777380, 19630604, -8067325, -31003611, -17451931, 38973729, 85208142, 63413732, -4759132, -39392465, -12336854, 18836998, 3583094, -31194661, -37023137, -21854789, -24060146, -39810849, -29630297, 14476235, 54554328, 58923478]
41581E8923478k4623384k9430524j6998567K937703J6310205N547656k3332643
41574a0666076l5272358j0442423K5223557L5250743J9724516M734074J834406
41567C0386439K831925K647964K810533m74252j0357348j6841680q958293N412282
41559G457570R330828J999040k908600n10873J181457j085330j327754J540944
41551A5677282J189444j981628J17412N692565J219352j3846742j6962293O318818
41543b575790L2488249K4838166j3640758l7955319k0710094J0664282J5881527
41536H990263n4492k260262J2212530R952220j6715294k7808897R46532L1087168
41528A6349768J6037250k3054476k4626192J8746068M4437775R319363m8362012
$$ y = [58923478, 34300094, 4869570, -12128997, -9191294, 7118911, 12666567, -10666076, -45938434, -56380857, -31157300, 4093443, 23817959, 28552033, 30386439, 33218364, 35866328, 38676861, 38202609, 27845261, 11003581, 2045288, 7457570, 16788398, 18787438, 15878838, 15367965, 16549422, 15464092, 14136338, 15677282, 16866726, 14885098, 15002510, 20695075, 21914427, 8067685, -8894608, -2575790, 29912459, 54750625, 41109867, 3154548, -17555546, -6891264, 8990263, 8935771, 6675509, 18888039, 28840259, 12124965, -15683932, -14737400, 16349768, 32387018, 9332542, -15293650, 3452418, 47890193, 57209556, 8847544]
41521H847544o1951755k2190246K0703638K6215488M736543q952614O05051K0503589
41513a1482762L0442582K1645234l31847k1176113k4989156n840937K0714991
41506H981992K6098831J310595k5125629j9864684Q280025J9219967J550750j0732464
41498I719383N265498K2723315R629770j7494973k0624230n18909R952796L75224
41490A9027874r405912r136506p016221k792021J0056776J8630855O202403r891105
41482A5676143R77362K5794308K1037237j3365904k8010492n290090J0492096
41475B7310660j0797809l4216918k1565944M568071M635348q812660J906121K9815990
41467g157141L3778573N771022j9761254j9083629k877671J0473014J2673455
$$ y = [8847544, -53104211, -75294457, -54590819, -28375331, -23638788, -32591402, -31986351, -11482762, 18959820, 40605054, 40273207, 19097094, -5892062, -11732999, 8981992, 35080823, 36391418, 11265789, -8598895, -318870, 18901097, 20451847, 9719383, 14984881, 37708196, 47337966, 29842993, 9218763, 8699854, 18652650, 19027874, 9621962, 485456, -6530765, -9322786, 733990, 19364845, 25567248, 15676143, 16653505, 42447813, 63485050, 50119146, 22108654, 16818564, 27310660, 16512851, -17704067, -39270011, -34701940, -30066592, -38879252, -36973131, -7157141, 26621432, 32392454, 12631200, -6452429, -9330100, 1142914, 13816369]
41460A3816369j43178k1806172k8753396n121697K8716351L6849151J2558444
41453C6115872j8238227l0206463j5865178J7320474M4837467L5589272r357808
41446F0195409m3982867l1907158K769761J1998607o153538j4496451j359866
41439b2936103Q228188K861807l00917M163290j849812k0534725k5485091l348351
41431e9201714K3492644L0276225J9220677M307424p712238j1368661k069606
41424c055249J0432521J1565510P882587J5755348K3869961L988691l4894493
41417C5544876m5814768j3173883J8900979J1600416j3418882j4930944M475438
41410a6816768J2815112K952915n882790o670485r435224j4645887j1324281J192654
$$ y = [13816369, 13673191, -8132981, -36886377, -42008074, -13291723, 23557428, 36115872, 17877645, -12328818, -28193996, -10873522, 33963945, 69553217, 60195409, 16212542, -15694616, -12924855, -926248, -7079786, -21576237, -22936103, -14707915, -11846108, -12147025, -7983735, -9833547, -30368272, -55853363, -59201714, -35709070, -5432845, 13787832, 18095256, 10383018, -985643, -3055249, 7377272, 18942782, 26825369, 42580717, 66450678, 70439369, 35544876, -10269892, -23443775, -4542796, 7057620, -6361262, -21292206, -16816768, -4001656, -1048741, -6931531, -13602016, -23037240, -37683127, -49007408, -47814754]
41402d7814754J1332928J1644524K807652r347787j0004105J3165091M1115249
41395A2898798L2887662j3244178l9123687l854659M5802993L2739876l7695876
41388C0410929q0201251m6406769J7595368M6085943L4187036J5636017L092669
41381B0399942j0807464k0005554j2222336L304329P093273Q9503k941829j630213
41373a6720349n547890r515638j126471J1962097J1270071K167822P658370K4272101
41365B4420113J9436994j3620707l2872311n369664L8416343M2946030N353582
41358G8710380k3860686j5253059L255595m750917l1376002m1180857k0381208
41351e4836754J2200170L1831902K8209524P984250q722946l402219J6424168
$$ y = [-47814754, -36481826, -24837302, -22029650, -31377437, -41381542, -28216451, 12898798, 45786460, 32542282, -6581405, -10436064, 35366929, 68106805, 30410929, -49790322, -96197091, -78601723, -32515780, 1671256, 17307273, 20399942, 9592478, -10413076, -22635412, -19331083, -12237810, -12148307, -15090136, -16720349, -22268239, -31783877, -32910348, -20948251, -9678180, -7510358, 148012, 24420113, 43857107, 30236400, -2635911, -8005575, 30410768, 73356798, 78710380, 54849694, 39596635, 42852230, 38101313, 6725311, -34455546, -54836754, -42636584, -10804682, 17404842, 25389092, 16666146, 13263927, 29688095]
41344B9688095J9446705q069616l7218901l3159086m124986J2546000M908095
41337a5983694l995642R42312P649049O359914O110360R693034K383184j6770600
41329c612083k0451531N999012L2070370J9972692j9768940m1312678k4842368
41322e1945526M189431J5662942Q154630j793399j975140R790548K5921508L0549418
41314C8554412J4252876j0661959k2517557j7054091o767845L475316J8369283
41307A7650435K8667582J3061212k5014002m7439815k8398762O627177J3142903
41300b1703270j1740265k7734605q462372K5936314M0272191K7080164M461245
41293B8109402j3981400k8532051l7740726l2021277q449368J8845311L1287194
$$ y = [29688095, 49134800, 41065184, 3846283, -29312803, -33437789, -20891789, -15983694, -19979336, -19037024, -11387975, -5028061, 1082299, 10775333, 13158517, -3612083, -24063614, -18064602, 14005768, 33978460, 14209520, -27103158, -51945526, -47756095, -32093153, -23938523, -25731922, -27707062, -17916514, 8004994, 38554412, 52807288, 42145329, 19627772, 2573681, -4194164, -718848, 17650435, 46318017, 59379229, 34365227, -13074588, -41473350, -34846173, -21703270, -33443535, -61178140, -69640512, -43704198, -3432007, 23648157, 28109402, 14128002, -14404049, -52144775, -84166052, -92615420, -73770109, -42482915]
41286d2482915K4518442Q526841o844395j8430169k3043672j4602978O352908
41279f6005938K6066897K8442338J2454054o221395j2022519m688486M137821
41272a7837228P238500J0144334J9688013K7579622J6262351j3357420l2022849
41265A7695323j5620185J8082221K8378750P640804q927063O21950R862219j0797713
41257D6936306m0213810l5458710j56070J9929428P235564p342669k657791J291950
41249a0435802r199174p939813K2705163M7174021K6231836j4579087j8079241
41242C5877903J6369087L3040238P312204k2596981k3005444j1013517j0036473
41235B5947017o775162J3140421K5701749O894783j8740127j4603780M016513
$$ y = [-42482915, -17964473, -9437632, -16282027, -34712196, -57755868, -72358846, -66005938, -39939041, -11496703, 957351, -5264044, -17286563, -21975049, -17837228, -10598728, -454394, 19233619, 46813241, 63075592, 49718172, 17695323, 2075138, 20157359, 48536109, 56176913, 47249850, 47871800, 57734019, 46936306, 6722496, -28736214, -28892284, -8962856, -1727292, -9069961, -11727752, -10435802, -19634976, -27574789, -4869626, 42304395, 68536231, 53957144, 35877903, 52246990, 85287228, 92599432, 70002451, 46997007, 35983490, 25947017, 19171855, 32312276, 58014025, 64908808, 46168681, 31564901, 35581414]
41228C5581414n116058l3318184k7211478K1147534M9605851J6839039l2272884
41221B5255234l2879436M755936J8516017n731665j6531308J5338695M5809838
41214E4533311K3168903l1841020n2317740j6457309K8009418L2119529L390856
41207D0605948j8379785j6218656m671978R93159l21074o083996j3957283j5180977
41199c3214642k419413J4059971J5035951K79078q776119J054752J8549219K7499279
41191C2068076K5004936J3396987o318796k2087565j3586371J5138535K6082653
41184F9698455n517987m9878819n6878032k1742773J3820612K1083140J1724777
41177a7690627L791181n264717j8673874k2026684m976172J6638775J9868378
$$ y = [35581414, 30465356, -2852828, -30064306, -8916772, 40689079, 57528118, 25255234, -7624202, -2868266, 15647751, 9916086, -6615222, 8723473, 54533311, 77702214, 45861194, -6456546, -22913855, 5095563, 37215092, 40605948, 22226163, 6007507, 1335529, 2328688, 2007614, -4076382, -18033665, -33214642, -35634055, -21574084, -6538133, -6259055, -15035174, -13980422, 4568797, 32068076, 57073012, 70469999, 64151203, 42063638, 28477267, 43615802, 69698455, 64180468, 14301649, -42576383, -64319156, -50498544, -29415404, -17690627, -13899446, -19164163, -37838037, -59864721, -64840893, -48202118, -28333740]
41170b8333740N693721m237981M592585K5622937L9208708K8011330p582783m3553302
41162A9421475n0836588k5744303O885816K4419941K7840389K7153005K1033519
41155E0173254L466298j9363811l2384998k8709020j5850079p529181j1649474
41148f1847011k0999220j6542660J0327889M0127930M4239218K2291874L312905
41141B0910925O188242J8320325K0216535J1026531j37935q229063o176097J3633437
41133G5752900L6838790K9036751j8005358o1597467n6174253j2413096J9224226
41126A2662493J4061890p030729j8164290j7261187j1062154L69356J3222227
41119a3202394J4393243k66884j4612020j1092707N889784J5374482O221766r494333
$$ y = [-28333740, -22640019, -26878000, -22285415, 3337522, 42546230, 70557560, 62974777, 19421475, -31415113, -57159416, -50273600, -25853659, 1986730, 29139735, 50173254, 53639552, 34275741, 1890743, -26818277, -42668356, -50197537, -61847011, -82846231, -99388891, -89061002, -48933072, -4693854, 17598020, 20910925, 27099167, 45419492, 65636027, 76662558, 76524623, 68295560, 62119463, 75752900, 112591690, 141628441, 123623083, 62025616, 5851363, -6561733, 12662493, 26724383, 19693654, 1529364, -15731823, -26793977, -26424621, -13202394, 1190849, 923965, -13688055, -24780762, -18890978, -3516496, 2705270, -6789063]
41111f789063j2177632j86268Q167129J538632o196489K378240J7435178J5075069
41103A9244796k121554o498197Q473629J5974858K468179p828817K812406J0414589
41095D2939889r295104l2524301k1381823J2971989K6002020Q709950m741854
41088B2680766L253200J1169505K569936p763896n799898j973451n393461l088470
41080A5654231J4064855K6601530J1252297k1466966l6245678j7696112R421617
41073A585774J0822509j2575515k2860046L854397L7480887L0288843j0844307
41066C7752542k7336781M208014L3142801J2784675k6540007k9597099n123460
41059g09315j534737j7963645j0382653K1740345K8598059k889722k4820599q953976
$$ y = [-6789063, -18966695, -19152963, -10985834, -9447202, -15643691, -13265451, 4169727, 19244796, 17123242, 10625045, 19098674, 35073532, 37541711, 29712894, 32525300, 42939889, 33644785, 1120484, -20261339, -7289350, 18712670, 27422620, 22680766, 25933966, 37103471, 39673407, 31909511, 26109613, 24136162, 18742701, 15654231, 29719086, 56320616, 67572913, 46105947, 9860269, -7835843, 1585774, 12408283, -167232, -23027278, -19172881, 18308006, 48596849, 37752542, 10415761, 14623775, 47766576, 60551251, 34011244, 4414145, -709315, -2244052, -20207697, -30590350, -8850005, 19748054, 16858332, -7962267, -16916243]
41051a6916243J2223618Q999825o01200J838491q25563j6222355j4508241J5855408
41043a0156260L3546166Q913180k1517322j2474629J7487157K1820216J299482
41036C8917990r599232n450000n892562q794329J463842J4315701R647700k17544
41028C4391566Q009592K0195239P593716j5425927j1009045J3026006J2345560
41021F9126707j5357950k1964269Q895978K9904489N453794l0655731k7894832
41014A7508186O622921K5305558J0145611j1686022j4099263k583030M095205
41007C5309166R73214l275504l025593j836486k859025j816674M419501Q509849
40999C6398448K943712m580237j507326O607762L985384n298921j549382J3090379
$$ y = [-16916243, -4692625, 4307200, 3706000, 5544491, 4718928, -11503427, -26011668, -10156260, 23389906, 32303086, 10785764, -1688865, 15798292, 37618508, 38917990, 29318758, 23868758, 17976196, 9181867, 10645709, 24961410, 34609110, 34391566, 42401158, 62596397, 70190113, 54764186, 43755141, 56781147, 69126707, 53768757, 31804488, 40700466, 70604955, 76058749, 45403018, 17508186, 24131107, 49436665, 59582276, 47896254, 33796991, 31213961, 35309166, 36282380, 33006876, 29981283, 28144797, 25285772, 23469098, 27888599, 36398448, 39342160, 34761923, 33254597, 39862359, 43847743, 38548822, 36999440, 50089819]
40991E0089819J3239972n019872j3980302l455384l74290j7053500k2249571M254806
40983E451678K9534671K0484202N85443O349604K2005534J1893238j2043115j4678036
40975F9583219m795246j4610743l2776821k4713551k976476n748172j8390553
40968c4428343M658993M6174494M0911782j0774059l4043004j668128K5414535
40961C6246270Q359562r408018N683909J3220627j6131633l2207921O867812M7003300
40953E9633908K0402733l6510633l5499778K5557640O2824271L0336525l0851337
40946I5893329o2964501m9645370o663371L3900444L4949232n957106l8698387
40939H14270k3011100J1355379J3386782o346461j218979K4193535K2735391p629906
$$ y = [50089819, 63329791, 58309919, 44329617, 40874233, 40499943, 23446443, 1196872, 5451678, 34986349, 55470551, 56055994, 62405598, 84411132, 96304370, 84261255, 69583219, 64787973, 50177230, 17400409, -7313142, -10289618, -16037790, -34428343, -29769350, 16405144, 57316926, 46542867, 12499863, 10831735, 36246270, 44605832, 35197814, 40881723, 54102350, 37970717, 5762796, 12630608, 59633908, 80036641, 43526008, 8026230, 33583870, 96408141, 126744666, 95893329, 32928828, -16716542, -23379913, 10520531, 45469763, 39512657, 814270, -22196830, -10841451, 2545331, -3801130, -5020109, 19173426, 41908817, 34278911]
40931C4278911j7079080J0447132L2253400J9946681l240549j3426957j7888310
40924D5291228j9177811k070317K4295880K3893890m764390j5879706J0452625
40917F2041399L3164092J7921473q883806r792797L477047Q0351j5386003k0056320
40909F2565436j5763841j4879795q128819J4325316L1385239J9456297n723682
40902H3236151j2826725l749098j524891n311597K379593J4657903P944158j3690111
40894G1115383k0385896k742719J7539708K3530997J8082351M006569j7339808
40887I3806585k7091627m991417K9318361K8120956j7753211n7986096m7895268
40880d471717n334240K1739963K0559766J6212057K3226201K7228158J4511354
$$ y = [34278911, 17199831, 27646963, 59900363, 79847044, 76606495, 63179538, 45291228, 26113417, 24043100, 48338980, 72232870, 67468480, 51588774, 62041399, 95205491, 113126964, 104243158, 94450361, 97927408, 98007759, 82621756, 62565436, 46801595, 31921800, 23792981, 38118297, 69503536, 88959833, 83236151, 70409426, 66660328, 65135437, 59823840, 62203433, 76861336, 84805494, 71115383, 50729487, 47986768, 65526476, 89057473, 107139824, 111146393, 93806585, 66714958, 61723541, 91041902, 119162858, 101409647, 43423551, -4471717, -9805957, 11934006, 32493772, 48705829, 71932030, 99160188, 113671542]
40873A13671542n873844j6837802j3967830l933134O927864J4390435J3454282
40866A07831513K639900j0000908j2509460l645829K984501m550991j8296478
40859F4452248j8131299L20736J6857201J3594617J79647j289212J0787884J7511834
40851A04283656J0322765J518004l14621m882276j8854876k7243273j3327105
40844E1502274J3593080K8826941K4588562J3332930K724270j1422416k5283802
40837I7861839k2446718N93200K1773465K0336580L916356n915862m593591l726680
40829A07798589o865246o134394o78742J316125j30182L096132P481069k14109
40821A05669242j5247075j2959797J2423897K9951050J3171543j9136962k8581516
$$ y = [113671542, 107797698, 90959896, 76992066, 73058932, 79986796, 94377231, 107831513, 110471413, 100470505, 87961045, 84315216, 87299717, 82748726, 64452248, 46320949, 46641685, 63498886, 77093503, 77273150, 75983938, 86771822, 104283656, 114606421, 116124425, 115809804, 110927528, 92072652, 64829379, 51502274, 65095354, 93922295, 118510857, 131843787, 134568057, 123145641, 97861839, 75415121, 76008321, 97781786, 118118366, 122034722, 116118860, 111525269, 107798589, 100933343, 94798949, 94120207, 95436332, 95306150, 98402282, 105883351, 105669242, 90422167, 77462370, 89886267, 119837317, 133008860, 113871898, 85290382]
40814H5290382j0684960N350253L710054j091570M596195J2921252J2262647M223927
40806A16578180m796806j1935414j2654557l727492N745212M264404n12293P304677
40798A00265911J8758749Q087810j9424408k3318193J0679079M0352505K6526552
40791A61928005p186457j1557548J2871953K1240037m206553l2031294l3086530
40784A07971613j5693344p45595O114639N752519l950217j5653541j2729035N978014
40776G7045053K0908511K1092946J7900232J8979510J2005175r262100k4697825
40769A33971502j6056475R48686j301003j8156014j8724971N315372K4520648
40762A10517745J4193790r470274j2819313P082751J8866475K763431j9538984
$$ y = [85290382, 74605422, 79955675, 83665729, 82574159, 87170354, 100091606, 112354253, 116578180, 111781374, 99845960, 87191403, 83463911, 89209123, 93473527, 92961234, 100265911, 119024660, 127112470, 107688062, 84369869, 95048948, 135401453, 161928005, 154741548, 143184000, 156055953, 177295990, 173089437, 141058143, 107971613, 92278269, 91532674, 97647313, 103399832, 99449615, 83796074, 71067039, 77045053, 97953564, 119046510, 136946742, 155926252, 167931427, 158669327, 133971502, 117915027, 118863713, 117562710, 99406696, 80681725, 85997097, 110517745, 124711535, 115241261, 102421948, 109504699, 128371174, 131134605, 111595621]
40755A11595621j5283262J0548217K0327790j047177k2632245j3956436Q745455
40748I8297963R871407q306944j2105675M815314J0202731j0704230k7374249
40741F4696317j2916325J2208148J3916789k853181p729113N748989J7978007
40734I1049631J9931241J8223667R307113j6397312m3782211m1086056o806024
40727C0440049K2110002K0988236P913323P476047J1798358K451454r970041k99795
40719I2907633K5990188L4059606Q880967k2940729k9346509j0692638J0504870
40712A09363388K1636962K5438385K2558213P410012j7778195l8037255l9832141
40705I0759369k4216995l809497Q759109R371308M525942M273471Q638952N679414
$$ y = [111595621, 96312359, 106860576, 127188366, 126141189, 103508944, 89552508, 98297963, 108169370, 99862426, 87756751, 92572065, 102774796, 92070566, 64696317, 51779992, 63988140, 77904929, 75051748, 67322635, 73071624, 91049631, 110980872, 129204539, 138511652, 122114340, 78332129, 37246073, 30440049, 52550051, 73538287, 81451610, 88927657, 100726015, 103177469, 93207428, 92907633, 118897821, 152957427, 161838394, 138897665, 109551156, 98858518, 109363388, 131000350, 156438735, 178996948, 186406960, 168628765, 130591510, 90759369, 66542374, 62732877, 71491986, 80863294, 85389236, 89662707, 98301659, 103981073]
40697A03981073q780641j7130560k412268J9980999J7867903p838393j9296898
40690H6371215o59900J2769757r045443l6371118k2906765J7712375L0276624
40683G8146745N335777q682978J1835576K8370175R012208j7213227j1337432
40676I5466844J1185285J0928148j0005726j8845244q890623m35813J960534R190652
40668I0554057J2759923n733769l2420794l1080316J014297K6084143K1368738
40661H2546279N226590j297614l499809r785790j0857595N08657J3203895J6428626
40653I2473239J4051820R793499L31571p576989J358789K0749171K1049380o422768
40645A45807712l1076924k7678259j2889171j3109529j9834555p831648J8136170
$$ y = [103981073, 95200432, 78069872, 75657604, 95638603, 113506506, 105668113, 86371215, 85711315, 98481072, 89435629, 53064511, 30157746, 47870121, 78146745, 83482522, 74799544, 86635120, 115005295, 124017503, 106804276, 95466844, 106652129, 117580277, 107574551, 88729307, 79838684, 79402871, 81363405, 90554057, 103313980, 97580211, 65159417, 34079101, 35093398, 61177541, 82546279, 87772869, 86475255, 82975446, 73189656, 62332061, 62840718, 76044613, 92473239, 106525059, 116318558, 116650129, 109073140, 110431929, 131181100, 152230480, 145807712, 114730788, 87052529, 74163358, 61053829, 41219274, 33387626, 51523796]
40638E1523796K7781285J0708484j0978927j5538912n034933O113243R410193
40631G3984229O361307M454585Q771171J2299350K017961j8810898k7161894j0755707
40623E1160104J1150348J3060738k580497j4277783j3271345n803920O260190
40616D5697835K2361281K7259178O055608k5348939l2965736j2355790L984460
40609C4687897m375600j7505262j1625993K467477K404544l793804R358146L8146525
40601D9763930M9057742K7409562k912078j7012344j8918962j9422282j0436519
40594E7529049J4254691L2396986J8389233j4973071l1122674k1215289q688857
40587D6570068m394724M959558J7847061R365405k0865629l2416782l482800K8266167
$$ y = [51523796, 79305081, 90013565, 79034638, 63495726, 58460793, 64574036, 73984229, 80345536, 84800121, 93571292, 105870642, 107888603, 89077705, 61915811, 51160104, 62310452, 75371190, 72790693, 58512910, 45241565, 39437645, 45697835, 68059116, 95318294, 101373902, 76024963, 43059227, 30703437, 34687897, 30312297, 12807035, 1181042, 3648519, 6053063, 2259259, 11617405, 49763930, 98821672, 126231234, 123319156, 106306812, 87387850, 67965568, 57529049, 71783740, 104180726, 122569959, 107596888, 76474214, 55258925, 46570068, 42175344, 47134902, 64981963, 74347368, 53481739, 21064957, 17582157, 45848324]
40579D5848324J9294611j4174556k4432686l806622J5916625J9785865J9541933
40572G7973494J6154177j773307k4628047k8691225j5855732q371208p794249
40565G013903Q84312J0710292M034902m087403J3643995L7060996K0606150k2631739
40557F7235408k8807954J1261733K9559352q377750m5149187k6833413J2632471
40550A1520660J7476345K44018K166047J2826347j522382k6301481k3361609K26382
40542f725673J1072879J1615891K2344230K8098362O059744j7059161l117913
40535E2288359K4157326J5161323j5814499j4307846J4864583J6303403j2543333
40528H0109316j6156913J3136628J5375508k8510926n6195442k7984103Q554166
$$ y = [45848324, 65142935, 50968379, 26535693, 22729071, 38645696, 58431561, 77973494, 94127671, 92354364, 67726317, 39035092, 23179360, 14808152, 7013903, 7898215, 18608507, 22643409, 18556006, 32200001, 69260997, 89867147, 67235408, 38427454, 49689187, 79248539, 70870789, 25721602, -1111811, 11520660, 28997005, 29241023, 31407070, 44233417, 42711035, 16409554, -6952055, -6725673, 4347206, 15963097, 38307327, 66405689, 72465433, 55406272, 52288359, 76445685, 91607008, 75792509, 61484663, 76349246, 92652649, 80109316, 63952403, 77089031, 92464539, 63953613, 7758171, -20225932, -11671766]
40521a1671766M418338j0807875R544353M4636269M3446792O443188k5486007
40514F0523292l3875919k7040179q517793J5312800K0306248k566519k1635569
40507B506361q250409J7168878J8787573J342631n663685J267074M000970J437681
40499C2597074N733793J2018629O529768m397119l445310Q478776J7081242J7621883
40491I2218736J2158920l63168j2244951p319193P132718r99114l2548590l7658758
40483B0376600Q868694N1902933K9975818k6608759l8348371J808412K4484182
40476G2459509j204025k7155752j6976320k700923j6238987k7177808K233871
40469a6760435M5619032M9881236J5406262j2533125j4360940q736001m671859
$$ y = [-11671766, -7253428, -18061303, -8516950, 36119319, 79566111, 86009299, 60523292, 26647373, -392806, -8910599, 6402201, 26708449, 24141930, 2506361, -5744048, 11424830, 30212403, 31555034, 25891349, 27158423, 31159393, 32597074, 38330867, 50349496, 56879264, 52482145, 49036835, 57515611, 74596853, 92218736, 104377656, 104014488, 91769537, 84450344, 91583062, 90583948, 58035358, 20376600, 29245294, 81148227, 111124045, 84515286, 46166915, 47975327, 72459509, 71255484, 44099732, 27123412, 24422489, 8183502, -18994306, -16760435, 28858597, 78739833, 94146095, 81612970, 67252030, 58516029, 53844170]
40462E3844170Q916426K4805889J6007204j5011756k6939325l65469K6887651
40455H8144790J4169325j9455999k4406707L753557K1183684O215532j2157278
40448G7446904r074320m547526k1588512l8101773k0718839J4884550K3554600
40441B1855084J716215r003105Q430353K1478072P504643p207586N073833K4039275
40433G3886784J4704657j5198747k9122585j7991099n860869o074980o042565
40426H300596L090734J0563183O827565m65802K31962P817121J1458307L536345
40418E1360011j1664116j9180292q206035J1516324J8825536J1198318Q997199
40411F2846945J9878332K0179188q218944m0973860l9606432o652788J7769438
$$ y = [53844170, 62760596, 87566485, 103573689, 88561933, 61622608, 61257139, 88144790, 102314115, 82858116, 58451409, 62204966, 83388650, 89604182, 77446904, 68372584, 63825058, 42236546, 4134773, -16584066, -1699516, 21855084, 23571299, 14568194, 22998547, 44476619, 51981262, 44773676, 49847509, 73886784, 88591441, 73392694, 44270109, 26279010, 20418141, 14343161, 8300596, 11391330, 21954513, 28782078, 28316276, 28548238, 36365359, 47823666, 51360011, 39695895, 20515603, 12309568, 23825892, 42651428, 53849746, 62846945, 82725277, 102904465, 94685521, 53711661, 14105229, 7452441, 25221879]
40404B5221879J1704171n755948j0310911l367470K478441O174052J2253389J6717202
40396E5114805J2445124J038178r504301j3148132p292296O408867J8071679J4891560
40388G8025484k964372j8383876j6669143m101123J505570l584741m373096P683518
40380C7138221J6579909L175255k0265315j8776631J4900507M1213414K4228655
40373I8194015j6816465l4417230j9772225p171072j3162414j2199841J3992046
40366H646814L9717238L2714843K377837j6634952j2164555j123658j06880j0715331
40358D2711356k4722074k6842121l916050L2139729M4439707J4015192k9135686
40351D8690053l8845615q031520K8333177L8043187K0564532l612039j5510584
$$ y = [25221879, 36926050, 31170102, 20859191, 17491721, 19970162, 26144214, 38397603, 55114805, 67559929, 68598107, 59093806, 45945674, 38653378, 45062245, 63133924, 78025484, 75061112, 56677236, 40008093, 35906970, 37412540, 33827799, 29454703, 37138221, 53718130, 56893385, 36628070, 17851439, 32751946, 73965360, 98194015, 81377550, 46960320, 27188095, 20017023, 6854609, -5345232, 8646814, 48364052, 81078895, 83456732, 66821780, 54657225, 53533567, 53426687, 42711356, 17989282, -8852839, -12768889, 19370840, 63810547, 77825739, 48690053, 9844438, 1812918, 30146095, 68189282, 88753814, 85141775, 69631191]
40344F9631191j1637588n475954j0470287j8520868r860422J1843128J8037683
40337D3546883k26246j4239782k741912J3617577R133904l093740J794823J2666733
40329F0458240K713601j7668302j3110453J6437296L0890314J0064796j8541080
40322G1244412k2302931m860667P639678K086564j0635072j0493040Q522716K6188161
40314F7389821J7188995r603802j5296081J0651859K6225866l03362l4086286
40307F2167010k3623680J6547399K7077386l974481k8574568j9067768l022702
40300B7528596n617990j0807952j190178R223759P433596P728470J9054349K1009758
40292G4362408J320566j3775419M43724K1503210J0977583k3138457l3056773
$$ y = [69631191, 57993603, 52517649, 42047362, 23526494, 13666072, 25509200, 43546883, 43320637, 29080855, 26338943, 39956520, 49090424, 45996684, 47791507, 60458240, 63171841, 45503539, 32393086, 48830382, 79720696, 89785492, 71244412, 48941481, 44080814, 51720492, 53807056, 43171984, 32678944, 41201660, 67389821, 84578816, 74975014, 59678933, 70330792, 96556658, 96253296, 62167010, 38543330, 55090729, 82168115, 78193634, 49619066, 30551298, 27528596, 21910606, 11102654, 9912476, 19136235, 26569831, 34298301, 53352650, 74362408, 75682974, 61907555, 62351279, 83854489, 94832072, 71693615, 38636842]
40285C8636842R55766M1024421M0407309J843271k9869952k7128409j0574984
40278E5294264j0319306j5106488P978683M7300564M6741508q376180n2821988
40271G0691057k9847293K2048283K7809053q684632j9572288J0351960K3458801
40264I6254941o208871k8907547p814846J9508941R659766j5594568j5487874
40257E1409942k66860k582733j4511981o408892J5473758J9950001L937777q959848
40249E8041164j1203259j3606167j4092027o05682J9493212K4143038R095743
40242G1266022p625803j0890722j054421J2180573J5913771M628864p295639j324725
40234G5797920J1658920K327583k3752111k3815140J1486053L1417111L570744
$$ y = [38636842, 39592608, 80617029, 121024338, 122867609, 92997657, 65869248, 55294264, 44974958, 29868470, 37847153, 85147717, 131889225, 123513045, 70691057, 40843764, 62892047, 90701100, 82016468, 62444180, 72796140, 96254941, 90046070, 61138523, 53323677, 72832618, 82492384, 66897816, 51409942, 51143082, 48560349, 34048368, 27639476, 43113234, 63063235, 67001012, 58041164, 46837905, 33231738, 19139711, 18534029, 38027241, 62170279, 71266022, 63640219, 52749497, 51695076, 63875649, 79789420, 84418284, 77122645, 75797920, 87456840, 89784423, 66032312, 42217172, 53703225, 85120336, 88691080]
40227H8691080k6291873k564708M8133859N3411475J837145m8256719n5855538
40220E9104721l3972087l833538K8316424M4683353K2991584j7565956k7210961
40213G2513540K901687K5856119J1319736j3286926j4945908m040206k633936
40206G7684106k113229J2579521K4974035J0343937k0642684l4698648k1643426
40199D6483612K08206J5495715K2762567J9805383L284630j6652954k1449732
40192F9937427p873662O499830N169888q437038j6702997p982288J0108957J7411576
40184F8131693M007956j5743828j9560047n824370O284474N606946J670269L261563
40176D7834656K403680q147310j6799003r513383O145032J1986368P526478P014450
$$ y = [88691080, 62399207, 59834499, 107968358, 161379833, 163216978, 114960259, 59104721, 25132634, 21299096, 49615520, 94298873, 117290457, 99724501, 72513540, 75415227, 101271346, 112591082, 99304156, 84358248, 80318042, 77684106, 75570877, 88150398, 113124433, 123468370, 102825686, 68127038, 46483612, 46691818, 62187533, 84950100, 104755483, 108040113, 91387159, 69937427, 62063765, 68563595, 73733483, 65296445, 48593448, 40611160, 50720117, 68131693, 72139649, 56395821, 36835774, 31011404, 37295878, 42902824, 44573093, 47834656, 50238336, 42091026, 25292023, 15778640, 21923672, 33910040, 41436518, 48450968]
40168D8450968J0669718J703595k2372455l6299071j8812891J5133317L0379916
40161B8853097J4559704r850120j6102602k809191J1069747J1757402M169111
40154D1647148K072875Q790128J0466706o864273l3076653l8055311j0045859
40147b5065239K0810645J6736555j4537821k6672528N30150L1171294K3884365
40140B6857421j1140056k9377225j0820767K3317276M3182165L6180243P646408
40133H5845465k2063608k7906337r067681J635115j8415965m0560437k1248353
40126e1781801K8019712M8943314J8524491j9476659j9877541N288595J6678986
40119B6319097N810061n258538l382131L469711M344146l222971j3922282j6625709
$$ y = [48450968, 59120686, 60824281, 38451826, 2152755, -16660136, -1526819, 28853097, 43412801, 33562681, 17460079, 14650888, 25720635, 37478037, 41647148, 43720023, 52510151, 62976857, 56112584, 23035931, -15019380, -25065239, -4254594, 12481961, -2055860, -28728388, -28198238, 2973056, 26857421, 15717365, -13659860, -24480627, -1163351, 42018814, 78199057, 85845465, 63781857, 35875520, 26807839, 28442954, 10026989, -30533448, -51781801, -23762089, 25181225, 43705716, 24229057, 4351516, 9640111, 26319097, 32129158, 26870620, 23488489, 26958200, 31302346, 28079375, 14157093, -2468616]
40111b468616m326866J2481999J5313463M064477k805447K806028R969027J1877616
40103D6911681J3663183J3099318O67343j5834181j6748410o268990p906100j7574573
40095A0009271m448683K7825965L1450485p701183l4390231o264256L5325349
40088E1806717K8739007j2190863k7034385o901598L121122j1969129j7199166
40081H371705M492554K3234508J5044847l394604r528564o902431o218379n001390
40073B0098246m98710J630931J585850O949599J4704331J3231742M437862J124019
40065F3263870J843758o825226k2135109k5114579j0875460N339695J3585258
40058A9082207J6734629J3453483j79482j2496275o947325R026990J3320296N716131
$$ y = [-2468616, -6795482, 5686517, 20999980, 25064457, 22259010, 25065038, 35034065, 46911681, 60574864, 73674182, 74341525, 58507344, 41758934, 35489944, 27583844, 10009271, 5560588, 33386553, 64837038, 57135855, 22745624, 16481368, 51806717, 80545724, 68354861, 41320476, 34418878, 37540000, 25570871, 8371705, 12864259, 36098767, 51143614, 47749010, 38220446, 31318015, 25099636, 20098246, 19599536, 21230467, 22816317, 29765916, 44470247, 57701989, 62139851, 63263870, 65107628, 58282402, 36147293, 11032714, 157254, 5496949, 19082207, 35816836, 49270319, 49090837, 36594562, 29647237, 38674227, 51994523, 57710654]
40050E7710654M455396Q258574j635899j9170243j4432382J2630558K1352101
40043F9168759o924533l3423018j7944628J9601135K8205319j992727l1650859
40036B5039448k9811601p770401Q763365J6005615K5462909L3468998J9214651
40029I0372984k0383009n1215117l8797397J852373K2083260Q331427j099078
40022A1145443J6961539K8466829N71073l4992519k6343677J4943847L0697272
40015D1449807M795307k1707864k0987109q239573J845683J3579774J7863307
40008B8599332l967834l2624498k3092503J9797316L6260140M726418k0485702
40001I212669J575425L0752941J4871178k3539756k7760481J127434J3950603
$$ y = [57710654, 62166050, 70424624, 68788725, 49618482, 35186100, 47816658, 69168759, 62244226, 28821208, 10876580, 30477715, 58683034, 56690307, 25039448, -4772153, -12542554, -3779189, 12226426, 37689335, 71158333, 90372984, 69989975, 18774858, -20022539, -18170166, 3913094, 12244521, 11145443, 28106982, 56573811, 57144884, 22152365, -4191312, 10752535, 41449807, 46245114, 24537250, 3550141, -4689432, -2843749, 10736025, 28599332, 24631498, -7993000, -31085503, -11288187, 24971953, 29698371, 9212669, 10788094, 41541035, 56412213, 32872457, 5111976, 6239410, 20190013]
39994B0190013m942310k3068050j8258568k483787J0163426J8428533J8171137
39987A8200394O237499k874829M427751J1696813m787187k9930058k4318427J4059367
39979g288677L9872832K1621029j8250717l7823199k6024455l264127J0342439
39972b0814875J0724193L184942n559783r646638n879710M027651J3363714J4858237
39964D257731Q888382N208798J0208268J5805671J1428532K820711K665860M996820
39956F6280773q818904l5667919m6810500k7220450L761864K1771103K5608460
39949a095573K4581962J9975044J2698691Q714391M610654j0259542k6962272
39942C2263355k0050921R162226K4523495R088860p212396J024136J1709623k689887
$$ y = [20190013, 15247703, -7820347, -26078915, -28562702, -18399276, 29257, 18200394, 24437893, 21563064, 25990815, 37687628, 32900441, 2970383, -21348044, -7288677, 32584155, 54205184, 35954467, -1868732, -27893187, -31157314, -20814875, -10090682, -6905740, -12465523, -22112161, -27991871, -23964220, -10600506, 4257731, 13146113, 18354911, 28563179, 44368850, 55797382, 58618093, 61283953, 66280773, 57461869, 21793950, -25016550, -52237000, -48475136, -26704033, -1095573, 23486389, 43461433, 56160124, 64874515, 69485169, 59225627, 32263355, 12212434, 21374660, 45898155, 54987015, 47774619, 48798755, 60508378, 57818491]
39934E7818491k4035916k1191761n577564p257481j7917579q463370J2552122
39927a4073058J2045531m621416P28976L0149085M0101607J0039919k7177025
39920D7193619l6615527k1924473k177106J3278021J4688727n256304k5984601
39913a6797644j5071950J7394186K2738434j0744212l2396896o866041K7869547
39906a3874576J9927708j5681217k4725389J121832J9255861P673834p983635
39899a4285582l332202J0113518J1785568K731059n338831r137782q122814K332052
39891a3255014J8433310K3037283P488275j2030822j4207075j481620N462306
39884A3446643j749248j0240577q892382l674372j725781M546085K0645561K7641232
$$ y = [57818491, 33782575, 12590814, 7013250, -244231, -18161810, -26625180, -14073058, -2027527, -6648943, -5919967, 24229118, 64330725, 74370644, 47193619, 10578092, -11346381, -13523487, -245466, 14443261, 9186957, -16797644, -31869594, -14475408, 8263026, -2481186, -34878082, -41744123, -13874576, 6053132, -9628085, -34353474, -33231642, -13975781, -6301947, -14285582, -17617784, -7504266, 4281302, 7012361, 1673530, -7464252, -15587066, -13255014, 5178296, 28215579, 35703854, 23673032, 9465957, 7984337, 13446643, 11697395, 1456818, -7435564, -11109936, -12835717, -8289632, 12355929, 39997161]
39876C9997161K423340l8851304m7383320o867160L4707745K5739153j5845312
39869f079697k7656857O715863L6755840K3022306p695399j0413322R842989J4971864
39861C9463587k432594j4403471r471858p844677j9893241k6125032j2255572
39854e2962858N482432Q129872K990371M688376Q381384N259405N896334J9415100
39846G280416K4482707l096609m0932282l9255359N839057L9545784K4178468
39839A8042182j0692186j8921494l774442K381680k605236L598408J6906206R526757
39831A4461875j6928516k5611166j174666K5599213K4262119L783051j0899893
39824A3492017j3086575p654838M329004J5803378J1234914p807045j6538681
$$ y = [39997161, 42420501, 3569197, -43814123, -50681283, -15973538, 9765615, -6079697, -33736554, -27020691, 9735149, 32757455, 25062056, 14648734, 24491723, 39463587, 37030993, 22627522, 13155664, 5310987, -14582254, -40707286, -52962858, -47480426, -39350554, -36360183, -31671807, -23290423, -18031018, -12134684, 7280416, 31763123, 28666514, -12265768, -51521127, -45682070, -6136286, 18042182, 7349996, -11571498, -15345940, -12964260, -15569496, -11971088, 4935118, 14461875, -2466641, -28077807, -29252473, -3653260, 20608859, 24391910, 13492017, 405442, -7249396, -2920392, 12882986, 24117900, 16310855, -227826]
39817b27826m567762M290989q256519k0160223l602500K4973598K4910037p326203
39809A0033591l0852901j5115837K4359391M8726203L6192909j809674l1731316
39802C9802366k7873103j286555J0541116o488058k1136174l413880K7404014
39795A7549726L1234184Q026571p276309k916756j810363j2948379j3920649M939108
39787B2877133J7079455K126758j8644938j5702402K549382O383662p003734j3134963
39779c469647l339534K110886r894720k0779492p580124J9553683K7722500O878655
39771A1202207j5048787j0925139Q408036J3185081P9491o901463O68526J656081
39763B324033j5621007k8643346j4501783J3891117K8703416K5952481J8331368
$$ y = [-227826, -4795588, -504599, -8761118, -28921341, -32523841, -7550243, 17359794, 10033591, -20819310, -35935147, -11575756, 37150447, 73343356, 71533682, 39802366, 11929263, 10642708, 21183824, 14695766, -6440408, -9854288, 17549726, 48783910, 56810481, 49534172, 46617416, 44807053, 31858674, 17938025, 22877133, 39956588, 42083346, 23438408, 7736006, 10285388, 16669050, 9665316, -3469647, -6809181, -4698295, -14593015, -35372507, -42952631, -23398948, 4323552, 11202207, -3846580, -14771719, -6363683, 6821398, 6900889, -574, 667952, 2324033, -13296974, -41940320, -56442103, -42550986, -13847570, 12104911, 30436279]
39756C0436279O858599j0628214j7867200j952452J4359522J693392k1073491
39749A826435p431949L7886187N1976706N181932m7765721m2340662N762556K8895621
39741C3991105M563644k3990870k0391999k151958j101031j1806974o092899J8430291
39733h550691L3394734K1824697J156484m888328M95566j316105j0792034j0793499
39725B0530824J361994P127687j800308r305747m117392O29244n059850m696804
39717D669648J4744750K9980208J1691363k5512673l9565124k0806139J071257
39710b3726710P279281Q829891J2435052O602824q712852j4387682o003776j496638
39702a9180610l220820R719381L4572948L2596251q237592l8282354j4509019
$$ y = [30436279, 37294878, 26666664, 8799464, 6847012, 21206534, 22899926, 1826435, -5605514, 32280673, 84257379, 89439311, 41673590, -667072, 5095484, 33991105, 38554749, 14563879, -5828120, -7980078, -9081109, -20888083, -26980982, -8550691, 24844043, 46668740, 47825224, 42936896, 43432462, 42116357, 31324323, 20530824, 21892818, 29020505, 27220197, 17914450, 13797058, 14426302, 9366452, 4669648, 19414398, 49394606, 61085969, 35573296, -3991828, -24797967, -23726710, -16447429, -7617538, 4817514, 11420338, 2707486, -11680196, -17683972, -19180610, -22401430, -12682049, 21890899, 54487150, 46249558, 7967204, -6541815]
39695f541815K8027782K3632669k3673328m4094843n920925L9647942L5690634
39688D6768116k775357k0211607j875067J4761812J884896k0847950j9858417
39681b153574M520237K1962465J3918726p333460k1007553k2517314j9418282
39674c2028755j5244938p750657L494468J5896233K4893203K2354581M403556
39667A6017691j4717174j3035777N963233J1260970r547955k6407532j3163934
39660d3630478P711067K288391j4719970l899686K7453044L2334144K249311j7755524
39652g969701l351840J4025256O367964p367723l977826L577508n6466j29733
39644A117439J2466035J2025214j6884809m0791861k6142297M476750J0059474
$$ y = [-6541815, 21485967, 45118636, 21445308, -22649535, -28570460, 11077482, 46768116, 43992759, 23781152, 21906085, 36667897, 38552793, 17704843, -2153574, 2366663, 24329128, 38247854, 30914394, 9906841, -12610473, -32028755, -47273693, -55024350, -51529882, -35633649, -10740446, 11614135, 16017691, 1300517, -11735260, -5772027, 5488943, -4059012, -30466544, -43630478, -35919411, -33631020, -48350990, -52250676, -24797632, 7536512, 9785823, -7969701, -11321541, 2703715, 9071679, 1703956, -2273870, 1303638, 1247172, 1117439, 13583474, 25608688, 8723879, -32067982, -58210279, -53733529, -43674055]
39637d3674055k032740M441332K8970824L7665539J9568202m743084k0019581
39630B0176437k2527012m683648K5554762K9037660j3234270n1770185k7486919
39623d4933175L4778186N4989973J5178743k0599775j0745548R337340o69731
39616C7336013k2809644k3853464j0645469m772857j730019Q413167J2781314
39609e280959K516702j412908J6848768L2747638J5578427k1287207l7405892
39602B304569j9850406O623672J5013671J177482j8185800j9749688K894184K3980831
39594e791485J3094837j8772462k9780518r647539O716306M81131j874460J5600880
39586b9973310K1877254l893410k3423406K591212M2767890L8458858n793685
$$ y = [-43674055, -45706795, -41265463, -12294639, 25370900, 44939102, 40196018, 20176437, -2350575, -7034223, 18520539, 47558199, 34323929, -17446256, -44933175, -10154989, 44834984, 60013727, 39413952, 28668404, 38005744, 37336013, 14526369, -9327095, -19972564, -24745421, -26475440, -18062273, -5280959, -2764257, -4177165, 12671603, 45419241, 60997668, 39710461, 2304569, -17545837, -10922165, 4091506, 5268988, -12916812, -32666500, -29772316, -5791485, 7303352, -11469110, -41249628, -50897167, -44180861, -43699730, -45574190, -29973310, -8096056, -11989466, -35412872, -32821660, 9946230, 48405088, 42611403]
39579D2611403l4472802k7624947j4680576j0013073L429172K3991781K3731655
39572F972613J867519o287308J1937955K6332871J7826329O712134Q141711M417370
39564G7921194j4050120k1899659k957432J4351782n26162l0200087l6134789
39557a3495273j4907424N441820J0805342J1610157J5696584J6708543P907099
39550C9766848q362777k2202201k0296042R92278K1836641J5489272j4690907
39543A2533112l5484476k8921208j2425877m012743K911489J4430993J7424822
39536c3543888P258366L170708J1687596P699191j8389145l0403331k532211K8693993
39528b6358721J8454604r549251j021305L3597885L1916247j5286829m4072139
$$ y = [42611403, 8138601, -19486346, -34166922, -44179995, -40750823, -16759042, 6972613, 8840132, 2552824, 14490779, 40823650, 58649979, 65362113, 73503824, 77921194, 63871074, 41971415, 39013983, 53365765, 52839603, 22639516, -13495273, -28402697, -22960877, -12155535, -545378, 15151206, 31859749, 39766848, 31404071, 9201870, -11094172, -10101894, 11734747, 27224019, 12533112, -22951364, -51872572, -64298449, -68311192, -65399703, -50968710, -33543888, -26285522, -23114814, -11427218, -3728027, -22117172, -52520503, -55052714, -26358721, -7904117, -17453368, -18474673, 15123212, 47039459, 31752630, -12319509]
39521a2319509j7560051J9580296J5444687j4922609k6081064j0941045N511918
39514d1287377J0711353P317212n046267k0005110j6965343Q851758K8555676
39507b7868098J7858839o429026j3989985m732209K998545Q089134J8598845K3820016
39499A8346061Q645379j3821087j6780742j316157O747938k000118j1368382j0186733
39491b1733841m695012Q63101J0689329K0841920J8257859J662238j3601186j5319484
39483c035076n661742O887854J3508873N998128j3635329k8058981k3212282o607898
39475e3816453O529741J5239914K3524751K2434943N902693p618165J83271J0284563
39467B2665258r483461m6004279m8458302k228965M5063177M8253266K0120535
$$ y = [-12319509, -29879560, -10299264, 5145423, -9777186, -35858250, -46799295, -41287377, -30576024, -23258812, -28305079, -48310189, -65275532, -56423774, -27868098, -10009259, -16438285, -30428270, -35160479, -32161934, -24072800, -5473955, 18346061, 26991440, 13170353, -3610389, -4926546, 1821392, -178726, -11547108, -21733841, -26428853, -25565752, -14876423, 5965497, 24223356, 25885594, 12284408, -3035076, -8696818, -1808964, 11699909, 17698037, 4062708, -23996273, -47208555, -53816453, -47286712, -32046798, -8522047, 13912896, 19815589, 12197424, 12380695, 22665258, 13181797, -32822482, -81280784, -83509749, -38446572, 9806694, 29927229]
39460B9927229q8683k925688m854726r989086p235342L960696J0293743L786025
39452B2874168j1106305k3870020k1204749M459766L7940122M7228207K1811842
39445G8133031q885211j3101131Q48269J488445j7114116k9422511j8242030L718445
39437b576809J5329032J1313205O1854q603263q677854j542909K714853l777373
39429D240736j3859832j2889894M29103J0751152N666514r638752j9700546j5017658
39421e0019177O8632J1909445J1444006O102960J1619629K7378449L0974657Q841206
39413E8319807j8598451k0880244k12950J2334311K597734r704987n949542M336224
39405B2241902N015858M47971J907845L683846m513990j3282951p097264N153286
$$ y = [29927229, 29838546, 26912858, 22058132, 12069046, 4833704, 8794400, 19088143, 22874168, 11767863, -12102157, -33306906, -28847140, 9092982, 56321189, 78133031, 69247820, 56146689, 56994958, 58483403, 41369287, 11946776, -6295254, -2576809, 12752223, 24065428, 24127282, 15524019, 6846165, 5303256, 8018109, 4240736, -9619096, -22508990, -22079887, -11328735, -5662221, -15300973, -35001519, -50019177, -49950545, -38041100, -26597094, -20494134, -8874505, 18503944, 49478601, 58319807, 39721356, 18841112, 18628162, 30962473, 33560207, 23855220, 17905678, 22241902, 27257760, 27705731, 29613576, 33297422, 28783432, 15500481, 8403217, 13556503]
39397A3556503J135844j5180266j4740759J0202304L0486587K3107235K780051
39390E1347499o660049o978750r374331p321871N643480J0895099q147925k9344899
39382E8253k1954592j967304r709040l6069203k8151189K0167358M4395930O914369
39374b6315418l7340951k0673556L5155594N5991686K6443776j809502j001347
39367C0450282R38002j4861563k3789739p993078R644721P753595J816758R532804
39359A3491782J5897343L313603j2581076j0044535j432288j1835226l3183292
39352c6373689l4510884j0639004J1338063J3376727O835456P425157J2159534
39345c0388640R970138Q22245n658232m799680l292843j0087984k1846318k2389467
$$ y = [13556503, 14692347, -487919, -15228678, -5026374, 25460213, 48567448, 51347499, 44687450, 37708700, 28334369, 21012498, 26655978, 37551077, 29403152, 58253, -21896339, -23863643, -33572683, -69641886, -97793075, -77625717, -33229787, -26315418, -63656369, -84329925, -49174331, 6817355, 33261131, 31451629, 30450282, 31388284, 16526721, -7263018, -15256096, -5611375, 2142220, 3958978, 13491782, 29389125, 32702728, 20121652, 10077117, 8644829, -3190397, -36373689, -70884573, -81523577, -70185514, -56808787, -49973331, -42548174, -30388640, -20418502, -19596257, -25254489, -30054169, -33347012, -43434996, -65281314, -87670781]
39337h7670781l622611J7630440J8047341K414385L04460K2316490M1171327L0192649
39329D0783700J464599j4219871j0986287p510123j1489274j1068136j696053
39322a4721445L589701j761276m366026N213909J1033577o439236l4461202l7293852
39314g9205850n989338K3113779J6198270q089586l968774L1957570N1653351
39307B5669422K5804207j2006294j5399868R178576K0897312Q349511n108604
39300E7384262q631341j3505412j7688830l478882K3690405L3192153J5191005
39293H6153360o810806j7507243k6167668l2094891j6264155J6172832K8072273
39286C1553702P655789q018709N820934J9173921O46928k6568406k5352980p881886
$$ y = [-87670781, -91293392, -73662952, -55615611, -53201226, -52896766, -30580276, 10591051, 40783700, 42248299, 28028428, 17042141, 9532018, -1957256, -13025392, -14721445, -11131744, -12893020, -17259046, -12045137, -1011560, -7450796, -41911998, -79205850, -85195188, -62081409, -45883139, -53972725, -57941499, -25983929, 25669422, 51473629, 39467335, 24067467, 33246043, 54143355, 62492866, 57384262, 48752921, 35247509, 17558679, 14079797, 37770202, 70962355, 86153360, 79342554, 61835311, 35667643, 3572752, -12691403, 3481429, 31553702, 39209491, 31190782, 37011716, 56185637, 56832565, 30264159, 4911179, -2970707]
39278b970707r214838k3264690j7702732L967916R036874l223069Q06497K8595924
39270a3968825M5817947L0323306K979832p670291j523284M055669q64362j3495191
39262D5654801k3260736k0714731j1802749j3513161k3287835j3850183K0348573
39255d0426021L9184654J3480041k1660589j6216334J4804000J7644264q816438
39248b006423j4619228R989679J6526794j3667832l2566878o262966K8109699
39241a4497155K5546262K763794m9263J3282350J2801933k434942j2650130j7697792
39233G065057k6538670k5828179p94334K7879604K8647350Q783149N67728P926605
39225B7708310O869172o787254j0664648K843004J5143541J4533989P680623m647162
$$ y = [-2970707, -12185545, -35450235, -53152967, -49185051, -40148177, -43371246, -42564749, -13968825, 31849122, 62172428, 65152260, 57481969, 55958685, 60014354, 59149992, 45654801, 22394065, 1679334, -10123415, -23636576, -46924411, -60774594, -40426021, -1241367, 12238674, -9421915, -25638249, -10834249, 6810015, -2006423, -16625651, -6635972, 9890822, -3777010, -36343888, -42606854, -14497155, 11049107, 13812901, 13763638, 27045988, 39847921, 37412979, 24762849, 7065057, -19473613, -45301792, -46096126, -18216522, 10430828, 19213977, 19781705, 27708310, 34577482, 27790228, 17125580, 19968584, 35112125, 49646114, 57326737, 52679575]
39217E2679575k9065886n1222189m1539009j396393K8783753K3382608M015273
39210a4362268L2262O172748M367574J086824J0092945J7259887J225239k0862711
39202E012500j0687584K7095346M1672293J0223713k6433735k7332466j2055863
39195G494204j9141053l4645738j6451508K4482746L0672929p375430k7437387
39188d2401237O487389M1776684J9728955k7318211k5915050K0259520L7091308
39181B9709358n36163l2287780j2747601K1165477J9798325O57875O705118K4769660
39173E7234269Q145792l6842609n0289877r658000L2763974K4198826j7084853
39166H467522l4735892j3355815J0375925O750895r734348q967374J1683381K7840806
$$ y = [52679575, 23613689, -27608500, -69147509, -70543902, -41760149, -18377541, -14362268, -14330006, -8157258, -3789684, -2702860, 7390085, 24649972, 25875211, 5012500, -5675084, 21420262, 63092555, 73316268, 46882533, 19550067, 7494204, -11646849, -46292587, -62744095, -38261349, -7588420, -14963850, -42401237, -35913848, 5862836, 25591791, -1726420, -27641470, -7381950, 29709358, 29173195, -3114585, -15862186, 5303291, 25101616, 25759491, 32464609, 57234269, 65380061, 28537452, -21752425, -31410425, 1353549, 25552375, 8467522, -26268370, -39624185, -29248260, -22497365, -32231713, -41199087, -29515706, -1674900]
39158a674900K1968580K788006p995292K79793J7726044K4544701J1661151p990466
39150F1307617j3970360o349739p500879k6093808l4315886m230993M1247717
39143A0093669M6742530k95766m5577845l6977111R654540L8160360K4742688
39136D6543065o065705k5188894k8135130k2969915j4009723j824114J2403848
39129c9246568K2375112J4816051j3648874l5148311j4014157L5945383N3021962
39122B4100598J1496544l3971834k6180908R471682J1433639j6214530j7103817
39115c6968626J5715073K6653591p549183m0209651l1785338l964675Q710655
39108f9398154Q635494R206227N565295k002101K457180J5089054J0038253p553417
$$ y = [-1674900, 20293680, 23081686, 15086394, 15366187, 33092231, 57636932, 69298083, 61307617, 47337257, 40987518, 33486639, 7392831, -26923055, -31154048, 10093669, 56836199, 56540433, 10962588, -26014523, -16359983, 21800377, 46543065, 40477360, 15288466, -12846664, -35816579, -49826302, -51650416, -39246568, -16871456, -2055405, -15704279, -50852590, -64866747, -28921364, 24100598, 35597142, 1625308, -24555600, -15083918, -3650279, -19864809, -36968626, -21253553, 5400038, -2149145, -42358796, -74144134, -78108809, -69398154, -60762660, -51556433, -45991138, -47993239, -45536059, -30447005, -20408752, -27962169]
39100b7962169J877545L8287587M3856804m705966m6110180k6529571J4403056
39093f882894J1566711j9880080j9953541J0007194J7129329n221730j0150337
39086b3385348J4173818K3586329l059853k8634164k0699580L125984J3831792
39079b1061022J1310987N715415m028870j3600247p109778J4516334K5892663
39072A1635482J2894900p346944j3367480m499454Q564391J6911312J2745631
39065C7537838k461711q731825Q396004K7102860J4141028k0491601l1528208
39058B3964385o104802J6922028P451658j5403928k1320128j1010967J030235
39051d471519J2745108J9698860N838015k3967288l2435293k369686K7152086
$$ y = [-27962169, -26084624, 12202963, 56059767, 51353801, 5243621, -21285950, -6882894, 4683817, -15196263, -35149804, -25142610, -8013281, -13235011, -23385348, -9211530, 14374799, 11314946, -17319218, -38018798, -34892814, -21061022, -9750035, -4034620, -8063490, -21663737, -28773515, -14257181, 11635482, 24530382, 17183438, 3815958, -683496, 7880895, 24792207, 37537838, 35076127, 26344302, 34740306, 61843166, 75984194, 55492593, 23964385, 17859583, 34781611, 42233269, 26829341, 5509213, -5501754, -4471519, 8273589, 27972449, 33810464, 9843176, -22592117, -24961803, 2190283]
39044B190283J4072614k0669973k4052268P621661K7206194J3194421k586424
39037A6976508N549774J5988413K180824j9722807j8422132N80197O649070m241172
39029E538675o183814R757497K0784292J2304995J85357j984609p464242k4804693
39021H133458k9195030N43547L5556971K9548864j0148079k9131819n996407K0226597
39013A9538102J5206062l563647p996185o205137j5055190j9925825j405264K2047845
39005B640761J8852830m577330j5996945q172695k83457J664689Q635154J8871849
38997B1634856J9036019J0362754K875976p783848k5450471k8697903j030242
38990i052859K6657272J2412900k4844480k5749226J4355253L1874346n528570
$$ y = [2190283, 16262897, -4407076, -28459344, -20837683, 6368511, 19562932, 16976508, 22526282, 38514695, 40695519, 20972712, 2550580, 3130777, 9779847, 5538675, -645139, 9112358, 29896650, 42201645, 42387002, 40402393, 32938151, 8133458, -21061572, -20518025, 15038946, 44587810, 34439731, 5307912, -688495, 19538102, 34744164, 31180517, 23184332, 16979195, 1924005, -18001820, -19407084, 2640761, 21493591, 16916261, 919316, -7253379, -7536836, -5872147, 2763007, 21634856, 40670875, 51033629, 53909605, 46125757, 20675286, -8022617, -9052859, 17604413, 30017313, 5172833, -20576393, -6221140, 25653206, 20124636]
38983B0124636m4523677k4922620L2946578O0963793L3649223j2997276l5356924
38976B9883733k3089104L578758J5523653J304477j8250921j5543502K486018
38969d106888M596450j1087581j1414731J2900143K5787328M720332k1244366
38962A50687k1493886j1161695j2323759p324639K3158846M8397284K8207306
38955D7610144j6459217k9563541l987319J6332247J2333457J0053334K0467249
38948E6786354J6017203j5121372l9461542k8342987q96520R611009L059720j136853
38940E15012j669251r816357j9998108j3816494R905346K9423016K5933478L705207
38932B4181849j6730527j9639904q210912J281341Q17600J261707J3874313K7663607
$$ y = [20124636, -24399041, -49321661, -16375083, 44588710, 78237933, 65240657, 29883733, 6794629, 10373387, 25897040, 27201517, 8950596, -6592906, -4106888, 489562, -10598019, -22012750, -9112607, 16674721, 21395053, 150687, -21343199, -32504894, -44828653, -52153292, -28994446, 19402838, 47610144, 31150927, 1587386, -2399933, 13932314, 26265771, 36319105, 56786354, 72803557, 57682185, 18220643, -10122344, -11018864, -1407855, 1651865, 515012, -1154239, -10970596, -30968704, -44785198, -34879852, -5456836, 20476642, 24181849, 7451322, -12188582, -20399494, -19118153, -18300553, -17038846, -3164533, 24499074]
38924B4499074K1142035m099716k0108795r030045J2641587J6186122l665284
38917C7564978k5837798k9820153j6307797k281186l86956m693241R72077J9885511
38909b0904565L5111777L1350022J5079528J870990p304196k0480504l2027196
38902B695856k7258168r325052O13105n389229j1088962l264142R599898J5157155
38894b8259539J5197869J4198266P431340n220618r484767K295627J3590436N982490
38886A5731104j1256453j4344319j057035P734911N72007j0508783j0258370J640878
38878b1746060J4959630J7875166J841797k6788937m0376470j5366770L0992584
38871c8609060N0287268K0715009k2657220l1147908j883282K5575989K3308592
$$ y = [24499074, 45641109, 41541393, 21432598, 12402553, 25044140, 41230262, 37564978, 11727180, -18092973, -34400770, -36681956, -37068912, -41762153, -40790076, -20904565, 14207212, 45557234, 60636762, 62507752, 55203556, 34723052, 2695856, -24562312, -33887364, -33274259, -38663488, -49752450, -53016592, -43416694, -28259539, -13061670, 1136596, 8567936, 3347318, -6137449, -3841822, 9748614, 15731104, 4474651, -9869668, -10926703, -3191792, -2619785, -13128568, -23386938, -21746060, -6786430, 11088736, 12930533, -13858404, -54234874, -69601644, -38609060, 11678208, 32393217, 9735997, -21411911, -23295193, 2280796, 25589388]
38864B5589388L034331j0133559j0888721j0992708j5642653j5948737m241285
38857c9223944J1638236J5490004M030062o357945j362498Q974642M444383j0914300
38849a3281360j0711143J0415815K0762739k296180l2650787l0325069Q3192K0291601
38841c7711192J8070229J6082904K2080569J4454130j1354304k4170814o051462
38834h599940J5974881J3180576j122356p88554P941606M382708o014103n393607
38826A9561211k50800p367474j7130271q926524Q086799Q924003j314602L023790
38818D606132J8264962J5382755o492448j6081263m683437N12531j1781733j6661698
38810a6934199n63697J3251425P301344r02288M583819Q489447l372247j5479593
$$ y = [25589388, 28623719, 18490160, 7601439, -3391269, -19033922, -34982659, -39223944, -27585708, -12095704, -8065642, -14423587, -15786085, -6811443, -2367060, -13281360, -23992503, -13576688, 7186051, 4889871, -27760916, -58085985, -58002793, -37711192, -19640963, -3558059, 18522510, 32976640, 21622336, -2548478, -8599940, 7374941, 20555517, 19433161, 18644607, 26586213, 30968921, 24954818, 19561211, 19310411, 11942937, -5187334, -14113858, -6027059, 2896944, 1582342, 4606132, 22871094, 38253849, 31761401, 15680138, 10996701, 11509232, -272501, -16934199, -17497896, -4246471, 3054873, 2152585, 6736404, 15225851, 11853604, -3625989]
38802c625989j2586483o640769p199959K011673K6866140L6647555J0277974k1393199
38794B4356943j9644249K396969P327159l347504k122005P241760j224565j9612145
38786d627637j3682522J5216440K8214993J2906365j150069J001177j776514j7174876
38778A8927357j8201345N696034K1590262O618595j1330216j810997J3221609
38771C4711299m564030m1601313m6791792o698669L5337607L8946537J2602418
38764B1942057r786166j3265387q463551p756273r424607m250346Q254608J4586040
38756h163625L264083j5419871j7688803J028476J6062933P306928j0620669r836952
38748c4067500Q302975J5005720k411208k1645793j7720773M122362K0464353
$$ y = [-3625989, -16212472, -22853241, -30053200, -28041527, -1175387, 35472168, 45750142, 24356943, 4712694, 7109663, 14436822, 11089318, 8967313, 16209073, 14984508, -4627637, -18310159, -3093719, 25121274, 38027639, 36877570, 37878747, 36102233, 18927357, 726012, 6422046, 28012308, 34630903, 23300687, 21489690, 34711299, 30147269, -11454044, -58245836, -64944505, -29606898, 9339639, 21942057, 12155891, -1109496, -9573047, -17329320, -26753927, -31004273, -22749665, -8163625, -4899542, -20319413, -38008216, -36979740, -20916807, -13609879, -24230548, -34067500, -25764525, -10758805, -13170013, -34815806, -52536579, -48414217, -27949864]
38741b7949864K1707548J6151596R083994l902364k1150568k8403097j6523026
38734e0985781L771383J4643807J2889950R031555Q724925O962326M06062o347218
38726i02991r361850r791635o555902M578596J9842098K6223253J7861735L868306
38718D5761610o342280j4045941j9909791j5435129J770039J5990466J2053153
38711A9842127k849530j1351994j1363381j2262887j3735098q796746l029714
38704d3547223q458581j8813167j3158947J1859748L3052801L0559697J0959799
38697B454127n848166r407519k409927O970193J1210969R921340J0942929J7180791
38689D1014737J7474195L535663j1120663q330328L937232J529978j7276154k9525849
$$ y = [-27949864, -6242316, 9909280, 18993274, 15090910, -6059658, -34462755, -50985781, -47214398, -32570591, -19680641, -10649086, -1924161, 5038165, 5444227, -902991, -10264841, -20056476, -26612378, -22033782, -2191684, 24031569, 41893304, 45761610, 39419330, 25373389, 5463598, -9971531, -8201492, 7788974, 19842127, 16992597, 5640603, -5722778, -17985665, -31720763, -40517509, -43547223, -52005804, -70818971, -83977918, -72118170, -39065369, -8505672, 2454127, -3394039, -12801558, -15211485, -8241292, 2969677, 12891017, 23833946, 41014737, 58488932, 62024595, 50903932, 42573604, 46510836, 48040814, 30764660, 1238811]
38681A238811k4941103j6697606j0647146M187132K4528162K5889293L819227
38674G376770r577121O719668K6897385J7861043r546263k0203140p397322O315161
38666A8446181P957696L051827m439715j2313977r320014Q371960K0116733Q514936
38658D0385627q177900l872131Q432645k102408k5535125k2374848O870308J6556875
38650A0183043q201280k3887392m10602K9117632K5072547M782896N105833J5360978
38642E7123655L83984k9640448k9117227O985654K9817481Q729392k6960127l4758252
38634a7435888j2878536J2222689K4511205K2860274P779144j3623943k2945142
38627D89803j1057125N659026O679554l385798m342237O784857J1708986j38548
$$ y = [1238811, -23702292, -40399898, -51047044, -46859912, -22331750, 3557543, 7376770, -2200351, 4519317, 31416702, 49277745, 39731482, 19528342, 12131020, 18446181, 26403877, 29455704, 25015989, 12702012, 3381998, 11753958, 31870691, 40385627, 32207727, 28335596, 36768241, 34665833, 9130708, -13244140, -6373832, 10183043, 1981763, -21905629, -22316231, 6801401, 31873948, 36656844, 41762677, 57123655, 57507639, 27867191, -1250036, 5735618, 35553099, 44282491, 17322364, -17435888, -30314424, -18091735, 6419470, 29279744, 37058888, 23434945, 489803, -10567322, -4908296, 1771258, -1614540, -5956777, 828080, 12537066, 12398518]
38619A2398518j5470845j5839181j572804J0456981P900385m485695j2141219
38612a8753860o473552Q100336K1004777K5552975K0311832N279537j5898063
38605C9123982l1075883k7116905p124565P521289O76399j6601171j7136384P967075
38597d3766163L4596656L2354856K356281k2166587j6564703M682667R741671
38590A234678n920750j6568802q021884K901973J815770L094564J9528005K8599814
38582B6663368M192502l1837329l2705210Q47186J7451418n911612k8761792j3240420
38574f3301889J7812782K2636297N172070l188619r3931m958122j2825811l275013
38566d2022236J3693862Q752383j1463251p992460K5240412M5414456K4032301
$$ y = [12398518, -3072327, -18911508, -20484312, -10027331, -2126946, -6612641, -18753860, -25227412, -17127076, 3877701, 29430676, 49742508, 55022045, 39123982, 8048099, -19068806, -26193371, -18672082, -17995683, -34596854, -51733238, -43766163, -9169507, 23185349, 25541630, 3375043, -13189660, -8506993, 1234678, -4686072, -21254874, -29276758, -26374785, -24559015, -21464451, -1936446, 26663368, 30855870, -981459, -33686669, -32839483, -15388065, -21299677, -50061469, -63301889, -45489107, -22852810, -17680740, -20869359, -20963290, -25921412, -38747223, -42022236, -28328374, -19575991, -31039242, -39031702, -13791290, 31623166, 55655467]
38559E5655467j3728649l0797517k4679789j2711563k146727L735126l106613
38552b7780265j6849883j4778791P722076K4101429J7835465Q809350J5389543
38545A4448924K0028857L663655j2975457j480014K1027656J4830595j7235449
38538D2308767l3182111j8488182l837532q463459r379345J2763278L2700029
38531A4421445J6169642k3743185l8907042j0609477K5545870K6714167l066782
38524F524638k1041455k477923K8329781L1493387K823752k5349037k8943665
38517h640522j5463422l66684J4675682K7817562K4329856j489712k6899551k5579580
$$ y = [55655467, 41926818, 11129301, -13550488, -26262051, -28408778, -24673652, -27780265, -44630148, -59408939, -51686863, -27585434, -9749969, -940619, 14448924, 34477781, 38141436, 25165979, 23685965, 44713621, 59544216, 42308767, 9126656, -9361526, -13199058, -21662517, -31041862, -18278584, 14421445, 30591087, 6847902, -32059140, -42668617, -17122747, 9591420, 6524638, -14516817, -16994740, 11335041, 42828428, 45652180, 20303143, -8640522, -24103944, -24470628, -9794946, 18022616, 42352472, 40862760, 13963209, -11616371]
$$ [...]
##END NTUPLES=NMR SPECTRUM
##END=
