##TITLE=31Pdec_SR167R1
 DMSO-d6, 24 sc
 24.3.2023
##JCAMPDX= 6.0         $$ Bruker NMR JCAMP-DX V2.0
##DATA TYPE= NMR SPECTRUM
##DATA CLASS= NTUPLES
##ORIGIN= UXNMR, Bruker Analytische Messtechnik GmbH
##OWNER= root
$$ XWIN-NMR		Version 3.5
$$ Fri Mar 24 15:58:30 2023 Russian Standard Time (UT+4h)  she@DPX200
##.OBSERVE FREQUENCY= 81.013821
##.OBSERVE NUCLEUS= ^31P
##.ACQUISITION MODE= SIMULTANEOUS
##.ACQUISITION SCHEME= undefined
##.AVERAGES= 24
##.DIGITISER RES= 16
##SPECTROMETER/DATA SYSTEM= spect
##.PULSE SEQUENCE= zgpg30
##.SOLVENT NAME= DMSO
##.SHIFT REFERENCE= (INTERNAL, DMSO, 0, 248.564)
##AUDIT TRAIL= $$ (NUMBER, WHEN, WHO, WHERE, WHAT)
$$ ##TITLE= Audit trail, XWIN-NMR		Version 3.5
$$ ##JCAMPDX= 5.01
$$ ##ORIGIN= Bruker BioSpin GmbH
$$ ##OWNER= she
$$ F:/spectra/data/she/nmr/P31/1/pdata/1/auditp.txt
$$ ##AUDIT TRAIL=  $$ (NUMBER, WHEN, WHO, WHERE, WHAT)
(   1,<2023-03-24 15:57:37.54 +0400>,<she>,<DPX200>,
      <created by zg, POWCHK disabled, PULCHK disabled
       configuration hash MD5:
       00 E9 B6 7A A2 85 ED C7 34 08 36 98 17 FE 4E 26
       data hash MD5: 32K
       CA 62 B9 0A 1C 98 B5 70 B2 81 B0 12 8F 9F 11 D6>)
(   2,<2023-03-24 15:57:39.95 +0400>,<she>,<DPX200>,
      <Start of raw data processing
       efp BC_mod = 2 LB = 1 FT_mod = 6 PKNL = 1 PHC0 = -10532.24 PHC1 = -115.7153 SI = 64K 
       data hash MD5: 64K
       FF 5E 15 0D 7F 6E 00 5A 4D 33 0E F2 ED 00 03 47>)
(   3,<2023-03-24 15:57:52.51 +0400>,<she>,<DPX200>,
      <pk PHC0 = -9.871809 PHC1 = 0 
       data hash MD5: 64K
       57 B1 0E F0 A5 65 E1 51 24 AD 17 51 CE 7B 1A E7>)
(   4,<2023-03-24 15:57:58.01 +0400>,<she>,<DPX200>,
      <abs ABSG = 5 
       data hash MD5: 64K
       50 D3 A5 86 DB 0C 12 3E E5 B8 1B 46 1E C8 EC D1>)
$$ ##END=
$$ 
$$ hash MD5
$$ 3F 2D 38 4F D0 48 EA CC 50 A6 26 53 80 22 64 74
##$RELAX= 
##$RELAX= 
##$RELAX= 
##$RELAX= 
##$RELAX= 
##$RELAX= 
##$RELAX= 
##$RELAX= 
##$RELAX= 
$$ Bruker specific parameters
$$ --------------------------
##$DU= <F:/spectra>
##$EXPNO= 1
##$NAME= <P31>
##$PROCNO= 1
##$TYPE= <nmr>
##$USER= <she>
##$AMP= (0..31)
100 100 100 100 100 100 100 100 100 100 100 100 100 100 100 100 100 100 
100 100 100 100 100 100 100 100 100 100 100 100 100 100 
##$AQSEQ= 0
##$AQ_mod= 1
##$AUNM= <au_zg>
##$AUTOPOS= <>
##$BF1= 81.014009
##$BF2= 200.13
##$BF3= 200.13
##$BF4= 200.13
##$BF5= 200.13
##$BF6= 200.13
##$BF7= 200.13
##$BF8= 200.13
##$BYTORDA= 1
##$CFDGTYP= 0
##$CFRGTYP= 5
##$CHEMSTR= <none>
##$CNST= (0..31)
1 1 145 1 1 1 1 1 1 1 1 1 1 1 1 1 1 1 1 1 1 1 1 1 1 1 1 1 1 1 1 1 
##$CPDPRG= <waltz16>
##$CPDPRG1= <>
##$CPDPRG2= <waltz16>
##$CPDPRG3= <>
##$CPDPRG4= <mlev>
##$CPDPRG5= <mlev>
##$CPDPRG6= <mlev>
##$CPDPRG7= <mlev>
##$CPDPRG8= <mlev>
##$CPDPRGB= <>
##$CPDPRGT= <>
##$D= (0..31)
0 1 0 0 0 0 0 0 0 0 0 0.03 2e-05 3e-06 0 0 0 0 0 0 0 0 0 0 0 0 0 0 0 0 
0 0 
##$DATE= 1679659056
##$DBL= (0..7)
120 120 120 11 120 120 24 19 
##$DBP= (0..7)
150 150 150 150 150 150 150 150 
##$DBP07= 0
##$DBPNAM0= <>
##$DBPNAM1= <>
$$ [...]
##$SUBNAM3= <"">
##$SUBNAM4= <"">
##$SUBNAM5= <"">
##$SUBNAM6= <"">
##$SUBNAM7= <"">
##$SUBNAM8= <"">
##$SUBNAM9= <"">
##$SW= 501.771253377433
##$SWIBOX= (0..15)
0 1 3 0 0 0 0 0 0 0 0 0 0 0 0 0 
##$SW_h= 40650.406504065
##$TD= 32768
##$TD0= 1
##$TE= 0
##$TE2= 300
##$TE3= 300
##$TEG= 300
##$TL= (0..7)
0 120 53 12 22 120 120 120 
##$TP= (0..7)
150 150 150 150 150 150 150 150 
##$TP07= 0
##$TPNAME0= <>
##$TPNAME1= <>
##$TPNAME2= <>
##$TPNAME3= <>
##$TPNAME4= <>
##$TPNAME5= <>
##$TPNAME6= <>
##$TPNAME7= <>
##$TPOAL= (0..7)
0.5 0.5 0.5 0.5 0.5 0.5 0.5 0.5 
##$TPOFFS= (0..7)
0 0 0 0 0 0 0 0 
##$TUNHIN= 0
##$TUNHOUT= 0
##$TUNXOUT= 0
##$USERA1= <user>
##$USERA2= <user>
##$USERA3= <user>
##$USERA4= <user>
##$USERA5= <user>
##$V9= 5
##$VALIST= <valist>
##$VCLIST= <CCCCCCCCCCCCCCC>
##$VD= 0
##$VDLIST= <DDDDDDDDDDDDDDD>
##$VPLIST= <PPPPPPPPPPPPPPP>
##$VTLIST= <TTTTTTTTTTTTTTT>
##$WBST= 1024
##$WBSW= 4
##$XGAIN= (0..3)
0 0 0 0 
##$XL= 0
##$YL= 0
##$YMAX_a= 2612
##$YMIN_a= -2027
##$ZGOPTNS= <>
##$ZL1= 120
##$ZL2= 120
##$ZL3= 120
##$ZL4= 120
##$ABSF1= 248.5645
##$ABSF2= -253.2056
##$ABSG= 5
##$ABSL= 3
##$ALPHA= 0
##$AQORDER= 0
##$ASSFAC= 0
##$ASSFACI= 0
##$ASSFACX= 0
##$ASSWID= 0
##$AUNMP= <proc_1d>
##$AZFE= 0.1
##$AZFW= 0.5
##$BCFW= 0
##$BC_mod= 2
##$BYTORDP= 0
##$COROFFS= 0
##$CY= -3
##$DATMOD= 1
##$DC= 0
##$DFILT= <>
##$DTYPP= 0
##$F1P= 0
##$F2P= 0
##$FCOR= 1
##$FTSIZE= 65536
##$FT_mod= 6
##$GAMMA= 0
##$GB= 0
##$INTBC= 1
##$INTSCL= 6.047779e-11
##$ISEN= 30
##$LB= 1
##$LEV0= 0
##$LPBIN= 0
##$MAXI= 10000
##$MC2= 0
##$MEAN= 0
##$ME_mod= 0
##$MI= 50
##$NCOEF= 0
##$NC_proc= -7
##$NLEV= 6
##$NOISF1= 182.463
##$NOISF2= 159.3651
##$NSP= 0
##$NTH_PI= 0
##$NZP= 0
##$OFFSET= 248.5645
##$PC= 4
##$PHC0= -10542.11
##$PHC1= -115.7153
##$PH_mod= 1
##$PKNL= yes
##$PPARMOD= 0
##$PSCAL= 0
##$PSIGN= 0
##$REVERSE= no
##$SF= 81.0140089999694
##$SI= 65536
##$SIGF1= 159.3651
##$SIGF2= -187.1042
##$SINO= 113.3802
##$SIOLD= 16384
##$SREGLST= <1H.CDCl3>
##$SSB= 0
##$STSI= 65536
##$STSR= 0
##$SW_p= 40650.406504065
##$SYMM= 0
##$S_DEV= 0
##$TDeff= 32768
##$TDoff= 0
##$TI= <>
##$TILT= no
##$TM1= 0
##$TM2= 0
##$TOPLEV= 0
##$USERP1= <user>
##$USERP2= <user>
##$USERP3= <user>
##$USERP4= <user>
##$USERP5= <user>
##$WDW= 1
##$XDIM= 65536
##$YMAX_p= 319938393
##$YMIN_p= -127110967
$$ End of Bruker specific parameters
$$ ---------------------------------
##NTUPLES= NMR SPECTRUM
##VAR_NAME=  FREQUENCY,     SPECTRUM/REAL,   SPECTRUM/IMAG
##SYMBOL=    X,             R,               I
##VAR_TYPE=  INDEPENDENT,   DEPENDENT,       DEPENDENT
##VAR_FORM=  AFFN,          ASDF,            ASDF
##VAR_DIM=   65536,         65536,           65536
##UNITS=     HZ,            ARBITRARY UNITS, ARBITRARY UNITS
##FACTOR=    0.620285442955139, 1,           1
##FIRST=     20137.2065510682, 0,            0
##LAST=      -20513.1999529968, 0,           0
##MIN=       -20513.1999529968, -127110967,  0
##MAX=       20137.2065510682, 319938393,    0
$$ Real data points
##PAGE= N=1
##DATA TABLE= (X++(R..R)), XYDATA
$$ [...]
41811B431897j534236k754400j463913o1408p93326j957760o39206K478920L856731
$$ 2431897 897661 -1856739 -3320652 -3382060 -4175386 -6133146 -6772352 -4293432 -436701
41802d36701J953661j028848k159329q27288J254264J932566N40633j347672j471412
$$ -436701 1516960 488112 -1671217 -2498505 -1244241 688325 1228958 -118714 -1590126
41793a590126K55689J301663j50986k403432k261299O17107L084273K469117k04495
$$ -1590126 -1334437 -32774 -183760 -2587192 -4848491 -4231384 -1147111 1322006 1117511
41784A117511j760064q08274R63076J343825L24146m23267n5432O35927P52169
$$ 1117511 -642553 -1450827 -487751 856074 1180220 756953 701521 1337448 2089617
41775B089617K91434n36352j556698j832063l42450J836087K058030Q264j179491
$$ 2089617 2381051 1844699 288001 -1544062 -1886512 -50425 2007605 2015869 836378
41766H36378M56186K327926J224101j519270k248825q08834o4612n19772J03620
$$ 836378 1292564 3620490 4844591 3325321 1076496 267662 203050 -316722 -213102
41757b13102J934059K154872j7216j751876j314375m91175p49034o94208O92420
$$ -213102 1720957 3875829 3858613 2106737 792362 301187 -447847 -1142055 -449635
41748d49635J691488Q80293m76376j092314j711946k501629j647032J061065K502999
$$ -449635 1241853 2122146 1645770 553456 -1158490 -3660119 -5307151 -4246086 -1743087
41739a743087R07256q29944L42725K676319K697929O95163o80370j145449k108537
$$ -1743087 -835831 -1665775 -1323050 1353269 4051198 4746361 4065991 2920542 812005
41730H12005k929174j924339L3162P49012N65907J275863K141243R76709j351344
$$ 812005 -2117169 -4041508 -4008346 -3259334 -2693427 -1417564 723679 1700388 349044
41721C49044j568529Q04774K592121J706141m38499j675858j458367k25469J068974
$$ 349044 -1219485 -414711 2177410 3883551 3445052 1769194 310827 85358 1154332
41712A154332Q59790j141854k438034q31454J745996J728607n10144j400299p5798
$$ 1154332 2014122 872268 -1565766 -2397220 -651224 1077383 567239 -833060 -908858
41703i08858P62062M9879j07716J003878J094109o59742j686249n06582O97982
$$ -908858 -146796 -96917 -204633 799245 1893354 1233612 -452637 -959219 -261237
41694b61237J94597l02241P23883J432977J21982j198271j10502J833212J625925
$$ -261237 -66640 -368881 355002 1787979 1909961 711690 601188 2434400 4060325
41685D060325k43444j001058l41639l03781j217604j337228l09300K05122m22293
$$ 4060325 3816881 2815823 2474184 2170403 952799 -384429 -693729 -488607 -910900
41676i10900r09620o05308l77017m54687J77124J410241J343442o95528k364594
$$ -910900 -1820520 -2425828 -2802845 -3257532 -3080408 -1670167 -326725 -1022253 -3386847
41667c386847j314844J298473K326670J026589k24864K39701J051885M40078o85886
$$ -3386847 -4701691 -3403218 -1076548 -49959 -274823 -35122 1016763 1456841 770955
41658G70955l75210P41491K30114j843519k441823l54834J502796N13606j550182
$$ 770955 395745 1137236 1367350 -476169 -2917992 -3272826 -1770030 -1256424 -2806606
41649b806606j535351J23686P12644j1828l5349Q03937P03168l72202n36942L75689
$$ -2806606 -4341957 -4218271 -3505627 -3517455 -3552804 -2748867 -2045699 -2417901 -2954843 -2579154
41639b579154O62542L93384J319144K729288J674517j666792l251691j404051
$$ -2579154 -1916612 -1523228 -204084 2525204 4199721 2532929 -718762 -2122813
41631b122813O12947L43683q2803J207512J724765p13737l073448j580439J808060
$$ -2122813 -1509866 -1166183 -1248986 -41474 1683291 969554 -2103894 -3684333 -1876273
41622a876273K409672J87344j004019j55975J25503r35479j111663K62457J077451
$$ -1876273 533399 720743 -283276 -439251 -313748 -1249227 -2360890 -2098433 -1020982
41613a020982N54990N26350J587080J668421k13521k024825k044617j337748j336890
$$ -1020982 -465992 60358 1647438 3315859 3102338 1077513 -967104 -2304852 -3641742
41604c641742j410196n24368O59660J008438P29313N83181N26065K65407J07980
$$ -3641742 -5051938 -5576306 -4916646 -3908208 -3178895 -2595714 -2069649 -1804242 -1696262
41595a696262L55827P54483J090732J399032J292505K19490j362231k223980j946314
$$ -1696262 -1340435 -585952 504780 1903812 3196317 3415807 2053576 -170404 -2116718
41586b116718j133619j56979R18246J315987J92002j625049k252083j249786J65517
$$ -2116718 -3250337 -3407316 -2489070 -1173083 -981081 -2606130 -4858213 -6107999 -5942482
41577e942482J334782K548576L209479K082402p0241o26645J068644K320323R08573
$$ -5942482 -4607700 -2059124 1150355 3232757 3162516 2535871 3604515 5924838 6833411
41568F833411j708808k638691j394328J44738L96673p34368k299411k769460j156535
$$ 6833411 5124603 2485912 1091584 1236322 1632995 898627 -1400784 -4170244 -5326779
41559e326779J320993K014809L73827q63736N33105K849787K769609O9890k234828
$$ -5326779 -4005786 -1990977 -1617150 -2480886 -1947781 902006 3671615 3741505 1506677
41550A506677j991396j28786J205480J057419k7377q86439o72804L12542P70256
$$ 1506677 -484719 -613505 591975 1649394 1622017 735578 62774 375316 1145572
41541A145572M0945q08923m31605P37083J058574J31173o60666k19357P88104
$$ 1145572 1186517 377594 -54011 683072 1741646 1872819 1212153 992796 1780900
41532A780900J016597K18507o67123p97028k48139L77158P69668J065348J255565
$$ 1780900 2797497 3016004 2348881 1551853 1303714 1680872 2450540 3515888 4771453
41523D771453R11540j34559j203885j494117j137666p74802l63611M62919J014741
$$ 4771453 5682993 5548434 4344549 2850432 1712766 937964 574353 1037272 2052013
41514B052013J12219j599055j671468P57088L128802K559229l38758k505509k562585
$$ 2052013 2164232 565177 -1106291 -349203 2779599 5338828 5000070 2494561 -68024
41505f8024j824075j392134n48484J192979K308824J096642j555620k766470j028896
$$ -68024 -1892099 -3284233 -3832717 -2639738 -330914 765728 -789892 -3556362 -4585258
41496d585258K033904L541190K346955j31255j586503r28130R50130K021720R35758
$$ -4585258 -2551354 989836 3336791 3205536 1619033 690903 1641033 3662753 4598511
41487D598511j509432k862898j651413O37258J197959m19000j710981q96168N12912
$$ 4598511 3089079 226181 -1425232 -787974 409985 -9015 -1719996 -2616164 -2103252
41478b103252K75832r18878o79325R90618J629864M99160p3821J356828K598789
$$ -2103252 -1827420 -2746298 -3425623 -2435005 -805141 -305981 -379802 977026 3575815
41469C575815R74757k455632m098669k493446K52697J521215R99173J77330K04764
$$ 3575815 4550572 2094940 -2003729 -4497175 -4244478 -2723263 -1724090 -1546760 -1341996
41460a341996P85715Q29145n0326q38154l47239J003892J573897P97094j01926
$$ -1341996 -556281 272864 222538 -615616 -962855 41037 1614934 2412028 2310102
41451B310102j57131q8020q03251j705066j679428q57462j72639J07926K78077
$$ 2310102 2152971 2064951 1261700 -443366 -2122794 -2980256 -3152895 -3044969 -2766892
41442b766892L21656K31219M47382R00454N29217r56692j839881o09758J372348
$$ -2766892 -2445236 -2214017 -1766635 -866181 -336964 -1293656 -3133537 -3743295 -2370947
41433b370947J415933o39351k137091j269626P96044J853081J236448l5034o40760
$$ -2370947 -955014 -1594365 -3731456 -5001082 -4205038 -2351957 -1115509 -1150543 -1791303
41424a791303j36711N64937O7953j452421j837463J63168K560253K596653P34216
$$ -1791303 -1928014 -1363077 -1295124 -2747545 -4585008 -4421840 -1861587 735066 1469282
41415A469282k97380Q5171p5223j168744j062177O81529J180685j102941l219339
$$ 1469282 1171902 1257073 1181850 13106 -1049071 -367542 813143 -289798 -3509137
41406c509137k065184P11852J539165O86638J218002L209700L355749N50639k153061
$$ -3509137 -5574321 -4862469 -3323304 -2636666 -1418664 1791036 5146785 5697424 3544363
41397C544363k252331j001525l99314j12112N89768O37596n61664j019541O97028
$$ 3544363 1292032 290507 -108807 -220919 368849 1006445 444781 -574760 122268
41388A22268K170627N11131k316981j747506K083000L830221Q26217k865809k634406
$$ 122268 2292895 2804026 487045 -1260461 822539 4652760 5478977 2613168 -21238
41379b1238J55978J216889P1573m88401J4598n67664k112775j772834P29530J782528
$$ -21238 134740 1351629 1423202 934801 949399 381735 -1731040 -3503874 -2774344 -991816
41369i91816k79329j996538k00715K742541K679969J90698p80585O02252J340312
$$ -991816 -1271145 -3267683 -3468398 -725857 1954112 2144810 1364225 1966477 3306789
41360C306789N4156j075941n39540J03002n13346j074950l05833L88545p29481
$$ 3306789 3360945 2285004 1745464 1848466 1335120 260170 -45663 342882 -386599
41351c86599k540169k519114k74033K291534L496258K940922R47573j372280k178377
$$ -386599 -2926768 -5445882 -5719915 -3428381 67877 3008799 3956372 2584092 405715
41342D05715o74974J585842K441509J558760j579j602700k795500k370791O5827
$$ 405715 -269259 1316583 3758092 5316852 5315273 3712573 917073 -1453718 -1387891
41333a387891K171912J147288j990493l065716m16757K592701K194931o70252
$$ -1387891 784021 1931309 -59184 -3124900 -3541657 -948956 1245975 575723
41325E75723j974384k25494J872234J453116p18941j558753N7539J737126Q01014
$$ 575723 -1398661 -1624155 248079 1701195 982254 -576499 -518960 1218166 2019180
41316B019180j891047k850743p31969J708198J537171k83131q75147j15183l01175
$$ 2019180 128133 -2722610 -3454579 -1746381 -209210 -492341 -1367488 -1482671 -1783846
41307a783846j650573j668823L58011J719783O63043p43060k91701O75005Q4296
$$ -1783846 -3434419 -5103242 -4745231 -3025448 -2362405 -3105465 -3397166 -2722161 -2637865
41298b637865q00740L89619K530877K453610J22697j414655r46512k42237j86610
$$ -2637865 -3438605 -3048986 -518109 1935501 2058198 643543 -302969 -545206 -731816
41289g31816M30705J596230J296807o43929j429016K44470J735369O43795j329274
$$ -731816 -301111 1295119 2591926 1947997 518981 763451 2498820 3142615 1813341
41280A813341j225302P07682J988790J572456J28177j702506k969096k012700
$$ 1813341 588039 1295721 3284511 4856967 4985144 3282638 313542 -1699158
41272a699158J034044K923132J266166j553419j495489J213893K607246Q48402
$$ -1699158 -665114 2258018 3524184 1970765 475276 1689169 4296415 5144817
41264E144817j768884k681197j873654n36269M83907N42435l34805q48203k19714
$$ 5144817 3375933 694736 -1178918 -1715187 -1231280 -688845 -1023650 -1871853 -2091567
41255b091567J39570q60093j103991J622308M749662L705276o81642k711396m73179
$$ -2091567 -1951997 -2812090 -3916081 -2293773 2455889 6161165 5479523 2768127 2294948
41246B294948J508695R8366j573696k25412J683089N53016j875473j634363P34254
$$ 2294948 3803643 3902009 2328313 2102901 3785990 4339006 2463533 829170 1563424
41237A563424J558054J69041j098374j509101j925109j520642P84007K619032
$$ 1563424 3121478 3290519 2192145 683044 -1242065 -2762707 -1978700 640332
41229F40332Q39422k625744k702153R89172L377024J738346q34580j164659l32486
$$ 640332 1479754 -1145990 -3848143 -2858971 518053 2256399 1421819 257160 -75326
41220g5326k03962j8154R25176R37596q33865k062146r79368M73498J67985m04418
$$ -75326 -279288 -297442 627734 1565330 731465 -1330681 -2310049 -1836551 -1668566 -2072984
41210b072984P89114J991780L70599k664962l037950j61594K362807K174260Q17961
$$ -2072984 -1283870 707910 1078509 -1586453 -4624403 -4785997 -2423190 -248930 569031
41201E69031M84184J041230J261409P70219k07278j402086k052181j290330L67144
$$ 569031 1053215 2094445 3355854 4126073 3918795 2516709 464528 -825802 -458658
41192d58658J108927L6668j625724k051339q63426P16191J305767O94262r2026
$$ -458658 650269 686937 -938787 -2990126 -3853552 -3137361 -1831594 -1137332 -1229358
41183a229358q1125L91648L01127k84885k18858O27405P96523l87565j431270
$$ -1229358 -1310483 -918835 -617708 -902593 -1121451 -494046 302477 -85088 -1516358
41174a516358r11556L05760O14577J56504L2672J87323m141l5149P96734J594928
$$ -1516358 -2427914 -2122154 -1507577 -1351073 -1318401 -1131078 -1135219 -1170368 -373634 1221294
41164A221294J084865j49640p43260r43629j581278j670299Q4503K166456J933005
$$ 1221294 2306159 2156519 1413259 469630 -1111648 -2781947 -2697444 -530988 1402017
41155A402017K3660m87464P31070R02220n99432r65030P87066J677781O1686j172241
$$ 1402017 1425677 938213 1669283 2571503 1972071 1007041 1794107 3471888 3533574 2361333
41145B361333K85954J712391q8994k927174k553754K92622J173151p27197j577882
$$ 2361333 2647287 4359678 4270684 1343510 -1210244 -917622 255529 -471668 -2049550
41136b049550O05210K972044K504484R0579j590142j584848o49810K37146K18200
$$ -2049550 -1444340 1527704 4032188 4122767 2532625 947777 297967 535113 753313
41127G53313r08753j776501p32192J528645K471752J278529j55568l21232k1399
$$ 753313 -155440 -1931941 -2664133 -1135488 1336264 2614793 2459225 2137993 2116594
41118B116594l58730q66860p34980j56820N11848J304171J582590K89771j855400
$$ 2116594 1757864 891004 156024 -796 511052 1815223 3397813 3687584 1832184
41109A832184k397600n17471J526251J553322K03686p71876j052627j080481o66898
$$ 1832184 -565416 -1082887 443364 1996686 2200372 1428496 375869 -704612 -1371510
41100a371510J22778L62093J9496M66494J743667J612460o98401k298704q23198
$$ -1371510 -1248732 -886639 -867143 -400649 1343018 2955478 2257077 -41627 -864825
41091h64825J568272J596527P8077j52292L04554j240690l723837l101720P29552
$$ -864825 703447 2299974 2378051 2225759 2530313 1289623 -2434214 -5535934 -4806382
41082d806382K949285J102473j343480q35299J135080J529754P48007P48287J014205
$$ -4806382 -1857097 -754624 -2098104 -2933403 -1798323 -268569 479438 1227725 2241930
41073B241930J4903j307328j078098j25728o20634k003924j679844N97495K235606
$$ 2241930 2256833 949505 -128593 -254321 -874955 -2878879 -4558723 -3961228 -1725622
41064a725622J818667P52829M77520N84056M00826K63713L82646K57079n1124
$$ -1725622 93045 845874 1323394 1907450 2308276 2571989 2954635 3211714 3160590
41055C160590K33015Q09512K22225j468590j839391M85487L071683K445226j035326
$$ 3160590 3393605 4203117 4425342 2956752 1117361 1602848 4674531 7119757 6084431
41046F084431l298366j806617J206572J791302o27701k764268j874996Q69013
$$ 6084431 2786065 979448 2186020 3977322 3349621 585353 -1289643 -420630
41038d20630K195313R87414o56322o16489M16620K42906j544216k996243k606303
$$ -420630 1774683 2762097 2105775 1489286 1905906 2148812 604596 -2391647 -4997950
41029d997950j275677o20071k90270J390170M126556M925607K002026j927088
$$ -4997950 -6273627 -6893698 -7183968 -5793798 -1667242 3258365 5260391 3333303
41021C333303k549220J51281J662607n60191l265617k292001J101908K280716
$$ 3333303 784083 935364 2597971 2037780 -1227837 -3519838 -2417930 -137214
41013a37214L95084p17592Q95166K116253R8841k701037k014351J731596L867141
$$ -137214 257870 -459722 435444 2551697 2650538 -50499 -2064850 -333254 3533887
41004C533887J872458j679508k946041j336261O98878J011031k15697j326873
$$ 3533887 5406345 3726837 780796 -555465 143413 1154444 938747 -388126
40996c88126j230318k43729Q03987J517173J557688L57933j563611j982444K80508
$$ -388126 -1618444 -1862173 -1058186 458987 2016675 2374608 810997 -1171447 -890939
40987h90939K603477J349362k545716m069694j141700K368431K460972M17036
$$ -890939 1712538 3061900 516184 -3553510 -4695210 -2326779 134193 551229
40979E51229l94841o1711p51305j983805j492338L33149R75712L08507O56678
$$ 551229 156388 94677 -656628 -2640433 -4132771 -3799622 -2823910 -2515403 -1858725
40970a858725K298853K700390Q72010r38125r71685m21537q46209j569813j150487
$$ -1858725 440128 3140518 4012528 3074403 2102718 1681181 834972 -734841 -1885328
40961a885328K89328J432841J322457l2777j567117j722642l28500O51742j32452
$$ -1885328 -1596000 -163159 1159298 1126521 -440596 -2163238 -2491738 -1839996 -1972448
40952a972448r67073K48907K039508J417221q18197r78512J234513J927531l87676
$$ -1972448 -2939521 -2690614 -651106 766115 -52082 -1030594 203919 2131450 1743774
40943A743774j982754Q8694L214074L382502R08832j147060j699605j596002r45725
$$ 1743774 -238980 -150286 3063788 6446290 7355122 6208062 4508457 2912455 1966730
40934A966730L39036R05776k23909j498321j078243J26793K18113l17829K35867
$$ 1966730 2305766 3211542 2987633 1489312 411069 537862 755975 438146 674013
40925F74013J492883J647386O29699j32252l75968q37710j137397m30736M66098
$$ 674013 2166896 3814282 4443981 4311729 3935761 3098051 1960654 1529918 1996016
40916A996016J87577o03978m31436p2069j340596l250355k840116k3507J839397
$$ 1996016 2183593 1579615 1148179 1076110 -264486 -3514841 -6354957 -6378464 -4539067
40907d539067R89645l73225l2752R88876R27429M28806R00539J610447R58824
$$ -4539067 -3549422 -3922647 -3955399 -2966523 -2039094 -1610288 -709749 900698 1859522
40898A859522m85977p16423L80377P21334o80061k036446j306274Q46110J893816
$$ 1859522 1373545 657122 1037499 1758833 1078772 -957674 -2263948 -1417838 475978
40889D75978Q32479o24465o19773K42722M9531j285843j796603n96148O41671
$$ 475978 1308457 683992 64219 306941 356472 -929371 -2725974 -3322122 -2680451
40880b680451L74071k90984N25878K224041K473511P59548r45137j130406m45083
$$ -2680451 -2306380 -2597364 -2071486 152555 2626066 3385614 2440477 1310071 864988
40871H64988n4409p4113l11811r52946j557770q29873J296218K500410P73371
$$ 864988 810579 736466 424655 -528291 -2086061 -2915934 -1619716 880694 1654065
40862A654065k279788k854328K6352K818074J999105j129033k179180L31737L141344
$$ 1654065 -625723 -3480051 -3453699 -635625 1363480 234447 -1944733 -1612996 1528348
40853A528348K927775N08121j160595j282485j238246j450246r03599M60501J314398
$$ 1528348 4456123 4964244 3803649 2521164 1282918 -167328 -1070927 -610426 703972
40844G03972J080554M25656m44481j798449k606859j263066J452350K621475J143297
$$ 703972 1784526 2210182 1765701 -32748 -2639607 -3902673 -2450323 171152 1314449
40835A314449q85204j425668p39612K37192J096662Q88435j132589k925902j337826
$$ 1314449 429245 -996423 -1736035 -1498843 -402181 486254 -646335 -3572237 -4910063
40826d910063K566317L865848J089982j351024l97813R55328l20364j630061K2861
$$ -4910063 -2343746 1522102 2612084 1261060 863247 1818575 1498211 -131850 -108989
40817a08989J744111k62965l134411j717060K155645K309393j310968k657340
$$ -108989 1635122 1372157 -1762254 -3479314 -1323669 985724 -325244 -2982584
40809b982584J65207K402304J313724l7719N39388P29765q10229j534890k96401
$$ -2982584 -2817377 -415073 898651 860932 1400320 2130085 1319856 -215034 -511435
40800e11435J76931j134758j138107J179963J912713q18756k763561o94996J744712
$$ -511435 -334504 -1469262 -2607369 -1427406 485307 -333449 -3097010 -3792006 -2047294
40791b047294M29392j940021p72605K242913K321160q4213p05216P95589R92678
$$ -2047294 -1617902 -3557923 -4330528 -2087615 233545 149332 -555884 239705 1232383
40782A232383n22200p58757O52418Q95905m19587n73118P73165O53947j519498
$$ 1232383 710183 -48574 603844 1499749 1080162 507044 1280209 1934156 414658
40773D14658k366262m07102R96961r07854l546217k781780J015669L676605K812035
$$ 414658 -1951604 -2358706 -1361745 -2269599 -5815816 -8597596 -7581927 -3905322 -1093287
40764a093287K49959q44157K91765J540721Q08803j070070j289392Q39387K508679
$$ -1093287 -843328 -1687485 -1395720 145001 953804 -116266 -1405658 -566271 1942408
40755A942408J402473q26469j220421K4095N72237R0222K6077J05833j194824
$$ 1942408 3344881 2518412 1297991 1322086 1894323 1984545 2010622 2116455 921631
40746I21631k876490k057487J058505K654236R05094j363819j226435K85051O87906
$$ 921631 -1954859 -4012346 -2953841 -299605 605489 -758330 -1984765 -1699714 -1011808
40737a011808m1430l73435n4396J97364L60307N58866J05396j205918k014476
$$ -1011808 -1053238 -1426673 -1481069 -1283705 -923398 -364532 -259136 -1465054 -3479530
40728c479530j181698M06451J248577J316354J303169R67392r4809r46476l75744
$$ -3479530 -4661228 -4254777 -3006200 -1689846 -386677 580715 485906 -460570 -836314
40719h36314J020538J404415J55875j445048j835182n94470J394519K463121J406207
$$ -836314 184224 1588639 1744514 299466 -1535716 -2130186 -735667 1727454 3133661
40710C133661r50809k110883q13703J115653J037378r67795k319056j479607L10489
$$ 3133661 2182852 71969 -741734 373919 1411297 443502 -1875554 -3355161 -3044672
40701c044672J148749Q79918N69953N83630L99780J3487K30929J146245J344963
$$ -3044672 -1895923 -1016005 -446052 137578 537358 550845 781774 1928019 3272982
40692C272982l07307k514115k607847q2889K295659J865295n05974j721390n41264
$$ 3272982 2965675 451560 -2156287 -2239176 56483 1921778 1415804 -305586 -846850
40683h46850J215478J410575R917j472460j726238n29179J101828J449337j76604
$$ -846850 368628 1779203 1789120 316660 -1409578 -1938757 -836929 612408 435804
40674D35804k119406j977980K59839K040737J623682J51060m49432j72341k36332
$$ 435804 -1683602 -3661582 -3401743 -1361006 262676 413736 -35696 -208037 -444369
40665d44369p48087p08860P2741O60898O67964Q64464J609221J801596L97690
$$ -444369 -1192456 -1901316 -1828575 -1167677 -499713 364751 1973972 3775568 4173258
40656D173258j613360k045256m86714Q07179j47974k185429k480745m60785J629756
$$ 4173258 2559898 514642 27928 835107 687133 -1498296 -3979041 -4439826 -2810070
40647b810070K179457K070593K240314J652218m72858k217086j294483J160625
$$ -2810070 -630613 1439980 3680294 5332512 4859654 2642568 1348085 2508710
40639B508710J807544j86544k158849j840840L3816J470485J591494O74649n33697
$$ 2508710 4316254 4129710 1970861 130021 163837 1634322 3225816 3900465 3366768
40630C366768r91502k31757O54975K78763q29513r23638J02798N76364j22398
$$ 3366768 2375266 2143509 2798484 3077247 2247734 1324096 1426894 2003258 1880860
40621A880860p77207p24733p49769j069395p39504K52363O30924K76194N51990
$$ 1880860 1103653 378920 -370849 -1440244 -2179748 -1927385 -1296461 -1020267 -468277
40612d68277J447354J185279l26222p83195L86948O44714r23339j234067J449695
$$ -468277 979077 2164356 1838134 1054939 1441887 2086601 1163262 -70805 1378890
40603A378890L447398J048777k964072l139571K31721J961246L81771p49856P62973
$$ 1378890 4826288 5875065 2910993 -228578 3143 1964389 2346160 1596304 2359277
40594B359277K104265P47789j360202j489846m84463n64321j352836j017927L01081
$$ 2359277 4463542 5211331 3851129 2361283 1876820 1312499 -40337 -1058264 -757183
40585g57183Q97917L82810n9509J86158M58356N8157q80561j563189j106312M95971
$$ -757183 140734 523544 464035 650193 1108549 1166706 286145 -1277044 -2383356 -1887385
40575a887385J785211J240126m98276j141666R3209J388182J063510j73837o98075
$$ -1887385 -102174 1137952 639676 -501990 -408781 979401 2042911 1869074 1170999
40566A170999k32805M78609J002452J070996K86890q95874j064393J12835R48512
$$ 1170999 938194 1416803 2419255 3490251 3777141 2881267 1816874 1929709 2878221
40557B878221J41702j106080r38992K75105P40930J57368j23489M12021O31753
$$ 2878221 3019923 1913843 974851 1249956 1990886 2148254 2024765 2436786 3068539
40548C068539l38441j747526k123348q37684J215415K073806M25174k479444l510588
$$ 3068539 2730098 982572 -1140776 -1978460 -763045 1310761 1735935 -743509 -4254097
40539d254097j256496J982551L025719J652200M2044o44687j018561j328014r68611
$$ -4254097 -5510593 -3528042 -502323 1149877 1191921 547234 -471327 -1799341 -2767952
40530b767952k26711k90440j046873q64483P44605K067646J675588L83497k47712
$$ -2767952 -2994663 -3285103 -4331976 -5196459 -4451854 -2384208 -708620 -325123 -572835
40521e72835j4251L25059L86215J34981m78036j000372n60946P24990J405516
$$ -572835 -587086 -262027 124188 259169 -218867 -1219239 -1780185 -1055195 350321
40512C50321N73393q07339j237997m84750O31706J321013J113077J20907m72906
$$ 350321 923714 116375 -1121622 -1606372 -974666 346347 1459424 1580331 1107425
40503A107425N02296K110471J976277j86746j747090j070722j1008o63992j913511
$$ 1107425 1609721 3720192 5696469 5509723 3762633 2691911 2680903 2016911 103400
40494A03400j707813p12052o00509m89938J199332K658962Q90471k520789k695742
$$ 103400 -1604413 -2316465 -2916974 -3406912 -2207580 451382 1341853 -1178936 -3874678
40485c874678R20723L158657R52754k100991j621826J200146K441917J351148
$$ -3874678 -2953955 204702 1157456 -943535 -2565361 -1365215 1076702 2427850
40477B427850j95544j461244k348972j443182J488911L011592L44584l370460
$$ 2427850 2232306 771062 -1577910 -3021092 -1532181 1479411 1823995 -1546465
40469a546465k836289J328547L396394J253042j091028o28523L91188m95454j482649
$$ -1546465 -4382754 -3054207 342187 1595229 504201 -124322 266866 -228588 -1711237
40460a711237k70787J441011R30535p94649r18599M70385J166184Q98118J074124
$$ -1711237 -1982024 -541013 389522 -405127 -1323726 -853341 312843 1210961 2285085
40451B285085J436790M69555j260965j475161K3336R01961K5565j084881j102919
$$ 2285085 3721875 4191430 2930465 1455304 1478640 2380601 2406166 1321285 218366
40442B18366o47978l17980O26925K297124K866057R14567k128656l425224j974494
$$ 218366 -429612 -747592 -120667 2176457 5042514 5957081 3828425 403201 -1571293
40433a571293O17979K052618J235615j104372k932278k547865l49290J481143
$$ -1571293 -953314 1099304 2334919 1230547 -1701731 -4249596 -4598886 -3117743
40425c117743J473293M41567J18019R47355J909480J973919J025558k97548j128278
$$ -3117743 -1644450 -1202883 -1084864 -137509 1771971 3745890 4771448 4473900 3345622
40416C345622j031910n18649m96041r55898q65889K47206J434747J670513J177576
$$ 3345622 2313712 1795063 1299022 343124 -522765 -275559 1159188 2829701 4007277
40407D007277N25904o52903k639226l944985k541080J081567L782287L332717
$$ 4007277 4533181 3880278 1241052 -2703933 -5245013 -4163446 -381159 2951558
40399B951558P73729j447883k287388k036893q59214R60930K140575J609160K69957
$$ 2951558 3725287 2277404 -9984 -2046877 -2906091 -1945161 195414 1804574 2074531
40390B074531j49472K43761q3014j092989r76523M96991J014643n24390j767964
$$ 2074531 1925059 2168820 2085806 992817 16294 513285 1527928 1003538 -764426
40381g64426n65628J306339R62797o98583n25232J300927J330168j199565k684932
$$ -764426 -1330054 -23715 939082 240499 -284733 1016194 2346362 1146797 -1538135
40372a538135r01512J412743J112968m67442l07823J139886J236634o222k34787
$$ -1538135 -2439647 -1026904 86064 -381378 -689201 450685 1687319 1681097 1446310
40363A446310Q06911R08172m90422j308855n80488j4172p15339j182800j13710
$$ 1446310 2253221 3161393 2670971 1362116 781628 767456 52117 -1130683 -1244393
40354a244393J158268Q84486k24687l19653N89300Q60687j58429j327326j353949
$$ -1244393 -86125 798361 573674 254021 843321 1704008 1545579 218253 -1135696
40345a135696k08226J026773J221003L90724q3815Q61299K130514J557738r63440
$$ -1135696 -1343922 -317149 903854 1294578 1210763 2072062 4202576 5760314 4796874
40336D796874k991073k721747j029067M41800J361077J707236O53648j637828
$$ 4796874 1805801 -915946 -1945013 -1503213 -142136 1565100 2218748 580920
40328E80920k726304p89357K190294K644371L26832j507159p96021Q82725J057777
$$ 580920 -2145384 -2934741 -744447 1899924 2226756 719597 -76424 806301 1864078
40319A864078m80724k050763k128795m47515J735559K254427L15285j813066j200341
$$ 1864078 1383354 -667409 -2796204 -3243719 -1508160 746267 1061552 -751514 -1951855
40310a951855J509406K570773N08248j619394q65884J177452J067444j169378
$$ -1951855 -442449 2128324 2636572 1017178 151294 1328746 2396190 1226812
40302A226812k412502j292193L91839J000079R21806O49474l22988j674405j704563
$$ 1226812 -1185690 -2477883 -2086044 -1085965 -164159 485315 162327 -1512078 -3216641
40293c216641j7119J253028N28358p08961m64096L86777j58958j246193j11812
$$ -3216641 -3233760 -1980732 -1452374 -2161335 -2625431 -2238654 -2397612 -3643805 -3755617
40284c755617L082038M589901K216444j561468l074151j867819J09841J753372
$$ -3755617 -673579 3916322 6132766 4571298 1497147 -370672 -260831 1492541
40276A492541K913774K689262L77596k332556k723874p71355P13188N7261j233884
$$ 1492541 4406315 7095577 7473173 5140617 2416743 1645388 2358576 2415837 1181953
40267A181953j153051q753O04679K55815k27828k80997p6253R6228J61546K19976
$$ 1181953 28902 20149 624828 880643 652815 371818 295565 391793 553339 773315
40257G73315M58101P45583M77865m34440q17574K29658J421989P58150j221422
$$ 773315 1231416 1976999 2454864 2020424 1202850 1432508 2854497 3612647 2391225
40248B391225j983382j047256o42704j480278j157391J368267L013752J192688
$$ 2391225 407843 -639413 -1282117 -2762395 -3919786 -2551519 462233 1654921
40240A654921j599417j478096P43441J362487J05432j02329J064411Q52277j022647
$$ 1654921 55504 -1422592 -679151 683336 788768 686439 1750850 2603127 1580480
40231A580480j474445J78693N56821j667118k792150j98727K793722J977277j161061
$$ 1580480 106035 284728 841549 -825569 -3617719 -3816446 -1022724 954553 -206508
40222b06508k122389k52479J392515J403972J018858P42699l6968o05243K01388
$$ -206508 -2328897 -2581376 -1188861 215111 1233969 1976668 1939700 1334457 1535845
40213A535845J045399l32265k805227k931558m59758J158161L65119l99357N49189
$$ 1535845 2581244 2248979 -556248 -3487806 -3947564 -2789403 -2424284 -2823641 -2274452
40204b274452J232418m9691j324474k67789J735939J916264O05646K58611J161781
$$ -2274452 -1042034 -1091725 -2416199 -2683988 -948049 968215 1573861 1832472 2994253
40195B994253J248359j91517j420637j147372k85764j95286p74154j067916p39511
$$ 2994253 4242612 4051095 2630458 1483086 1197322 1002036 227882 -840034 -1579545
40186a579545k16185J03630K69450M96134O39859K02946p66330j076474L23676
$$ -1579545 -1795730 -1692100 -1422650 -926516 -286657 -83711 -850041 -1926515 -1602839
40177a602839K412291K762390O86321j618665j963328q82751j81158l1782N80597
$$ -1602839 809452 3571842 4258163 2639498 676170 -206581 -387739 -419521 161076
40168A61076J293109N58958j483148k501470j165229Q47441J260207L41257J8364
$$ 161076 1454185 2013143 529995 -1971475 -3136704 -2289263 -1029056 -687799 -669435
40159f69435N95889M08946j035878j667760N7724K198041J674509r87333j958532
$$ -669435 -73546 335400 -700478 -2368238 -2310514 -112473 1562036 574703 -1383829
40150a383829L12472K561703J418120j685169k849048j280714N60208J366015
$$ -1383829 -1071357 1490346 2908466 1223297 -1625751 -2906465 -2346257 -980242
40142i80242K012937K441745J246744j019328j712256l95169J90622j072482j551992
$$ -980242 1032695 3474440 4721184 3701856 1989600 1594431 1785053 712571 -839421
40133h39421K98838J687059J94331j601717k85404K234197J522499j973388l448270
$$ -839421 -540583 1146476 1340807 -260910 -546314 1687883 3210382 1236994 -2211276
40124b211276j273617R94742P26636k95354J05137J026449R88544O17110P31672
$$ -2211276 -3484893 -2490151 -1763515 -2058869 -1953732 -927283 61261 678371 1410043
40115A410043M79961n61891q81107K56597Q45691p48221k645847k036581M83752
$$ 1410043 1890004 1328113 447006 703603 1549294 801073 -1844774 -3881355 -3397603
40106c397603J843553R91292q4750L27126J475229J617714K44945j587476k389945
$$ -3397603 -1554050 -562758 -647508 -320382 1154847 2772561 3017506 1430030 -959915
40097i59915j587963j09523O33625M86392N23629J115891J258006L88918m84444
$$ -959915 -2547878 -2657401 -2023776 -1537384 -1013755 102136 1360142 1749060 1264616
40088A264616m16625l9489l55725j117796j517585j423448q63651M74387J992802
$$ 1264616 847991 808502 452777 -665019 -2182604 -3606052 -4469703 -3995316 -2002514
40079b002514J858641m09745k341461j514663Q84924J748520M97804o38475l90298
$$ -2002514 -143873 -553618 -2895079 -4409742 -3524818 -1776298 -1278494 -1916969 -2307267
40070b307267K01611L37565P00615J444902J333928M404r13369k59892P56837
$$ -2307267 -2105656 -1768091 -1067476 377426 1711354 1715758 802389 542497 1299334
40061A299334O00394j05991J33998R60776O81003q81168j922150j257528R7608
$$ 1299334 1899728 1793737 1927735 2888511 3569514 2688346 766196 -491332 -393724
40052c93724N33858K6644q5731R10432K021565J582891p46057l146576l158256
$$ -393724 140134 166778 81047 991479 3013044 4595935 3849878 703302 -2454954
40043b454954l99357K510798K497086m00126k854327k179039M28354J675666O36645
$$ -2454954 -2854311 -343513 2153573 1753447 -1100880 -3279919 -2851565 -1175899 -539254
40034e39254l71834L44370J199450M7199k009296j958221M80876K213953J254298
$$ -539254 -911088 -566718 632732 679931 -1329365 -3287586 -2806710 -592757 661541
40025F61541n73287o26314Q27617J576572P80317n27219j392090j642961j187060
$$ 661541 88254 -538060 289557 1866129 2646446 2119227 727137 -915824 -2102884
40016b102884k00457L85948K9807k75969N33234J617853J500006O82119P39353
$$ -2102884 -2303341 -1917393 -1887586 -2163555 -1630321 -12468 1487538 2169657 2909010
40007B909010J134644k40468k950092l537397n99462K465595K099626k36739n29582
$$ 2909010 4043654 3803186 853094 -2684303 -3283765 -818170 1281456 1044717 515135
39998E15135J555292K477789O35013j295764q97993K71831l46872j916784j628463
$$ 515135 2070427 4548216 5183229 3887465 2989472 3261303 2914431 997647 -630816
39989f30816N58942J633282Q5003j911296j793184o941J257879J145913K88134
$$ -630816 -71874 1561408 1646411 -264885 -2058069 -2065010 -807131 338782 626916
39980F26916r43127k329208k585380m87480K665365L803979J974407l20677o35679
$$ 626916 -316211 -2645419 -5230799 -5718279 -3052914 751065 2725472 2404795 1769116
39971A769116K32052L2545j289753j728851m65736R95884J121025K05842n29027
$$ 1769116 2001168 2033713 743960 -984891 -1450627 -454743 666282 872124 343097
39962C43097n25221n576N87370P27962J31685n70754k48682J064599J734399O23035
$$ 343097 -182124 -187700 399670 1127632 1259317 688563 439881 1504480 3238879 3861914
39952C861914j041354j117195L99690J231771N0930j585189j539996k60952l4975
$$ 3861914 2820560 1703365 2103055 3334826 3385756 1800567 260571 -381 -35356
39943c5356j456566k474321j415466O56149J656302J344839J044843J216943R55300
$$ -35356 -1491922 -3966243 -5381709 -4725560 -3069258 -1724419 -679576 537367 1492667
39934A492667j72728j226595j200025k76727N70717O12155j38590r21597p97808
$$ 1492667 1319939 93344 -1106681 -1383408 -812691 -200536 -339126 -1260723 -2058531
39925b058531K82472J282266J462000J257627R85497j91571k476178l753025k050625
$$ -2058531 -1776059 -493793 968207 2225834 3211331 3019760 543582 -3209443 -5260068
39916e260068R45847J686173p952p19285R25370J932625r172k415456j717117
$$ -5260068 -4314221 -2628048 -2636000 -3355285 -2429915 -497290 -506462 -2921918 -4639035
39907d639035J230312K539540R11437j158938j298862J31647J307376J051369
$$ -4639035 -3408723 -869183 42254 -1116684 -2415546 -2283899 -976523 74846
39899G4846k50366q33203O45267K759132K390306p09378k719838j079377J520543
$$ 74846 -175520 -1008723 -363456 2395676 4785982 4076604 1356766 277389 1797932
39890A797932J372217m55584n14725P21334j06949k653292k705552P25595L275936
$$ 1797932 3170149 2714565 2199840 2921174 2814225 160933 -2544619 -1819024 1456912
39881A456912J920366p07848j109107j36786m23625j673246j827822p97851N3262
$$ 1456912 3377278 2669430 1560323 1423537 999912 -673334 -2501156 -3299007 -3245745
39872c245745N64717J175083J083882l01238j298900o7590K097681K277864K14666
$$ -3245745 -2681028 -1505945 -422063 -723301 -2022201 -2089791 7890 2285754 2500420
39863B500420j491248j268629k52039N9265l36882q42819j245586j260233m72747
$$ 2500420 1009172 -259457 -511496 -452231 -789113 -1631932 -2877518 -4137751 -4610498
39854d610498P51696J391678J189483J009560J453736J969137J723177P39832
$$ -4610498 -3858802 -2467124 -1277641 -268081 1185655 3154792 4877969 5617801
39846E617801k16096n52483m20816m62154r51768j290720p74809K00293N20694
$$ 5617801 5401705 4849222 4428406 3966252 3014484 1723764 948955 1149248 1669942
39837A669942J04519J80440J267517K030958J139079o76686j640211j339300q07054
$$ 1669942 1774461 1954901 3222418 5253376 6392455 5715769 4075558 2736258 1929204
39828A929204o62164n97264n57942r48225j414777p80949J143224K690286K211459
$$ 1929204 1267040 669776 111834 -836391 -2251168 -3032117 -1888893 801393 3012852
39819C012852K99749q50452j99700R96978J107411K24884m87900q12722j396374
$$ 3012852 3312601 2462149 2262449 3259427 4366838 4591722 4103822 3291100 1894726
39810A894726j886448j018842R10949J633880K02533j143053k48413J456749J186556
$$ 1894726 8278 -1010564 -99615 1534265 1736798 593745 345332 1802081 2988637
39801B988637p32315j592441p90732k70040o09384k15455J038750R55753r47614
$$ 2988637 2256322 663881 -126851 -396891 -1006275 -1221730 -182980 772773 -174841
39792a74841j884220j01383K144394J989255j18158j922446k463761j691186N78404
$$ -174841 -2059061 -2160444 -16050 1973205 1855047 -67399 -2531160 -4222346 -3643942
39783c643942L098192L080272J93217j777803j53535K207971J178837k115717
$$ -3643942 -545750 2534522 2727739 949936 796401 3004372 4183209 2067492
39775B067492l177943j086974Q64709Q52283M46437P27214N29690o68507j496301
$$ 2067492 -1110451 -2197425 -1332716 -480433 -33996 693218 1222908 554401 -941900
39766i41900j211968o91592l32117L85103R63543L38822n76719J14541J563120
$$ -941900 -2153868 -2845460 -3177577 -2792474 -1828931 -1490109 -2066828 -1952287 -389167
39757c89167R39694j538240k220969J60192K207585J227964p91561r52794J48198
$$ -389167 550527 -987713 -3208682 -3048490 -840905 387059 -404502 -1357296 -1209098
39748a209098N80759O93395J414848J441942m39689k207774j359550O98482P30844
$$ -1209098 -628339 65056 1479904 2921846 2482157 274383 -1085167 -386685 344159
39739C44159r04104q45697J549379K973330J246681j719583l134243k739881j693662
$$ 344159 -559945 -1405642 143737 3117067 4363748 2644165 -490078 -3229959 -4923621
39730d923621l42010J265937K247124J843082O11362l55799o21267k46729M87840
$$ -4923621 -5265631 -3999694 -1752570 90512 701874 346075 -275192 -521921 -34081
39721c4081O78195n57132k252693j888465J257455M315029L992456O88747k273676
$$ -34081 644114 86982 -2165711 -4054176 -2796721 1518308 5510764 6199511 3925835
39712C925835k907724k090081j106081k2485R30976O32683r02706j555606m78
$$ 3925835 1018111 -1071970 -2178051 -2200536 -1269560 -636877 -1539583 -3095189 -3095667
39703c095667J757205R60861j633384k657595j056170P35927J011940J161906
$$ -3095667 -1338462 -377601 -2010985 -4668580 -5724750 -4988823 -3976883 -2814977
39695b814977K377461K844380P81889j745125j280019J656619K931391O32819
$$ -2814977 -437516 2406864 3188753 1443628 163609 1820228 4751619 5384438
39687E384438k399831k737647o83350R17624N64355p29632j384794j098307p18333
$$ 5384438 2984607 246960 -436390 481234 1045589 315957 -1068837 -2167144 -2885477
39678b885477p73623n00761J045591K863153K469569m19026k342289l90681L200701
$$ -2885477 -3659100 -4159861 -3114270 -251117 2218452 1799426 -542863 -933544 2267157
39669B267157L689917N08544k107830j478831J11024l23393k014719k351034q19868
$$ 2267157 5957074 6465618 4357788 2878957 2989981 2666588 651869 -1699165 -2519033
39660b519033J155769K460950K384430K85557k759015l696811j152211K139345
$$ -2519033 -1363264 1097686 3482116 3767673 1008658 -2688153 -3840364 -1701019
39652a701019K806281J273078K65044L83112J78919l92958K1857J014966N54631
$$ -1701019 1105262 2378340 2643384 3026496 3205415 2812457 2834314 3849280 4403911
39643D403911j402415k447735j542331n38789r11403j524469j010135j38034j08030
$$ 4403911 3001496 553761 -988570 -1527359 -2438762 -3963231 -4973366 -5111400 -5219430
39634e219430k11685Q85298K612270L078011J701326j80759j130567r64540l84230
$$ -5219430 -5431115 -4545817 -1933547 1144464 2845790 2665031 1534464 569924 185694
39625A85694n6213r9564q0316M33550J215806J602144J388553R62695M75395l79141
$$ 185694 129481 29917 -50399 383151 1598957 3201101 4589654 5552349 6027744 5648603
39615E648603j498863k054077j519556m76919J08173L3821j15987J84690Q52448
$$ 5648603 4149740 2095663 576107 99188 207361 241182 125195 309885 1162333
39606A162333J319778J083106K64252m76760q04187j115441j585608j313359N41907
$$ 1162333 2482111 3565217 3829469 3352709 2548522 1433081 -152527 -1465886 -923979
39597i23979K918973L427926J219497j660666k475102q50311R63878O98260j455179
$$ -923979 1994994 5422920 6642417 4981751 2506649 1656338 2620216 3318476 1863297
39588A863297l045502k097054M92953J918168R98624l76973k00334O03326o6411
$$ 1863297 -1182205 -3279259 -2786306 -868138 130486 -246487 -446821 156505 90094
39579I0094j555341r97042J975526L858176J969150j681424l140907j614177L53698
$$ 90094 -1465247 -2462289 -486763 3371413 5340563 3659139 518232 -1095945 -742247
39570g42247Q64340M76884J99142q6448n55384m86173N26732J373207O61131j136618
$$ -742247 122093 598977 798119 711671 156287 -329886 196846 1570053 2231184 1094566
39560A094566j878878m38302J592162J710306k57352j889402j453341r5860L13854
$$ 1094566 -784312 -1222614 369548 2079854 1822502 -66900 -1520241 -1616101 -1302247
39551a302247K04040J163720K547767J954089o17398j930054j33401K245795J918642
$$ -1302247 -1098207 65513 2613280 4567369 3949971 2019917 1886516 4132311 6050953
39542F050953m78804j721860p30175O07121O67875k95796j528582k497992k295176
$$ 6050953 5572149 3850289 3120114 3727235 4395110 4099314 2570732 72740 -2222436
39533b222436m35457J615292J711103L5802j080386n72589J79195j846l97456
$$ -2222436 -2657893 -1042601 668502 704304 -376082 -948671 -769476 -771322 -1168778
39524a168778j31542L49728M91472N85005N88355k27532j444779j228322P81155
$$ -1168778 -1300320 -950592 -459120 125885 714240 486708 -958071 -2186393 -1405238
39515a405238K195779J195539o07382o41478P46327J210340J52646r21437j190856
$$ -1405238 790541 1986080 1378698 737220 1483547 2693887 2846533 1925096 734240
39506G34240j226518j171067n38703K03056R6409j80961J020836L207019L705956
$$ 734240 -492278 -1663345 -2202048 -1998992 -1902583 -2083544 -1062708 2144311 5850267
39497E850267J515156j087556j809279j066591k08925P39380J764429J349361
$$ 5850267 7365423 6277867 4468588 3401997 3193072 3932452 5696881 7046242
39489G046242j257482l676829l058154l42968R27161k34802j234806l12491J040034
$$ 7046242 5788760 2111931 -946223 -1289191 -362030 -596832 -1831638 -2144129 -1104095
39480a104095J136528P52526R36423O00798j241583k677405j328696J439136J975652
$$ -1104095 32433 784959 1721382 2322180 1080597 -1596808 -2925504 -1486368 489284
39471D89284k16209j749775n51012J392482J679411R16998N89179R0236j563803
$$ 489284 273075 -1476700 -2027712 -635230 1044181 1961179 2550358 2640594 1076791
39462A076791k995424k300800l43945O17010N97624J199963K022869J138586r93363
$$ 1076791 -1918633 -4219433 -4563378 -3946368 -3348744 -2148781 -125912 1012674 19311
39453A9311j586599L019J211864N88253o9704P35191J566866P88338p01116j371816
$$ 19311 -1567288 -1564269 -352405 235848 166144 901335 2468201 3256539 2555423 1183607
39443A183607j367563j109569k1849J453398J155472j259067k687227j026264
$$ 1183607 -183956 -1293525 -1315374 138024 1293496 34429 -2652798 -3679062
39435c679062J351515J423262J26603k14295l60198j916766k968476p92686K684118
$$ -3679062 -2327547 -904285 -777682 -991977 -1352175 -3268941 -6237417 -7030103 -4345985
39426d345985L265315J272441O47840J893301J604550q46107k058925r37405m64575
$$ -4345985 -1080670 191771 839611 2732912 4337462 3491355 1432430 495025 30450
39417C0450j647012j455811J032653K147222J44295j277347M66254K036822K58915
$$ 30450 -1616562 -3072373 -2039720 107502 251797 -1025550 -559296 1477526 1736441
39408A736441j857479m03560K222533J342728j802068k200082M25233J558707
$$ 1736441 -121038 -524598 1697935 3040663 1238595 -961487 -536254 1022453
39400A022453l43293j927736j033903M91266Q80201Q89985J105738O22235m54536
$$ 1022453 679160 -1248576 -2282479 -1791213 -911012 -21027 1084711 1706946 1252410
39391A252410m69103P79316J366205M20150o94826j041832j297933j592983p99096
$$ 1252410 783307 1562623 2928828 3348978 2654152 1612320 314387 -1278596 -2077692
39382b077692J109407K289211J549165k18280j650216k127772j189693J131473
$$ -2077692 -968285 1320926 2870091 2651811 1001595 -1126177 -2315870 -1184397
39374a184397L085941K523982p8762j918746j569614l98460K1511k18327n59083
$$ -1184397 1901544 4425526 4346764 2428018 858404 459944 481455 263128 -295955
39365b95955r87647j208329n82867N10923Q10159P3616n42567k11569P54084J706615
$$ -295955 -1283602 -2491931 -3074798 -2563875 -1753716 -1680100 -2222667 -2434236 -1680152 26463
39355B6463J986499R19358j051280j990706r01785N18684M78639j543P15311J457862
$$ 26463 2012962 2932320 1881040 -109666 -1011451 -492767 -14128 -15671 699640 2157502
39345B157502L64169j048997l5322K129314J671415j225062k412322n89207Q94047
$$ 2157502 2521671 1472674 1437352 3566666 5238081 4013019 1600697 1011490 1905537
39336A905537L7863r59892m28981q055o56394m42614J265403J718845m04213k207491
$$ 1905537 1943400 983508 554527 546472 -109922 -552536 712867 2431712 2027499 -179992
39326a79992j470081k69728n46050k24123K315406L814158J002570l115338l082175
$$ -179992 -1650073 -1919801 -2465851 -2689974 -374568 3439590 4442160 1326822 -1755353
39317a755353Q07936L241612J799948o63922j296133n80250J4366K50971K68885
$$ -1755353 -947417 2294195 4094143 3430221 2134088 1553838 1568204 1819175 2088060
39308B088060l4323l39559l70819p88963k016545k890131k206761o96166K75256
$$ 2088060 2053737 1714178 1343359 554396 -1462149 -4352280 -6559041 -7255207 -6979951
39299f979951P86441J337511J226362P1438n88929L96680J422348O63537n67921
$$ -6979951 -6193510 -4855999 -3629637 -3558199 -4147128 -3750448 -2328100 -1664563 -2232484
39290b232484K4370J586240J462402k38018q75010L06001J243972N61245q49837
$$ -2232484 -2208114 -621874 840528 602510 -272500 33501 1277473 1838718 988881
39281I88881j846123k161040j511189J57804J659827J869769J594491K047637
$$ 988881 -857242 -3018282 -4529471 -4371667 -2711840 -842071 752420 2800057
39273B800057K279864O93477j637093k124698p70285o6597q74532j439746p81761
$$ 2800057 5079921 5773398 4136305 2011607 1241322 1174725 300193 -1139553 -1921314
39264a921314r8940j60675J1786R44589J447198N65586r19745j755862j623148
$$ -1921314 -2020254 -2180929 -2169143 -1224554 222644 788230 -131515 -1887377 -3510525
39255c510525q18197K26011Q38319N98880l4745m04546m93901k92934O74997K122340
$$ -3510525 -4328722 -4102711 -3264392 -2665512 -2700257 -3104803 -3598704 -3891638 -3216641 -1094301
39245a094301K602409J627945N94893K14130p63902k386092j935078J478506L689486
$$ -1094301 1508108 3136053 3730946 3945076 3181174 795082 -1139996 338510 4027996
39236D027996J039339l211229l103199R65546L074629J025798j274101j103385
$$ 4027996 5067335 1856106 -1247093 -281547 2793082 3818880 2544779 1441394
39228A441394n16031j039109m86209K215388L799332J608059j851959k604722
$$ 1441394 925363 -113746 -599955 1615433 5414765 7022824 5170865 2566143
39220B566143p17562Q29596N88841n98408j486423j087881P90185K279390R13538
$$ 2566143 1848581 2678177 3267018 2668610 1182187 94306 884491 3163881 4077419
39211D077419k402265l605061j155687J555528J449411J48051M25426J332712
$$ 4077419 1675154 -1929907 -3085594 -1530066 -80655 67396 492822 1825534
39203A825534M02912j526414j583330K84355J347558M28121r50792j461726j188232
$$ 1825534 2228446 702032 -881298 -596943 750615 1178736 227944 -1233782 -2422014
39194b422014p7403K045831L659774K395109j395181l993622k553537J315806
$$ -2422014 -2499417 -453586 3206188 5601297 4206116 212494 -2341043 -1025237
39186a025237L518369K334361j3866o55298K98909L78605j430839k976114j784732
$$ -1025237 2493132 4827493 4813627 4158329 4457238 4835843 3405004 428890 -1355842
39177a355842J437924L559090K923669J062750K66452O66576N27623j031436k520067
$$ -1355842 82082 3641172 6564841 7627591 7894043 8560619 9088242 8056806 5536739
39168E536739j858099N59883J835302L97143j600714j518906l19252l77443n43358
$$ 5536739 3678640 4238523 6073825 6470968 4870254 3351348 3032096 2654653 2111295
39159B111295K112143O078091O588612L721129K898518N690183P602094P757848
$$ 2111295 4223438 10301529 16890141 20611270 23509788 29199971 36802065 44559913
39151D4559913J1506232J8202217J7081024M401220n690479k38832J2053398J6437254
$$ 44559913 56066145 74268362 91349386 95750606 90060127 89821295 101874693 118311947
39143A18311947K0118841M0672483O7377856O2284435J1172831m9237339p2543905
$$ 118311947 138430788 179103271 246481127 308765562 319938393 270701054 198157149
39136A98157149n5540204l1320597k1963705k0542959j5120500p519790m090683
$$ 198157149 142616945 111296348 89332643 68789684 53669184 46149394 42058711
39129D2058711m153059m404883m875156n538752m256683j325832o8003j073303
$$ 42058711 37905652 33500769 28625613 23086861 18830178 17504346 17436343 16363040
39121A6363040j496725q26381j403063k829624k164958j04597m68098k913688
$$ 16363040 14866315 14039934 12636871 9807247 7642289 7537692 7069594 4155906
39113D155906k811381O28593K729368J259002m64662j50313R906j331386j716898
$$ 4155906 1344525 1973118 4702486 5961488 5496826 5346513 5356419 4025033 2308135
39104B308135J39253J553624O72468m63558j8555O64744L05555m0317K29285k5502
$$ 2308135 2447388 4001012 4673480 4209922 4191367 4856111 5161666 5121349 5350634 5325132
39094E325132p48643k89241R76328O91561r64693j242008k3268j28048j591775
$$ 5325132 4576489 4287248 5263576 5955137 4990444 3748436 3725168 3597120 2005345
39085B005345j148567J367351K067929J93976r4541K422939K994960p67108l969198
$$ 2005345 856778 2224129 4292058 4486034 4391493 6814432 9809392 9042284 5073086
39076E073086k397324M78583j60358k247635j020994K489718L479833J245705
$$ 5073086 2675762 3154345 2993987 746352 -274642 2215076 5694909 6940614
39068F940614p67666r41591l79113N67361J979534K096253k47814k391677j280351
$$ 6940614 6172948 5231357 4852244 5419605 7399139 9495392 9247578 6855901 5575550
39059E575550J422360J923051M40226K00904J561804J957310J063443J198740
$$ 5575550 6997910 8920961 9361187 9562091 11123895 13081205 14144648 15343388
39051A5343388K530984K378384o2592k207535k291166j800215k502472l620435
$$ 15343388 17874372 20252756 20190164 17982629 15691463 13891248 11388776 7768341
39043G768341l264767j100047J238058J618052m68877k642746j789364J443139
$$ 7768341 4503574 3403527 4641585 6259637 5790760 3148014 1358650 2801789
39035B801789K425721j138074n040712l879819J301935M557307L202106L30342
$$ 2801789 5227510 4089436 -951276 -4831095 -3529160 1028147 4230253 4560595
39027D560595o91274k27149q2099n33637r65819j184692j037685l15915M85566
$$ 4560595 3869321 3642172 3560073 3026436 2060617 875925 -161760 -477675 7891
39018G891O85006N97711P47668M98702o59264j291878O1045J822027J164821j356165
$$ 7891 692897 1290608 2038276 2536978 1877714 585836 646881 2468908 3633729 2277564
39008B277564k153815J7883K158104J485583r32870k403596k192639j293106l37532
$$ 2277564 123749 141632 2299736 3785319 2852449 448853 -1743786 -3036892 -3374424
38999c374424N74839J048218Q36337N38985Q36437J383333J166327j45182j535017
$$ -3374424 -2799585 -1751367 -915030 -376045 460392 1843725 3010052 2864870 1329853
38990A329853j496990J49266J506351O53176j530715k237294q67550M158r79895
$$ 1329853 -167137 -17871 1488480 2141656 610941 -1626353 -2493903 -2489745 -3469640
38981c469640j391674P38360K799293J415200j564386j493388J503396K490477
$$ -3469640 -4861314 -4122954 -1323661 91539 -1472847 -2966235 -1462839 1027638
38973A027638l09525k640555j122993J553768J333775q77196j299642N70706J779484
$$ 1027638 718113 -1922442 -3045435 -1491667 -157892 -1035088 -2334730 -1764024 15460
38964A5460Q98657l20501l11983J25047k81243j194061j473265q98982j69245
$$ 15460 914117 593616 281633 406680 125437 -1068624 -2541889 -3440871 -3610116
38955c610116K44064M85063P49337R45535J052973J292746J489765P67586j159679
$$ -3610116 -3366052 -2880989 -2131652 -1186117 -133144 1159602 2649367 3416953 2257274
38946B257274k697244j928156L14359Q97733j150131k761498j166778J850338
$$ 2257274 -439970 -2368126 -2053767 -1156034 -2306165 -5067663 -6234441 -4384103
38938d384103K557463O77587q07617m24367M05615N12895M22275M55901K22077
$$ -4384103 -1826640 -1149053 -1956670 -2381037 -1975422 -1462527 -1040252 -584351 -362274
38929c62274K35862J262886J894363p1077l382228l925217n76739K905050L230884
$$ -362274 -126412 1136474 3030837 2959760 -422468 -4347685 -4924424 -2019374 1211510
38920A211510J516470J89337o25053j333861p24693J488615K642512Q29835j583434
$$ 1211510 2727980 2917317 2292264 958403 233710 1722325 4364837 5194672 3611238
38911C611238j431785K31505J93859j402233j594411J27968J081492l9486j414469
$$ 3611238 2179453 2410958 2604817 1202584 -391827 -263859 817633 778147 -636322
38902f36322j430721o88072J6403R52607J863068J560520Q3148q70664n72014
$$ -636322 -2067043 -2755115 -2738712 -1786105 76963 1637483 1720631 849967 277953
38893B77953l32206j005940j383490k87502J369303J962702J376522O32507K41697
$$ 277953 -54253 -1060193 -2443683 -2731185 -1361882 600820 1977342 2609849 2851546
38884B851546k1608l89002r02696j366275j147304J02285J305217P85447j285002
$$ 2851546 2829938 2440936 1538240 171965 -975339 -873054 432163 1217610 -67392
38875f7392k614240j723759J21857Q62623L20514k43411k25195O6117N56589J333983
$$ -67392 -2681632 -4405391 -4283534 -3420911 -3100397 -3343808 -3569003 -3502886 -2946297 -1612314
38865a612314J748211J007905l00345n76135N39296J320427J28613k131981k741862
$$ -1612314 135897 1143802 843457 267322 806618 2127045 2255658 123677 -2618185
38856b618185n67181K112100K175589j69063j354313O35376K974766J635123k652467
$$ -2618185 -3185366 -1073266 1102323 933260 -421053 214323 3189089 4824212 2171745
38847B171745m942932k788031O75482J675055R10180J204817K319950J670909
$$ 2171745 -2771187 -5559218 -4883736 -3208681 -2298501 -1093684 1226266 2897175
38839B897175o72510j518116L84751K096714P85087k182212l370687j873787K71902
$$ 2897175 2224665 706549 1091300 3188014 3973101 1790889 -1579798 -3453585 -3181683
38830c181683J319777J439687J365698J171242P69091N10402O80816Q41079J33060
$$ -3181683 -1861906 -422219 943479 2114721 2883812 3394214 4075030 4916109 5049169
38821E049169j642930l288019k965334l17381K449112K677760N50774j054524
$$ 5049169 3406239 118220 -2847114 -3164495 -715383 1962377 2513151 1458627
38813A458627m35559P77620L87561r87439j115346K24119J028150L07312n97157
$$ 1458627 1023068 1800688 2188249 1200810 85464 309583 1337733 1645045 1047888
38804A047888l76986L53138L63346l26400q46455q29540m87739J7550N42694P65500
$$ 1047888 670902 1024040 1387386 1060986 214531 -615009 -1102748 -1085198 -542504 222996
38794B22996N78406K94089J35836Q066l4710K29219N40459L59559k1570L05844
$$ 222996 801402 1095491 1231327 1239393 1204683 1433902 1974361 2333920 2312350 2618194
38784B618194J035592M35747j904496l421531j518818K481693M473329K766487
$$ 2618194 3653786 4089533 2185037 -1236494 -2755312 -273619 4199710 6966197
38776F966197L7990p33693k64189j093911l034984l129190l09956K389656J720928
$$ 6966197 7004187 6270494 6006305 4912394 1877410 -1251780 -1561736 827920 2548848
38767B548848j337569l036272j893816N3327R00789J166514J630408J412195m7475
$$ 2548848 1211279 -1824993 -3718809 -3665482 -2764693 -1598179 32229 1444424 1396949
38758A396949j093547k39835J044085N65615p04679j24533J789176J634781j375976
$$ 1396949 303402 63567 1107652 1673267 968588 844055 2633231 4268012 2892036
38749B892036l823568l226802j397341p60519m86260J041038K506281J725843
$$ 2892036 -931532 -4158334 -5555675 -6316194 -6802454 -5761416 -3255135 -1529292
38741a529292k86413p33422M59639Q50031k75569j046462m58435K45275J27559
$$ -1529292 -1815705 -2549127 -2089488 -1239457 -1515026 -2561488 -3019923 -2774648 -2647089
38732b647089j227O31729J551831K154983K301342J571846k45767j875338j799067
$$ -2647089 -2648316 -2016587 -464756 1690227 3991569 5563415 5317648 3442310 1643243
38723A643243p93991q75964j660463o71680K139428L393957J223509j718082k136234
$$ 1643243 849252 -26712 -1687175 -2358855 -219427 3174530 4398039 2679957 543723
38714E43723m64493Q54738J155723J053564J58856j753946k757971j090391J463168
$$ 543723 79230 933968 2089691 3143255 3302111 1548165 -1209806 -2300197 -837029
38705h37029J616334n33532j819234j005827j71898o92369j126176k40173P63574
$$ -837029 779305 245773 -1573461 -2579288 -2751186 -3443555 -4569731 -4809904 -4046330
38696d046330O76361N18510J394840K071171R26852j056074j591790n53658J43551
$$ -4046330 -3369969 -2851459 -1456619 614552 1541404 485330 -1106460 -1660118 -1516567
38687a516567k54010n08947Q0592M26127l13643j079100m78388R75732J490657
$$ -1516567 -1770577 -2279524 -2198932 -1772805 -2086448 -3165548 -3643936 -2668204 -1177547
38678a177547N16314m96001o6038J347396J926560Q23316p42493j037290j2610
$$ -1177547 -661233 -1157234 -1223272 124124 2050684 2874000 2131507 1094217 1081607
38669A081607P88747M42972k33696k15471Q2987k87860r12245m41167J124753
$$ 1081607 1870354 2313326 2079630 1864159 1947146 1659286 747041 305874 1430627
38660A430627K008684R91624r47463k009559j713164q87562k87657j32385m55943
$$ 1430627 3439311 4430935 3483472 1473913 -239251 -1126813 -1414470 -1546855 -2002798
38651b002798q99951n25252J075534K635583K351888L20989j280432r27656K98087
$$ -2002798 -2902749 -3428001 -2352467 283116 2635004 2955993 1675561 747905 1045992
38642A045992L01139j101038j937421p92985J228769J906396P65059m81929m92993
$$ 1045992 1347131 246093 -1691328 -2484313 -1255544 650852 1415911 933982 440989
38633D40989j05205o16464j276317l77165J439288J474613o41473j524032J021760
$$ 440989 335784 -280680 -1556997 -1934162 -494874 979739 338266 -1185766 -164006
38624a64006L939081K895210j140695l101367j208257R69542N35738q23325p79976
$$ -164006 3775075 6670285 5529590 2428223 1219966 2189508 2725246 1901921 1121945
38615A121945l57189j097088j448495L23957K005379M82495k514895k391994R68608
$$ 1121945 764756 -332332 -1780827 -1456870 548509 1031004 -1483891 -3875885 -2907277
38606b907277K674465M60554j819560m97931K103197J537762j743367l184086
$$ -2907277 -232812 227742 -1591818 -2089749 13448 1551210 -192157 -3376243
38598c376243r01996K004018K185542J71421j290644j021641p6264L85927M48826
$$ -3376243 -4278239 -2274221 -88679 82742 -1207902 -2229543 -2305807 -1919880 -1471054
38589a471054O99465J069070R25813J22252n90426m98520R7404M19224M64220
$$ -1471054 -771589 297481 1223294 1345546 755120 256600 354004 773228 1237448
38580A237448Q23188J231987M66855j744360l689187l481130j323815R36466K060855
$$ 1237448 2060636 3292623 3759478 2015118 -1674069 -5155199 -6479014 -5542548 -3481693
38571c481693K220613J861687R95758j68717q96747p48467j49234K48606K55130
$$ -3481693 -1261080 600607 1596365 1427648 530901 -217566 -366800 -118194 136936
38562A36936j35462j040207k080566k065063k54251K239979L329631K345501O44708
$$ 136936 1474 -1038733 -3119299 -5184362 -5438613 -3198634 130997 2476498 3121206
38553C121206l46528n97025n47299m4787P82376P58825p27906k165482j712631
$$ 3121206 2774678 2177653 1630354 1585567 2367943 3126768 2398862 233380 -1479251
38544a479251j1687P68853L63299N01150J463337J307090n51931j701079l73028
$$ -1479251 -1490938 -722085 -358786 142364 1605701 2912791 2360860 659781 286753
38535B86753J564688J441253j72021o71147N59582J729637J435673k04086k371609
$$ 286753 1851441 3292694 3120673 2449526 3009108 4738745 6174418 5970332 3598723
38526C598723l602370k231949R90695K240166m97035l338906j267011L837732
$$ 3598723 -3647 -2235596 -1244901 995265 498230 -2840676 -4107687 -269955
38518b69955M833531l63014n221542l695937J557587L714913J326805j163458
$$ -269955 4563576 4200562 -1020980 -4716917 -3159330 555583 1882388 718930
38510G18930q48726L48598m441j103964r45446L44472J008735L02507q55765j416097
$$ 718930 -129796 218802 214361 -889603 -1835049 -1490577 -481842 -179335 -1035100 -2451197
38500b451197j248285o76087J66897J090655J472052Q76157k8201n0754P96852
$$ -2451197 -3699482 -4375569 -4208672 -3118017 -1645965 -769808 -798009 -848763 -51911
38491e1911J152422L49978n72263p03313o90427j088090q50269O44035J578822
$$ -51911 1100511 1450489 878226 174913 -515514 -1603604 -2453873 -1809838 -231016
38482b31016K44419j673677j418239K18998K76350r65586l75290J980006K160277
$$ -231016 13403 -1660274 -3078513 -2859515 -2583165 -3548751 -3924041 -1944035 216242
38473B16242p96154k384921K28754L167643J833969j762228k335589N86044K854354
$$ 216242 -579912 -2964833 -2736079 431564 2265533 503305 -1832284 -1246240 1608114
38464A608114K494691J428815R45452K4451j513157k114492j479219j175102j558193
$$ 1608114 4102805 5531620 6477072 6501523 4988366 2873874 1394655 219553 -1338640
38455a338640j071202N60064J267893n4296j585887j266845L92221J486911J325317
$$ -1338640 -2409842 -1849778 -581885 -636181 -2222068 -3488913 -3096692 -1609781 -284464
38446b84464O74783K94133J54846j89553p54173o64726P51792K161504J109217
$$ -284464 390319 684452 839298 649745 -104428 -769154 -17362 2144142 3253359
38437C253359k161227l721762r49188L213033L889102R10618j625521j709266
$$ 3253359 1092132 -2629630 -3578818 -365785 3523317 4433935 2808414 1099148
38429A099148j328574j823457j489338P49305K726401K168373M690j356727j165209
$$ 1099148 -229426 -2052883 -3542221 -2792916 -66515 2101858 2106548 749821 -415388
38420d15388j70307Q98132J253496J31233j707536k152923o47031P72851N43389
$$ -415388 -585695 312437 1565933 1697166 -10370 -2163293 -2810324 -2037473 -1494084
38411a494084j68581K37718J082276Q68314J532j7156Q00072J022882K5599j355045
$$ -1494084 -1662665 -1424947 -342671 525643 527175 510019 1310091 2332973 2358572 1003527
38401A003527k052013j637382m00048P20778Q64421L44816J55146K00863n41730
$$ 1003527 -1048486 -2685868 -3085916 -2365138 -1500717 -1155901 -1000755 -799892 -1341622
38392a341622j765218j606439N15113K699816L200564K392824J151104n20849
$$ -1341622 -3106840 -4713279 -4198166 -1498350 1702214 4095038 5246142 4725293
38384D725293j964198j490707O34459J363273o93883k545000j373884P07795J15757
$$ 4725293 2761095 1270388 1904847 3268120 2574237 29237 -1344647 -636852 -521095
38375e21095k117323k110106L33170J742710J030792N89951J139860N42644j227351
$$ -521095 -2638418 -4748524 -4415354 -2672644 -1641852 -1051901 87959 630603 -596748
38366e96748j032049J595769K476191n33365l375189j968606J357958J965929
$$ -596748 -1628797 -33028 2443163 1909798 -1465391 -3433997 -2076039 -110110
38358a10110K05234l79758K87543m37535j835762m66253L058172L739871p2232
$$ -110110 95124 -284634 2909 -434626 -2270388 -2736641 321531 4061402 3989170
38349C989170l790201l468368r73248L25964Q04429K097506K828675R16217k046160
$$ 3989170 198969 -3269399 -4242647 -3916683 -3112254 -1014748 1813927 2730144 683984
38340F83984k663874p02935J185745J581449J030975j58103j650268j679298P00281
$$ 683984 -1979890 -2682825 -1497080 84369 1115344 957241 -693027 -2372325 -1672044
38331a672044K856359J642298j527361k518305q36258J95758m80230k78663J514810
$$ -1672044 1184315 2826613 1299252 -1219053 -2055311 -1859553 -2339783 -2618446 -1103636
38322a103636J884086l87648j972236l77042K024732K283775J423218J412055
$$ -1103636 780450 392802 -1579434 -1956476 68256 2352031 3775249 5187304
38314E187304J140905p65334k217765r77423Q36281k0795k240643k118534K14753
$$ 5187304 6328209 5562875 3345110 2367687 3203968 3183173 942530 -1176004 -961251
38305i61251J429807P24002J73759J72821o49804j441115p2141K003628J075339
$$ -961251 468556 1192558 1366317 1539138 889334 -551781 -623922 1379706 2455045
38296B455045k179426k824279L35721K388436J50690k801503k089704Q95447K151108
$$ 2455045 275619 -2548660 -2212939 175497 326187 -2475316 -4565020 -3669573 -1518465
38287a518465J301453O39653N03247l38754j335914r11256M06215P36561K0688
$$ -1518465 -217012 422641 925888 587134 -748780 -1660036 -1253821 -517260 -496572
38278d96572k56359J39125J65160k08031J9388Q37006J100294L55865o93414j386064
$$ -496572 -752931 -613806 -448646 -656677 -637289 199717 1300011 1655876 962462 -423602
38268d23602j621866j464812j068843n98765J91132J489501K395380J785255M45481
$$ -423602 -2045468 -3510280 -4579123 -5177888 -4986756 -3497255 -1101875 683380 1128861
38259A128861L97898J624560J841858L65984n91660J08774L25723j414541k725615
$$ 1128861 1526759 3151319 4993177 5359161 4767501 4876275 5201998 3787457 1061842
38250A061842j151579J297359J013057j496228k572717j123740M09663M79330
$$ 1061842 -89737 1207622 2220679 724451 -1848266 -2972006 -2562343 -2083013
38242b083013K38012O32485Q48542L69150K0496J88456J11730l56779j90169Q73281
$$ -2083013 -1845001 -1212516 -363974 5176 25672 214128 325858 -30921 -221090 652191
38232F52191J478105N80928r72481j563322p50302L96379N56995l53732r45876
$$ 652191 2130296 2711224 1738743 175421 -574881 -178502 378493 24761 -921115
38223i21115q9184J209954R06615r30210j887940q05883N70501P32929P90549
$$ -921115 -1010299 199655 1106270 176060 -1711880 -2517763 -1947262 -1214333 -423784
38214d23784J833152K341661Q47671q73642l56290J378626J491001n144o92235
$$ -423784 1409368 3751029 4598700 3725058 3368768 4747394 6238395 6233251 5541016
38205E541016j30087k52477j597891k466633j984663j059937j36180J193512K171667
$$ 5541016 5410929 5158452 3560561 1093928 -890735 -1950672 -2086852 -893340 1278327
38196A278327J276069j004945k327643j762544o27571M0874N37804J020535J292778
$$ 1278327 2554396 1549451 -778192 -2540736 -3168307 -3127433 -2589629 -1569094 -276316
38187b76316J878074K963263K786062j12138l494970l550582l24190K264130J934400
$$ -276316 1601758 4565021 7351083 7238945 3743975 193393 -130797 2133333 4067733
38178D067733K29467j014007j809831k077781j063505M55838N93574l47938k44877
$$ 4067733 4297200 3283193 1473362 -604419 -1667924 -1212086 -618512 -966450 -1211327
38169a211327P51458K23284j755152k040031J64050J539891J04959j617939j052233
$$ -1211327 -459869 -236585 -1991737 -4031768 -3867718 -2327827 -2222868 -3840807 -4893040
38160d893040N96332J370524J858836K818149K782167Q29126j155970j569014
$$ -4893040 -4296708 -2926184 -1067348 1750801 4532968 5362094 4206124 2637110
38152B637110j591123k199087j804868M24300K022611R85979q38673j077744n56247
$$ 2637110 1045987 -1153100 -2957968 -2533668 -511057 474922 -363751 -1441495 -1997742
38143a997742o58624k05772J535060J988592n04045k605154o91041K908424L247634
$$ -1997742 -2656366 -2862138 -1327078 661514 157469 -2447685 -3138726 -230302 3017332
38134C017332K87065j914305j861920j348137p87559Q37166K066431L59793k679802
$$ 3017332 3304397 1390092 -471828 -1819965 -2607524 -1770358 296073 655866 -2023936
38125b023936k638083P54815K913340J450428p05238n00736J128008J914225J489863
$$ -2023936 -4662019 -3907204 -993864 456564 -248674 -749410 378598 2292823 3782686
38116C782686M30545r21852j498441j88339J662462J350244q94293j858966l78932
$$ 3782686 4213231 3291379 1792938 1604599 3267061 4617305 3723012 1864046 1485114
38107A485114R48804K07779j026117q52033J9023K56546K00037L93537J48596
$$ 1485114 2433918 2641697 1615580 763547 782570 1039116 1239153 1632690 1781286
38098A781286p57705j024778j331R87789Q54170M56579Q17878J334429R56710
$$ 1781286 1023581 -1197 -2528 985261 1839431 2296010 3113888 4448317 5405027
38089E405027k83687j724879k633255k017176L16725K403344J978430k33912j546593
$$ 5405027 5121340 3396461 763206 -1253970 -937245 1466099 3444529 3210617 1664024
38080A664024j500945j900923k589037j157522K122519L261671M92153k452652
$$ 1664024 163079 -1737844 -4326881 -5484403 -3361884 -100213 391940 -2060712
38072b060712j641338J556688L154801K171934N66326m45592j018265r91677j71728
$$ -2060712 -3702050 -2145362 1009439 3181373 3747699 3302107 2283842 1292165 1120437
38063A120437O16908O12156K33259j12798p86313j421282p85112P05993Q73882
$$ 1120437 1737345 2349501 2582760 2469962 1683649 262367 -522745 183248 1057130
38054A057130m84290p92617O58818R00727j316825k225826J052849M784566L675649
$$ 1057130 572840 -219777 439041 1339768 22943 -2202883 -1150034 3634532 7310181
38045G310181q35162k722648l86362J977370J561001J20777n33806j242456k335502
$$ 7310181 6475019 3752371 3366009 5343379 6904380 7025157 6491351 5248895 2913393
38036B913393k010997K74922K109257J633197P7127p62547j085117j540954j402916
$$ 2913393 902396 1177318 3286575 4919772 4996899 4234352 3149235 1608281 205365
38027B05365j04322J078642O30473r55779j816879r18829J073251K462746J874638
$$ 205365 101043 1179685 1810158 854379 -962500 -1881329 -808078 1654668 3529306
38018C529306k30860j614945r50946J23972o38578k321512j902833R58161L042532
$$ 3529306 3298446 1683501 732555 856527 217949 -2103563 -4006396 -3048235 -5703
38009e703K234634L56775p0349M41581j16211j586596j858831j77320J757452
$$ -5703 2228931 2585706 2515357 2956938 2840727 1254131 -604700 -782020 975432
38000I75432K144442J127029j0113p19898j361094j829747j282457J70674P04306
$$ 975432 3119874 4246903 4236790 3516892 2155798 326051 -956406 -785732 -81426
37991h1426p54226k143044p44240K175614K348899j100352l768168k342897O61671
$$ -81426 -835652 -2978696 -3722936 -1547322 801577 -298775 -4066943 -6409840 -5748169
37982e748169J443060Q36893J694529L060495J935209p73959j344761L73426Q88939
$$ -5748169 -4305109 -3468216 -1773687 1286808 3222017 2448058 1103297 1476723 2365662
37973B365662o12281j080524N68134J448573j11822j870251j736064n72424M49968
$$ 2365662 1753381 672857 1240991 2689564 2577742 707491 -1028573 -1600997 -1151029
37964a151029J434305J584309l90682k652597j664076J552986J876958j486051
$$ -1151029 283276 1867585 1476903 -1175694 -2839770 -1286784 590174 -895877
37956h95877k998599P8275K853339J090094j782010j103052J136742R63799O8994
$$ -895877 -3894476 -3816201 -962862 127232 -1654778 -2757830 -1621088 -657289 -588295
37947e88295J827808L725347J411477k688940k825131J35520M98557j830272j471726
$$ -588295 1239513 4964860 6376337 3687397 862266 997786 1496343 -333929 -1805655
37938a805655K004528K806434n97805k478205K5474J973741l58347k969035j468512
$$ -1805655 198873 3005307 2407502 -70703 -45229 1928512 1570165 -1398870 -2867382
37929b867382J438834J317732l88632K0017J433929N52269j481414j068738J172329
$$ -2867382 -1428548 -110816 -499448 -479431 954498 1506767 25353 -1043385 128944
37920A28944J332123j252280l297622k843742j034657Q59665K450902K783824
$$ 128944 1461067 208787 -3088835 -5932577 -6967234 -6107569 -3656667 -872843
37912h72843J338982q5892L19587J102472o3265j838958j048165J694745K548142
$$ -872843 466139 380247 699834 1802306 1739041 -99917 -1148082 546663 3094805
37903C094805N67521j125574q01758l87158j127687j196695M70342J644597N42360
$$ 3094805 3662326 2536752 1734994 1347836 220149 -976546 -506204 1138393 1680753
37894A680753r24947l45748J134673Q34841j081463k110380j271970J38345J071627
$$ 1680753 755806 410058 1544731 2379572 1298109 -812271 -2084241 -1945896 -874269
37885h74269J605304J523142K68162j378049j448398N87453K575620K028877p51022
$$ -874269 731035 2254177 2522339 1144290 -304108 283345 2858965 4887842 4136820
37876D136820k717027j422483K007888L813719J830451j798582l103488j183020
$$ 4136820 1419793 -2690 2005198 5818917 7649368 5850786 2747298 1564278
37868A564278Q89217M02917j473047j768188K0267J650083J607021P70174L03890
$$ 1564278 2453495 2856412 1383365 -384823 -364556 1285527 2892548 3662722 3966612
37859C966612j97799j374443k268377j437132O20477J738556Q87720o58991j381771
$$ 3966612 3768813 2394370 125993 -1311139 -690662 1047894 1935614 1276623 -105148
37850a05148j397621j397939r27770P02843K406725K132939j15290j789339j002075
$$ -105148 -1502769 -2900708 -3828478 -3125635 -718910 1414029 1298739 -490600 -1492675
37841a492675J145776K273678J527999k79154k117328l023720j953117J015400
$$ -1492675 -346899 1926779 3454778 3175624 1058296 -1965424 -3918541 -2903141
37833b903141L786866M056594J835399r24784k724458l237975k308897j05785
$$ -2903141 883725 4940319 6775718 5850934 3126476 -111499 -2420396 -2526181
37825b526181J873503J905012M26688m00295J84955O98944J60102l99340j33613
$$ -2526181 -652678 1252334 1679022 1278727 1463682 2162626 2322728 1923388 1789775
37816A789775l7269q94971j413280l94344P15268q0171j663620j161533J245475
$$ 1789775 1752506 857535 -555745 -950089 -234821 -314992 -1978612 -3140145 -1894670
37807a894670K073532n6982j863824k63412K688089K727429j33505j668224N8394
$$ -1894670 178862 121880 -1741944 -2005356 682733 3410162 3276657 1608433 1666827
37798A666827J925426Q53810j524043j797256q6345P80878J06340j93029M27334
$$ 1666827 3592253 4446063 2922020 1124764 1038419 1819297 1925637 1732608 2159942
37789B159942K92329q62445r64074M65945Q72745r13763k087101m09568J593163
$$ 2159942 2452271 1589826 625752 1091697 1964442 1050679 -1036422 -1445990 147173
37780A47173N76731j760009j119833K287589L757031J204323k117256k866964
$$ 147173 723904 -1036105 -2155938 131651 3888682 5093005 2975749 108785
37772A08785j681331o26025q560N54423P38824Q10215J701244K414163L62283
$$ 108785 -1572546 -2198571 -2207131 -1652708 -913884 -103669 1597575 4011738 4374021
37763D374021l935452n803477k664641J639906K060138n86771j542910O21753
$$ 4374021 438569 -5364908 -8029549 -6389643 -4329505 -4916276 -6459186 -5837433
37755e837433K808934K713204J366673K82213n03281j007476p44111j43793k07298
$$ -5837433 -3028499 -315295 1051378 1333591 830310 -177166 -921277 -1065070 -1272368
37746a272368n19211O8972Q25630l3156j749335j407641J323921L013148J439598
$$ -1272368 -1791579 -1722607 -896977 -930133 -2679468 -4087109 -2763188 249960 1689558
37737A689558j123162j507642r7156N91097j11659q81341r88712p59348k43996
$$ 1689558 566396 -941246 -1038402 -447305 -558964 -1440305 -2429017 -3188365 -3432361
37728c432361O03052J026564M72187j08383M12442J308459J017505k81985r12406
$$ -3432361 -2829309 -1802745 -1330558 -1438941 -1026499 281960 1299465 1017480 105074
37719A05074l10263L54739K33492j34179r2266J31370R1168k03215n20978n36900
$$ 105074 -205189 149550 383042 248863 156597 287967 379135 175920 -345058 -881958
37709h81958J74297J378958J781452O13773p80059n99909M60261R7493j620651
$$ -881958 -707661 671297 2452749 3066522 2286463 1686554 2146815 2244308 623657
37700F23657j843835M73031K343769J150436j139175j083292O61116O06722j451490
$$ 623657 -1220178 -747147 1596622 2747058 1607883 524591 1185707 1792429 340939
37691C40939j846033P60413K729387J043227j930458k289108n97463k81091j557934
$$ 340939 -1505094 -744681 1984706 3027933 1097475 -1191633 -1789096 -2070187 -3628121
37682c628121j229901J568464L461244J845111j356266k682526j546747J78351
$$ -3628121 -4858022 -3289558 171686 2016797 660531 -2021995 -3568742 -3390391
37674c390391J170212J314651O31928n74042j251586p90462m3522J9517j63297
$$ -3390391 -2220179 -905528 -273600 -847642 -2099228 -2889690 -2933212 -2913695 -3076992
37665c076992J83970N18527q3182j047443r94991J06917J012328J148285J064130
$$ -3076992 -2893022 -2374495 -2457677 -3505120 -4500111 -4393194 -3380866 -2232581 -1168451
37656a168451J100916R91869P74339Q76859J212223J139170L22920j074554k713510
$$ -1168451 -67535 924334 1698673 2575532 3787755 4926925 5249845 4175291 1461781
37647A461781l815197l224453q35082J612927K352633J657223R05414L87155l77814
$$ 1461781 -2353416 -5577869 -6412951 -4800024 -2447391 -790168 115246 502401 124587
37638A24587q86140k31984R02474R14575j09853m88318K38273O31938j29784j026302
$$ 124587 -761553 -993537 -91063 823512 713659 225341 463614 1095552 965768 -60534
37628f0534j052481n73241k36795q8839k04766o41890n09222J085653K873932
$$ -60534 -1113015 -1686256 -1923051 -2011890 -2216656 -2858546 -3367768 -2282115 591817
37619E91817K364691m53057k605235k210860p20690J25455J062379L065033M489078
$$ 591817 2956508 2503451 -101784 -2312644 -3033334 -2907879 -1845500 1219533 5708611
37610E708611L056134m62960k999641l092375k001105j222599p66449n3963Q35663
$$ 5708611 8764745 8301785 5302144 2209769 208664 -1013935 -1780384 -1834347 -998684
37601i98684J225466O04650o71679j341347m87237J042181J420816K66889r30996
$$ -998684 226782 831432 159753 -1181594 -1668831 -626650 794166 1061055 130059
37592A30059j062302n25933K84831J671043K949344K229939o54899k902988k236155
$$ 130059 -932243 -1458176 -1173345 497698 3447042 5676981 5022082 2119094 -117061
37583a17061n6947Q10952J06945l05620K15084M78186k69358j337640j690865
$$ -117061 -174008 636944 743889 438269 653353 1131539 862181 -475459 -2166324
37574b166324q89681N75602J212325m0303j674573q75122K054547L171178O51953
$$ -2166324 -3056005 -2480403 -1268078 -1308381 -2982954 -3858076 -1803529 1367649 2019602
37565B019602j899345q13648J847182J867348o2819R8462K318588K227896j391022
$$ 2019602 120257 -693391 1153791 3021139 2958320 3056782 5375370 7603266 6212244
37556F212244m176601k797477M92291J986031J448046N72126k58452j078884p80070
$$ 6212244 2035643 -761834 -269543 1716488 3164534 3736660 3478208 2399324 1619254
37547A619254R56119K128368J176864m27168n52687K17783j13784j553072k351812
$$ 1619254 2575373 4703741 5880605 5453437 4900750 5118533 5004749 3451677 1099865
37538A099865j874098j077744n38863J16270Q69936R45840O7908q57498o99060
$$ 1099865 -774233 -1851977 -2390840 -2274570 -1404634 -458794 -390886 -1248384 -1947444
37529a947444N29632J433057O58802j225963j997812o42966J040727J044666J94241
$$ -1947444 -1417812 15245 674047 -551916 -2549728 -3192694 -2151967 -1107301 -913060
37520i13060M78071J355056O76080j162234j477980J478M39893j096290j734766
$$ -913060 -434989 920067 1596147 433913 -1044067 -1042589 -602696 -1698986 -3433752
37511c433752K64522K242128J366540q83649j379471l5778J122829J479969J415889
$$ -3433752 -3169230 -927102 439438 -444211 -1823682 -1859460 -736631 743338 2159227
37502B159227L08692j905231k870009q12016K006600K183790K47829p15711l46007
$$ 2159227 2467919 562688 -2307321 -3119337 -1112737 1071053 1318882 603171 257164
37493B57164q45756k111546j474202J249011K653196R76365j185482j118506J43845
$$ 257164 -588592 -2700138 -4174340 -2925329 -272133 704232 -481250 -1599756 -1455911
37484a455911L02059l46674K6656J428141K089758J184554k30708p16961J21957
$$ -1455911 -1153852 -1500526 -1473870 -45729 2044029 3228583 2997875 2280914 2402871
37475B402871J419411J723210L95478j416358j965360j164751n77193r64710j223114
$$ 2402871 3822282 5545492 5940970 4524612 2559252 1394501 817308 -147402 -1370516
37466a370516k98275J162337J884102J604124P88564l13860j381109j574095m67027
$$ -1370516 -1668791 -506454 1377648 2981772 3770336 3456476 2075367 501272 34245
37457C4245R85903J348395M26845n72665n51356L29281J058875J026087O44735
$$ 34245 1020148 2368543 2795388 2222723 1671367 2000648 3059523 4085610 4730345
37448D730345O61784R78360O33162p79695k197267k215576q74189L42280K30286
$$ 4730345 5392129 6370489 7003651 6223956 4026689 1811113 936924 1279204 1509490
37439A509490r23545j856404j676848o74343Q9985Q5497O759O65974J489310J166091
$$ 1509490 585945 -1270459 -2947307 -3621650 -3531665 -3446168 -3439409 -2773435 -1284125 -118034
37429a18034k36886j160781q11725m9968L70573P11648Q20384r9586j328018p05167
$$ -118034 -354920 -1515701 -2327426 -2377394 -2006821 -1295173 -474789 -574375 -1902393 -2607560
37419b607560J584715K029486j024442l864478k389908J613777L184507J561167
$$ -2607560 -1022845 1006641 -17801 -3882279 -6272187 -4658410 -1473903 87264
37411H7264K73337P13399O67364n60845o77060P64143Q75205j240355k132308
$$ 87264 360601 1074000 1741364 1180519 503459 1267602 2142807 902452 -1229856
37402a229856L48903K982637K057776q76637j805546l84818N16598j79551q75429
$$ -1229856 -880953 2101684 4159460 3282823 1477277 1092459 1609057 1429506 554077
37393E54077n85412L3824M80428P02689J84861j003305j110760R40823L034725
$$ 554077 -31335 2489 482917 1185606 1370467 367162 -743598 197225 3231950
37384C231950K347853m16701k135296j961240j700739j756896l93049K245371
$$ 3231950 5579803 5163102 3027806 1066566 -634173 -2391069 -2784118 -538747
37376e38747K995120L49370k594303k228220N14842J814791M94436q57548j47663
$$ -538747 2456373 2805743 211440 -2016780 -1501938 312853 807289 -50259 -197922
37367a97922J338688J231238l86394j238252j52790J335516J103289p80552k308142
$$ -197922 1140766 2372004 1985610 747358 594568 1930084 3033373 2252821 -55321
37358e5321k174820j040648o9111N65450J096288J173449N09310j74708j1948
$$ -55321 -2230141 -3270789 -3339900 -2774450 -1678162 -504713 4597 -170111 -182059
37349a82059O06394O62457K64955M26606J064257P14079j152258k804979k375447
$$ -182059 424335 1086792 1351747 1778353 2842610 3556689 2404431 -400548 -2775995
37340b775995n29582L97753k27072m43952J146637K807613J932824p95271j850081
$$ -2775995 -3305577 -2907824 -3134896 -3578848 -2432211 375402 2308226 1512955 -337126
37331c37126P6376J886261N97556j981141j829599J102174K639536N27666k402001
$$ -337126 -260750 1625511 2223067 241926 -1587673 -485499 2154037 2681703 279702
37322B79702k521604k71135J207004N41071q35592j146462k9193J596565K184910
$$ 279702 -2241902 -2513037 -1306033 -764962 -1600554 -2747016 -2776209 -1179644 1005266
37313A005266P30857j740931k704429j099153J234661K059383J442491P36015
$$ 1005266 1736123 -4808 -2709237 -3808390 -2573729 -514346 928145 1664160
37305A664160K05904o35057j356422j128321l11014R6402Q6661L05296P14187
$$ 1664160 1870064 1235007 -121415 -1249736 -1560750 -1464348 -1377687 -1072391 -358204
37296c58204R85227J440532K096745J712148l94372k451660k279849n61329K28513
$$ -358204 627023 2067555 4164300 5876448 5482076 3030416 750567 189238 417751
37287D17751l21176l50206P00117J078056j30288j358836j111562q1858M71340
$$ 417751 96575 -253631 446486 1524542 1394254 35418 -1076144 -1158002 -686662
37278f86662O87550J085586J050352q4045j370529j221292L12583J464817R79331
$$ -686662 888 1086474 2136826 2052781 682252 -539040 -226457 1238360 2217691
37269B217691l99376q99234J62080J534994J461327k14989j884279k206530j526387
$$ 2217691 1818315 919081 1081161 2616155 4077482 3862493 1978214 -228316 -1754703
37260a754703q78669n23747j78953K03182P45578J804329K891756K555589M97843
$$ -1754703 -2633372 -3157119 -3336072 -3132890 -2387312 -582983 2308773 4864362 5362205
37251E362205j395852j553393r35682j066284j301441l09973J020834Q75395k23702
$$ 5362205 3966353 2412960 1477278 410994 -890447 -1200420 -179586 695809 472107
37242D72107l57847K70939q8793j117631q27733N20111N88399o40933n38125J280962
$$ 472107 114260 385199 296406 -821225 -1648958 -1128847 -540448 -1181381 -1719506 -438544
37232d38544J765461l52429k038253q15838J325552J444894O6177o54240n53304
$$ -438544 1326917 974488 -1063765 -1879603 -554051 890843 957020 302780 -250524
37223b50524m44667J84075J596537K034128L93900j266939p93571M24255m0316
$$ -250524 -695191 -511116 1085421 3119549 3513449 2246510 1452939 1877194 1836878
37214A836878j327098r02492R16355J573720M45689q95340j711255k216089j636031
$$ 1836878 509780 -392712 523643 2097363 2543052 1647712 -63543 -2279632 -3915663
37205c915663N07879K121580J091729p81467k68647J697135J355162j331066k419985
$$ -3915663 -3407784 -1286204 -194475 -975942 -1244589 452546 1807708 476642 -1943343
37196a943343p13361M50080n53800p41313J790981L987442K790201M1392j059336
$$ -1943343 -2656704 -2206624 -2760424 -3501737 -1710756 2276686 5066887 5108279 4048943
37187D048943j025760j824601k422021p92115J690947K089049P18453J12594L12790
$$ 4048943 3023183 1198582 -1223439 -2015554 -324607 1764442 2482895 2595489 2908279
37178B908279o38789k200678j714571O42941J550111m6509j157461K59375K105041
$$ 2908279 2269490 68812 -1645759 -1002818 547293 500784 -656677 -397302 1707739
37169A707739J831913K94665l83114l77835j064694k056467j873058n46313O27205
$$ 1707739 3539652 3834317 3451203 3073368 2008674 -47793 -1920851 -2467164 -1839959
37160a839959J222618J683904J804269J021988j91995q98088j278429k077066
$$ -1839959 -617341 1066563 2870832 3892820 3700825 2802737 1524308 -552758
37152e52758k805555k236185n85629N19629M23718J73286N41652R02486O79128
$$ -552758 -3358313 -5594498 -6180127 -5660498 -5236780 -5063494 -4521842 -3619356 -2940228
37143b940228M78574Q88546J277402Q23085o9085m25633k57683m16256j080601
$$ -2940228 -2461654 -1573108 -295706 527379 458294 32661 -225022 -641278 -1721879
37134a721879j305954k91311J399420K265918J577560M09579M14206J416436J230406
$$ -1721879 -3027833 -3319144 -1919724 346194 1923754 2333333 2747539 4163975 5394381
37125E394381j233231l693646l076209J27317K276944J473174l92186j105656
$$ 5394381 4161150 467504 -2608705 -2481388 -204444 1268730 876544 -229112
37117b29112r75700q37645M6100J822576K207013j43954k290268p21558K756897
$$ -229112 -1204812 -2042457 -1996357 -173781 2033232 1889278 -400990 -1122548 1634349
37108A634349L049925n61509l254595k006165L07446J28505j392034j218373L53166
$$ 1634349 4684274 4122765 868170 -1137995 -830549 -702044 -2094078 -3312451 -2959285
37099b959285Q83751K95006M83561J358766Q27383j258457k244966n45279J919539
$$ -2959285 -2075534 -1780528 -1296967 61799 889182 -369275 -2614241 -3159520 -1239981
37090a239981K257755K08267j784038j470980P66814K286171J141109j347492
$$ -1239981 1017774 1226041 -557997 -2028977 -1262163 1024008 2165117 817625
37082H17625j936465K88860K522931K114147J50925o04230O7619J19139j054472
$$ 817625 -1118840 -829980 1692951 3807098 3958023 3353793 3421412 3540551 2486079
37073B486079j836055j256883k61320K06956L28861K23750m67448j310902j112330
$$ 2486079 650024 -606859 -868179 -661223 -332362 -108612 -576060 -1886962 -2999292
37064b999292K08248J265710J183574M80613l22509j355681k188282j630670M70490
$$ -2999292 -2791044 -1525334 -341760 138853 -183656 -1539337 -3727619 -5358289 -4887799
37055d887799K530717L009772J900212J82000j046523q72920N31669J339779Q6930
$$ -4887799 -2357082 652690 2552902 2734902 1688379 815459 1347128 2686907 2773837
37046B773837j854176j921792l69919J33375q12044m81913J937631L091842O06704
$$ 2773837 919661 -1002131 -1372050 -1238675 -2050719 -2532632 -595001 2496841 3103545
37037C103545k673735k797612n99356K12674q45462r32495Q34055K057948J320023
$$ 3103545 429810 -2367802 -2967158 -2754484 -3599946 -4532441 -3698386 -1640438 -320415
37028c20415K10581K12830M69721j57714j116059j448797j232528p14721L39335
$$ -320415 -109834 102996 572717 415003 -701056 -2149853 -3382381 -4097102 -3757767
37019c757767J521524J562907K04754j047157q95075K25584J246021J770462J638536
$$ -3757767 -2236243 -673336 -468582 -1515739 -2410814 -2185230 -939209 831253 2469789
37010B469789O36336n45388n16512O93803J148374k60463j989852k105306j043240
$$ 2469789 3106125 2560737 2044225 2738028 3886402 3625939 1636087 -469219 -1512459
37001a512459m56341l71141M78539J974428K367192R35155p84755j046882n8765
$$ -1512459 -1968800 -2339941 -1861402 113026 2480218 3415373 2630618 1583736 1524971
36992A524971N92548P409j158158j643332j007494l3494K80959o6742l02987j55134
$$ 1524971 2117519 2124928 966770 -676562 -1684056 -1717550 -1436591 -1503333 -1806320 -1961454
36982a961454l6663J60533J168855K553031K267743n19971l287642k905325j2739
$$ -1961454 -1998117 -1837584 -668729 1884302 4152045 3632074 344432 -2560893 -2573632
36973b573632J710941P50085l79654N75318K019425J289588q26973j214941O15306
$$ -2573632 -862691 -112606 -492260 83058 2102483 3392071 2565098 1350157 1965463
36964A965463J705491K33920j749543j533168L20980J177066K56739p60890o48646
$$ 1965463 3670954 3904874 2155331 622163 943143 2120209 2376948 1616058 967412
36955I67412j15982j62801o00253p62228m57941K95904J371977J906691Q53362
$$ 967412 851430 688629 88376 -673852 -1131793 -835889 536088 2442779 3296141
36946C296141j173598j969860o55930P94665K72144j432470j992053r47818K45666
$$ 3296141 2122543 152683 -503247 291418 563562 -868908 -2860961 -3808779 -3563113
36937c563113Q31735J121588P47223p80744j851368j81653K950935L279083j89347
$$ -3563113 -2731378 -1609790 -862567 -1643311 -3494679 -3676332 -725397 2553686 2364339
36928B364339k893870j190774K049484J901166j000953j900387K29373J421567
$$ 2364339 -529531 -1720305 329179 2230345 1229392 -670995 -441622 979945
36920I79945l48187j974903p49053J226381Q95669q31572j291722o92958r54247
$$ 979945 631758 -1343145 -2092198 -865817 29852 -801720 -2093442 -2786400 -3740647
36911c740647j612169o36066J498003K175627R35073K7862M34255O00142j09333
$$ -3740647 -5352816 -5988882 -4490879 -2315252 -1380179 -1352317 -918062 -317920 -427253
36902d27253N6564J795193K753533J086706j272185j415127J04654M26524r44329
$$ -427253 -370689 1424504 4178037 5264743 3992558 2577431 2682085 3108609 2164280
36893B164280j566071j73894J335395R05770o95112j203825K1364J496513J647292
$$ 2164280 598209 424315 1759710 2665480 1970368 766543 787907 2284420 3931712
36884C931712L39657j338131k050330j134764P68932J992611J293334p49018k091318
$$ 3931712 4271369 2933238 882908 -251856 517076 2509687 3803021 3054003 962685
36875I62685j267696R77907K325437J283284j152709k513177j573355K99744Q24675
$$ 962685 -305011 672896 2998333 4281617 3128908 615731 -957624 -657880 166795
36866A66795m45313j637271r16994J240894K626177J885495p5769j371705j207319
$$ 166795 -278518 -1915789 -2832783 -1591889 1034288 2919783 2844014 1472309 264990
36857B64990k54802N47012Q03145M28378m91562j382334j507241r38984m51610
$$ 264990 10188 557200 1360345 1788723 1297161 -85173 -1592414 -2531398 -2983008
36848b983008j79332N10547J297908O41488j483661k228283M56690L892840L473454
$$ -2983008 -3162340 -2651793 -1353885 -712397 -2196058 -4424341 -3967651 -74811 3398643
36839C398643p92209l872891k579222N31211J694441J112192R87743J145761J12641
$$ 3398643 2606434 -1266457 -3845679 -3314468 -1620027 -507835 479908 1625669 1738310
36830A738310j174753n68794J151851J084024r31648j826033k21120J497610J104942
$$ 1738310 563557 -5237 1146614 2230638 1298990 -527043 -748163 749447 1854389
36821A854389l94820j057169q85348q00454o98490j25147O36762J351024K155695
$$ 1854389 1459569 402400 -482948 -1283402 -1981892 -2107039 -1470277 -119253 2036442
36812B036442K240437K26757k969548l921075j071409K617074L314500R44466
$$ 2036442 4276879 4503636 1534088 -2386987 -3458396 -841322 2473178 3417644
36804C417644j684651k615298j615004Q49179L152659K710976p38330l519021
$$ 3417644 1732993 -882305 -2497309 -1648130 1504529 4215505 3477175 -41846
36796d1846k437439O14386J537300J02586n31479N53461J081396J69967l25817
$$ -41846 -2479285 -1864899 -327599 -225013 -756492 -203031 878365 1048332 722515
36787G22515K96017K82222q82063j151035K59261J153845J88333p84078j36670
$$ 722515 1018532 1300754 418691 -732344 -473083 680762 869095 85017 -51653
36778e1653P68860L94334k15147K05377O65936K19872J04743R71532O84712j992610
$$ -51653 717207 1111541 896394 1101771 1767707 1987579 2092322 3063854 3748566 1755956
36768A755956m054524k274999J434449K601817O05342j418958j768448j172532
$$ 1755956 -2298568 -4573567 -3139118 -537301 68041 -1350917 -3119365 -4291897
36760d291897K69418K677474L665258Q56261l079090k990731P84464K409888l85527
$$ -4291897 -4022479 -1345005 2320253 3176514 97424 -2893307 -2108843 301045 -84482
36751h4482k898591j354292J306424J013360q84805j020092m4670l71650q56005
$$ -84482 -2983073 -4337365 -3030941 -2017581 -2902386 -3922478 -3967148 -4338798 -5194803
36742e194803J029564L676385L243368N536k117137j747121r98614o22853P70929
$$ -5194803 -4165239 -488854 2754514 2760050 642913 -1104208 -2102822 -2725675 -1954746
36733a954746K395548J372396j730337k441490O15004K960890J183116j688569
$$ -1954746 440802 1813198 82861 -2358629 -1743625 1217265 2400381 711812
36725G11812j281152J199971J471783p94255k052001q83178M00318M3292r61057
$$ 711812 -569340 630631 2102414 1308159 -743842 -1627020 -1226702 -1183410 -2144467
36716b144467j411473j563178j557324p38185O86570J437673J271569J315374
$$ -2144467 -3555940 -5119118 -6676442 -7414627 -6728057 -5290384 -4018815 -2703441
36708b703441J774975J469105L75275L01064J752871K347191K23431k679204l052600
$$ -2703441 -928466 540639 915914 1216978 2969849 5317040 5540471 2861267 -191333
36699a91333r05198O02699l00655j945790k097805q98662O4889K56086L95461
$$ -191333 -1096531 -493832 -794487 -2740277 -4838082 -5736744 -5671855 -5415769 -5020308
36690e020308P90680Q19468K03217k16507L98733J469131J541219K88135q74690
$$ -5020308 -4229628 -3410160 -3206943 -3423450 -3024717 -1555586 -14367 273768 -600922
36681f00922o73270K47449L46120m96588r68623n52660k36365n56986m85622P45860
$$ -600922 -1274192 -1026743 -680623 -1177211 -2145834 -2698494 -2934859 -3491845 -3977467 -3231607
36671c231607K010983J837495O28539j41973j78737j87601j07972N66684J079304
$$ -3231607 -1220624 616871 1245410 1103437 924700 737099 629127 1195811 2275115
36662B275115J65740j470599j680612k12311P90184K92440j20682O12025R94640
$$ 2275115 2440855 970256 -710356 -922667 -132483 159957 39275 651300 1645940
36653A645940p2812p98315M58628J744441L79608k177622k112165O96221K395249
$$ 1645940 1573128 774813 1233441 2977882 3357490 1179868 -932297 -236076 2159173
36644B159173J210333k50821P3463L42724j357321l026167j674206J775852L645718
$$ 2159173 3369506 3118685 3192148 3534872 2177551 -848616 -2522822 -746970 2898748
36635B898748K484611J58040j362774j771574j334136l60437K21324l13525j079937
$$ 2898748 5383359 5541399 4178625 2407051 1072915 712478 933802 620277 -459660
36626d59660o86971M13889M99739n93820j188016m95970L39261M36130N04764
$$ -459660 -1146631 -732742 -233003 -826823 -2014839 -2510809 -2171548 -1735418 -1230654
36617a230654J151474J516489P25103n62961j224447j334041j568935j645185
$$ -1230654 -79180 1437309 2162412 1599451 375004 -959037 -2527972 -4173157
36609d173157o35892J313664K643626K060738J08233j271802p77389P72083J318678
$$ -4173157 -4809049 -3495385 -851759 1208979 1317212 45410 -731979 40104 1358782
36600A358782O9421j398771j054006R93167K558253J900027m70258k426614k247871
$$ 1358782 1428203 29432 -1024574 -31407 2526846 4426873 3956615 1530001 -717870
36591g17870k16326J523509J201592l10523n23633R76161J582926l29533k360344
$$ -717870 -934196 589313 1790905 1480382 956749 1932910 3515836 3186303 825959
36582H25959j349529J672971K786762Q57693j254962j279290j78936M43449N78445
$$ 825959 -523570 1149401 3936163 4793856 3538894 2259604 2080668 2524117 3102562
36573C102562L03729j151001l263101l600862j192228J543721K098491J222509
$$ 3102562 3406291 2255290 -1007811 -4608673 -5800901 -4257180 -2158689 -936180
36565i36180R83067J243473M60244j197829j929425r69480O91753J843659J862048
$$ -936180 46887 1290360 1750604 552775 -1376650 -2346130 -1654377 189282 2051330
36556B051330N89849j197476j839680o49365Q49982P40500q10893j932611j323695
$$ 2051330 2641179 1443703 -395977 -1045342 -195360 545140 -265753 -2198364 -3522059
36547c522059O43599K391707K243554J30149j589446o88342J373930R84068j919543
$$ -3522059 -2878460 -486753 1756801 1886950 297504 -390838 983092 1967160 47617
36538D7617l004683n6524L229208K722668j31671j380098q38617r86373j659714
$$ 47617 -2957066 -3013590 215618 2938286 2806615 1426517 587900 -398473 -2058187
36529b058187o58870J448587J824286J95505j105798j505832k233188k412640
$$ -2058187 -2717057 -1268470 555816 751321 -354477 -1860309 -4093497 -6506137
36521f506137O2100L633027M077145J138658p81323L18071J333958N5467j266400
$$ -6506137 -6444037 -2811010 1266135 2404793 1623470 1941541 3275499 3330966 2064566
36512B064566p44305l41979j469106j649394P28470K437718M66906k403155j781221
$$ 2064566 1320261 978282 -490824 -2140218 -1411748 1025970 1492876 -910279 -2691500
36503b691500J247390K148775J98176j269920q39381l97826p30594j62610J814488
$$ -2691500 -1444110 704665 902841 -367079 -1206460 -1604286 -2334880 -2497490 -683002
36494f83002L191107K596384J001423m16356j688663k750252k829687j709804
$$ -683002 2508105 5104489 6105912 5689556 4000893 1250641 -1579046 -3288850
36486c288850k8815J715755K979847K539677N0613k260234j807467O27702J740599
$$ -3288850 -3317665 -1601910 1377937 3917614 3968227 1707993 -99474 528228 2268827
36477B268827K71446j634014j845395p09376L90352Q40944N51221l19228q53793
$$ 2268827 2540273 906259 -939136 -1648512 -1258160 -417216 134005 -185223 -1039016
36468a039016j99006Q13441N59109o65687p90584P28380J835121R67694o36703
$$ -1039016 -1238022 -424581 134528 -531159 -1321743 -593363 1241758 2209452 1572749
$$ [...]
##END NTUPLES=NMR SPECTRUM
##END=
