##TITLE=31Pdec_SR167R
 CDCl3, 64 sc
 13.4.2023
##JCAMPDX= 6.0         $$ Bruker NMR JCAMP-DX V2.0
##DATA TYPE= NMR SPECTRUM
##DATA CLASS= NTUPLES
##ORIGIN= UXNMR, Bruker Analytische Messtechnik GmbH
##OWNER= root
$$ XWIN-NMR		Version 3.5
$$ Thu Apr 13 16:24:46 2023 Russian Standard Time (UT+4h)  she@DPX200
##.OBSERVE FREQUENCY= 81.013821
##.OBSERVE NUCLEUS= ^31P
##.ACQUISITION MODE= SIMULTANEOUS
##.ACQUISITION SCHEME= undefined
##.AVERAGES= 64
##.DIGITISER RES= 16
##SPECTROMETER/DATA SYSTEM= spect
##.PULSE SEQUENCE= zgpg30
##.SOLVENT NAME= CDCl3
##.SHIFT REFERENCE= (INTERNAL, CDCl3, 0, 248.564)
##AUDIT TRAIL= $$ (NUMBER, WHEN, WHO, WHERE, WHAT)
$$ ##TITLE= Audit trail, XWIN-NMR		Version 3.5
$$ ##JCAMPDX= 5.01
$$ ##ORIGIN= Bruker BioSpin GmbH
$$ ##OWNER= she
$$ F:/spectra/data/she/nmr/P31/1/pdata/1/auditp.txt
$$ ##AUDIT TRAIL=  $$ (NUMBER, WHEN, WHO, WHERE, WHAT)
(   1,<2023-04-13 16:23:47.93 +0400>,<she>,<DPX200>,
      <continue with go, POWCHK disabled, PULCHK disabled
       configuration hash MD5:
       00 E9 B6 7A A2 85 ED C7 34 08 36 98 17 FE 4E 26
       data hash MD5: 32K
       73 69 BD DE BD 67 22 24 14 D1 FB 25 8C F9 12 18>)
(   2,<2023-04-13 16:23:51.45 +0400>,<she>,<DPX200>,
      <Start of raw data processing
       efp BC_mod = 2 LB = 1 FT_mod = 6 PKNL = 1 PHC0 = -11014.54 PHC1 = 104.6854 SI = 64K 
       data hash MD5: 64K
       4E 23 C3 C4 C6 5A A2 E1 18 44 DE AE 9F C3 F4 24>)
(   3,<2023-04-13 16:24:14.07 +0400>,<she>,<DPX200>,
      <pk PHC0 = -94.5078 PHC1 = 290.2 
       data hash MD5: 64K
       53 9A D4 C7 5D 20 E4 CC 6E 08 BB 08 56 E8 55 AC>)
$$ ##END=
$$ 
$$ hash MD5
$$ 5B 22 50 3E 07 B5 1E B4 D7 21 49 68 A9 83 FA AD
##$RELAX= 
##$RELAX= 
##$RELAX= 
##$RELAX= 
##$RELAX= 
##$RELAX= 
##$RELAX= 
##$RELAX= 
##$RELAX= 
$$ Bruker specific parameters
$$ --------------------------
##$DU= <F:/spectra>
##$EXPNO= 1
##$NAME= <P31>
##$PROCNO= 1
##$TYPE= <nmr>
##$USER= <she>
##$AMP= (0..31)
100 100 100 100 100 100 100 100 100 100 100 100 100 100 100 100 100 100 
100 100 100 100 100 100 100 100 100 100 100 100 100 100 
##$AQSEQ= 0
##$AQ_mod= 1
##$AUNM= <au_zg>
##$AUTOPOS= <>
##$BF1= 81.014009
##$BF2= 200.13
##$BF3= 200.13
##$BF4= 200.13
##$BF5= 200.13
##$BF6= 200.13
##$BF7= 200.13
##$BF8= 200.13
##$BYTORDA= 1
##$CFDGTYP= 0
##$CFRGTYP= 5
##$CHEMSTR= <none>
##$CNST= (0..31)
1 1 145 1 1 1 1 1 1 1 1 1 1 1 1 1 1 1 1 1 1 1 1 1 1 1 1 1 1 1 1 1 
##$CPDPRG= <waltz16>
##$CPDPRG1= <>
##$CPDPRG2= <waltz16>
##$CPDPRG3= <>
##$CPDPRG4= <mlev>
##$CPDPRG5= <mlev>
##$CPDPRG6= <mlev>
##$CPDPRG7= <mlev>
##$CPDPRG8= <mlev>
##$CPDPRGB= <>
##$CPDPRGT= <>
##$D= (0..31)
0 1 0 0 0 0 0 0 0 0 0 0.03 2e-05 3e-06 0 0 0 0 0 0 0 0 0 0 0 0 0 0 0 0 
0 0 
##$DATE= 1681388538
##$DBL= (0..7)
120 120 120 11 120 120 24 19 
##$DBP= (0..7)
150 150 150 150 150 150 150 150 
##$DBP07= 0
##$DBPNAM0= <>
##$DBPNAM1= <>
##$DBPNAM2= <>
##$DBPNAM3= <>
##$DBPNAM4= <>
##$DBPNAM5= <>
##$DBPNAM6= <>
##$DBPNAM7= <>
##$DBPOAL= (0..7)
0.5 0.5 0.5 0.5 0.5 0.5 0.5 0.5 
##$DBPOFFS= (0..7)
$$ [...]
##$SUBNAM2= <"">
##$SUBNAM3= <"">
##$SUBNAM4= <"">
##$SUBNAM5= <"">
##$SUBNAM6= <"">
##$SUBNAM7= <"">
##$SUBNAM8= <"">
##$SUBNAM9= <"">
##$SW= 501.771253377433
##$SWIBOX= (0..15)
0 1 3 0 0 0 0 0 0 0 0 0 0 0 0 0 
##$SW_h= 40650.406504065
##$TD= 32768
##$TD0= 1
##$TE= 0
##$TE2= 300
##$TE3= 300
##$TEG= 300
##$TL= (0..7)
0 120 53 12 22 120 120 120 
##$TP= (0..7)
150 150 150 150 150 150 150 150 
##$TP07= 0
##$TPNAME0= <>
##$TPNAME1= <>
##$TPNAME2= <>
##$TPNAME3= <>
##$TPNAME4= <>
##$TPNAME5= <>
##$TPNAME6= <>
##$TPNAME7= <>
##$TPOAL= (0..7)
0.5 0.5 0.5 0.5 0.5 0.5 0.5 0.5 
##$TPOFFS= (0..7)
0 0 0 0 0 0 0 0 
##$TUNHIN= 0
##$TUNHOUT= 0
##$TUNXOUT= 0
##$USERA1= <user>
##$USERA2= <user>
##$USERA3= <user>
##$USERA4= <user>
##$USERA5= <user>
##$V9= 5
##$VALIST= <valist>
##$VCLIST= <CCCCCCCCCCCCCCC>
##$VD= 0
##$VDLIST= <DDDDDDDDDDDDDDD>
##$VPLIST= <PPPPPPPPPPPPPPP>
##$VTLIST= <TTTTTTTTTTTTTTT>
##$WBST= 1024
##$WBSW= 4
##$XGAIN= (0..3)
0 0 0 0 
##$XL= 0
##$YL= 0
##$YMAX_a= 2562
##$YMIN_a= -2379
##$ZGOPTNS= <>
##$ZL1= 120
##$ZL2= 120
##$ZL3= 120
##$ZL4= 120
##$ABSF1= 0
##$ABSF2= 0
##$ABSG= 0
##$ABSL= 0
##$ALPHA= 0
##$AQORDER= 0
##$ASSFAC= 0
##$ASSFACI= 0
##$ASSFACX= 0
##$ASSWID= 0
##$AUNMP= <proc_1d>
##$AZFE= 0.1
##$AZFW= 0.5
##$BCFW= 0
##$BC_mod= 2
##$BYTORDP= 0
##$COROFFS= 0
##$CY= -3
##$DATMOD= 1
##$DC= 0
##$DFILT= <>
##$DTYPP= 0
##$F1P= 0
##$F2P= 0
##$FCOR= 1
##$FTSIZE= 65536
##$FT_mod= 6
##$GAMMA= 0
##$GB= 0
##$INTBC= 1
##$INTSCL= 6.047779e-11
##$ISEN= 30
##$LB= 1
##$LEV0= 0
##$LPBIN= 0
##$MAXI= 10000
##$MC2= 0
##$MEAN= 0
##$ME_mod= 0
##$MI= 50
##$NCOEF= 0
##$NC_proc= -10
##$NLEV= 6
##$NOISF1= 182.463
##$NOISF2= 159.3651
##$NSP= 0
##$NTH_PI= 0
##$NZP= 0
##$OFFSET= 248.5645
##$PC= 4
##$PHC0= -11109.05
##$PHC1= 394.8854
##$PH_mod= 1
##$PKNL= yes
##$PPARMOD= 0
##$PSCAL= 0
##$PSIGN= 0
##$REVERSE= no
##$SF= 81.0140089999694
##$SI= 65536
##$SIGF1= 159.3651
##$SIGF2= -187.1042
##$SINO= 113.3802
##$SIOLD= 16384
##$SREGLST= <1H.CDCl3>
##$SSB= 0
##$STSI= 65536
##$STSR= 0
##$SW_p= 40650.406504065
##$SYMM= 0
##$S_DEV= 0
##$TDeff= 32768
##$TDoff= 0
##$TI= <>
##$TILT= no
##$TM1= 0
##$TM2= 0
##$TOPLEV= 0
##$USERP1= <user>
##$USERP2= <user>
##$USERP3= <user>
##$USERP4= <user>
##$USERP5= <user>
##$WDW= 1
##$XDIM= 65536
##$YMAX_p= 398410517
##$YMIN_p= -195106776
$$ End of Bruker specific parameters
$$ ---------------------------------
##NTUPLES= NMR SPECTRUM
##VAR_NAME=  FREQUENCY,     SPECTRUM/REAL,   SPECTRUM/IMAG
##SYMBOL=    X,             R,               I
##VAR_TYPE=  INDEPENDENT,   DEPENDENT,       DEPENDENT
##VAR_FORM=  AFFN,          ASDF,            ASDF
##VAR_DIM=   65536,         65536,           65536
##UNITS=     HZ,            ARBITRARY UNITS, ARBITRARY UNITS
##FACTOR=    0.620285442955139, 1,           1
##FIRST=     20137.2065510682, 0,            0
##LAST=      -20513.1999529968, 0,           0
##MIN=       -20513.1999529968, -195106776,  0
##MAX=       20137.2065510682, 398410517,    0
$$ Real data points
##PAGE= N=1
##DATA TABLE= (X++(R..R)), XYDATA
$$ [...]
12750a5776152j1538966l813066J896930O635247R809965R634639Q182006R459429
$$ -15776152 -27315118 -31128184 -29231254 -22596007 -12786042 -3151403 5030603 14490032
12742A4490032J0390694L335682q359998r868673K289667J0369853K75248j5846293
$$ 14490032 24880726 28216408 19856410 9987737 12277404 22647257 22922505 7076212
12734G076212j6932989l456272O038403K593425m935312n416872M242704J9599482
$$ 7076212 -9856777 -13313049 -7274646 -4681221 -9616533 -15033405 -10790701 8808781
12726H808781K7437920J2267522k0865475l9793460k1902483J0144166J4514650
$$ 8808781 36246701 48514223 27648748 -12144712 -34047195 -23903029 -9388379
12719i388379j0931655k4985229l244081K7570227L0151615P561668p713842q45925
$$ -9388379 -20320034 -45305263 -48549344 -20979117 9172498 16734166 9020324 8174399
12711H174399J2105366J2389437K22275j2733524j8765857j8126535j4572246
$$ 8174399 20279765 32669202 32891477 20157953 1392096 -16734439 -31306685
12704c1306685r581936L10J5493914K7216622K0843211j797388j8152223j1141878
$$ -31306685 -40888621 -40888311 -25394397 1822225 22665436 20868048 2715825 -8426053
12696h426053P370350J1407446n260181k3007049k2610694n275327J4071070K2073119
$$ -8426053 -1055703 10351743 5091562 -17915487 -40526181 -45801508 -31730438 -9657319
12688i657319J4015138l380810j3639320n654143R627637Q744310j3343794l3457343
$$ -9657319 4357819 977009 -12662311 -18316454 -8688817 55493 -13288301 -46745644
12680d6745644k8688687m099505J7209417K1920791J3166956j751053j5684725
$$ -46745644 -75434331 -79533836 -62324419 -40403628 -27236672 -28987725 -44672450
12673d4672450j8552891n181353J4360179K4243356K1544888J4605801O856401
$$ -44672450 -63225341 -68406694 -54046515 -29803159 -8258271 6347530 13203931
12666A3203931l038479q424869j145422R081274L237489j4817076j8033566K539888
$$ 13203931 10165452 1740583 595161 9676435 12913924 -1903152 -19936718 -17396830
12658a7396830K0117001J1729199o583895o178918J0017139J5839490L132365
$$ -17396830 2720171 14449370 7865475 1686557 11703696 27543186 30675551
12651C0675551j1860209j6680330j2507772j598040J0688777Q205519j4239868
$$ 30675551 18815342 2135012 -10372760 -11970800 -1282023 6923496 -7316372
12644g316372k8939820q308725K5994587K8217247K139093j524143K7291426L1599668
$$ -7316372 -36256192 -44564917 -18570330 9646917 11786010 10261867 37553293 69152961
12636F9152961j9987978o9928867n2406678N865156K9601447J0621601N361765
$$ 69152961 49164983 -20763884 -73170562 -67305406 -37703959 -27082358 -21720593
12629b1720593K8439210L0004529q602357l4078884r309977K2708425J0206426
$$ -21720593 6718617 36723146 28120789 -5958095 -15268072 7440353 17646779
12622A7646779k2538323j7845828K1734459M1605037J9906304j0766747k1408159
$$ 17646779 -4891544 -22737372 -1002913 40602124 60508428 49741681 28333522
12615B8333522j8891370j8034284k0100226k3425611k5003758j1789527K0420743
$$ 28333522 9442152 -8592132 -28692358 -52117969 -77121727 -88911254 -68490511
12608f8490511M4455732L1983143J453348l301387J9017129K4799062l618417
$$ -68490511 -24034779 7948364 9401712 6100325 25117454 49916516 46298099
12601D6298099l1491127l0073138j5925951j0365928k568350J7944409K9586251
$$ 46298099 14806972 -15266166 -31192117 -41558045 -44126395 -26181986 3404265
12594C404265J3698197q919292j1030673k079553l126364m180308J3171905L0907775
$$ 3404265 17102462 8183170 -2847503 -4927056 -8053420 -12233728 938177 31845952
12586C1845952J6927192j9137227l5971904k1984030o111866o866456q530559
$$ 31845952 48773144 29635917 -6335987 -28320017 -34431883 -41298339 -49828898
12579d9828898N249621K5474494L4695932K7522087Q804744j0958824j8424584
$$ -49828898 -44579277 -19104783 15591149 43113236 51917980 40959156 22534572
12572B2534572j2150581r463503k1177784k9791501j4848440J1985120K3230955
$$ 22534572 10383991 920488 -20257296 -50048797 -64897237 -52912117 -29681162
12565b9681162J5188082L477100p169527j7387644j3469880R801840K3160547
$$ -29681162 -14493080 -11015980 -18185507 -35573151 -49043031 -39241191 -16080644
12558a6080644K873459k0406351m907523K5983803J5501505k6274241l0566981
$$ -16080644 -13207185 -33613536 -38521059 -12537256 2964249 -23309992 -53876973
12551e3876973J4430494L8408004M747770k9626736j2492717K0121861J5327921
$$ -53876973 -39446479 -1038475 3709295 -25917441 -38410158 -18288297 -2960376
12544b960376n891489K590178K3322316J0663781k0357291j8067189J3028069
$$ -2960376 -8851865 -6261687 17060629 27724410 7367119 -10700070 2327999
12537B327999J8497595j3452696l4477500j5659974J4375813K1828997J0227905
$$ 2327999 20825594 7372898 -27104602 -42764576 -28388763 -6559766 3668139
12530C668139j976755q199442p125275J196170O819343J170431n212470P85976
$$ 3668139 1691384 -6508058 -13633333 -12437163 -5617820 -4447389 -9659859 -8873883
12522h873883R792804P484699L247351J0412818J4414986k180297j9171831o811890
$$ -8873883 918921 8403620 11650971 22063789 36478775 34298478 15126647 8314757
12514H314757J8599966J5570353j3780667k6367753p718178J1501358J1439153
$$ 8314757 26914723 42485076 28704409 2336656 -5381522 6119836 17558989
12507A7558989O688085P336641K564923q000123q947029k548890o690872j5463271
$$ 17558989 24247074 31583715 34148638 26148515 17201486 14652596 7961724 -7501547
12499g501547o110875J1819799M547334k2656605k5670271K521386J4748554r885576
$$ -7501547 -13612422 -1792623 2754711 -19901894 -45572165 -43050779 -28302225 -38187801
12491c8187801k6637715J831307M4519873N2180947K5979180j708489j8059810
$$ -38187801 -64825516 -62994209 -18474336 33706611 59685791 57977302 39917492
12484C9917492k4409672j3751148R415333J6006561o612278k8045191k0366501
$$ 39917492 15507820 1756672 11172005 27178566 20566288 -7478903 -27845404
12477b7845404o62482L253243j905227J598691M967148l380946n727861J2892014
$$ -27845404 -28507886 -25254643 -27159870 -25561179 -20594031 -23974977 -29702838 -16810824
12469a6810824K7303691R582089j9590568k1216319J55645R838902J928891r33297
$$ -16810824 10492867 20074956 484388 -20731931 -20576286 -10737384 -8808493 -9741790
12461i741790N216555L916947l248183J364063J4905921J7452112Q213862L403211
$$ -9741790 -4525235 -608288 -3856471 -2492408 12413513 29865625 38079487 41482698
12453D1482698L332548l890953j2520966q647145k527971j3648313k9278480j8818859
$$ 41482698 44815246 40924293 28403327 19756182 17228211 3579898 -25698582 -44517441
12445d4517441J2236093K5030975Q031791o213630N033176K1679874J7555636
$$ -44517441 -32281348 -7250373 781418 -5432212 -399036 21280838 38836474
12438C8836474j14784o982074K740018J3189401Q470296j1040537k6954711j8217707
$$ 38836474 38721690 31739616 34479634 47669035 56139331 45098794 18144083 -73624
12430g3624J3046944L7271491L0045259l45966k8773832m1066166l2762732l162420
$$ -73624 12973320 50244811 80290070 79944104 51170272 10104106 -22658626 -25821046
12422b5821046K8615577K7805079p578969k9829681p705096K0522190N673074
$$ -25821046 2794531 30599610 23020641 -6809040 -14514136 6008054 11681128
12415A1681128k9491114k5083462J7653600M0386816K2763388L092324N11797
$$ 11681128 -17809986 -42893448 -25239848 15146968 37910356 41002680 41514477
12408D1514477j1543888l8383041m0281396l593051K5923609J5302489l861580
$$ 41514477 29970589 -8412452 -48693848 -52286899 -26363290 -11060801 -14922381
12401a4922381O125885K6180928J8212028j1827887k9885087k4049955m397851
$$ -14922381 -8796496 17384432 35596460 23768573 -6116514 -30166469 -34564320
12394c4564320K0260187L5768739K1768282j3930516l0065721q369754J7471785
$$ -34564320 -14304133 21464606 43232888 29302372 -763349 -9133103 8338682
12387H338682J6752441P130488J1461345J0665932j5899146l9464222k3238881
$$ 8338682 25091123 32221611 43682956 54348888 38449742 -1014480 -24253361
12380b4253361J2510436K0041199j515955j3703942m621334M815655Q342589J5999114
$$ -24253361 -11742925 8298274 6782319 -6921623 -11542957 -6727302 1615287 17614401
12372A7614401J6720783q065697l6953492k7246894J6040586L9523593J7489385
$$ 17614401 34335184 26269487 -10684005 -37930899 -21890313 17633280 35122665
12365C5122665j6787118k6348289j5374170m893911p7766K557855L486830O886227
$$ 35122665 18335547 -8012742 -23386912 -28280823 -28358589 -25800734 -22313904 -15427677
12357a5427677J5481419J6133898k457819k0100038p595129K2552005K8748825
$$ -15427677 53742 16187640 13729821 -6370217 -13965346 8586659 37335484
12350C7335484O283341n400163R034457J4847382j0377523l5863775k8857069
$$ 37335484 43618825 38218662 47253119 62100501 51722978 15859203 -12997866
12343a2997866n604129L929805O593201K0707921K9591193P825522k3838844j9872057
$$ -12997866 -18601995 -14672190 -8078989 12628932 42220125 50045647 26206803 6334746
12335F334746J7776249L5747792O184985l2240551k9715128O684618K7204895
$$ 6334746 24110995 59858787 66043772 33803221 4088093 10772711 37977606
12328C7977606Q218155k1530020k5585563o817270O021803M238436N495579J5260622
$$ 37977606 46195761 24665741 -919822 -7737092 -1715289 2523147 8018726 23279348
12320B3279348J3349968o728494j5360840P859613L0961371J1683036l2330811
$$ 23279348 36629316 29900822 14539982 22399595 53360966 65044002 32713191
12313C2713191m3184447r018414K0781001J4606379M67572Q497627K0666968R793571
$$ 32713191 -10471256 -19489670 1291331 15897710 16365282 24862909 45529877 55323448
12305E5323448j1246086j6348793j0800829j1535547r726464P772309K2387061
$$ 55323448 44077362 27728569 16927740 5392193 -4334271 3438038 25825099
12298B5825099J0233825j3121892j5173429Q60601P288637L161821R425333K0783888
$$ 25825099 36058924 22937032 7763603 8624204 15912841 19074662 28499995 49283883
12290D9283883J0518877j6216874k1576606L734030K2239108Q068271j5026957
$$ 49283883 59802760 43585886 22009280 25743310 47982418 56050689 41023732
12283D1023732j4672276K747097R971593J771271l965838M283706J8518210K1144683
$$ 41023732 26351456 29098553 39070146 40841417 36875579 41159285 59677495 80822178
12275H0822178J355179k9531269l9983456j2534977K4757090K4863529j6222188
$$ 80822178 82177357 52646088 12662632 127655 24884745 49748274 33526086
12268C3526086m9903364l6767492O441217L4607479K7543598O29310k0244176
$$ 33526086 -16377278 -53144770 -46703553 -12096074 15447524 16076834 -4167342
12261d167342j9753324k340906R781212Q03441j2815967o97505L3043890M7009188
$$ -4167342 -23920666 -26261572 -16480360 -15676919 -28492886 -29190391 3853499 50862687
12253E0862687J9244058k1617592l8549775l1645282k0223162o931137J1996795
$$ 50862687 70106745 48489153 9939378 -21705904 -41929066 -48860203 -36863408
12246c6863408K2834654J2533614m825852r668497r951746k0891512k6767675
$$ -36863408 -14028754 -1495140 -6320992 -15989489 -25941235 -46832747 -73600422
12239g3600422j722582L9060871N0657181K2523111p736601j1934862n006355
$$ -73600422 -75323004 -36262133 14395048 36918159 29181558 17246696 12240341
12232A2240341p493214r938127K177325J5151323P484849j1715086j2592136J2090980
$$ 12240341 4747127 -5191000 -3013675 12137648 19622497 7907411 -4684725 7406255
12224G406255L5609415L0861204Q49527k7603951l2326356j5209536L190008O540416
$$ 7406255 43015670 73876874 74726401 47122450 14796094 -413442 2776566 9316982
12216I316982j442349o164686k507119K141232K269877O3153l187513q751345
$$ 9316982 7874633 1709947 -797172 1344060 3613937 3677090 489577 -8261768
12208h261768j1348925k119404J4249047J9128072N131806j0332276p825496O854263
$$ -8261768 -19610693 -21730097 -7481050 11647022 16778828 6446552 -1378944 5475319
12200E475319J1020309l957399k2264944k3864179o388939J4594989K2437924
$$ 5475319 16495628 12538229 -9726715 -33590894 -39979833 -25384844 -2946920
12193b946920J5376617O767529Q231229J4318866J0313217m906899j4290162o069143
$$ -2946920 12429697 19197226 27428455 41747321 52060538 47153639 32863477 26794334
12185B6794334Q042487P971747p007106j7082915q111602J0333989J6951267M370536
$$ 26794334 34836821 42808568 35801462 18718547 10606945 20940934 37892201 42262737
12177D2262737j2040894j2497748K570029J2694386N311496n583637k67081J4037436
$$ 42262737 30221843 17724095 20294124 32988510 38300006 32716369 32449288 46486724
12169D6486724J1181785j1994676k5566289j0071893J1850765Q394325j3202057
$$ 46486724 57668509 45673833 20107544 10035651 21886416 30280741 17078684
12162A7078684j9188354j926855J1529226M900324m867694j142158N389997J885268
$$ 17078684 -2109670 -4036525 7492701 12393025 7525331 6383173 11773170 13658438
12154A3658438J017784J7213573L2222203J6426662k1661752l9627412j8642394
$$ 13658438 14676222 31889795 64111998 80538660 58876908 19249496 607102
12147F07102J1892968J7465140J712750q940107m583607L776778O982637N371661
$$ 607102 12500070 29965210 31677960 22737853 18154246 21931024 28913661 34285322
12139C4285322j38981q169855j1860933p114340j664111l778765p615198l006373
$$ 34285322 34146341 25976486 14115553 7001213 5337102 1558337 -6056861 -9063234
12131i063234O559599J0812585J1214425J5331561J8336736R814164n005161j1785989
$$ -9063234 -2503635 8308950 19523375 34854936 53191672 63005836 58000675 46214686
12123D6214686j0891155j1228339n841974J5134181K9628074K999890m8914520
$$ 46214686 35323531 24095192 18253218 33387399 63015473 66015363 17100843
12116A7100843o1936553j2205503M0490789L4320782o614740j4005649K0913459
$$ 17100843 -44835710 -57041213 -16550424 17770358 11155618 -2850031 18063428
12109A8063428M2288171J9094173j6857560k7716205j5296637K507239J8609477
$$ 18063428 60351599 79445772 62588212 34872007 19575370 22082609 40692086
12102D0692086K3961264N346389k5542660l3617256r482186J3756983J0705977
$$ 40692086 64653350 69999739 44457079 10839823 1357637 15114620 25820597
12095B5820597j900159k092122M17547p768044j1266252L837136J5266889k72023
$$ 25820597 23920438 21828316 22245863 14477819 3211567 7048703 22315592 22043569
12087B2043569k0630656j1415690J2720105J0349755j3936120j5031524J3712603
$$ 22043569 1412913 -10002777 2717328 13067083 -869037 -15900561 -2187958
12080b187958K5581024q13062k4107262r836251J1966085l13364k7569083k1054801
$$ -2187958 23393066 22580004 -1527258 -11363509 602576 289212 -27279871 -48334672
12072d8334672J6441875L3586860R031789k1223507k1357225o49362J2431255
$$ -48334672 -31892797 1694063 10725852 -10497655 -31854880 -32504242 -20072987
12065b0072987R717299N30259p326303q155259K068915J4192100J1103399m771673
$$ -20072987 -10355688 -9825429 -17151732 -25306991 -23238076 -9045976 2057423 -2714250
12057b714250q777354Q223205K1058672P814312j4264344j5123242J941028R362537
$$ -2714250 -11491604 -3268399 17790273 25604585 11340241 -3783001 -1841973 7520564
12049G520564m6667q684503r071224j0615832j1714176J196287K1318198K2366881
$$ 7520564 7473897 -1210606 -10281830 -20897662 -32611838 -31415551 -10097353 12269528
12041A2269528K925614m358995J4056236K4169671k862378l8024574l1640245
$$ 12269528 15195142 10836147 24892383 49062054 46199676 8175102 -23465143
12034b3465143J3517459M5546224L3821784m34231k4886166l3315494l3798400
$$ -23465143 -9947684 35598540 69420324 68986093 44099927 10784433 -23013967
12027b3013967k7923642j5400137j068864J2863362K7366318L4505363K2111406
$$ -23013967 -50937609 -66337746 -67406610 -54543248 -27176930 7328433 29439839
12020B9439839l321605j6396474m568798J4985405J8994639M657667j5291978
$$ 29439839 26118234 9721760 5152962 20138367 39133006 43790673 28498695
12013B8498695k9262386k9262396j1623629J2643390K0777569N035464j3012297
$$ 28498695 -763691 -30026087 -41649716 -29006326 -8228757 -3193293 -16205590
12006a6205590q342244J4602660K8304419J7345540n274111j6480698q392094
$$ -16205590 -24547834 -9945174 18359245 35704785 30430674 13949976 5557882
11999E557882O828794J2599490N436584m210447p698251q063886r579801o906627
$$ 5557882 12386676 24986166 30422750 26212303 18514052 10450166 870365 -6036262
11991f036262L629783J0302330J063666j2821326r927128N684015O891081j3984221
$$ -6036262 -2406479 7895851 8959517 -3861809 -13788937 -8104922 -1213841 -15198062
11983a5198062l0971427k2985833k384376R312453J2227773J6846419K0581654
$$ -15198062 -46169489 -69155322 -71539698 -62227245 -49999472 -33153053 -12571399
11976a2571399J5562906N826642j473071r235840j8159750j5749757L770859K2354424
$$ -12571399 2991507 8818149 7345078 -1890762 -20050512 -35800269 -32029410 -9674986
11968i674986K1003437P066997j497217n089334j2370679j5130768j497748J5602733
$$ -9674986 11328451 18395448 16898231 11808897 -561782 -15692550 -17190298 -1587565
11960a587565J3529839k304494o338363M765868R466430Q89165l965126J664494
$$ -1587565 11942274 9637780 3299417 8065285 17531715 18420880 14455754 16120248
11952A6120248M173317P68666O653782J9301497J0867750k4251110m7123692k6570953
$$ 16120248 20293565 21062231 27716013 47017510 57885260 33634150 -13489542 -40060495
11944d0060495J2752536K5524340Q335834o752558o138247m792275r139157p366211
$$ -40060495 -27307959 -1783619 6552215 -200343 -6338590 -11130865 -20270022 -27636233
11936b7636233J543642L344732p91192Q213259K8711626K9908741j10062k7830865
$$ -27636233 -26092591 -22747859 -23539051 -15325792 13385834 43294575 43184513 15353648
11928A5353648k0939621L512959R120615j076651M872228K7369018K9479908k584902
$$ 15353648 -5585973 -2073014 7047601 5970950 10843178 38212196 67692104 65107202
11920F5107202l4069991l3527611j5513581p971235o526674P560692K5071157
$$ 65107202 31037211 -2490400 -18003981 -25975216 -32501890 -24941198 129959
11913A29959K0498011l812162j8754910j0657034O367235J7956659K1679767J3859132
$$ 129959 20627970 16815808 -1939102 -12596136 -6228901 11727758 33407525 47266657
11905D7266657o357899k0229592q034822J4068293J0047756j8708268l0606684
$$ 47266657 40908758 20679166 12644344 26712637 36760393 18052125 -12554559
11898a2554559q633655J4119789J2429487Q412132K2630617K7450972o656877
$$ -12554559 -21188214 -7068425 5361062 13773194 36403811 63854783 57197906
11891E7197906m9477321m7890899o540273K1438467J6095916Q797539J6613853
$$ 57197906 7720585 -40170314 -46710587 -25272120 -9176204 -378665 16235188
11884A6235188J3686282j4599962l6117833j9582705J5531882K8219091J3623943
$$ 16235188 29921470 15321508 -20796325 -40379030 -24847148 3371943 16995886
11877A6995886R96767O142904J4443446R308989m280414r723063o74675J2843184
$$ 16995886 17992653 24135557 38579003 47887992 43607578 33884515 33209840 46053024
11869D6053024J7035536R586207m00785p269174j5216864k4504454k3047093n269555
$$ 46053024 63088560 72674767 72273982 65004808 49787944 25283490 2236397 -3033158
11861c033158J0744350M569980j3872955j5578996N028236K2642677J8592386
$$ -3033158 7711192 12281172 -1591783 -17170779 -12142543 10500134 29092520
11854B9092520K142476j0781623j6282104j2402515M752308K3318072J8817737
$$ 29092520 31234996 20453373 4171269 -8231246 -3478938 19839134 38656871
11847C8656871q961621k5453688q133869J7151743J2512251j5629530k7289363
$$ 38656871 29695250 4241562 -3892307 13259436 25771687 10142157 -17147206
11840a7147206p830638J6145737K0367460J1723751M933078k637349j6087001
$$ -17147206 -24977844 -8832107 11535353 23259104 28192182 25554833 9467832
11833I467832k2468888p554731J5847121J8977635l081416k2313162j5698624
$$ 9467832 -13001056 -20555787 -4708666 14268969 11187553 -11125609 -26824233
11826b6824233L813124Q260086l551814n135281J6601754L9184498L3746420K939207
$$ -26824233 -23011109 -14751023 -18302837 -23438118 -6836364 32348134 66094554 69033761
11818F9033761k4752153l1424937k4938078j9273167j4912049m242117J2498464
$$ 69033761 44281608 12856671 -12081407 -31354574 -46266623 -50508740 -38010276
11811c8010276K4442482K2409692J0825342M595306J1456268K0307231J4761403
$$ -38010276 -13567794 8841898 19667240 24262546 35718814 56026045 70787448
11804G0787448l037165j4335872j1283894o562501r068182q637186J829155P508500
$$ 70787448 67750283 53414411 42130517 35568016 26499834 17862648 19691803 27200303
11796B7200303m850805j9304789j1718782J0538586J6833551j839824k1850839
$$ 27200303 22349498 3044709 -8674073 1864513 18698064 16858240 -4992599
11789d992599k1875161o172192R541402J5455312Q710957n004241j0757436k126790
$$ -4992599 -26867760 -33039952 -23498550 -8043238 667719 -4336522 -15093958 -17220748
11781a7220748M851532m403431j3954960q42476K0218937J4222976j2685161j5004100
$$ -17220748 -12369216 -16772647 -30727607 -31570083 -11351146 2871830 -9813331 -24817431
11773b4817431J7916758L7894574J3002449j8492661p914321K5430667K4569984
$$ -24817431 -6900673 30993901 43996350 25503689 17589368 43020035 67590019
11766F7590019j6421553m5815336l2341708k430708R119925N763032P918050J3704715
$$ 67590019 51168466 5353130 -26988578 -29419286 -20299361 -14536329 -6618279 7086436
11758G086436N727308j6209701l1034946k3118015O53992K1896163K9521363K3604678
$$ 7086436 12813744 -3395957 -34430903 -57548918 -56894926 -34998763 -5477400 18127278
11750A8127278P780864j2429904k4751637j6662679O273227K0272933J2768539
$$ 18127278 25908142 13478238 -11273399 -27936078 -21662851 -1389918 11378621
11743A1378621K27475J063643M526494q906869k7345624k1555376M089802J3461448
$$ 11378621 11606096 12669739 17196233 8289364 -19056260 -40611636 -36521834 -23060386
11735b3060386l302191j4502366k787353O029732o982645j5790692N351823L2816626
$$ -23060386 -26362577 -40864943 -43652296 -37622564 -44605209 -60395901 -55044078 -22227452
11727b2227452K9641439M519902p424056k619523l642641j0463885l382913J2356238
$$ -22227452 7413987 11933889 4509833 1890310 -1752331 -12216216 -15599129 -3242891
11719c242891R916768j1850103k5227044j8730450o922391N008536K5245716M1183308
$$ -3242891 6673877 -5176226 -30403270 -49133720 -56056111 -51047575 -25801859 15381449
11711A5381449K6256777r287454j9673244P260256K5687767J307177l4380323
$$ 15381449 41638226 32350772 12677528 19937784 45625551 46932728 12552405
11704A2552405l2220510L187773K7412448K0572321J042796j2398066j7618771
$$ 12552405 -19668105 -16480332 10932116 31504437 32547233 20149167 2530396
11697B530396j4224111j820027P959321K250974j0405124r300278O871399J7709751
$$ 2530396 -11693715 -13513742 -5554421 -3303447 -13708571 -23008849 -16137450 1572301
11689A572301J1748989P71994n27744O399478J1282472J0209994P027675N505212
$$ 1572301 13321290 14093284 13565540 19965018 31247490 41457484 48485159 53990371
11681E3990371M258128j954296j4602660k4552824j9960934m421968L220029n303229
$$ 53990371 58248499 56294203 41691543 17138719 -2822215 -7244183 -4024154 -9327383
11673i327383j3876033n986207R249993J2401190O151349J0258190K6699752L3182386
$$ -9327383 -23203416 -29189623 -19939630 -7538440 -1387091 8871099 35570851 68753237
11665F8753237J6020802j0021162k2353817j5799734n51567J0560366O294874
$$ 68753237 84774039 74752877 52399060 36599326 36047759 46608125 52902999
11658E2902999j5885639l8559308l6061649p870870J5960885J5342983P475844
$$ 52902999 37017360 -1541948 -37603597 -45474467 -29513582 -14170599 -6694755
11651f694755J4560367K3066553N587424k6863308l2038752N4163K7219486J5036234
$$ -6694755 7865612 30932165 36519589 9656281 -22382471 -22328308 4891178 19927412
11643A9927412j3538391j4570707J1805991K5458074P369956j6548433j7665867
$$ 19927412 6389021 -8181686 3624305 29082379 36452335 19903902 2238035
11636B238035k728648M763945J924049M352146J4634843J5290337k397394k0065308
$$ 2238035 -490613 4273332 6197381 10549527 25184370 40474707 38077313 18012005
11628A8012005j6447548l22428J35210j9068359k7438869n252995K1542076J5608885
$$ 18012005 1564457 1242029 1377239 -17691120 -45129989 -50382984 -28840908 -13232023
11620a3232023j5210217k6932478k991632K4647693K5244217P731903n126296
$$ -13232023 -28442240 -55374718 -58366350 -33718657 -8474440 -742537 -5868833
11613e868833j0469792j2459178l554357J5202026J9389465l620000k5737531
$$ -5868833 -16338625 -28797803 -32352160 -17150134 2239331 -1380669 -27118200
11606b7118200j6487961R426150J8569900J3570776J8937775K7873061J3690994
$$ -27118200 -43606161 -34180011 -15610111 -2039335 16898440 44771501 58462495
11599E8462495j3269386j5013466O690159R148787j5886016k5112280j311422
$$ 58462495 45193109 30179643 36869802 46018589 30132573 5020293 3708871
11592C708871J2351485j1724203l2117517p323762K9083130J9823708k1924588
$$ 3708871 16060356 4336153 -27781364 -35105126 -6021996 13801712 -8122876
11585h122876l2268571N098257M0172147L4422199N121142j4821215j7640306
$$ -8122876 -40391447 -35293190 4878957 39301156 44422298 29601083 11960777
11578A1960777r641742N342989J7369342J2000323o890514j6785687q338529J488635
$$ 11960777 2319035 7662024 25031366 37031689 30141175 13355488 5016959 6505594
11570F505594l270792j4604567j5024965j953760J2645898J9172111J8213379
$$ 6505594 3234802 -11369765 -26394730 -28348490 -15702592 3469519 21682898
11563B1682898J3843897N115437j0909647k6342599k2835167K335069K0348370
$$ 21682898 35526795 40642232 29732585 3389986 -19445181 -17110112 3238258
11556C238258N362979k0752910j3699909K0884046K6569613j5070099m5799412
$$ 3238258 8601237 -12151673 -25851582 -4967536 21602077 6531978 -39267434
11549c9267434j6711990L3726907L9076559N506287r744399M020908N714333j3897877
$$ -39267434 -55979424 -22252517 16824042 22330329 12585930 16606838 22321171 8423294
11541H423294j6315872R109592K1452894k99771k1517688j3465060K364276J445971
$$ 8423294 -7892578 1217014 22669908 22370137 852449 -12612611 -10248335 -8802364
11533h802364m96213J3473091K1684992K976826j9209063j3688912N577347O110554
$$ -8802364 -9298577 4174514 25859506 28836332 9627269 -4061643 1515704 7626258
11525G626258o343055k457428J4878033J5241260n363530j8432488j1729224m934671
$$ 7626258 1283203 -1174225 13703808 28945068 23581538 5149050 -6580174 -11514845
11517a1514845r750613r482446Q115587K5613861K1146606K2997j5684160j6313309
$$ -11514845 -21265458 -30747904 -22632317 2981544 24128150 24151147 8466987 -7846322
11509g846322q260010K077106J2328211J6467973Q109411o989510j3128923l838894
$$ -7846322 -16106332 -14029226 -1701015 14766958 22876369 15886859 2757936 -1080958
11501a080958R574237J4222695J2122401J1521595R619916j102113j3234398j0947968
$$ -1080958 8493279 22715974 34838375 46359970 55979886 54877773 41643375 30695407
11493C0695407J807970K238382j3886700k0531292l126678J3299014L368200j3334681
$$ 30695407 32503377 34741759 20855059 323767 -2802911 10496103 13864303 529622
11485E29622j667830K7942002K9607040p993387m2610815l8545553j0422986P797925
$$ 529622 -1138208 26803794 56410834 48417447 5806632 -32738921 -43161907 -35363982
11477c5363982P856042K761138J40454n51890J038548L282285J636355j361433
$$ -35363982 -27507940 -24746802 -24606348 -25158238 -24119690 -20837405 -19201050 -20562483
11469b0562483J820968P431894L820362m481448K136820K4782277L6299805J8581727
$$ -20562483 -18741515 -11309621 -7489259 -11970707 -9833887 14948390 51248195 69829922
11461F9829922r590419j7843864l345579J0181801L678470j7540880l0102165
$$ 69829922 60239503 42395639 39050060 49231861 52910331 35369451 5267286
11454E267286j6124525J3344042K4861770N367435j4390906k943988J9952504
$$ 5267286 -10857239 2486803 27348573 32716008 18325102 15381114 35333618
11447C5333618J1937967k0421863k8292296j885893J0859602j4664614l5489283
$$ 35333618 47271585 26849722 -1442574 -3328467 7531135 -7133479 -42622762
11440d2622762j1402399K8249444L2079376M728248j0685530k944369K611385
$$ -42622762 -54025161 -25775717 6303659 11031907 346377 -2597992 13393
11433A3393n293341j2554659j1217333o338373J735292J2449849J3202159O1187
$$ 13393 -5279948 -17834607 -29051940 -35390313 -33655021 -21205172 -8003013 -7941826
11425g941826n086886J1976167K5676026P237091k4434449k8751266n792187J0725366
$$ -7941826 -13028712 -1052545 24623481 31860572 7426123 -21325143 -27117330 -16391964
11417a6391964J1333778J4625200J9876609O380780j8353838j9218127Q861370
$$ -16391964 -5058186 9567014 29443623 35824403 17470565 -1747562 7113808
11410G113808K8611193J7374392m863890j6664030k3119351k7378568j5306078
$$ 7113808 35725001 53099393 48235503 31571473 8452122 -18926446 -34232524
11403c4232524J0646724J9902714M91499j6237071m000380J6197775J2129175
$$ -34232524 -23585800 -3683086 -3191587 -19428658 -23429038 -7231263 4897912
11396D897912p839943j2366012K538944J4128747J1929974O043334L672417K835820
$$ 4897912 -2942031 -15308043 -12769099 1359648 13289622 19332956 23005373 25841193
11388B5841193L948951O207261p44311k0683758l3983167j9712097J0485323K3755012
$$ 25841193 29790144 35997405 35253094 14569336 -19413831 -39125928 -28640605 -4885593
11380d885593R432688j0638905j5008348m599847R960034K1535318K1610013K696138
$$ -4885593 4547095 -6091810 -21100158 -25700005 -15739971 5795347 27405360 30101498
11372C0101498k4516043l3520665j4381157R386952J0758072m294462p828642
$$ 30101498 5585455 -27935210 -42316367 -32929415 -22171343 -26465805 -34294447
11365c4294447P789271J9063155O416655j7740461k6701303j3530070N838618
$$ -34294447 -26505176 -7442021 -1025366 -18765827 -45467130 -58997200 -53158582
11358e3158582J6596123J7257125J0462409k133022j2516486q574603Q283268
$$ -53158582 -36562459 -19305334 -8842925 -10975947 -23492433 -32067036 -23783768
11351b3783768J8618305P960298j3040163k1510216j0480460N958077J3122563
$$ -23783768 -5165463 2794835 -10245328 -31755544 -42236004 -36277927 -23155364
11344b3155364J1427032J0298621J3653584J6270779J3737342J1254405J5654446
$$ -23155364 -11728332 -1429711 12223873 28494652 42231994 53486399 69140845
11337F9140845J8472961P78841l4152852m8262158j3562311L8234135M5409487
$$ 69140845 87613806 88392647 54239795 5977637 -7584674 30649461 76058948
11330G6058948L0148l6159799j7411593K1849330K0749738j9579318m4654603
$$ 76058948 76089096 39929297 22517704 44367034 65116772 45537454 882851
11323H82851k8164464J622291J4567560J3715655R790018l19573j3831156j2369366
$$ 882851 -27281613 -25659322 -11091762 2623893 12413911 12094338 -1736818 -14106184
11315a4106184Q308585K2945745J1409019j0416734j5118240l766368J514309
$$ -14106184 -5797599 17148146 28557165 18140431 3022191 -744177 770132
11308G70132m575328m849550Q503730J8642582R533540q289438j2197144j339272
$$ 770132 -3805196 -8654746 -151016 18491566 28025106 19735668 7538524 6199252
11300F199252K665779p190626o763526K0159129M3288319K0343312l3398142n2508238
$$ 6199252 8865031 1674405 -5089121 15070008 58358327 78701639 45303497 -7204741
11292g204741j2000295L2217763K2446147j9710609l3726866j1081790P769022
$$ -7204741 -19205036 13012727 35458874 15748265 -17978601 -29060391 -21291369
11285b1291369Q335875J3168021K3450620J2827327j2933519j2361396J7349480
$$ -21291369 -12955494 212527 23663147 36490474 23556955 11195559 28545039
11278B8545039K2925844j8740569n4117967l3956202R405960J7181910l563439
$$ 28545039 51470883 32730314 -21387653 -55343855 -45937895 -28755985 -32319424
11271c2319424k928763K3123133L1934541J1662871k779191N559161J0888177
$$ -32319424 -35248187 -12125054 19809487 31472358 28693167 34252328 45140505
11264D5140505k868579j3373729l145309Q673479J520616j1713367j0786441m080628
$$ 45140505 42271926 28898197 25752888 34426367 35946983 24233616 13447175 9366547
11256I366547j1122793k6188269k6299035o919834J2928131J7645653R889828
$$ 9366547 -1756246 -27944515 -54243550 -61163384 -48235253 -30589600 -20699772
11249b0699772M43936k952363K184544J0650782R934071o911941k7927845l0597219
$$ -20699772 -20255836 -23208199 -21023655 -10372873 -438802 -7350743 -35278588 -65875807
11241f5875807p528923K0965441K5911009K957682j7922456m774196L2937972
$$ -65875807 -73404730 -52439289 -26528280 -23570598 -41493054 -46267250 -13329278
11234a3329278M7289061J0794890m0084181m4635556J969896L9470267K3893472
$$ -13329278 33959783 44754673 4670492 -39965064 -37995168 1475099 25368571
11227B5368571j4165208j8949943Q371798J8217946o446490k5922879j0995416
$$ 25368571 11203363 -7746580 625218 18843164 12396674 -13526205 -24521621
11220b4521621J1013538N569143r558003L649832L2989921K8840993j4427738
$$ -24521621 -13508083 -7938940 -17496943 -13847111 19142810 47983803 33556065
11213C3556065m1218650j5339081K5984980K8352177k870184k0572927j0137884
$$ 33556065 -7662585 -23001666 2983314 31335491 28465307 7892380 -2245504
11206b245504j412706j1710647j9569784m831760J8427602K5614165J5767590
$$ -2245504 -3658210 -15368857 -34938641 -39770401 -21342799 4271366 20038956
11199B0038956N274886K619521M041525M117303l73468r159414j4650968r142734
$$ 20038956 25313842 27933363 31974888 36092191 35718723 26559309 11908341 2765607
11191B765607L30135j678293j2754391j0735487J1597752K8675002J5977943j2807142
$$ 2765607 3095742 1417449 -11336942 -22072429 -10474677 18200325 34178268 21371126
11183B1371126k3137042n359096J7650436K4026876J3968992j737661j5198791
$$ 21371126 -1765916 -7125012 10525424 34552300 48521292 46783631 31584840
11176C1584840k0676759j6270527j0277236j2643408j7268435p284084J7358243
$$ 31584840 10908081 -5362446 -15639682 -28283090 -45551525 -52835609 -35477366
11169c5477366L2997493K2065592l259625j9186188k1361861k2084245k3007014
$$ -35477366 -2479873 19585719 16326094 -2860094 -24221955 -46306200 -69313214
11162f9313214j0716583J7074898L8217150L0637184J839208j7888970r595507
$$ -69313214 -80029797 -62954899 -24737749 5899435 7738643 -10150327 -19745834
11155a9745834J5354224K9547893J6521195j4879388l6827665k5889817J1426625
$$ -19745834 -4391610 25156283 41677478 26798090 -10029575 -35919392 -24492767
11148b4492767L8495659K5035030j5690811l8417767j8001259K2482586M1511093
$$ -24492767 14002892 39037922 23347111 -15070656 -33071915 -10589329 30921764
11141C0921764K4511920q825993l0602436k6623495j837171K3113263K6371471
$$ 30921764 55433684 46607691 16005255 -10618240 -12455411 10657852 37029323
11134C7029323O227953j6769973k4575226j8154596m172873J5957448L1373501
$$ 37029323 43257276 26487303 1912077 -16242519 -20415392 -4457944 26915557
11127B6915557J9423366j8553609m0235550j3787495K9373448L2930335k417103
$$ 26915557 46338923 27785314 -12450236 -26237731 3135717 36066052 33648949
11120C3648949k1872817k080250J7517785L833199j8592613j4443690M267781
$$ 33648949 11776132 9695882 27213667 31046866 12454253 -1989437 2278344
11113B278344M328525j2528946j8870470r265313j872801k837094j710031M007319
$$ 2278344 6606869 -5922077 -24792547 -34057860 -35930661 -38767755 -40477786 -36470467
11105c6470467P442684R604296J4226197J3601602K679644l878869N838893J4675110
$$ -36470467 -29027783 -19423487 -5197290 8404312 11083956 7205087 13043980 27719090
11097B7719090K633842j3794798n226171J7300267J5310073j3593367l1477303
$$ 27719090 30352932 16558134 11331963 28632230 43942303 30348936 -1128367
11090a128367k4066064j9967402l1665604k7374149J0852783M5328525L6653721
$$ -1128367 -25194431 -45161833 -76827437 -104201586 -93348803 -48020278 -11366557
11083a1366557M611761p175805J11510n115459k0818600j4902364J2740504K4043040
$$ -11366557 -6754796 -13930601 -13819091 -18934550 -39753150 -54655514 -41915010 -17871970
11075a7871970M821888j4107991j0733661k673185m883004R15293K5273137L6620497
$$ -17871970 -13050082 -27158073 -37891734 -40564919 -45447923 -44532630 -19259493 17361004
11067A7361004P068553l4147309l7532611p256570R054029k612721o548547J5905904
$$ 17361004 24429557 -9717752 -47250363 -54506933 -45452904 -48065625 -54614172 -38708268
11059c8708268L4034022K2719980N959944J3480716K7632461J3349570k0350704
$$ -38708268 -4674246 18045734 24005678 37486394 65118855 78468425 58117721
11052E8117721l1653998r777859J2878889J2194488o77383r254662j4913618j8924962
$$ 58117721 26463723 16685864 29564753 41759241 41081858 31827196 16913578 -2011384
11044b011384j0948931Q645333J8814111P372286r055689j1379616n973569p623857
$$ -2011384 -12960315 -4314982 14499129 21871415 12815726 1436110 -4537459 -12161316
11036a2161316j1312318l338712J1220711J5491894Q243749K075208j635895j3183953
$$ -12161316 -23473634 -26812346 -15591635 -99741 8144008 10219216 8583321 -4600632
11028d600632k9512111l0743019q584135J8007988K4833114J0621287m201750
$$ -4600632 -34112743 -64855762 -73439897 -55431909 -30598795 -19977508 -24179258
11021b4179258j671422J5064594K4713192J0032989j9809792l4218794j5980036
$$ -24179258 -25850680 -10786086 13927106 23960095 4150303 -30068491 -46048527
11014d6048527J4905438K4348390P174278q987656l582036J0810233J0361650
$$ -46048527 -31143089 -6794699 379579 -8608077 -12190113 -1379880 8981770
11007H981770n951354j7346779j0250605N906487J2370647L422155p976933o031944
$$ 8981770 3030416 -14316363 -24566968 -18660481 -6289834 -2867679 -10844612 -16876556
10999a6876556P922632J5907976P734677j826597P298540K6301858K2322459j4522586
$$ -16876556 -8953924 6954052 14688729 12862132 20160672 46462530 68784989 54262403
10991E4262403m7876675l8076746K726337K3616007K278595k7514150k5906281
$$ 54262403 6385728 -31691018 -28964681 -5348674 -3070079 -30584229 -56490510
10984e6490510J63001J5598825J1719163J1359822K2875809K2644227m076237
$$ -56490510 -56327509 -40728684 -29009521 -17649699 5226110 27870337 23794100
10977B3794100l1996504k8804873k777239J0570004K605183J293725K1482480
$$ 23794100 -8202404 -37007277 -39784516 -29214512 -26609329 -25315604 -3833124
10970c833124L5505690J3457444k6460950l6178334k425070L4064486L2501200
$$ -3833124 31672566 45130010 18669060 -17509274 -19934344 14130142 46631342
10963D6631342L195169j3638470o229419j066830j4275627k2975748k421123K9945152
$$ 46631342 49826511 36188041 29958622 28891792 14616165 -8359583 -10780706 19164446
10955A9164446L5756500J1708219p620345m540026k786601k3602502m6424603
$$ 19164446 54920946 66629165 59008820 54468794 51682193 28079691 -18344912
10948a8344912l8178342l646691K0800846J5621290l459854j1755191q21914K0205579
$$ -18344912 -56523254 -60169945 -39369099 -23747809 -27207663 -38962854 -39784768 -19579189
10940a9579189L2615400K1523082m747605j6727547j258704J4506544j317959
$$ -19579189 13036211 34559293 29811688 13084141 11825437 26331981 25014022
10933B5014022l5864793m5685013j6453262K0389491L1936382J8021513k469269
$$ 25014022 -10850771 -56535784 -72989046 -52599555 -20663173 -2641660 -5110929
10926e110929j4705140j1989499K018476J1234682N345182k334047L778896J0466209
$$ -5110929 -19816069 -31805568 -29787092 -18552410 -13207228 -15541275 -11762379 -1296170
10918a296170l576748k3303796j3874912J8579126K8667777L144743j6839558
$$ -1296170 -4872918 -28176714 -42051626 -23472500 5195277 8340020 -8499538
10911h499538k589193J9290313J6562579J275303j771853Q83638n997509j1742667
$$ -8499538 -11088731 8201582 24764161 26039464 24267611 25151249 19153740 7411073
10903G411073l739738K721436n941940j0744619M008349J3551942o378785k9282175
$$ 7411073 3671335 6392771 450831 -10293788 -6285439 7266503 887718 -28394457
10895b8394457j6818949J5147941K1996168M254780p768J4165926J4411212m497959
$$ -28394457 -45213406 -30065465 -8069297 -3814517 -3822285 10343641 24754853 20256894
10887B0256894j0338133N461180J0953366q283274k3318961j2450732N207404
$$ 20256894 9918761 15379941 26333307 18050033 -5268928 -17719660 -12512256
10880a2512256O856484p59639n331766j1797689k0442448j3870484J1755860K9703402
$$ -12512256 -5655772 -6415411 -11747177 -23544866 -43987314 -57857798 -46101938 -16398536
10872a6398536J9119495m360994j4350292q998453j921841K446162N855393N114871
$$ -16398536 2720959 -1640035 -15990327 -24988780 -26910621 -24464459 -18609066 -13494195
10864a3494195K63007n38596L239218o04744j5113307k3486212j1756134J2179304
$$ -13494195 -13231188 -13769784 -10530566 -11135310 -26248617 -49734829 -61490963 -49311659
10856d9311659L0653376L2956198J5789946j4253360l4654453k5243059K448601
$$ -49311659 -18658283 14297915 30087861 15834501 -18819952 -44063011 -41614410
10849d1614410J7032281J1667613Q511260J4584734Q794281j4835430k8389696
$$ -41614410 -24582129 -12914516 -4403256 10181478 18975759 4140329 -24249367
10842b4249367j4928018K502329J733355j473060J2594870K6778274J6564616
$$ -24249367 -39177385 -36675056 -34941701 -36414761 -23819891 2958383 19522999
10835A9522999l609767l268159J2172476J3003429k838211j0632559n746943q085402
$$ 19522999 15913232 12645073 24817549 37820978 34982767 24350208 18603265 10517863
10827A0517863j9119331j5682914M682722J0778611j2216050l1740271j2364301
$$ 10517863 -8601468 -24284382 -19601660 -8823049 -21039099 -52779370 -65143671
10820f5143671K9725949M5475999J7443021k1119694l2670954j7830427j322558
$$ -65143671 -35417722 10058277 27501298 6381604 -26289350 -44119777 -45442335
10813d5442335O765469J5421126K4553686J7642240q702894k8967736k0843337
$$ -45442335 -38676866 -23255740 1297946 18940186 10237292 -18730444 -39573781
10806c9573781J575619R402051K567153L316497J2448708P372142j2589631j6460370
$$ -39573781 -37998162 -28596111 -26028958 -22712461 -10263753 -2891611 -15481242 -31941612
10798c1941612Q101414K8701590J5459868j3116966j9408661j544917J1043058
$$ -31941612 -23840198 4861392 20321260 7204294 -12204367 -13749284 -2706226
10791b706226M244645p723969j0302427m727994K357212O493040L553739n637865
$$ -2706226 1538419 -6185550 -16487977 -21215971 -18858759 -12365719 -8811980 -14449845
10783a4449845j1505263p308579Q17439M452890N020379O338647N944504L306785
$$ -14449845 -25955108 -33263687 -32446248 -27993358 -22972979 -16634332 -10689828 -7383043
10775g383043L982353O111765j373116j5918899j5774059P341229K9035498K4467245
$$ -7383043 -3400690 2711075 1337959 -14580940 -30354999 -23013770 6021728 30488973
10767C0488973K568369j1053548q094897M729211K2073359L2282185J5506668
$$ 30488973 33057342 22003794 13908897 18638108 40711467 72993652 88500320
10760H8500320k3774977m4632916k1840971J1041124P628544k1590496k8714995
$$ 88500320 64725343 20092427 -1748544 9292580 16921124 -4669372 -33384367
10753c3384367l105515K1507029K6801479K6105552K2116053R44957k5096199
$$ -33384367 -36489882 -14982853 11818626 37924178 60040231 60985188 35888989
10746C5888989k1063495J0339035K2165671l581311k5302580j0770069J1130138
$$ 35888989 14825494 25164529 47330200 43748889 18446309 7676240 18806378
10739A8806378M012067j3010688k496622K2445801J9198268j1589358k7185151
$$ 18806378 22818445 9807757 7311135 29756936 48955204 37365846 10180695
10732A0180695j2539490O93388q088636j5984549j63622K0852297J6343852p261607
$$ 10180695 -2358795 -1665407 -9754043 -25738592 -25902214 -5049917 11293935 4032328
10724D032328j5637496K502397K1135916J7544888M325941N956323J7808546J2172247
$$ 4032328 -11605168 -9102771 12033145 29578033 33903974 39860297 57668843 69841090
10716F9841090j6039807l5439315k2226175L493068P195596r280531j4614941
$$ 69841090 53801283 18361968 -3864207 -371139 6824457 -2456074 -17071015
10709a7071015J502177J6465672J4937633R433941J1663108J1986108J784168
$$ -17071015 -15568838 896834 15834467 25268408 36931516 48917624 50701792
10702E0701792q358444r386663j0710324j8598061j8734843j159492J6391244
$$ 50701792 42343348 32956685 22246361 3648300 -15086543 -16246035 145209
10695A45209J3686644O19856m82716Q552589J0059686M239248M622070P188237
$$ 145209 13831853 14451709 13968993 22521582 32581268 36820516 41442586 48630823
10687D8630823l621418k0252762j7347822M087388J1684809p784140k4677852
$$ 48630823 45009405 24756643 7408821 11496209 23181018 15396878 -9280974
10680i280974j1954168J2686243J5292841l287167j3798512n090581N493652N889965
$$ -9280974 -21235142 -8548899 6743942 3456775 -10341737 -15432318 -9938666 -4048701
10672d048701N528904J2038788J4741009L025736j4283860k0658593j3586461
$$ -4048701 1480203 13518991 28260000 31285736 17001876 -3656717 -17243178
10665a7243178l639574J923740N090276J0081556J7008073K0124472J0669272
$$ -17243178 -20882752 -18959012 -13868736 -3787180 13220893 33345365 44014637
10658D4014637j1639964k9075358k1300759M117832J3937339n271542k2483737
$$ 44014637 32374673 3299315 -18001444 -13883612 53727 -5217815 -27701552
10651b7701552n109260K9161593L4810621N213614j9834782j5180391r9840M022918
$$ -27701552 -32810812 -3649219 31161402 36375016 16540234 1359843 1260003 5282921
10643E282921O634502J7386371J8521565k070814j9947879j1172035M769538j726227
$$ 5282921 11917423 29303794 47825359 45754545 25806666 14634631 19404169 17677942
10635A7677942j6084855n077369J8793511J2709140k0245236k8074153N897061
$$ 17677942 1593087 -3484282 15309229 28018369 7773133 -20301020 -14403959
10628a4403959L0845611N432090l8920305m5777314j1628185K0084639K1430550
$$ -14403959 16441652 21873742 -17046563 -62823877 -74452062 -54367423 -32936873
10621c2936873L433359r967586m921400J6082487L2374092K1462708q572475k1387144
$$ -32936873 -29503514 -39471100 -44392500 -28310013 4064079 25526787 16954312 -4432832
10613d432832l073559J3216699l245041l0550178k5927177Q899238L0694873J6294805
$$ -4432832 -7506391 5710308 2465267 -28084911 -54012088 -45112850 -14417977 1876828
10605A876828j2626090k6021079j8162476j527138Q961025L804931j0391799j0554525
$$ 1876828 -10749262 -36770341 -54932817 -56459955 -47498930 -43693999 -54085798 -64640323
10597f4640323J3805001L7288784K7810260n746746k2516054o346843J4694269
$$ -64640323 -50835322 -13546538 14263722 8516976 -13999078 -20345921 -5651652
10590e651652J1362486r628173k1869518j3225484P262434K2774997K1411135
$$ -5651652 5710834 -3917339 -25786857 -39012341 -31749907 -8974910 12436225
10583A2436225O032993n578831p47139R828330P772975l148752k844972J0610350
$$ 12436225 18469218 12890387 12143248 21971578 29744553 26595801 23750829 34361179
10575C4361179J5647926J115220j6403537j8170522q207351k073633m396540p949523
$$ 34361179 50009105 51124325 34720788 16550266 8342915 6269282 1872742 -6076781
10567f076781o416698o72850L144494M99092l393754J449080J1108830P941702
$$ -6076781 -12493479 -13166329 -10021835 -9522743 -12916497 -11467417 -358587 7583115
10559G583115q893295j3061122P138601J9176897p037813m2361220l5188526N708481
$$ 7583115 -1310180 -14371302 -7232701 11944196 4906383 -37454837 -72643363 -66934882
10551f6934882K1300137l152514j5337627J5036041M4978500K9250991q414073
$$ -66934882 -45634745 -48787259 -64124886 -49088845 -4110345 25140646 16726573
10544A6726573j7685187L416869J9777620J5878316K87375k0701970l5563711
$$ 16726573 -958614 2458255 22235875 38114191 38401566 17699596 -17864115
10537a7864115k0300543K1410834L8667568m24018m8402577l6739124K4043653
$$ -17864115 -38164658 -16753824 21913744 21489726 -26912851 -63651975 -39608322
10530c9608322N8833765L3031602j2793026l1802578k1309477N12845K0123435
$$ -39608322 19225443 52257045 39464019 7661441 -13648036 -13135191 6988244
10523F988244K2161297r32790k5376565j9579529O029041J2285210n131245j1113465
$$ 6988244 29149541 28216751 2840186 -16739343 -10710302 1574908 -3556337 -14669802
10515a4669802N289920J2075596q411464l0017417k7965573j2078378K178546
$$ -14669802 -9379882 2695714 -5715750 -35733167 -63698740 -75777118 -73598572
10508g3598572J6381545K6456039J6612021p002527j4719814q83240O410076l236562
$$ -73598572 -57217027 -30760988 -14148967 -21151494 -35871308 -36754548 -30344472 -33581034
10500c3581034n653861P331710R053105r168367j5834792N103228K5269428K3485112
$$ -33581034 -39234895 -31903185 -22850080 -32018447 -47853239 -42750011 -17480583 6004529
10492F004529J4662119M109579k3155743l8092264K6202513J49855524J92012421
$$ 6004529 20666648 24776227 1620484 -36471780 -10269267 139586257 331598678
10485C31598678O6811839j12384809j66673342q3251802k342026j797294j9555938
$$ 331598678 398410517 286025708 119352366 36100564 33758538 31961244 12405306
10478A2405306N059642L3928187J3961359l2186196m9709298k7152993R881273
$$ 12405306 17464948 51393135 65354494 33168298 -16541000 -43693993 -33812720
10471c3812720L5561842L0767096l854952k9160647q483556K8700324K1367018
$$ -33812720 1749122 32516218 28661266 -499381 -8982937 19717387 41084405
10464D1084405k2549243l1938599R764643L3962029J232922l5715279k5748539
$$ 41084405 18535162 -13403437 -3638794 30323235 31556157 -4159122 -29907661
10457b9907661R97451J585741j053345K6336388N0607704K4253032k7209198m1800164
$$ -29907661 -28910210 -27324469 -28377814 -2041426 48566278 72819310 45610112 3809948
10449C809948j5611746O077855Q672047J4033600K2602052J2357172j1473351
$$ 3809948 -11801798 -5723943 2948104 16981704 39583756 51940928 40467577
10442D0467577k0072372j0972026q152614j6279807j6341088l194968Q579289
$$ 40467577 20395205 9423179 1270565 -15009242 -31350330 -34545298 -25966009
10435b5966009J1372268P460747m208735j7500901j2756205J1768196K5340553
$$ -25966009 -14593741 -7132994 -11341729 -28842630 -41598835 -29830639 -4490086
10428d490086J0702030n174686L40823L278572j7483060k9293758p27532L0409642
$$ -4490086 6211944 1037258 1378081 4656653 -12826407 -42120165 -42847697 -12438055
10420a2438055J2488207k7418477k4237709J3716496K0013270j2787321k2505135
$$ -12438055 50152 -27368325 -51606034 -37889538 -17876268 -30663589 -53168724
10413e3168724J0227450K9636974O159900j4760798J176815J8238564R59701k1437398
$$ -53168724 -42941274 -13304300 -7144400 -21905198 -20728383 -2489819 -1530118 -22967516
10405b2967516r914425J6614942J7847923k822867j4657536j0004720j67131J2148345
$$ -22967516 -32881941 -16266999 1580924 -1241943 -15899479 -25904199 -26071330 -13922985
10397a3922985K4115269K1864560M485884o964603m507024o260581j6769985j2572536
$$ -13922985 10192284 32056844 36542728 29578125 25071101 18810520 2040535 -10532001
10389a0532001J1374925K2984290O922667o315468L963493Q832516j6402486m1021997
$$ -10532001 842924 23827214 30749881 24434413 28397906 37230422 20827936 -20194061
10381b0194061k6496667J0316889K7720656K1897855J3725420L361836j4039018
$$ -20194061 -46690728 -36373839 -8653183 13244672 26970092 30331928 16292910
10374A6292910j6329098R764780K6580483m095465m9330180m4818590O289153
$$ 16292910 -36188 9728592 36309075 32213610 -17116570 -61935160 -55646007
10367e5646007L7476367J8614731j0600000j3252944k332633O14723K334419J0627442
$$ -55646007 -18169640 445091 -10154909 -23407853 -25740486 -25125763 -22791344 -12163902
10359a2163902J1850062K02874l595700J3160122K8852731J8977730p132555k2569296
$$ -12163902 -313840 -110966 -3706666 9453456 38306187 57283917 50151362 27582066
10351B7582066j9534949r778980m62838J0616420K0503714J8072090j386863k5569374
$$ 27582066 8047117 -1731863 -2194701 8421719 28925433 46997523 45610660 20041286
10343B0041286l4202826k0379461m5134O315255l01100j289279R690644J7815703
$$ 20041286 -14161540 -34541001 -34586135 -28270880 -28571980 -29861259 -20170615 -2354912
10335b354912J2378208J226510p538307j6239949k0269011o229822J8115817K1298106
$$ -2354912 10023296 11249806 3711499 -12528450 -32797461 -39027283 -20911466 386640
10327C86640l884436k0370240j769825K3643401J8452830l363648m061219J2944420
$$ 386640 -3497796 -23868036 -25637861 -1994460 16458370 13094722 9033503 21977923
10319B1977923J4057073l744228j2667561o330247m151502p968078j397147R099835
$$ 21977923 36034996 32290768 19623207 13292960 9141458 1173380 -223767 8876068
10311H876068k92383k2414281k2739737L738200K3863288K0680163J2164093Q628476
$$ 8876068 8583685 -13830596 -36570333 -32832133 -8968845 11711318 23875411 32503887
10303C2503887k373178j7690645j1662620J6257665L0217226J2961097p826042
$$ 32503887 30130709 12440064 777444 17035109 47252335 60213432 52387390
10296E2387390p126180K154261J504660l221607n507278j5682416l2330670l0941373
$$ 52387390 45261210 47415471 48920131 45698524 40191246 24508830 -7821840 -38763213
10288c8763213m577144J6972839J1927421j696313j997335J985898l537842p811460
$$ -38763213 -43340357 -26367518 -14440097 -16136410 -18133745 -16147847 -19685689 -27497149
10280b7497149N37690Q594803L927392k109224J711529O768763Q170052J6197364
$$ -27497149 -26959459 -18364656 -14437264 -16546488 -14834959 -8066196 103856 16301220
10272A6301220K5470807J0846526k3607906l4662712p004714J5922830K713130
$$ 16301220 41772027 52618553 29010647 -5652065 -12656779 3266051 5979181
10265E979181j3481325K651166K2755466P344546j8927188r417417K1061359K4274594
$$ 5979181 -7502144 -4850978 17904488 25249034 6321846 -3095571 17965788 42240382
10257D2240382M196102K401865J6092245N543483k5663270l2638016j0764052
$$ 42240382 46436484 48838349 64930594 70474077 44810807 12172791 1408739
10250A408739l002794j9974907k2461446M831438K7755336K5551083J7349044
$$ 1408739 -1594055 -21568962 -44030408 -39198970 -11443634 14107449 31456493
10243C1456493J1740847p346489k8989539j5896421K2873396K8942202q626165
$$ 31456493 43197340 35850851 6861312 -9035109 13838287 42780489 34154324
10236C4154324k5978149Q795145L5831146L572794m0193649k6971141J7909288
$$ 34154324 8176175 16971320 52802466 56375260 16181611 -10789530 7119758
10229G119758K0480661j8420536l0523316M358201L1874476J5911771j2229795
$$ 7119758 27600419 9179883 -21343433 -16985232 14889244 30801015 18571220
10222A8571220j3672527L783873J2479979O187408m994721j2787880j0218543
$$ 18571220 4898693 8682566 21162545 27349953 22355232 9567352 -651191
10215f51191M810179J8294214J3074028m429618j1525719l244134L742560R44154
$$ -651191 4158988 22453202 35527230 31097612 19571893 16327759 20070319 21014473
10207B1014473k141327L61224K022738l0093l79736J456403L52433k169891j201411
$$ 21014473 18873146 19234370 21257108 21227015 20847279 22303682 22656115 20486224 19284813
10198A9284813p53822o203055j0223670m320392L460058K376409L61028P667778
$$ 19284813 18530991 12327936 2104266 -2216126 1243932 3620341 3981369 11649147
10190A1649147J0593949q344262l2407452k7563316N140138K9243843K6154507
$$ 11649147 22243096 13898834 -18508618 -46071934 -40931796 -11687953 14466554
10183A4466554J3472883N724061o262980k5383436l1518476j2191026J5224946
$$ 14466554 27939437 33663498 27400518 2017082 -29501394 -41692420 -26467474
10176b6467474K7461278K1425999N971406j1390237k0710450j4004817j128144
$$ -26467474 993804 22419803 28391209 17000972 -3709478 -17714295 -18842439
10169a8842439O2304o551569j072806J4038583J3929861l090492p332923J0558035
$$ -18842439 -18780135 -25331704 -26404510 -12365927 1563934 -1526558 -8859481 1698554
10161A698554J8606834l142889k5473707j6875353M649403L959532j1715954p684821
$$ 1698554 20305388 17162499 -8311208 -25186561 -20537158 -16577626 -28293580 -35978401
10153c5978401J7697399K9661078J2235422r241511p665956R725211J5823825
$$ -35978401 -18281002 11380076 23615498 14373987 6708031 16433242 32257067
10146C2257067M23661j7461025j2977638J0993194K2040923J402341k2096527
$$ 32257067 32680728 15219703 2242065 13235259 35276182 36678523 14581996
10139A4581996q230133K9947897L7347632p36751l3670124k3349630k6704n990999
$$ 14581996 6351863 36299760 73647392 72910641 39240517 15890887 15864183 9873184
10131I873184k5858601j9555287P104922J7212762P431604N509984J5531559J5816677
$$ 9873184 -15985417 -35540704 -28435782 -11223020 -3791416 1718568 17250127 33066804
10123C3066804M859898K267566P144422j97976j6711246j9101979o976547k926923
$$ 33066804 37926702 40194268 47338690 47140714 30429468 11327489 4350942 1424019
10115A424019j0851528j4161774j2429056j7588217j7757002P891200L9847172
$$ 1424019 -9427509 -23589283 -36018339 -53606556 -71363558 -63472358 -23625186
10108b3625186L5846155J494991j0901314J5738442L6733212J7568103j8933894
$$ -23625186 12220969 13715960 2814646 18553088 55286300 72854403 53920509
10101E3920509l7767051l6134479k1221682R109734L9373874L6184524J212303
$$ 53920509 16153458 -19981021 -41202703 -32092969 7280905 43465429 44677732
10094D4677732j9452803m663377R094612p179082k6179000j6622152K300401J143137
$$ 44677732 25224929 20561552 29656164 22477082 -3701918 -20324070 -18023669 -16880532
10086a6880532o504723L702688J7388230J0216472n547071p181570l081756n471319
$$ -16880532 -23385255 -19682567 -2294337 7922135 2375064 -4806506 -7888262 -13359581
10078a3359581M046444L4789331M8382817J3515758l2855412l6783884j0331115
$$ -13359581 -9313137 25476194 73859011 87374769 54519357 17735473 7404358
10071G404358j391466q357134M861621K8956139K0763396j4008208k5184925m704514
$$ 7404358 6012892 -2344242 2517379 31473518 52236914 38228706 13043781 8339267
10063H339267M755841p855780n418544J9507788K4135347o114829k8036832j6715470
$$ 8339267 13095108 5239328 -179216 19328572 43463919 37349090 9312258 -7403212
10055g403212n722347j8581618k2516599Q336405L8374647K6329183p906681j9059296
$$ -7403212 -13125559 -31707177 -54223776 -45887371 -7512724 18816459 10909778 -8149518
10047h149518m290462Q344364R511171O115405m301119j9139684j6146378J0979850
$$ -8149518 -12439980 -4095616 5415555 11530960 7229841 -11909843 -28056221 -17076371
10039a7076371K8327050R703316j7422351j3994176O888279L701113k3291345
$$ -17076371 11250679 20953995 3531644 -10462532 -3574253 126860 -23164485
10032b3164485l3695616j2467827J0502987R084603n977376r620055N962274K7520715
$$ -23164485 -56860101 -69327928 -58824941 -49740338 -55717714 -65337769 -59375495 -31854780
10024c1854780L4092879J6047034r622682j3814940N331378J6614668K348642
$$ -31854780 2238099 18285133 8662451 -5152489 178889 16793557 19142199
10017A9142199j5149068j3547358o773854j2031121j1190592J5156668M1132719
$$ 19142199 3993131 -9554227 -16328081 -28359202 -39549794 -24393126 16739593
10010A6739593L0656574j47517q238990K119770r769811l9428736l3046877K0533490
$$ 16739593 47396167 47248650 39009660 41129430 31359619 -8069117 -41115994 -20582504
10002b0582504N7165142K8574652k5039604l5192476o24235K3555879R415906
$$ -20582504 36582638 65157290 40117686 4925210 4300975 27856854 37272760
9995C7272760j7270672k5758248j5786161k182061O335389O751811M5579n195904
$$ 37272760 20002088 -5756160 -21542321 -23724382 -17388993 -10637182 -10591603 -15787507
9987a5787507j068377O719870O439191o93515k883833J819724K510842n042955
$$ -15787507 -16855884 -10136014 -3696823 -4390338 -7274171 -5454447 -2943605 -7986560
9979g986560r826859j686090J4355671K4857628K1253935M187776j5727610j9775895
$$ -7986560 -17813419 -19499509 -5143838 19713790 40967725 45155501 29427891 9651996
9971I651996K089375L0327091K8603778q839813l8844902k1226546K1977474L0919974
$$ 9651996 11741371 42068462 70672240 61832427 22987525 1760979 23738453 54658427
9963E4658427q714874m3830836k9934999O570633J2365058j2521342k0300042
$$ 54658427 45943553 2112717 -27822282 -21251649 -8886591 -21407933 -41707975
9956d1707975Q257699L7031479L1000018K775969j4123099j1889172o991115p906774
$$ -41707975 -33450276 3581203 34581221 37357190 23234091 11344919 4353804 -3552970
9948c552970n632078P282078K1731619J9804392k646029k3017387j2807708K2141266
$$ -3552970 -9185048 -1902970 19828649 39633041 36987012 13969625 1161917 23303183
9940B3303183L9559413J5059679k1080815k7326118j0763419o024699j1734571
$$ 23303183 62862596 77922275 56841460 29515342 18751923 12727224 992653
9933I92653J060181K4385506J7641562j6762232k5201538R500015L4044074R942301
$$ 992653 2052834 26438340 44079902 27317670 2116132 11616147 45660221 55602522
9925E5602522k5654889k5832546o752429m653487q263555P962531K3727435R349977
$$ 55602522 29947633 4115087 -2637342 -7290829 -15554384 -7591853 16135582 25485559
9917B5485559j0558729L369013K8622698J4807786k4798560l1256822p65650J0095025
$$ 25485559 14926830 18295843 46918541 61726327 36927767 5670945 4905295 15000320
9909A5000320j6888228l3452384j1160688J3239588M441140j6831067j5406718
$$ 15000320 -1887908 -35340292 -46500980 -33261392 -28820252 -45651319 -61058037
9902f1058037O556980K5513412K9712250J9072088K133642o35350J7506940K6654493
$$ -61058037 -54501057 -28987645 724605 19796693 21930335 21294985 38801925 65456418
9894F5456418M462980j3636675R926414K7763673l3693871j29844084j25541631
$$ 65456418 69919398 56282723 66209137 93972810 60278939 -69565145 -195106776
9887a95106776Q20205R8647261N7182167l3231119l0610095L9274541M3834518
$$ -195106776 -194286571 -95639310 -38457143 -71688262 -102298357 -63023816 -19189298
9880a9189298l0324768o0770793N538794O8753042L6014184m3400571o4191784
$$ -19189298 -49514066 -110284859 -104746065 -35993023 21161 -43379410 -107571194
9873a07571194j3692962L2707641K5343090j0012501k3669772k691091K2889010
$$ -107571194 -121264156 -88556515 -63213425 -73225926 -96895698 -99586789 -76697779
9866g6697779J8844548j1020181k6523082l811146K8806564L0947625R743856
$$ -76697779 -57853231 -68873412 -95396494 -99207640 -70401076 -39453451 -29709595
9859b9709595L212972J4982108J1764053j3197923k3155316J477262K8638877
$$ -29709595 -26496623 -11514515 249538 -12948385 -36103701 -34626439 -5987562
9852e987562K3642449j086374j1225905q79937Q175099K151393j1527272j8667389
$$ -5987562 17654887 16568513 5342608 4462671 12637770 14789163 3261891 -15405498
9844a5405498j2400531J782143J0058374O211571J420189O852740J3627410P917813
$$ -15405498 -27806029 -26023886 -15965512 -9753941 -8333752 -1481012 12146398 20064211
9836B0064211k892412l183570J027620m511671q009872J0295647L0735814J3120472
$$ 20064211 17171799 13988229 15015849 10504178 2494306 12789953 43525767 56646239
9828E6646239l1968931m4209886l646804L3452332J8962570j6513301j9704236
$$ 56646239 24677308 -19532578 -23179382 10272950 29235520 12722219 -6982017
9821f982017Q90567O51818j9566393j8140830J1787062K9819686J5351325l726291
$$ -6982017 -6091450 -5439632 -25006025 -43146855 -31359793 -1540107 13811218 10084927
9813A0084927l014941P96639j3562737l0782222k2821022M716148J8016933J670603
$$ 10084927 7069986 7866625 -5696112 -36478334 -59299356 -54583208 -36566275 -34895672
9805c4895672k1069780j7822070J4124146M4022901M0780385P027546k3431421
$$ -34895672 -55965452 -73787522 -59663376 -15640475 25139910 32167456 8736035
9798H736035k3718489l393386P001519m030430j6654321r224398J2184384K3510775
$$ 8736035 -14982454 -18375840 -11374321 -15404751 -32059072 -41283470 -29099086 -5588311
9790e588311J6212393P112322J0928534J6462429M809643j6044835j8131151J689224
$$ -5588311 10624082 17736404 28664938 45127367 49937010 33892175 15761024 17450248
9782A7450248J1176998p355500k3727951n010516K8297114L1225587O342677j770851
$$ 17450248 28627246 21271746 -2456205 -7466721 20830393 52055980 58398657 56627806
9774E6627806J6952677K0459293j2747812m4771313l8215163r957571P127120
$$ 56627806 73580483 94039776 81291964 36520651 -1694512 -11652083 -4524963
9767d524963J4831513K3721344J5849818j8824276m1553205j6113635K3104084
$$ -4524963 10306550 34027894 49877712 31053436 -10499769 -26613404 -3509320
9760c509320J5845298k6281762l4602338O214040L3613151P903895k9115280k6168007
$$ -3509320 12335978 -13945784 -48548122 -42334082 -8720931 -817036 -29932316 -56100323
9752e6100323L168275J7567211J4850236J6633012J7959608m14845k7250216l1111381
$$ -56100323 -52932048 -35364837 -20514601 -3881589 14078019 13663174 -13587042 -44698423
9744d4698423q049992J4458850J6744447M026246r786482j2704655L012209K7306966
$$ -44698423 -52748415 -38289565 -21545118 -17518872 -27305354 -40010009 -36997800 -9690834
9736i690834L0763173k3541l5008986l4221382j463053K2036111J2849961j2644257
$$ -9690834 21072339 21048798 -13960188 -48181570 -49644623 -27608512 -14758551 -27402808
9728b7402808k9009316k7185468q672751J8815070L6107852K7680226O612312
$$ -27402808 -56412124 -83597592 -92270343 -73455273 -37347421 -9667195 -3054883
9721c054883R05785J1385067J0618410r225305j9006316N47411K4109865J9449787
$$ -3054883 -2149098 9235969 19854379 10629074 -8377242 -7829831 16280034 35729821
9713C5729821k617325p563896P088184J0425587r913215k8777386k4938107j1998473
$$ 35729821 33112496 25548600 32636784 43062371 33149156 4371770 -20566337 -32564810
9705c2564810j0606687j2349547L319311K7698559K8061375k832920k8830296
$$ -32564810 -43171497 -55521044 -52201733 -24503174 3558201 725281 -28105015
9698b8105015j7048263J5611680K5301803K351934j7987610r825345O746630J497040
$$ -28105015 -45153278 -29541598 -4239795 -1887861 -19875471 -29700816 -22954186 -21457146
9690b1457146j5566838j0160181J8464007L1152961P846113j9010288j0870013
$$ -21457146 -37023984 -47184165 -28720158 2432803 10278916 -8731372 -19601385
9683a9601385J9673248K7421125N50863k4070720j5798300P777567J0046089j1659141
$$ -19601385 71863 27492988 28043851 3973131 -11825169 -4047602 5998487 -5660654
9675e660654k5323370j1224569J2883292J9835859R551873L256872R100067J1428889
$$ -5660654 -30984024 -42208593 -29325301 -9489442 62431 3319303 12419370 23848259
9667B3848259k581774k0637478k0790605j416917J7336787J9821620J0038567
$$ 23848259 21266485 629007 -20161598 -21578515 -4241728 15579892 25618459
9660B5618459l68185o571726q416485n300133q71993l674481j4078259j8419352
$$ 25618459 25250274 18678548 10262063 4961930 4089937 415456 -13662803 -32082155
9652c2082155o842478R475072J1844364R26308m731323K865070R711850K711977
$$ -32082155 -38924633 -29449561 -17605197 -16678889 -21410212 -18545142 -8833292 -6121315
9644f121315q573363m076145J7779693L3539090K0129904j5971197l9716528k3875443
$$ -6121315 -14694678 -18770823 -991130 32547960 52677864 36706667 -3009861 -26885304
9636b6885304J5349330L1089482K988804l1768276k3987519J9680701M2956794
$$ -26885304 -11535974 19553508 22542312 -9225964 -33213483 -13532782 29424012
9629B9424012J5873904k7282268l9580890k1310476m452167j244353L4990K747641
$$ 29424012 45297916 18015648 -21565242 -42875718 -47327885 -48572238 -48537248 -45789607
9621d5789607J1427j294962J1453349K6068063J7024353r604819j7800279L206143
$$ -45789607 -45778180 -47073142 -35619793 -9551730 7472623 -2132196 -19932475 -16726332
9613a6726332K0572648R470123j1156965j5727596j2702174j9361798k3237689
$$ -16726332 3846316 13316439 2159474 -13568122 -26270296 -45632094 -68869783
9606f8869783m362779K2453304K5382084N716496n463746M047062J5731983J5463248
$$ -68869783 -73232562 -50779258 -25397174 -19680678 -25144424 -21097362 -5365379 10097869
9598A0097869Q573451q07946j4760256k3477888j2193321R681653J5575085K716956
$$ 10097869 18671320 17863374 3103118 -20374770 -32568091 -22886438 -7311353 -4594397
9590d594397l673212P230650J7091474J4305021J1325606J4238679R005912o562697
$$ -4594397 -8267609 -1036959 16054515 30359536 41685142 55923821 64929733 58367036
9582E8367036j1758508k626131o068396k9829338l6558194j908184L6254082K9574603
$$ 58367036 46608528 43982397 37914001 8084663 -28473531 -30381715 5872367 35446970
9574C5446970p218218k2229728n804706P503810M430917O405932J8969411J9424512
$$ 35446970 28228752 5999024 194318 7698128 12129045 18534977 37504388 56928900
9566E6928900J851684j1198838j1226114j5332193k5209529j8134092O793846
$$ 56928900 58780584 47581746 36355632 21023439 -4186090 -22320182 -15526336
9559a5526336J6861390j01288j1438775N569524K4078873J3883521p684149p989196
$$ -15526336 1335054 1233766 -10205009 -4635485 19443388 33326909 25642760 17653564
9551A7653564N614473L555782j1808111j1778400P464429J7463328J751291k2014771
$$ 17653564 23268037 26823819 15015708 3237308 10701737 28165065 29916356 7901585
9543G901585k7937644r751712J8498413L5206147K7037107K899127j4298217j6844119
$$ 7901585 -20036059 -29787771 -11289358 23916789 50953896 53853023 39554806 22710687
9535B2710687j8350781k2368564r592632K4881141M7541678K8585260j2015065
$$ 22710687 4359906 -18008658 -27601290 -2720149 44821529 73406789 61391724
9528F1391724l2226314k4699213j1968402j187571J6252059K9837693J7619129
$$ 61391724 29165410 4466197 -7502205 -8689776 7562283 37399976 55019105
9521E5019105j2569354k8274034j9702425o456213J496336J1329965J6591736
$$ 55019105 42449751 14175717 -5526708 -11982921 -10486585 843380 17435116
9514A7435116J421714k0631656j5937837J3142976K5898616P653070r921970p212742
$$ 17435116 18856830 -1774826 -17712663 -4569687 21328929 28981999 19060029 11847287
9506A1847287n489598j6294147j4238659R185969J6109785j3133088l4132850
$$ 11847287 6357689 -9936458 -24175117 -14989148 1120637 -12012451 -46145301
9499d6145301p293253K9859385J9397639k0991099k7148372O260859K2596537
$$ -46145301 -53438554 -23579169 -4181530 -25172629 -52321001 -46060142 -23463605
9492b3463605J164624j3882766N670617K7224643J7388103n903472j1192751k591590
$$ -23463605 -22298981 -36181747 -30511130 -3286487 14101616 8198144 -2994607 -5586197
9484e586197n19324m582400m161685k223574m307891l188448O315496J5147354
$$ -5586197 -6105521 -10687921 -14849606 -17073180 -21381071 -24569519 -18254023 -3106669
9476c106669J6447597J4438437P631340j0828691k6677924j2162518K4153853
$$ -3106669 13340928 27779365 35410705 24582014 -2095910 -14258428 9895425
9469I895425L3253700l863036l9815756k8979387M173267R146648q741483n784522
$$ 9895425 43149125 39286089 -529667 -29509054 -25335787 -16189139 -24930622 -30715144
9461c0715144J9632261K5828576L832129p155460Q686337J4434360j3222002l7818036
$$ -30715144 -11082883 14745693 18577822 11422362 20108699 34543059 21321057 -16496979
9453a6496979j8636373K3931882L8428600J4769727j1924715j6532324o728047
$$ -16496979 -35133352 -11201470 27227130 41996857 30072142 13539818 6811771
9446F811771M299677J5329237K4185202K1945398O839461j0901157k1027982j9651549
$$ 6811771 11111448 26440685 50625887 72571285 79410746 68509589 47481607 27830058
9438B7830058o732726R899819J2770904o447069k8764598k6262389R21324K3116573
$$ 27830058 21097332 30997151 43768055 37320986 8556388 -17706001 -16784677 6331896
9430F331896J8609833l902197k2729723k5453309r963635J7106621L5355784K4126309
$$ 6331896 24941729 21039532 -1690191 -27143500 -37107135 -20000514 15355270 39481579
9422C9481579p047245k1013617k010791J7555773K428928l0371067l4083290k217759
$$ 39481579 32434334 11420717 9409926 26965699 29394627 -976440 -35059730 -37277489
9414c7277489K1716464R763781j2230812r656223R014998J3384080K312059j19533
$$ -37277489 -15561025 -5797244 -18028056 -27684279 -18669281 -5285201 -2973142 -3092675
9406c092675J0470561J3044278O11383p158507O96185O506937o004003k3901469
$$ -3092675 7377886 20422164 21033547 13875040 14571225 21078162 15074159 -8827310
9398h827310k5081824j0250894K954131N974351K829014k255324m749890K867233
$$ -8827310 -33909134 -44160028 -41205897 -35231546 -32402532 -34657856 -39407746 -36540513
9390c6540513J7664927K0858520L728403j3358101j0220018j930396j3746715
$$ -36540513 -18875586 1982934 5711337 -7646764 -17866782 -19797178 -33543893
9383c3543893l0666910j3406015L2983602N2495820J7729738k6426219k7958956
$$ -33543893 -64210803 -77616818 -44633216 7862604 25592342 -833877 -28792833
9376b8792833j7992J1097915R76646P35776J2574088P453995j4233933j5571534
$$ -28792833 -28810825 -17712910 -16736264 -16000488 -3426400 4027595 -10206338 -25777872
9368b5777872J0824945K2408175k658161k2641207J492293L6222400K3500433
$$ -25777872 -14952927 7455248 4797087 -17844120 -16351827 19870573 43371006
9361D3371006k5082113m1629594n518438K5794816N631607l3552145l3424204
$$ 43371006 18288893 -23340701 -28859139 -3064323 2567284 -30984861 -64409065
9354f4409065M658462K8990292J3930202j4957314k7768413k4059347j3575530
$$ -64409065 -59750603 -30760311 -16830109 -31787423 -59555836 -83615183 -97190713
9347i7190713L999531K5147714L2927968K0087900M903427N401288J1524013L244073
$$ -97190713 -93191182 -68043468 -35115500 -15027600 -10124173 -4722885 6801128 10045201
9339A0045201j4639638j9664731q132575P75662k622190o687558l329696m88942
$$ 10045201 -4594437 -24259168 -32391743 -31616081 -34238271 -40925829 -44255525 -44744467
9331d4744467j609482L498896J5317034J6000959N93617p104045P437321J8609856
$$ -44744467 -46353949 -42855053 -27538019 -11537060 -10943443 -18047488 -10610167 7999689
9323G999689p78467k8194470j8957206K2392644M3045651J9455301j0244918q880265
$$ 7999689 7221222 -20973248 -39930454 -17537810 25507841 44963142 34718224 25837959
9315B5837959M880261n111069k8671585k4123493J4521777M4012624L0052966
$$ 25837959 30718220 25607151 -3064434 -27187927 -12666150 31346474 61399440
9308F1399440r183445k9699946j4939063J1229054J7614187m52214k1978135k7417157
$$ 61399440 52215995 22516049 7576986 18806040 36420227 35968013 13989878 -13427279
9300a3427279j6832748j568614J0791094J5727865P250216j1502016k1151516
$$ -13427279 -30260027 -31828641 -21037547 -5309682 1940534 -9561482 -30712998
9293c0712998p939471J2882705J6764188Q074951J1598634K7128943K5759652
$$ -30712998 -38652469 -25769764 -9005576 -930625 10668009 37796952 63556604
9286F3556604j473844k5412889k3384618r874109m696142k086211O463707R208371
$$ 63556604 62082760 36669871 13285253 3411144 -1284998 -3371209 3092498 12300869
9278A2300869m44355n121365K559138p19631k3268960k7587711J0732036M6263052
$$ 12300869 11856514 6735149 9294287 8574656 -14694304 -42282015 -31549979 14713073
9270A4713073K2638388l4574434m8166857k543758L9407944L4273164P685931
$$ 14713073 37351461 2777027 -45389830 -47933588 -8525644 25747520 33433451
9263C3433451o311864j3339641k3016811j9218020M391898K1853623J5757549
$$ 33433451 27121587 13781946 -9234865 -28452885 -24060987 -2207364 13550185
9256A3550185M055072L171105J716338p289784q001294J005767n896791k8945229
$$ 13550185 17605257 20776362 22492700 15202916 7201622 8207389 2310598 -26634631
9248b6634631k4141644K5809476O5918585M1953797j6747868m0516190j8204034
$$ -26634631 -50776275 -24966799 40951786 82905583 66157715 25641525 7437491
9241G437491L467011J249551k930686L554456L307058j0149945j5443149j98860
$$ 7437491 10904502 12154053 9223367 12777823 16084881 5934936 -9508213 -9707073
9233i707073J7664460J7131187l80253j9073077k4649178j1907645P670404J1298583
$$ -9707073 7957387 25088574 24708321 5635244 -19013934 -30921579 -23251175 -11952592
9225a1952592o237264j9943076r265463R995655J1918061J728257J778250J1379051
$$ -11952592 -18189856 -38132932 -47398395 -37402740 -25484679 -23756422 -21978172 -10599121
9217a0599121J3200561P475772O333676N246107n466048j2236969J512354J7873635
$$ -10599121 2601440 10077212 16410888 21656995 16190947 3953978 5466332 23339967
9209B3339967P751812j7633028k2226359n080903K239147n673491k762586J3647276
$$ 23339967 31091779 13458751 -8767608 -13848511 -11609364 -17282855 -20045441 -6398165
9201f398165J5467875r01797m251106J3539998K0296080J536340j3741898o211565
$$ -6398165 9069710 8167913 3916807 17456805 37752885 39289225 25547327 19335762
9193A9335762K607222l703079o138639O311424Q323275j4408983l1576323j7127707
$$ 19335762 21942984 18239905 12101266 18412690 26735965 12326982 -19249341 -36377048
9185c6377048P061765J2537480J1095653K1027305K4250486K353606j8327595
$$ -36377048 -29315283 -16777803 -5682150 15345155 39595641 41949247 23621652
9178B3621652p644597J0950917k309168l1547184k8218970P981415K9604946J7818586
$$ 23621652 15977055 26927972 24618804 -6928380 -35147350 -27165935 2439011 20257597
9170B0257597K262356K322089J474810j0142673j4775034l761545L711010n387015
$$ 20257597 22519953 24842042 26316852 16174179 1399145 -2362400 1348610 -4038405
9162d038405j6921273j6200643p721246K115091J4731196K2939545J2956590p474742
$$ -4038405 -20959678 -37160321 -44881567 -42766476 -28035280 -5095735 7860855 386113
9154C86113j1311960O261733J6739815K322984j6266740j3120994N732836J7794482
$$ 386113 -10925847 -4664114 12075701 14398685 -1868055 -14989049 -9256213 8538269
9146H538269J6641125Q902186m884968k4697832l6468572k3808697P802130L1980833
$$ 8538269 25179394 34081580 29196612 4498780 -31969792 -55778489 -47976359 -15995526
9138a5995526K7701521J09121k3425963j9096748O528500K0889665O072917j4776734
$$ -15995526 11705995 11815116 -11610847 -30707595 -24179095 -3289430 2783487 -11993247
9130a1993247r496951J5006229K4681876J3261180R075958K1821198K1972328
$$ -11993247 -21490198 -6483969 18197907 31459087 40535045 62356243 84328571
9123H4328571q750424m1603891m2178224j9676463m580290P4184J0556720K2080822
$$ 84328571 75578147 33974256 -8203968 -27880431 -32460721 -32386537 -21829817 251005
9115B51005J4916020n817183j3070603j188979O547481j604190q468504o72540
$$ 251005 15167025 9349842 -3720761 -4909740 1637741 33551 -8434953 -9107493
9107i107493Q230636J590072j4038322k1432052j6256228n101828O630810J3081672
$$ -9107493 -876857 713215 -13325107 -34757159 -51013387 -56115215 -49484405 -36402733
9099c6402733P273424n609040o970195R634443K3912682J5773774l893382q693047
$$ -36402733 -29129309 -34738349 -41708544 -32074101 -8161419 7612355 3718973 -4974074
9091d974074L927588J0570250j491401j6319705j3424896N769064K2975744K4142206
$$ -4974074 -1046486 9523764 8032363 -8287342 -21712238 -15943174 7032570 31174776
9083C1174776R836853p666009j4602954r580744o129152j2804495j6127236O49528
$$ 31174776 41011629 33345620 18742666 9161922 3032770 -9771725 -25898961 -25249433
9075b5249433K5648298K8280878L649382j8384208j7019304o892193o072132m685634
$$ -25249433 398865 28679743 32329125 13944917 -3074387 -9966580 -16038712 -20724346
9067b0724346J1354521K7451778J9836988o077744k3673265k0500435k439497
$$ -20724346 -9369825 18081953 37918941 31841197 8167932 -12332503 -14772000
9060a4772000K2926665M1684249L0419540j0454433l8112357j9808302J3771829
$$ -14772000 8154665 49838914 80258454 69804021 31691664 11883362 25655191
9053B5655191J2787182j1844554j0717113J3227938Q053285k8886200l5696400
$$ 25655191 38442373 26597819 15880706 29108644 37161929 8275729 -27420671
9046b7420671P334819L5048761L361172l5600468k1607179J5187073J4357471
$$ -27420671 -20085852 14962909 18324081 -17276387 -38883566 -23696493 -9339022
9039i339022r631197l849245K0678256J1774913k1667970k1394442J4161222K5449482
$$ -9339022 -18970219 -22819464 -2141208 9633705 -12034265 -33428707 -19267485 6181997
9031F181997j768276j3791688R985815J9257775j2357626l3851653l695182L6866641
$$ 6181997 4413721 -9377967 607848 19865623 7507997 -26343656 -30038838 6827803
9023F827803L1786177j890426j2864696j677241o329797k7945502l1217129q538113
$$ 6827803 38613980 36723554 23858858 22181617 15851820 -12093682 -43310811 -51848924
9015e1848924Q344611Q37803j2419705q535924J0659811K6611649K3471682R93809
$$ -51848924 -43504313 -42666510 -55086215 -63622139 -52962328 -26350679 -2878997 -1885188
9007a885188k0606433j7290371P520849K2957886J2421804m736138o623826K02382
$$ -1885188 -22491621 -39781992 -32261143 -9303257 3118547 -1617591 -8241417 -8039035
8999h039035J904198M554367J5670392K0820484O660730j0561264p667961Q938714
$$ -8039035 -6134837 -1580470 14089922 34910406 41571136 31009872 23341911 32280625
8991C2280625J5664687O835831o770298j9189038k5204484j2852516J4087568
$$ 32280625 47945312 54781143 48010845 28821807 3617323 -9235193 4852375
8984D852375K5347157M571218j9772708j6024024l47920p277216k8246586k5526539
$$ 4852375 30199532 34770750 14998042 -1025982 -1373902 -8651118 -36897704 -62424243
8976f2424243L483226K3370921J8251168P106901K409263k607166m166475J0075536
$$ -62424243 -58941017 -35570096 -17318928 -10212027 -7802764 -10409930 -14576405 -4500869
8968d500869K5524609J2447337j9651016k5936212L591577K4637216P501695j9212969
$$ -4500869 21023740 33471077 13820061 -12116151 -8524574 16112642 23614337 4401368
8960D401368j8364908J454126R722753K77255j3164450k0875227j4353801J2224641
$$ 4401368 -13963540 -12509414 -2786661 -2509406 -15673856 -36549083 -50902884 -38678243
8952c8678243L8146236K6815025j7378059m0099078j3328883J9386491J1367360
$$ -38678243 -532007 26283018 8904959 -31194119 -44523002 -25136511 -13769151
8945a3769151j3674593o928915J9974723J7140370j4657165k4335905L094306
$$ -13769151 -27443744 -34372659 -14397936 2742434 -11914731 -36250636 -33156330
8938c3156330K5382736J7791405Q352025J8201001K1970279r68208k1534148o663165
$$ -33156330 -7773594 10017811 18369836 36570837 58541116 57572908 36038760 29375595
8930B9375595K3232432K4762556k000539j9239896j1915429k865811r413608j9812129
$$ 29375595 52608027 77370583 75370044 56130148 44214719 41348908 31935300 12123171
8922A2123171j9055516j1059590n327594j135442M608925P568821L723975k177443
$$ 12123171 -6932345 -17991935 -23319529 -24454971 -19846046 -12277225 -8553250 -10730693
8914a0730693l653483k112361l846972j0600157j5684965q462525J4049326L6565825
$$ -10730693 -14384176 -16496537 -20343509 -30943666 -46628631 -55091156 -41041830 -4476005
8906d476005L4775794N959293j7647995m861496K7850957L0971018r508142m5302596
$$ -4476005 30299789 36259082 18611087 13749591 41600548 72571566 63063424 17760828
8898A7760828k8470803K0398002L8674768P274874k7720209k4415888J015896
$$ 17760828 -10709975 9688027 48362795 55637669 27917460 3501572 4517468
8891D517468J0077180R75731j312537M006220o416876l0440771l1603383N467708
$$ 4517468 14594648 15570379 14257842 18264062 11847186 -18593585 -50196968 -44729260
8883d4729260M3407531M0204322O558145j3438778n067094N438121k002993j4614548
$$ -44729260 -1321729 38882593 45440738 32001960 26934866 32372987 30369994 15755446
8875A5755446j3507223n78980J2844993K2941757K5608287J0928491j7852165
$$ 15755446 2248223 1669243 14514236 37455993 63064280 73992771 56140606
8868E6140606l5891108k6852586q884279r182137k3028053k3260928m367786J1462341
$$ 56140606 20249498 -6603088 -15487367 -24669504 -47697557 -70958485 -75326271 -63863930
8860f3863930J2531064J2111564J7870295J6272270J491916p161469K962068J1720019
$$ -63863930 -51332866 -39221302 -21351007 -5078737 -3586821 -10748290 -7786222 3933797
8852C933797k582666k3972655k1090536K714073J4623829M082354m266799N821792
$$ 3933797 1351131 -22621524 -43712060 -40997987 -26374158 -22291804 -26558603 -20736811
8844b0736811J6633823P518340j2224638j8192815l816396J6073642K5485260
$$ -20736811 -4102988 3415352 -8809286 -27002101 -30818497 -14744855 10740405
8837A0740405K0857067J0538573N479195N303264l003460k2270243l0906578j3265815
$$ 10740405 31597472 42136045 47615240 52918504 49915044 27644801 -3261777 -16527592
8829a6527592N292517j1237636m5187674l6817079K5062874P1986424M7692558
$$ -16527592 -11235075 -22472711 -67660385 -104477464 -79414590 -7428166 40264392
8822D0264392j0338328k7384571Q68648J4184807j2322266l5072710j6072442
$$ 40264392 29926064 2541493 3410141 17594948 5272682 -29800028 -45872470
8815d5872470K1383673L1457496N205679k8923852m0496411j9454645J7167660
$$ -45872470 -24488797 6968699 12174378 -16749474 -57245885 -76700530 -59532870
8808e9532870L4039214J3814475j4506455j0517251J6193806J8122574j2492233
$$ -59532870 -25493656 -11679181 -26185636 -36702887 -20509081 -2386507 -14878740
8801a4878740k6818350R03957K7700973J1700321j7038881o327623K9197490L0032615
$$ -14878740 -41697090 -40793133 -13092160 -1391839 -18430720 -24758343 4439147 34471762
8793C4471762j0587072l4428497r809737K1436246J0537761k8326577m5100064
$$ 34471762 23884690 -10543807 -20353544 1082702 11620463 -16706114 -61806178
8786f1806178k2389025J3642328L3967386L1044856J1968329r243315j6297743
$$ -61806178 -84195203 -70552875 -36585489 -5540633 6427696 -2815619 -19113362
8779a9113362n708276M763854k950719k0813051k4275507p071762J0387353J1217405
$$ -19113362 -24821638 -20057784 -23008503 -43821554 -68097061 -75168823 -64781470 -53564065
8771e3564065M270780N930734J2925974J0220413k89624k12192J3261724J7511378
$$ -53564065 -49293285 -43362551 -30436577 -20216164 -20505788 -20717980 -7456256 10055122
8763A0055122r39157k1031198j6584807L522053J1430698O788255J2678180K6721880
$$ 10055122 9115965 -11915233 -28500040 -24977987 -13547289 -6759034 5919146 32641026
8755C2641026J8006332j5010168k6839214P197264M3404128L0275792j2258779
$$ 32641026 50647358 35637190 8797976 15995240 59399368 89675160 77416381
8748G7416381k4476831p94488O140159k4762575m8436126k7401053J0665334K0267610
$$ 77416381 52939550 52145062 58285221 33522646 -14913480 -42314533 -31649199 -11381589
8740a1381589M510784l254873K259474j292013j8296462k7247419j6159906K674703
$$ -11381589 -6870805 -10125678 -7866204 -9158217 -27454679 -54702098 -70862004 -68187301
8732f8187301J4805830J9366546K1377581K3856812K6417493K0424279o124953
$$ -68187301 -53381471 -34014925 -12637344 11219468 37636961 58061240 51936287
8725E1936287m4245377n7522054k3946293K4825798L5996980N629852j6511526
$$ 51936287 7690910 -49831144 -73777437 -48951639 -12954659 -7324807 -23836333
8718b3836333J287193K9536745K4574831q341959k7053974j3294328Q530864J1765160
$$ -23836333 -22549140 6987605 31562436 23220477 -3833497 -17127825 -8596961 3168199
8710C168199Q73581l832085K735682Q091910L251501o837284j3429822j3951002
$$ 3168199 4041780 209695 2945377 11037287 14288788 7451504 -5978318 -19929320
8702a9929320p895917P773655K9374228L8976482K1993970p424902j7495614k366588
$$ -19929320 -27825237 -20051582 9322646 48299128 70293098 62868196 45372582 43005994
8694D3005994O547218j1650320l0353779j4368236K0377044K5253943o788544
$$ 43005994 49553212 37902892 7549113 -6819123 13557921 38811864 32023320
8687C2023320k9543091j5609078M657888p04445j1739036L790148K9337967K5110363
$$ 32023320 2480229 -13128849 -8470961 -9175406 -20914442 -17124294 12213673 37324036
8679C7324036m267035j8006473p501968m731103j9272537j8982765J0612139L4729880
$$ 37324036 33057001 15050528 7548560 2817457 -16455080 -35437845 -24825706 9904174
8671I904174K2924919m413455j3219074o532121m756890m163313O374754J0685959
$$ 9904174 32829093 28415638 15196564 8664443 3907553 -255760 6118994 16804953
8663A6804953r411446l0794598j7667401J6045459K2621479k752394j3830106
$$ 16804953 7393507 -23401091 -41068492 -25023033 -2401554 -5153948 -18984054
8656a8984054R216547K7436557R906923j6010842j4411820j95790p014448k6050732
$$ -18984054 -9767507 17669050 27575973 11565131 -2846689 -3042479 -10056927 -36107659
8648c6107659k3473201m04393J1799950O901382Q013393J7972892J1378971j5552816
$$ -36107659 -59580860 -59985253 -48185303 -41283921 -33270528 -15297636 -3918665 -19471481
8640a9471481k8996564q319838K0533519K2823289O78621j8658376j9273733k784107
$$ -19471481 -48468045 -56787883 -36254364 -13431075 -12752454 -31410830 -50684563 -53468670
8632e3468670K3069980M3135579L8068572P440480k2844426l1109806k3908324
$$ -53468670 -30398690 12736889 50805461 58245941 35401515 4291709 -19616615
8625a9616615j6077971n679233J2024675K3575834J4902382k512684p309350l79774
$$ -19616615 -35694586 -41373819 -29349144 -5773310 9129072 6616388 -692962 -1072736
8617a072736J837748l405746o521533o972254q753094m492637R248701J2465839
$$ -1072736 765012 -2640734 -9162267 -16134521 -24887615 -29380252 -20131551 -7665712
8609g665712j0175445l2329612j6303434K5495738M3611015K5304072O181742
$$ -7665712 -17841157 -50170769 -66474203 -40978465 2632550 27936622 34118364
8602C4118364L115880p698415k8787822j9348124K9793793N6545314J4175278
$$ 34118364 37234244 29535829 748007 -18600117 11193676 67738990 81914268
8595H1914268m8543732n5012375j3735180N747091j2471665j7103685J3035156
$$ 81914268 33370536 -21641839 -35377019 -29629928 -42101593 -59205278 -46170122
8588d6170122L5216286K1310525J883520N096128R870999n990105k0274554q107055
$$ -46170122 -10953836 10356689 12240209 17336337 27207336 21217231 942677 -7164378
8580g164378J0982171R509709K820026J8775324M1069983K9893707j3426707m5616796
$$ -7164378 3817793 13327502 16147528 34922852 75992835 105886542 92459835 46843039
8572D6843039m1165538j6812853K567274J0935840J1477750N612029l540042j1989604
$$ 46843039 5677501 -11135352 -8568078 2367762 13845512 19457541 15917499 3927895
8564C927895j7516905j1944569J4493707M5477570L9103602j4115391n6639207
$$ 3927895 -13589010 -25533579 -11039872 34437698 73541300 59425909 2786702
8557B786702l1399429L0069972M1957412j2857389n5417812k6839099K7086192
$$ 2786702 -28612727 1457245 43414657 30557268 -24860544 -51699643 -24613451
8550b4613451L0071019j0755712k4678292J0048346L8428528J8766759j6939241
$$ -24613451 5457568 -5298144 -29976436 -19928090 18500438 37267197 20327956
8543B0327956j9296246L186919N205400k0027762l1468297o615960K2763446J8888640
$$ 20327956 1031710 4218629 9424029 -10603733 -42072030 -48687990 -25924544 -7035904
8535g035904o626960j3597304N657495J8757129N777932j1810208n782164J9043065
$$ -7035904 -13662864 -27260168 -21602673 -2845544 2932388 -8877820 -14659984 4383081
8527D383081L6418354L4051295J9895138M177900p845284j2430254j1251389j2783713
$$ 4383081 40801435 74852730 94747868 98925768 91080484 78650230 67398841 54615128
8519E4615128j8231788j5041821K693484J8137724J2238779r167729k5996355
$$ 54615128 36383340 21341519 24035003 42172727 54411506 45243777 19247422
8512A9247422l1580732l0118331j7577165R180933L1243626K4884613q72957j2418617
$$ 19247422 -12333310 -42451641 -60028806 -50847873 -19604247 5280366 4407409 -8011208
8504h011208L74974J2852195P782063q78081K292679Q387404M719198j629171
$$ -8011208 -7636234 5215961 12998024 12119943 14412622 22800026 27519224 25890053
8496B5890053K26230L404391k787626j1135181q231516J578156K123064r867060
$$ 25890053 26116283 29520674 26733048 15597867 7366351 8944507 11067571 1200511
8488A200511k0477470j6438815K028732K2409434K8202199J3010554q380904j2223260
$$ 1200511 -19276959 -35715774 -33687042 -11277608 16924591 29935145 21554241 9330981
8480I330981M724680J8342921P823590j6510055k5888562p411809K2363079L4813904
$$ 9330981 14055661 32398582 40222172 23712117 -2176445 -9588254 12774825 47588729
8472D7588729J7109218j3352169k4129875m582979J8416664J4710609p503860
$$ 47588729 64697947 51345778 27215903 22632924 41049588 55760197 48256337
8465D8256337j6187117n704915j795321j4249519j9894539n045329R429756N938022
$$ 48256337 32069220 26364305 24568984 10319465 -9575074 -14620403 -5190647 747375
8457G47375J910473J6322219L0365914J4971724j9240726l3787458j6104741Q441669
$$ 747375 2657848 18980067 49345981 64317705 45076979 11289521 -4815220 3626449
8449C626449J4675374K171436j6506178k9635479k7691396q407170J7435911L4428420
$$ 3626449 18301823 20473259 3967081 -25668398 -53359794 -61766964 -44331053 -9902633
8441i902633L3771684J3300527j9447357l9068448k0719963K0472258L5740779
$$ -9902633 23869051 37169578 17722221 -21346227 -42066190 -21593932 14146847
8434A4146847Q321705j7336875o49558L2009831K9797646l125135k1088108j3129151
$$ 14146847 22468552 5131677 4482119 36491950 66289596 63164461 42076353 28947202
8426B8947202r228327j6222235o905282K0061827K6390944k012830k7688532k1304286
$$ 28947202 19718875 3496640 -3408642 16653185 43044129 41031299 13342767 -7961519
8418g961519l881605k231844l728580J0748326K3750424J0567100j3097775j3015219
$$ -7961519 -11843124 -14074968 -17803548 -7055222 16695202 27262302 14164527 1149308
8410A149308Q709488J8051773J510540j8438066j9426816m589437J0458465J6512377
$$ 1149308 9858796 27910569 29421109 10983043 -8443773 -13033210 -2574745 13937632
8402A3937632J3037390M069829n494888j4518687k3457990k6227731j4770839
$$ 13937632 26975022 31044851 25549963 11031276 -12426714 -38654445 -53425284
8395e3425284N000541J6079181J4184465J1936119J3524606O951147q259186j0700898
$$ -53425284 -48424743 -32345562 -18161097 -6224978 7299628 14250775 5991589 -4709309
8387d709309P913902K1214233N459902k1669473k7460512j3368126o113846r782370
$$ -4709309 3204593 24418826 29878728 8209255 -19251257 -32619383 -38733229 -48515599
8379d8515599j875020K2869688L7073750J8890935j6302461l3743188j7138601
$$ -48515599 -50390619 -27520931 9552819 28443754 12141293 -21601895 -38740496
8372c8740496J7253327L6982838K3412656q705401k6246016j7363135l911380
$$ -38740496 -21487169 15495669 38908325 30202924 3956908 -13406227 -17317607
8365a7317607n234741q976434K434695J5857086Q591820p688806j432197K4547375
$$ -17317607 -22552348 -31528782 -29094087 -13237001 -4645181 -12333987 -13766184 10781191
8357A0781191L2838067R930925j3925993j5081896r211452j4547400j7055906
$$ 10781191 43619258 53550183 39624190 24542294 15330842 783442 -16272464
8350a6272464j05779J8101480R506517j8496511l4083822k5893741p825249J0852998
$$ -16272464 -16378243 1723237 11229754 -7266757 -41350579 -67244320 -75069569 -64216571
8342f4216571K8760778L2227126O861893k8713734l4444971l378844K5253755
$$ -64216571 -35455793 -3228667 3633226 -25080508 -59525479 -62904323 -37650568
8335c7650568K0765572Q17682k422632R190378J1628754J894163j322507O697857
$$ -37650568 -16884996 -16067314 -18489946 -9299568 2329186 4223349 2900842 9598699
8327I598699R593406n67247j1348686j2076061p113797j771871N374693J0015393
$$ 9598699 19192105 18624858 7276172 -4799889 -11913686 -13685557 -8310864 1704529
8319A704529K706059r161094k212136K5570312M0016547J5001162k5795604l8700859
$$ 1704529 4410588 -4750506 -6962642 18607670 58624217 73625379 47829775 9128916
8311I128916k0355486o293950j2580306j4673531N784019K5880088J5802311j2927246
$$ 9128916 -11226570 -17520520 -30100826 -44774357 -38990338 -13110250 2692061 -10235185
8303a0235185k1794854J8698K2071683J6923722l466644p745712J0031326K1969284
$$ -10235185 -32030039 -32011341 -9939658 6984064 3517420 -4228292 5803034 27772318
8295B7772318L866903l1038934m5712598k3233871J4088847L2181732K1701021
$$ 27772318 31639221 600287 -45112311 -68346182 -54257335 -22075603 -374582
8288c74582P05924j0132300n098059P682959J4092373M352026j5196728k4732032
$$ -374582 331342 -9800958 -14899017 -7216058 6876315 11228341 -3968387 -28700419
8280b8700419j3790640N032972J4524965J4955910J4557829J0469909q93631n981110
$$ -28700419 -42491059 -37458087 -22933122 -7977212 6580617 17050526 16156895 10175785
8272A0175785P098342K0102886O435964k2451871k8621898p433589M803607p272360
$$ 10175785 17274127 37377013 43812977 21361106 -7260792 -14694381 -9890774 -17163134
8264a7163134j2201180J1128616L1972352J5856612j8700908k8975582r365258
$$ -17163134 -29364314 -18235698 13736654 29593266 10892358 -18083224 -27448482
8257b7448482J2875358K3006260K3128146R738214j4257761k1879689K103413
$$ -27448482 -14573124 8433136 31561282 41299496 27041735 5162046 7265459
8250G265459K3306961K376334l5616424l1574192J2686196L2112509j05340l2356827
$$ 7265459 30572420 32948754 -2667670 -34241862 -21555666 10556843 10451503 -21905324
8242b1905324k0003308Q078829O330770j3223651j1562947Q112963J3786099M594021
$$ -21905324 -41908632 -33829803 -27499033 -40722684 -52285631 -44172668 -30386569 -25792548
8234b5792548N769975J5820785Q523226j5166538k3471276p110258N290530l360985
$$ -25792548 -20022573 -4201788 4321438 -10845100 -34316376 -41426634 -36136104 -39497089
8226c9497089j0282021P777185L5181187L9991683J8166492n629082j1455552
$$ -39497089 -49779110 -42001925 -6820738 33170945 51337437 45708355 34252803
8219C4252803j755868Q891595R263088p17175j0412458r178666M20716N119351
$$ 34252803 32496935 41388530 50651618 49934443 39521985 30343319 30764035 35883386
8211C5883386j697804j2310689j6254119j1450658j633969Q163700J0724627J442194
$$ 35883386 34185582 21874893 5620774 -5829884 -7463853 699847 11424474 12866668
8203A2866668j1614091j2684119Q50579J2567819Q870363l174117q696191o483110
$$ 12866668 1252577 -11431542 -10580963 1986856 10857219 7683102 -1013089 -7496199
8195g496199o162088j0484856j2890887r589669l003117M969507J3163776J6265762
$$ -7496199 -13658287 -24143143 -37034030 -46623699 -49626816 -44657309 -31493533 -15227771
8187a5227771R572346k153155r461136j0376788q795685l908608O562511J4782062
$$ -15227771 -5655425 -7808580 -17269716 -27646504 -36442189 -40350797 -33788286 -19006224
8179a9006224J0148386m76720K570310K1077867L0838046J5097845j0075890j9282115
$$ -19006224 -8857838 -9334558 -6764248 14313619 45151665 60249510 50173620 30891505
8171C0891505j3317852j1618466j7846760j6032214m5131J4857265J5303195P444833
$$ 30891505 17573653 5955187 -11891573 -27923787 -27968918 -13111653 2191542 9636375
8163I636375L391674L105505r86926r925037j6885439j5165266l468722J1819930
$$ 9636375 13028049 16133554 15146628 5221591 -11663848 -26829114 -30297836 -18477906
$$ [...]
##END NTUPLES=NMR SPECTRUM
##END=
