##TITLE=31Pdec_SR166_k
 DMSO, 24 sc
 21.2.2023
##JCAMPDX= 6.0         $$ Bruker NMR JCAMP-DX V2.0
##DATA TYPE= NMR SPECTRUM
##DATA CLASS= NTUPLES
##ORIGIN= UXNMR, Bruker Analytische Messtechnik GmbH
##OWNER= root
$$ XWIN-NMR		Version 3.5
$$ Tue Feb 21 18:20:12 2023 Russian Standard Time (UT+4h)  she@DPX200
##.OBSERVE FREQUENCY= 81.013821
##.OBSERVE NUCLEUS= ^31P
##.ACQUISITION MODE= SIMULTANEOUS
##.ACQUISITION SCHEME= undefined
##.AVERAGES= 24
##.DIGITISER RES= 16
##SPECTROMETER/DATA SYSTEM= spect
##.PULSE SEQUENCE= zgpg30
##.SOLVENT NAME= CDCl3
##.SHIFT REFERENCE= (INTERNAL, CDCl3, 0, 248.564)
##AUDIT TRAIL= $$ (NUMBER, WHEN, WHO, WHERE, WHAT)
$$ ##TITLE= Audit trail, XWIN-NMR		Version 3.5
$$ ##JCAMPDX= 5.01
$$ ##ORIGIN= Bruker BioSpin GmbH
$$ ##OWNER= she
$$ F:/spectra/data/she/nmr/P31/1/pdata/1/auditp.txt
$$ ##AUDIT TRAIL=  $$ (NUMBER, WHEN, WHO, WHERE, WHAT)
(   1,<2023-02-21 18:19:20.17 +0400>,<she>,<DPX200>,
      <created by zg, POWCHK disabled, PULCHK disabled
       configuration hash MD5:
       00 E9 B6 7A A2 85 ED C7 34 08 36 98 17 FE 4E 26
       data hash MD5: 32K
       CF E5 8E 00 16 97 DC C7 E6 84 29 CF E8 C5 97 98>)
(   2,<2023-02-21 18:19:23.39 +0400>,<she>,<DPX200>,
      <Start of raw data processing
       efp BC_mod = 2 LB = 1 FT_mod = 6 PKNL = 1 PHC0 = -11021.88 PHC1 = 177.0102 SI = 64K 
       data hash MD5: 64K
       07 0E 5E 6C 5E 9A F6 99 80 1E 1F AC 57 82 38 95>)
(   3,<2023-02-21 18:19:37.46 +0400>,<she>,<DPX200>,
      <pk PHC0 = -4.390226 PHC1 = 0 
       data hash MD5: 64K
       18 A5 2A E1 42 DC 3C FC CA B2 71 4B 26 95 CB DF>)
(   4,<2023-02-21 18:19:43.90 +0400>,<she>,<DPX200>,
      <abs ABSG = 5 
       data hash MD5: 64K
       0D 71 5B 84 EA C2 7C 3A 52 F6 B5 AA 75 CB DE 7B>)
$$ ##END=
$$ 
$$ hash MD5
$$ 0F 9F 49 5D CD AD 2B 75 46 48 97 9A E9 8E AF 55
##$RELAX= 
##$RELAX= 
##$RELAX= 
##$RELAX= 
##$RELAX= 
##$RELAX= 
##$RELAX= 
##$RELAX= 
##$RELAX= 
$$ Bruker specific parameters
$$ --------------------------
##$DU= <F:/spectra>
##$EXPNO= 1
##$NAME= <P31>
##$PROCNO= 1
##$TYPE= <nmr>
##$USER= <she>
##$AMP= (0..31)
100 100 100 100 100 100 100 100 100 100 100 100 100 100 100 100 100 100 
100 100 100 100 100 100 100 100 100 100 100 100 100 100 
##$AQSEQ= 0
##$AQ_mod= 1
##$AUNM= <au_zg>
##$AUTOPOS= <>
##$BF1= 81.014009
##$BF2= 200.13
##$BF3= 200.13
##$BF4= 200.13
##$BF5= 200.13
##$BF6= 200.13
##$BF7= 200.13
##$BF8= 200.13
##$BYTORDA= 1
##$CFDGTYP= 0
##$CFRGTYP= 5
##$CHEMSTR= <none>
##$CNST= (0..31)
1 1 145 1 1 1 1 1 1 1 1 1 1 1 1 1 1 1 1 1 1 1 1 1 1 1 1 1 1 1 1 1 
##$CPDPRG= <waltz16>
##$CPDPRG1= <>
##$CPDPRG2= <waltz16>
##$CPDPRG3= <>
##$CPDPRG4= <mlev>
##$CPDPRG5= <mlev>
##$CPDPRG6= <mlev>
##$CPDPRG7= <mlev>
##$CPDPRG8= <mlev>
##$CPDPRGB= <>
##$CPDPRGT= <>
##$D= (0..31)
0 1 0 0 0 0 0 0 0 0 0 0.03 2e-05 3e-06 0 0 0 0 0 0 0 0 0 0 0 0 0 0 0 0 
0 0 
##$DATE= 1676989159
##$DBL= (0..7)
120 120 120 11 120 120 24 19 
##$DBP= (0..7)
150 150 150 150 150 150 150 150 
##$DBP07= 0
##$DBPNAM0= <>
##$DBPNAM1= <>
$$ [...]
##$SUBNAM3= <"">
##$SUBNAM4= <"">
##$SUBNAM5= <"">
##$SUBNAM6= <"">
##$SUBNAM7= <"">
##$SUBNAM8= <"">
##$SUBNAM9= <"">
##$SW= 501.771253377433
##$SWIBOX= (0..15)
0 1 3 0 0 0 0 0 0 0 0 0 0 0 0 0 
##$SW_h= 40650.406504065
##$TD= 32768
##$TD0= 1
##$TE= 0
##$TE2= 300
##$TE3= 300
##$TEG= 300
##$TL= (0..7)
0 120 53 12 22 120 120 120 
##$TP= (0..7)
150 150 150 150 150 150 150 150 
##$TP07= 0
##$TPNAME0= <>
##$TPNAME1= <>
##$TPNAME2= <>
##$TPNAME3= <>
##$TPNAME4= <>
##$TPNAME5= <>
##$TPNAME6= <>
##$TPNAME7= <>
##$TPOAL= (0..7)
0.5 0.5 0.5 0.5 0.5 0.5 0.5 0.5 
##$TPOFFS= (0..7)
0 0 0 0 0 0 0 0 
##$TUNHIN= 0
##$TUNHOUT= 0
##$TUNXOUT= 0
##$USERA1= <user>
##$USERA2= <user>
##$USERA3= <user>
##$USERA4= <user>
##$USERA5= <user>
##$V9= 5
##$VALIST= <valist>
##$VCLIST= <CCCCCCCCCCCCCCC>
##$VD= 0
##$VDLIST= <DDDDDDDDDDDDDDD>
##$VPLIST= <PPPPPPPPPPPPPPP>
##$VTLIST= <TTTTTTTTTTTTTTT>
##$WBST= 1024
##$WBSW= 4
##$XGAIN= (0..3)
0 0 0 0 
##$XL= 0
##$YL= 0
##$YMAX_a= 1859
##$YMIN_a= -1378
##$ZGOPTNS= <>
##$ZL1= 120
##$ZL2= 120
##$ZL3= 120
##$ZL4= 120
##$ABSF1= 248.5645
##$ABSF2= -253.2056
##$ABSG= 5
##$ABSL= 3
##$ALPHA= 0
##$AQORDER= 0
##$ASSFAC= 0
##$ASSFACI= 0
##$ASSFACX= 0
##$ASSWID= 0
##$AUNMP= <proc_1d>
##$AZFE= 0.1
##$AZFW= 0.5
##$BCFW= 0
##$BC_mod= 2
##$BYTORDP= 0
##$COROFFS= 0
##$CY= -3
##$DATMOD= 1
##$DC= 0
##$DFILT= <>
##$DTYPP= 0
##$F1P= 0
##$F2P= 0
##$FCOR= 1
##$FTSIZE= 65536
##$FT_mod= 6
##$GAMMA= 0
##$GB= 0
##$INTBC= 1
##$INTSCL= 6.047779e-11
##$ISEN= 30
##$LB= 1
##$LEV0= 0
##$LPBIN= 0
##$MAXI= 10000
##$MC2= 0
##$MEAN= 0
##$ME_mod= 0
##$MI= 50
##$NCOEF= 0
##$NC_proc= -9
##$NLEV= 6
##$NOISF1= 182.463
##$NOISF2= 159.3651
##$NSP= 0
##$NTH_PI= 0
##$NZP= 0
##$OFFSET= 248.5645
##$PC= 4
##$PHC0= -11026.27
##$PHC1= 177.0102
##$PH_mod= 1
##$PKNL= yes
##$PPARMOD= 0
##$PSCAL= 0
##$PSIGN= 0
##$REVERSE= no
##$SF= 81.0140089999694
##$SI= 65536
##$SIGF1= 159.3651
##$SIGF2= -187.1042
##$SINO= 113.3802
##$SIOLD= 16384
##$SREGLST= <1H.CDCl3>
##$SSB= 0
##$STSI= 65536
##$STSR= 0
##$SW_p= 40650.406504065
##$SYMM= 0
##$S_DEV= 0
##$TDeff= 32768
##$TDoff= 0
##$TI= <>
##$TILT= no
##$TM1= 0
##$TM2= 0
##$TOPLEV= 0
##$USERP1= <user>
##$USERP2= <user>
##$USERP3= <user>
##$USERP4= <user>
##$USERP5= <user>
##$WDW= 1
##$XDIM= 65536
##$YMAX_p= 521845264
##$YMIN_p= -379541995
$$ End of Bruker specific parameters
$$ ---------------------------------
##NTUPLES= NMR SPECTRUM
##VAR_NAME=  FREQUENCY,     SPECTRUM/REAL,   SPECTRUM/IMAG
##SYMBOL=    X,             R,               I
##VAR_TYPE=  INDEPENDENT,   DEPENDENT,       DEPENDENT
##VAR_FORM=  AFFN,          ASDF,            ASDF
##VAR_DIM=   65536,         65536,           65536
##UNITS=     HZ,            ARBITRARY UNITS, ARBITRARY UNITS
##FACTOR=    0.620285442955139, 1,           1
##FIRST=     20137.2065510682, 0,            0
##LAST=      -20513.1999529968, 0,           0
##MIN=       -20513.1999529968, -379541995,  0
##MAX=       20137.2065510682, 521845264,    0
$$ Real data points
##PAGE= N=1
##DATA TABLE= (X++(R..R)), XYDATA
$$ [...]
##PAGE= N=2
##DATA TABLE= (X++(I..I)), XYDATA
$$ plain form
12948 135289 -6434935 251368 12769875 13398600 809759 -7938858 -4114592 1102751
12940 1102751 -2403968 -7669262 -5583780 -1782899 -5610639 -12672773 -12556551 -6762112
12932 -6762112 -4767055 -7044544 -6105421 -1697002 -924202 -3824792 -2450036 4178273
12924 4178273 7060427 2589613 -843764 3212649 9191090 10111441 9241531 12502034
12916 12502034 15888694 10782051 -1007227 -7465997 -2456582 6295518 8176375 2917469
12908 2917469 -1489254 -585840 2481695 4183781 5990481 9607371 11445802 7635856
12900 7635856 2439910 4236487 12315745 15559862 7858718 -2619470 -5477629 -2733473
12892 -2733473 -3030943 -6136539 -3838483 5175485 11959616 10310070 4308260 382733
$$ packed form
12948A35289o570224O686303J2518507O28725j2588841q748617L824266N217343
12940A102751l506719n265294K085482L800881l827740p062134J16222N794439
12932f762112J995057k277489R39123M408419P72800k900590J374756O628309
12924D178273K882154m470814l433377M056413N978441R20351q69910L260503
12916A2502034L386660n106643j1789278o458770N009415Q752100J880857n258906
12908B917469m406723R03414L067535J702086J806700L616890J838431l809946
12900G635856n195946J796577Q079258L244117p701144j0478188k858159K744156
12892b733473k97470l105596K298056R013968O784131j649546o001810l925527
$$ plain form
12884 382733 -730528 -1331555 -2462103 -4758154 -7844251 -7455319 129750 9527220 10489437
12875 10489437 3235163 -549 6604248 12564190 7315887 -2792224 -4521318 1732606
12867 1732606 4253386 -14292 -1410943 4859671 9296916 2065308 -11868138 -18964024
12859 -18964024 -14324750 -5711909 -1536334 -1185083 405951 2720454 -387858 -10243290
12851 -10243290 -18330602 -16574433 -9498639 -8842017 -16517452 -21750040 -17802529 -12055626
12843 -12055626 -13049783 -15933524 -10678270 786514 7334103 6322224 6601389 13008399
12835 13008399 18894630 17389208 10838011 4718986 165848 -2472437 84273 7871200
12827 7871200 13283144 9633921 599581 -4884544 -4374626 -2867580 -4215022 -7398116
$$ packed form
12884C82733j113261o01027j130548k296051l086097L88932P585069R397470R62217
12875A0489437p254274l235712O604797N959942n248303j0108111j729094O253924
12867A732606K520780m267678j396651O270614M437245p231608j3933446p095886
12859a8964024M639274Q612841M175575L51251J591034K314503l108312r855432
12851a0243290q087312J756169P075794O56622p675435n232588L947511N746903
12843a2055626r94157k883741N255254J1464784O547589j011879K79165O407010
12835A3008399N886231j505422o551197o119025m553138k638285K556710P786927
12827G871200N411944l649223r034340n484125N09918J507046j347442l183094
$$ plain form
12819 -7398116 -10378463 -12494117 -13088529 -11682959 -9392572 -7247513 -4204799 -12528
12811 -12528 1626015 -2991137 -11338937 -16729314 -16234757 -12509347 -8396464 -4673418 -3131326
12802 -3131326 -5996184 -10417153 -8901259 1403231 13720885 19373787 17383694 12974324
12794 12974324 9527969 6379677 2794937 -404457 -2794968 -4384226 -3964120 -586516
12786 -586516 3629005 5315958 4312996 3201028 2729580 1422222 -77321 1438217
12778 1438217 6363035 10279556 9698136 6944206 6806190 10352551 14275981 14757389 10364572
12769 10364572 3029400 -2317356 -1326155 4743244 9751343 10062948 8403443 8246564
12761 8246564 7861120 3753505 -2386168 -4690141 -415107 7089159 12353055 12564320
$$ packed form
12819g398116k980347k115654n94412J405570K290387K145059L042714M192271
12811a2528J638543m617152q347800n390377M94557L725410M112883L723046J542092
12802c131326k864858m420969J515894J0304490J2317654N652902j990093m409370
12794A2974324l446355l148292l584740l199394k390511j589258M20106L377604
12786e86516M215521J686953j002962j111968m71448j307358j499543J515538
12778A438217M924818L916521n81420k753930j38016L546361L923430M81408m392817
12769A0364572p335172n346756R91201O069399N008099L11605j659505j56879
12761H246564l85444m107615o139673k303973M275034P504266N263896K11265
$$ plain form
12753 12564320 9461596 8173560 12205076 18103341 18569686 13031739 10038286 14903233
12745 14903233 20492848 17024833 6538552 -652719 -619582 2400254 6479409 13212048
12737 13212048 18485657 13760844 -302842 -11446445 -11201984 -4426669 4972 -600705
12729 -600705 -5598268 -14508432 -22222264 -19818040 -7092409 3584023 3082959 -2248819
12721 -2248819 -1624645 4573523 9062063 10522372 11963069 11760451 7289524 3599320
12713 3599320 7369853 14502909 14292113 4769176 -5746813 -11272786 -12717729 -10707580
12705 -10707580 -4100467 3542637 5345344 824186 -3228446 -2532637 844470 4145691
12697 4145691 5759420 2073934 -8517734 -18331718 -16909203 -6357477 -453510 -5757878
$$ packed form
12753A2564320l102724j288036M031516N898265M66345n537947k993453M864947
12745A4903233N589615l468015j0486281p191271L3137L019836M079155O732639
12737A3212048N273609m724813j4063686j1143603K44461O775315M431641o05677
12729f00705m997563q910164p713832K404224J2725631J0676432n01064n331778
12721b248819O24174O198168M488540J460309J440697k02618m470927l690204
12713C599320L770533P133056k10796r522937j0515989n525973j444943K010149
12705a0707580O607113P643104J802707m521158m052632O95809L377107L301221
12697D145691J613729l685486j0591668r813984J422515J0551726N903967n304368
$$ plain form
12689 -5757878 -13134360 -12105546 -4930652 -1028969 -4189106 -10693674 -15178404 -14158936
12681 -14158936 -7960044 -2022071 -2112109 -6701062 -9084311 -7659090 -7374420 -9890291
12673 -9890291 -10272024 -5947965 -1071522 1173603 2913468 5043592 4655525 2914028
12665 2914028 6646055 16721016 23439373 20093211 13172595 11530315 12738638 9083333
12657 9083333 1260392 -3515626 -3316010 -2516849 -3567965 -5591974 -8867842 -13179809
12649 -13179809 -13732760 -6295293 4781400 10787942 10275552 9883310 13792892 18729597
12641 18729597 20299480 18910786 17593670 17327581 16145991 11664321 4610672 86853
12633 86853 2953038 11006067 16148853 13926907 7909469 2845301 -1148174 -4454514
$$ packed form
12689e757878p376482J028814P174894L901683l160137o504568m484730J019468
12681a4158936O198892N937973r0038m588953k383249J425221K84670k515871
12673i890291l81733M324059M876443K245125J739865K130124l88067j741497
12665B914028L732027J0074961O718357l346162o920616j642280J208323l655305
12657I083333p822941m776018J99616P99161j051116k024009l275868m311967
12649a3179809n52951P437467J1076693O006542n12390l92242L909582M936705
12641A8729597J569883j388694j317116k66089j181590m481670p053649m523819
12633H6853K866185Q053029N142786k221946o017438n064168l993475l306340
$$ plain form
12625 -4454514 -4092945 818659 4773264 3148728 -127106 1545825 7099499 9942407
12617 9942407 8339868 7097079 9452234 12627053 11822859 5467784 -3217413 -8302461
12609 -8302461 -6607630 -2025432 -1194072 -4473113 -6334646 -5112801 -4781846 -5404722 -1569669
12600 -1569669 5654852 6158394 -2950647 -9455394 -3870910 5124791 4921698 -696363
12592 -696363 139736 6027108 5656977 -1704108 -6021303 -5109482 -6508755 -10143802 -6128039
12583 -6128039 6371921 13627288 6927852 -5148336 -10830143 -10460843 -10429837 -11267769
12575 -11267769 -9894924 -7072756 -5377082 -4166712 -1721399 1249375 3352004 3979231
12567 3979231 1761025 -3566384 -7445784 -4865432 1535211 4961497 5645313 9538077
$$ packed form
12625d454514L61569M911604L954605j624536l275834J672931N553674K842908
12617I942407j602539j242789K355155L174819q04194o355075q685197n085048
12609h302461J694831M582198Q31360l279041j861533J221845L30955o22876L835053
12600a569669P224521N03542r109041o504747N584484Q995701k03093n618061
12592f96363Q36099N887372l70131p361085m317195R11821j399273l635047M015763
12583f128039J2499960P255367o699436j2076188n681807L69300L1006q37932
12575a1267769J372845K822168J695674J210370K445313K970774K102629O27227
12567C979231k218206n327409l879400K580352O400643L426286O83816L892764
$$ plain form
12559 9538077 15857224 16957418 12361245 10856589 14847897 15131203 7284297 855458
12551 855458 3560228 7563562 2638176 -6005215 -5873412 2888471 9194320 9529449 11179297
12542 11179297 16689438 17977920 10296632 2132751 3950618 12588859 14868247 5482802
12534 5482802 -6015940 -8473149 -3389798 59145 648104 6034866 16997814 22045351
12526 22045351 14430652 4459874 3905761 6122278 -3587358 -22147362 -30349180 -20576019
12518 -20576019 -5954472 1715700 6420024 13320292 15513250 6618372 -5240635 -8417421
12510 -8417421 -4426806 -2160327 -2377432 190150 4270606 3679527 -616903 -761564 5504913
12501 5504913 10798315 7794129 -2154866 -10793406 -10663534 -1999859 6612580 7060076
$$ packed form
12559I538077O319147J100194m596173j504656L991308K83306p846906o428839
12551H55458K704770M003334m925386q643391J31803Q761883O305849L35129J649848
12542A1179297N510141J288482p681288q163881J817867Q638241K279388r385445
12534E482802j1498742k457209N083351L448943N88959N386762J0962948N047537
12526B2045351p614699r970778n54113K216517r709636j8560004q201818R773161
12518b0576019J4621547P670172M704324O900268K192958q894878j1859007l176786
12510h417421L990615K266479k17105K567582M080456n91079m296430j44661O266477
12501E504913N293402l004186r948995q638540J29872Q663675Q612439M47496
$$ plain form
12493 7060076 1778858 332314 5253724 8266780 3032748 -5828752 -10212007 -7999552
12485 -7999552 -1325496 7160064 12203545 8208883 -1405794 -5013524 1772096 9305429
12477 9305429 7667114 -1256115 -10478576 -16837393 -17288484 -7566380 7411590 13126799
12469 13126799 5071222 -2397898 2443850 10399121 8233715 2214548 7098303 19685134
12461 19685134 22858245 12572975 2556839 2554793 7818624 10871754 9668607 3317184
12453 3317184 -7323667 -14014726 -8305408 4821521 11600545 7899485 2179719 833838
12445 833838 2126133 4123080 6629592 5370865 -3649241 -13766196 -13638162 -4021885
12437 -4021885 3219117 2930673 1132894 1540024 963956 -435415 2505155 9049477 12196718
$$ packed form
12493G060076n281218j446544M921410L013056n234032q861500m383255K212455
12485g999552O674056Q485560N043481l994662r614677l607730O785620P533333
12477I305429j638315q923229r222461o358817m51091R722104J4977970N715209
12469A3126799q055577p469120M841748P955271k165406o019167M883755J2586831
12461A9685134L173111j0285270j0016136k046N263831L053130j203147o351423
12453C317184j0640851o691059N709318J3126929O779024l701060n719766j345881
12445H33838J292295J996947K506512j258727r020106j0116955J28034R616277
12437d021885P241002k88444j797779M07130n76068j399371K940570O544322L147241
$$ plain form
12428 12196718 11019115 11203612 12374121 8614828 3087489 6703861 18637132 23706214
12420 23706214 14772600 3176882 425503 3558426 6061089 9504717 15345298 17419508
12412 17419508 12324593 6995355 7127197 7812824 3901335 -304344 24887 1734524
12404 1734524 2518366 7469413 17115331 19897244 8723317 -4066731 -1757597 13000690
12396 13000690 22530994 17921768 6284316 -2996643 -7690470 -8929885 -7549735 -5543434
12388 -5543434 -5486610 -7799840 -10638065 -10295009 -1583513 15720101 29722693 25476991
12380 25476991 5186940 -11233249 -11743655 -6922509 -10847577 -19320649 -19595700 -12229588
12372 -12229588 -8274718 -10123404 -9551777 -2470842 6530950 12935040 15605058 13449073
$$ packed form
12428A2196718j177603J84497J170509l759293n527339L616372J1933271N069082
12420B3706214q933614j1595718k751379L132923K502663L443628N840581K074210
12412A7419508n094915n329238J31842O85627l911489m205679L29231J709637
12404A734524P83842M951047R645918K781913j1173927j2790048K309134J4758287
12396A3000690R530304m609226j1637452r280959m693827j239415J380150K006301
12388e543434N6824k313230k838225L43056Q711496J7303614J4002592m245702
12380B5476991k0290051j6420189n10406M821146l925068q473072k75051P366112
12372a2229588L954870j848686N71627P080935R001792O404090K670018k155985
$$ plain form
12364 13449073 7681660 4323234 5964115 5682917 -1568567 -7700252 -3288407 5454273
12356 5454273 5794652 -160019 254456 7052513 7186656 -1308927 -3716970 7048240
12348 7048240 17752511 15638667 7397558 5847314 9142895 6666094 -1782762 -6343013
12340 -6343013 -3254180 1374499 3003378 3505815 4070762 2626188 537322 3632904
12332 3632904 12485382 18170463 13256266 2632130 -2967284 -1712637 -1747011 -7770952
12324 -7770952 -14285130 -14804070 -10823126 -6962125 -3224394 1741792 4983591 4453774
12316 4453774 5195506 11238866 15688155 10339962 1774851 3376005 12377969 12309272 1210249
12307 1210249 -2070928 11713343 24660927 18965969 5435542 5666866 17417820 19955924
$$ packed form
12364A3449073n767413l358426J640881k81198p251484o131685M411845Q742680
12356E454273L40379n954671M14475O798057J34143q495583k408043J0765210
12348G048240J0704271k113844q241109j550244L295581k476801q448856m560251
12340f343013L088833M628679J628879N02437N64947j444574k088866L095582
12332C632904Q852478N685081m914197j0624136n599414J254647l4374o023941
12324g770952o514178n18940L980944L861001L737731M966186L241799n29817
12316D453774P41732O043360M449289n348193q565111J601154R001964o8697j1099023
12307A210249l281177J3784271J2947584n694958j3530427K31324J1750954K538104
$$ plain form
12299 19955924 8076066 -2166143 -1576480 -28182 -5502425 -9418560 -2083727 10383692
12291 10383692 14750243 8185932 -1321727 -6729267 -7497059 -6770933 -7502451 -9310461
12283 -9310461 -7736950 346862 10683232 15524591 13546285 10817295 11900729 15273051
12275 15273051 17605781 17338104 14174848 10129145 10112138 15909087 21138144 18663703
12267 18663703 11171982 6847951 6517366 4304436 -34124 -286751 3720529 4052073
12259 4052073 -1648748 -5067460 -1188698 1986679 -4848454 -17319729 -22043629 -13251959
12251 -13251959 1490207 11043958 11964430 9926355 11577019 15632101 14159649 4331249
12243 4331249 -5209043 -4745172 3202652 7964456 5740997 2432075 2695255 4818777
$$ packed form
12299A9955924j1879858j0242209N89663J548298n474243l916135P334833J2467419
12291A0383692M366551o564311r507659n407540p67792P26126p31518j808010
12283i310461J573511Q083812J0336370M841359j978306k728990J083434L372322
12275A5273051K332730k67677l163256m045703j7007N796949N229057k474441
12267A8663703p491721m324031l30585k212930m338560k52627M007280L31544
12259D052073n700821l418712L878762L175377o835133j2471275m723900Q791670
12251a3251959J4742166R553751R20472k038075J650664M055082j472452r828400
12243D331249r540292M63871P947824M761804k223459l308922K63180K123522
$$ plain form
12235 4818777 6357406 6481727 2796274 -5480494 -11459211 -7541468 1458102 3356256
12227 3356256 -2100067 -1780188 9429159 19012621 15172319 2960883 -6161853 -10476971
12219 -10476971 -14043820 -15209584 -9940024 -1089065 5242439 8374423 10167829 8548235
12211 8548235 2413891 -1815450 1885610 7998541 5818074 -4990615 -14490539 -17374724
12203 -17374724 -18595021 -22852960 -26419681 -22765363 -11592699 686560 7178160 5978599
12195 5978599 977105 -2708144 -4874571 -10019915 -19391221 -26104146 -21804130 -6979585
12187 -6979585 8661143 15937333 14210274 9853668 8382206 8918259 7020718 2537764
12179 2537764 1246103 6240974 11751547 10860892 6105906 4995119 7157375 5292991
$$ packed form
12235D818777J538629J24321l685453q276768n978717L917743Q999570J898154
12227C356256n456323L19879J1209347R583462l840302j2211436r122736m315118
12219a0476971l566849j165764N269560Q850959O331504L131984J793406j619594
12211H548235o134344m229341L701060O112931k180467j0808689r499924k884185
12203a7374724j220297m257939l566721L654318J1172664J2279259O491600j199561
12195E978599n001494l685249k166427n145344r371306o712925M300016J4824545
12187f979585J5640728P276190j727059m356606j471462N36053j897541m482954
12179B537764j291661M994871N510573q90655m754986j110787K162256j864384
$$ plain form
12171 5292991 -1213651 -3875212 1560069 9037118 12612712 13475861 12878163 8228435
12163 8228435 1548628 1646015 10623512 17325138 12553109 2858380 198406 4776061
12155 4776061 7692783 5137777 547772 -3055267 -4459239 -2010094 2766182 4117776
12147 4117776 1338442 2380586 10328541 14513890 5970262 -5966946 -6111787 3097802
12139 3097802 5659285 -3448497 -13181402 -15215284 -12714425 -9022727 -2187569 5673247
12131 5673247 6488727 -1246877 -8373802 -7780376 -2169288 3730861 8881131 10960191
12123 10960191 6357658 -808748 -222792 9143204 15302150 10542948 2135897 -799393
12115 -799393 -674933 -3286691 -6042621 -4793784 -4436928 -10639161 -16434726 -9937080 6935330
$$ packed form
12171E292991o506642k661561N435281P477049L575594Q63149n97698m649728
12163H228435o679807R7387Q977497O701626m772029r694729k659974M577655
12155D776061K916722k555006m590005l603039j403972K449145M776276J351594
12147D117776k779334J042144P947955M185349q543628j1937208j44841R209589
12139C097802K561483r107782r732905k033882K500859L691698O835158P860816
12131E673247Q15480p735604p126925N93426N611088N900149N150270K079060
12123A0960191m602533p166406N85956R365996O158946m759202q407051k935290
12115g99393J24460k611758k755930J248837L56856o202233n795565O497646J6872410
$$ plain form
12106 6935330 19580428 20309870 15432718 11219810 4241766 -8787844 -20084987 -18202522
12098 -18202522 -3580667 10121390 10791700 124745 -9872195 -9867161 -750485 9998823
12090 9998823 15740100 13476779 3242816 -10799507 -19913949 -16876117 -4226038 7141615
12082 7141615 9468845 5339329 2007109 2099479 2631501 647470 -3259045 -6019050 -4974471
12073 -4974471 -686837 2784141 2481708 1136401 3340251 7071567 4992333 -3497598
12065 -3497598 -8378994 -2773026 5022916 1586712 -12080049 -20281156 -12846470 2523887
12057 2523887 11516207 10392493 6757244 7169194 10218518 11398953 9960675 9158442
12049 9158442 11839274 17366698 22440572 24305505 22998196 20338013 17397640 14457632
$$ packed form
12106F935330J2645098P29442m877152m212908o978044j3029610j1297143J882465
12098a8202522J4621855J3702057O70310j0666955r996940N034R116676J0749308
12090I998823N741277k263321j0233963j4042323r114442L037832J2650079J1367653
12082G141615K327230m129516l332220R2370N32022j984031l906515k760005J044579
12073d974471M287634L470978l02433j345307K203850L731316k079234q489931
12065c497598m881396N605968P795942l436204j3666761q201107P434686J5370357
12057B523887Q992320j123714l635249M11950L049324J180435j438278q02233
12049I158442K680832N527424N073874J864933j307309k660183k940373k940008
$$ plain form
12041 14457632 13162153 15622956 19632686 18063694 7333095 -5218667 -8300440 -1709802
12033 -1709802 2097814 -5179363 -15633557 -16334731 -7873879 -2612207 -6102377 -10799481
12025 -10799481 -10225446 -8760494 -11472110 -13067260 -5937890 6233739 12566080 9960473
12017 9960473 4823231 1181617 -3393063 -9302355 -11614260 -8301680 -4396704 -4110831
12009 -4110831 -4754620 -2406430 1532518 3583277 3585100 2601582 -811944 -7740291 -14954149
12000 -14954149 -17874468 -15715584 -10889580 -5565944 -1139109 1923322 6090591 14718755
11992 14718755 24973978 27590592 18408431 5802695 774229 3382706 5704621 4737696
11984 4737696 3884633 3623486 464741 -4419519 -5160306 -1872643 -2081116 -8004379 -11533832
$$ packed form
12041A4457632j295479K460803M009730j568992j0730599j2551762l081773O590638
12033a709802L807616p277177j0454194p01174Q460852N261672l490170m697104
12025a0799481N74035J464952k711616j595150P129370J2171629O332341k605607
12017I960473n137242l641614m574680n909292k311905L312580L904976K85873
12009d110831o43789K348190L938948K050759J823r83518l413526o928347p213858
12000a4954149k920319K158884M826004N323636M426835L062431M167269Q628164
11992A4718755J0255223K616614r182161j2605736n028466K608477K321915r66925
11984D737696q53063k61147l158745m884260p40787L287663k08473n923263l529453
$$ plain form
11975 -11533832 -6955467 31686 2572954 3526153 7529226 9943839 4970745 -785334
11967 -785334 3807187 15361261 18740900 9492689 -30711 317366 6724279 13305185
11959 13305185 21868853 31823440 33291694 21787774 9575768 9405687 15169565 13116344
11951 13116344 5398747 5303939 12716390 13486884 4300370 -786746 6047920 13637721
11943 13637721 11243627 5324525 5620312 7643029 2927592 -3320011 -495135 7841157
11935 7841157 8810251 1728121 -1118745 4524274 8401229 4014774 -278098 4407754
11927 4407754 12475317 12455382 4405502 -778642 2919412 9801728 11853425 8730590
11919 8730590 5640491 4751301 2557214 -4192602 -12526858 -15255604 -8759442 2672679
$$ packed form
11975a1533832M578365O987153K541268R53199M003073K414613m973094n756079
11967g85334M592521J1554074L379639r248211r523400L48077O406913O580906
11959A3305185Q563668R954587J468254j1503920j2212006j70081N763878k053221
11951A3116344p717597r4808P412451P70494r186514n087116O834666P589801
11943A3637721k394094n919102K95787K022717m715437o247603K824876Q336292
11935G841157R69094p082130k846866N643019L876955m386455m292872M685852
11927D407754Q067563j9935q049880n184144L698054O882316K051697l122835
11919H730590l090099q89190k194087o749816q334256k728746O496162J1432121
$$ plain form
11911 2672679 10725601 10524406 4363207 -978562 -928455 1952926 942073 -5672712 -11267106
11902 -11267106 -10116768 -6467036 -8078321 -13129690 -12276834 -3637314 4098880 5664980
11894 5664980 6233016 10289566 13324667 10520403 4902908 512962 -3871472 -7863257
11886 -7863257 -6264275 -231597 -232865 -8093699 -8907980 5579622 18620546 12005817
11878 12005817 -3364637 -4033969 6402741 2619742 -18163555 -27800071 -11177738 9656667
11870 9656667 10249779 -1145284 -2978427 3460607 861528 -11994212 -18812551 -13245844
11862 -13245844 -7548766 -12411780 -23457599 -30767500 -30649542 -25034258 -17241135 -10513599
11854 -10513599 -5575449 201995 7225884 10396344 6717659 2005477 3012920 6781260
$$ packed form
11911B672679Q052922k01195o161199n341769N0107K881381j010853o614785n594394
11902a1267106J150338L649732j611285n051369Q52856Q639520P736194J566100
11894E664980N68036M056550L035101k804264n617495m389946m384434l991785
11886g863257J598982O032678j268p860834q14281J4487602J3040924o614729
11878A2005817j5370454o69332J0436710l782999k0783297r636516J6622333K0834405
11870I656667N93112j1395063j833143O439034k599079j2855740o818339N566707
11862a3245844N697078m863014j1045819p309901J17958N615284P793123O727536
11854a0513599M938150N777444P023889L170460l678685m712182J007443L768340
$$ plain form
11846 6781260 5980587 1717414 1833478 7652842 11085452 5369431 -7850671 -21885506
11838 -21885506 -29584765 -25869261 -12377188 911930 4782987 1067595 -1500104 -71947
11830 -71947 286243 -3461893 -7460892 -7106117 -2774004 1594932 2061145 -2674805 -8895914
11821 -8895914 -9940387 -4277812 1427451 1634824 25902 2094626 4408109 366965
11813 366965 -6303376 -4790496 5836254 13381885 9091815 -1093979 -5786025 -2058371
11805 -2058371 4043298 6168020 3052909 -1925425 -4325028 -3398688 -3055799 -5848681
11797 -5848681 -8238399 -6036320 -1866235 -1147659 -2733056 -816305 4889373 8595033
11789 8595033 7767875 5202896 1839205 -3824148 -8214395 -3961617 8319919 17699722
$$ packed form
11846F781260q00673m263173J16064N819364L432610n716021j3220102j4034835
11838b1885506p699259L715504J3492073J3289118L871057l715392k567699J428157
11830g1947L58190l748136l998999L54775M332113M368936M66213m735950o221109
11821h895914j044473N662575N705263K07373j608922K068724K313483m041144
11813C66965o670341J512880J0626750P545631m290070j0185794m692046L727654
11805b058371O101669K124722l115111m978334k399603R26340L42889k792882
11797e848681k389718K202079M170085P18576j585397J916751N705678L705660
11789H595033q27158k564979l363691n663353m390247M252778J2281536R379803
$$ plain form
11781 17699722 16080101 6929640 -1916762 -6974631 -7695721 -4215378 -706637 -3693157
11773 -3693157 -12204258 -16228187 -10023363 -839289 867643 -5686182 -13618983 -17805870
11765 -17805870 -17068627 -12186038 -7061825 -6984533 -10716629 -9709503 -609500 7426505
11757 7426505 4773650 -4583470 -8979489 -5245479 -723019 -1336951 -5276013 -7624428
11749 -7624428 -5246948 1818515 8847932 8447002 -736482 -9859525 -9954626 -3474124 38860
11740 38860 -3026210 -8055163 -10339305 -8637322 -2694663 5841876 11550145 10587529 5986038
11731 5986038 1846476 -3788254 -12597357 -17389314 -10845195 218879 2165519 -4800119
11723 -4800119 -7137032 -204515 5183532 2650019 1148073 7814742 14031021 10133217
$$ packed form
11781A7699722j619621r150461q846402n057869p21090L480343L508741k986520
11773c693157q511101m023929O204824R184074J706932o553825p932801m186887
11765a7805870P37243M882589N124213P7292l732096J007126R100003Q036005
11757G426505k652855r357120m396019L734010M522460o13932l939062k348415
11749g624428K377480P065463P029417m00930r183484r123043r5101O480502L512984
11740C8860l065070n028953k284142J701983N942659Q536539N708269r62616m601491
11731E986038m139562n634730q809103m791957O544119J1064074J946640o965638
11723d800119k336913O932517N388047k533513j501946O666669O216279l897804
$$ plain form
11715 10133217 2689050 3416123 9159216 7936304 4832 -2641480 3430599 7910801
11707 7910801 3858103 -2307862 -1679155 5972493 15636992 23259707 24830481 17191714
11699 17191714 4040260 -5529667 -8109212 -8838040 -10081600 -6127211 4939252 12909931
11691 12909931 8329354 -2456597 -5822157 -801835 1010656 -5445052 -11660826 -10095781
11683 -10095781 -4889299 -2626647 -1116340 5022799 13197272 15476016 9904466 2248626
11675 2248626 -2318157 -3118772 -248737 6621791 14542989 17724413 14189179 8739786
11667 8739786 7288728 10554153 14684492 15931476 13611354 10437187 10699687 16140205
11659 16140205 23120462 25876924 22626056 16214351 9562380 4149002 2270245 5326656
$$ packed form
11715A0133217p444167P27073N743093j222912p931472k646312O072079M480202
11707G910801m052698o165965O28707P651648R664499P622715J570774p638767
11699A7191714j3151454r569927k579545p28828j243560L954389J1066463P970679
11691A2909931m580577j0785951l365560N020322J812491o455708o215774J565045
11683a0095781N206482K262652J510307O139139Q174473K278744n571550p655840
11675B248626m566783q00615K870035O870528P921198L181424l535234n449393
11667H739786j451058L265425M130339J246984k320122l174167K62500N440518
11659A6140205O980257K756462l250868o411705o651971n413378j878757L056411
$$ plain form
11651 5326656 9128279 7142498 710430 -474816 8146853 18609231 21749014 19195409
11643 19195409 16768357 12640796 2773084 -6413486 -4210462 6282271 10241836 3761981
11635 3761981 112154 7397440 14162154 8070308 -2685697 -1399326 10867411 17563895
11627 17563895 12782632 8241458 11887520 15277965 8971456 -2343192 -9350657 -12772745
11619 -12772745 -17477334 -19087446 -9477722 7100407 16123612 12187895 5507437 5810759
11611 5810759 9296462 7302558 436749 -3822703 -3485539 -3714132 -7032204 -9170926
11603 -9170926 -6250337 -758992 2247770 1478741 -524378 -1165155 576790 4194052
11595 4194052 7114750 6063254 1487910 -1166355 2144358 7651915 7967895 2824745
$$ packed form
11651E326656L801623j985781o432068j185246Q621669J0462378L139783k553605
11643A9195409k427052m127561r867712r186570K203024J0492733L959565o479855
11635C761981l649827P285286O764714o091846j0756005J286371J2266737O696484
11627A7563895m781263m541174L646062L390445o306509j1314648p007465l422088
11619a2772745m704589j610112R609724J6578129R023205l935717o680458L03322
11611E810759L485703j993904o865809m259452L37164k28593l318072k138722
11603i170926K920589N491345L006762p69029k003119o40777J741945L617262
11595D194052K920698j051496m575344k654265L310713N507557L15980n143150
$$ plain form
11587 2824745 855355 8007011 17579175 16269289 -104550 -20283977 -28363917 -19553936
11579 -19553936 -4051691 4140390 793750 -6863201 -10684149 -10524824 -10872542 -12002122
11571 -12002122 -10032847 -5575623 -5692076 -13848313 -23196850 -25188536 -21000880 -17663384
11563 -17663384 -15462744 -8076942 4341524 11727742 7772390 -964965 -5600827 -7516164
11555 -7516164 -11875046 -14076169 -4789049 12146407 19600960 9400039 -5847231 -10636523
11547 -10636523 -7741840 -10779204 -20743980 -23456938 -11268965 4990920 11017852 6728998
11539 6728998 1804337 528555 -54055 -1123129 -951173 -1446013 -6576908 -13708535 -15295046
11530 -15295046 -11217342 -10625717 -17409258 -22100815 -14811792 91439 10052150 10669612
$$ packed form
11587B824745j969390P151656R572164j309886j6373839k0179427q079940Q809981
11579a9553936J5502245Q192081l346640p656951l820948J59325l47718j129580
11571a2002122J969275M457224j16453q156237r348537j991686M187656L337496
11563a7663384K200640P385802J2418466P386218l955352q737355m635862j915337
11555g516164m358882k201123R287120J6935456P454553j0200921j5247270m789292
11547a0636523K894683l037364r964776k712958J2187973J6259885O026932m288854
11539F728998m924661j275782n82610j069074J71956m94840n130895p131627j586511
11530a5295046M077704N91625o783541m691557P289023J4903231R960711O17462
$$ plain form
11522 10669612 7515836 4414998 -496470 -6840170 -9292640 -5957287 -2683181 -4874038
11514 -4874038 -9555588 -9760227 -4022870 1986694 1855333 -5560824 -15027224 -18694901
11506 -18694901 -12955132 -2644289 3392844 1443968 -4394047 -8315144 -8125089 -4331939
11498 -4331939 1485297 5632717 3876343 -2938123 -7739507 -4664685 4125196 10992486
11490 10992486 10473463 3347876 -4559985 -6834895 -2562439 1596574 -921017 -6861723
11482 -6861723 -6768659 663856 5396674 1007836 -4845167 -1788195 7369488 10880979
11474 10880979 5003420 -2326373 -3914172 -1137693 1533546 2876716 3681155 4028640
11466 4028640 3571630 1488187 -3592668 -10191303 -12132837 -5328842 4500423 6642276
$$ packed form
11522A0669612l153776l100838m911468o343700k452470L335353L274106k190857
11514d874038m681550k04639N737357O009564j31361p416157r466400l667677
11506a8694901N739769J0310843O037133j948876n838015l921097J90055L793150
11498d331939N817236M147420j756374o814466m801384L074822Q789881O867290
11490A0992486n19023p125587p907861k274910M272456M159013k517591n940706
11482f861723R3064P432515M732818m388838n853003L056972R157683L511491
11474A0880979n877559p329793j587799K776479K671239J343170Q04439L47485
11466D028640m57010k083443n080855o598635j941534O803995R829265K141853
$$ plain form
11458 6642276 -2214997 -15634510 -26259322 -30185657 -23815295 -6282866 12734199 17765219
11450 17765219 5993884 -6698372 -5071106 6283840 11159838 4400239 -3587147 -3596408
11442 -3596408 1297211 4064584 4859900 7946962 12014512 10756261 3049426 -3423847
11434 -3423847 -1895217 3684735 3437589 -4845521 -12573990 -12350090 -7382396 -5018741
11426 -5018741 -6012831 -6360865 -5929107 -7245148 -7778774 -2742674 4319389 3745521 -4992620
11417 -4992620 -10281028 -5435228 719835 -2446329 -11372426 -15445907 -13873881 -14264961
11409 -14264961 -17817718 -17786540 -12433995 -8384613 -8945818 -8869601 -4451037 -359081 -1391670
11400 -1391670 -4393989 -4246212 -2376432 -2841102 -4072482 -1662930 2896793 3394796 -1568903
$$ packed form
11458F642276q857273j3419513j0624812l926335O370362J7532429J9017065N031020
11450A7765219j1771335j2692256J627266J1354946M875998o759599p987386r261
11442c596408M893619K767373P95316L087062M067550j258251p706835o473273
11434c423847J528630N579952k47146q283110p728469K23900M967694K363655
11426e018741r94090l48034M31758j316041n33626N036100P062063n73868q738141
11417d992620n288408M845800O155063l166164q926097m073481J572026l91080
11409a4264961l552757L1178N352545M049382n61205P6217M418564M091956j032589
11400a391670l002319J47777J869780m64670j231380K409552M559723M98003m963699
$$ plain form
11391 -1568903 -6503863 -7118436 -4776956 -1447527 4078907 11630630 15755724 11083714
11383 11083714 -318266 -10723177 -14672177 -12118222 -5613869 1171328 3015226 -3251323
11375 -3251323 -13229002 -17564006 -12584674 -4812469 -2090203 -3563170 -2395387 3810900
11367 3810900 10055356 11260040 8781073 8346275 13047168 19097019 18828073 9471321
11359 9471321 -1180276 -1692888 8606106 16717413 11516359 -1871378 -9090459 -4994408
11351 -4994408 2262382 4605523 3701982 5637805 12048927 18873842 19899043 11061477
11343 11061477 -4019519 -13203431 -7262674 7102015 13362246 6369379 -940503 3863165
11335 3863165 15826663 20999618 14934992 4502098 -4330113 -11514243 -17278842 -19368374
$$ packed form
11391a568903m934960o14573K341480L329429N526434P551723M125094m672010
11383A1083714j1401980j0404911l949000K553955O504353O785197J843898o266549
11375c251323r977679m335004M979332P772205K722266j472967J167783O206287
11367C810900O244456J204684k478967m34798M700893O049851k68946r356752
11359I471321j0651597n12612J0298994Q111307n201054j3387737p219081M096051
11351d994408P256790K343141r03541J935823O411122O824915J025201q837566
11343A1061477j5080996r183912N940757J4364689O260231o992867p309882M803668
11335C863165J1963498N172955o064626j0432894q832211p184130n764599k089532
$$ plain form
11327 -19368374 -16573261 -9928649 -464604 10142769 17652842 18394744 13780273 8214042
11319 8214042 3895550 1209452 1864946 6636309 11528178 11445588 6863658 2105896 -1602532
11310 -1602532 -5609733 -7377653 -1691059 10377526 20037566 20890982 15584942 10071531
11302 10071531 6342250 4182418 5186880 9671785 12436898 7701825 -2021122 -7465668
11294 -7465668 -4658660 -900710 -5260085 -16056175 -22660561 -18918097 -9436507 -1634379
11286 -1634379 2452746 3217341 -1353523 -11012716 -18283607 -16680407 -11359777 -11997334
11278 -11997334 -16516234 -13857624 -4111406 -1676706 -12251707 -20437127 -11353980 6103380
11270 6103380 11782083 3159465 -3987844 -1005024 3651520 1612988 -2631948 -1776847
$$ packed form
11327a9368374K795113O644612R464045J0607373P510073P41902m614471n566231
11319H214042m318492k686098O55494M771363M891869q2590m581930m757762l708428
11310a602532m007201j767920N686594J2068585R660040Q53416n306040n513411
11302A0071531l729281k159832J004462M484905K765113m735073r722947n444546
11294g465668K807008L757950m359375j0796090o604386L742464R481590P802128
11286a634379M087125P64595m570864r659193p270891J603200N320630o37557
11278a1997334m518900K658610R746218K434700j0575001q185420R083147J7457360
11270F103380N678703q622618p147309K982820M656544k038532m244936Q55101
$$ plain form
11262 -1776847 2163569 2763454 -558715 -3386338 -3125990 -376918 3449932 6668957
11254 6668957 7742658 6733316 4250948 -540277 -7283555 -11023088 -6902998 1952085
11246 1952085 7130397 5936906 3842634 5338224 8573648 10367617 10484576 9241574
11238 9241574 6364892 3511323 2460766 367547 -6487064 -13633003 -11404048 634878
11230 634878 10523572 9002997 502313 -4981727 -4022949 402756 4318419 3532084 -4101456
11221 -4101456 -12655750 -11665044 -685370 7535486 4228327 -3753366 -6826051 -7757510
11213 -7757510 -13403051 -19681236 -18166125 -12342540 -12882286 -19300036 -20892689 -15554290
11205 -15554290 -12771901 -15650651 -14662803 -4723147 4574743 3577743 -3239610 -6602465
$$ packed form
11262a776847L940416N99885l322169k827623K60348K749072L826850L219025
11254F668957J073701j009342k482368m791225o743278l739533M120090Q855083
11246A952085N178312j193491k094272J495590L235424J793969J16959j243002
11238I241574k876682k853569j050557k093219o854611p145939K228955J2038926
11230F34878R888694j520575q500684n484040R58778M425705L915663p86335p633540
11221d101456q554294R90706J0979674Q220856l307159p981693l072685r31459
11213g757510n645541o278185J515111N823585n39746o417750j592653N338399
11205a5554290K782389k878750R87848R939656R297890r97000o817353l362855
$$ plain form
11197 -6602465 -7128470 -10661402 -15667072 -16277105 -13804893 -14303479 -16611691 -13509313 -4830481
11188 -4830481 821775 -419891 -1791883 2527857 8124188 8444911 5756667 6648192
11180 6648192 10675074 11546548 7936808 5032228 4903066 3251533 -1597450 -3794271
11172 -3794271 724390 5560362 1781825 -8136620 -12342552 -5983846 2071336 2293787
11164 2293787 -1761592 1055010 12731469 21750341 17309922 3211449 -6605524 -4770918
11156 -4770918 2105921 4083739 1331626 2019333 8837294 14575653 12813572 6481911
11148 6481911 1656516 -1261831 -3727508 -1444883 9877486 22971100 23944791 10723759
11140 10723759 -3061771 -6340081 -3411285 -2619833 -1505022 6616782 17024459 17094753
$$ packed form
11197f602465n26005l532932n005670o10033K472212m98586k308212L102378Q678832
11188d830481N652256j241666j371992M319740N596331L20723k688244Q91525
11180F648192M026882Q71474l609740k904580j29162j651533m848983k196821
11172c794271M518661M835972l778537r918445m205932O358706Q055182K22451
11164B293787m055379K816602J1676459R018872m440419j4098473r816973J834606
11156d770918O876839J977818k752113O87707O817961N738359j762081o331661
11148F481911m825395k918347k465677K282625J1322369J3093614R73691j3221032
11140A0723759j3785530l278310K928796P91452J114811Q121804J0407677P0294
$$ plain form
11132 17094753 5181844 -4983139 -2107799 8539827 13720817 9377835 3246127 2693169
11124 2693169 5564679 4222464 -4031727 -12682028 -12664094 -2820218 7897774 9764599
11116 9764599 2388343 -6254765 -9284638 -6578305 -2063015 874235 1033625 -85514
11108 -85514 1313236 7184597 13181920 12226633 4153634 -2515354 -1580258 2084946 -274019
11099 -274019 -8145675 -12358244 -8442108 -2445722 -1166752 -2708703 -1265441 2979254
11091 2979254 4465345 771195 -4894885 -8906195 -9863942 -6415572 1956221 10976904
11083 10976904 13764599 9055062 2711476 -1023973 -4828743 -11946421 -19685624 -23655988
11075 -23655988 -24294929 -24224853 -22572831 -17088348 -8924904 -288515 9218412 18273479
$$ packed form
11132A7094753j1912909j0164983K875340J0647626N180990m342982o131708n52958
11124B693169K871510j342215q254191q650301J7934R843876J0717992J866825
11116I764599p376256q643108l029873K706333M515290K937250J59390j119139
11108h5514J398750N871361N997323r55287q072999o668988R35096L665204k358965
11099b74019p871656m212569L916136N996386J278970j541951J443262M244695
11091B979254J486091l694150n666080m011310r57747L448370Q371793R020683
11083A0976904K787695m709537o343586l735449l804770p117678p739203l970364
11075b3655988o38941P0076J652022N484483Q163444Q636389R506927R055067
$$ plain form
11067 18273479 20190885 11511900 779394 -1003422 3263026 1131500 -8760450 -13226475
11059 -13226475 -5123175 5100354 5119154 -2715734 -8953184 -11682823 -13157655 -9618880
11051 -9618880 2518619 14443277 12408993 -2818077 -15699329 -16623465 -12361100 -12943314
11043 -12943314 -17743143 -19572065 -15385645 -7624125 -220067 2194997 -3927519 -15336644
11035 -15336644 -22438167 -20393422 -15846705 -17346225 -22848442 -23283337 -15964090 -6879919
11027 -6879919 -299040 5983501 13407386 18022398 16827939 12940219 9808656 5160434
11019 5160434 -3551781 -11606670 -12230453 -7463647 -5915516 -9632722 -11442523 -7534222
11011 -7534222 -4408435 -8298986 -14275557 -12687369 -2440691 8767194 14850540 15970059
$$ packed form
11067A8273479J917406q678985j0732506j782816M266448k131526r891950m466025
11059a3226475Q103300J0223529J8800p834888o237450k729639j474832L538775
11051i618880J2137499J1924658k034284j5227070j2881252r24136M262365n82214
11043a2943314m799829j828922M186420P761520P404058K415064o122516j1409125
11035a5336644p101523K044745M546717j499520n502217m34895P319247R084171
11027f879919O580879O282541P423885M615012j194459l887720l131563m648222
11019E160434q712215q054889o23783M766806J548131l717206j809801L908301
11011g534222L125787l890551n976571J588188J0246678J1207885O083346J119519
$$ plain form
11003 15970059 15042065 15460160 20063425 26426631 25959059 14878088 3218783 3583472
10995 3583472 12516569 14493049 5421969 -685919 6477547 17237293 16609775 6240420
10987 6240420 272588 4321358 10201381 10256904 6526430 4082673 3254935 1655024 -988585
10978 -988585 -2945139 -2866965 -557993 3050934 6337292 8395141 9186951 7665915 2354165
10969 2354165 -4576446 -7373265 -4076417 -547263 -2888003 -8486669 -9555401 -3904595
10961 -3904595 2875629 5216711 2902764 -1054196 -3527006 -2158281 3019027 8387599
10953 8387599 10089516 8524269 6906840 6050742 3840433 -202505 -2847615 -375542
10945 -375542 7362102 15671529 17431561 9254804 -3382334 -10304564 -7960371 -2965137
$$ packed form
11003A5970059r27994M18095M603265O363206m67572j1080971j1659305L64689
10995C583472Q933097J976480r071080o107888P163466J0759746o27518j0369355
10987F240420n967832M048770N880023N5523l730474k443757q27738j599911k643609
10978i88585j956554P8174K308972L608927L286358K057849P91810j521036n311750
10969B354165o930611k796819L296848L529154k340740n598666j068732N650806
10961c904595O780224K341082k313947l956960k472810J368725N177308N368572
10953H387599J701917j565247j617429q56098k210309m042938k645110K472073
10945c75542P737644Q309427J760032q176757j2637138o922230K344193M995234
$$ plain form
10937 -2965137 -2108676 -3991538 -4556944 -4926065 -7054404 -6751192 65214 7327889 5060732
10928 5060732 -5196546 -11152465 -6864555 457132 3034905 2693478 4335512 7174997
10920 7174997 7916909 6878383 5692794 3387101 -591186 -3353266 -2982299 -2540084 -5377295
10911 -5377295 -9255018 -9255815 -4597078 841101 3325473 2211220 -483030 -1923877 -1309054
10902 -1309054 -898390 -1818075 -297989 6944841 14704293 13979607 5161600 -1948229 -3044654
10893 -3044654 -4186349 -7983277 -6762430 2624206 8641985 1685718 -8290468 -5509610
10885 -5509610 6640767 11243791 5134373 1634014 5204656 3470559 -9099480 -18333659
10877 -18333659 -12443744 -1494977 -617105 -6014571 -4177014 3790906 5299289 -886349
$$ packed form
10937b965137Q56461j882862n65406l69121k128339L03212O816406P262675k267157
10928E060732j0257278n955919M287910P321687K577773l41427J642034K839485
10920G174997P41912j038526j185589k305693l978287k762080L70967M42215k837211
10911e377295l877723p97M658737N438179K484372j114253k694250j440847O14823
10902a309054M10664r19685J520086P242830P759452p24686q818007p109829j096425
10893c044654j141695l796928J220847R386636O017779o956267r976186K780858
10885e509610J2150377M603024o109418l500359L570642j734097j2570039r234179
10877a8333659N889915J0948767Q77872n397466J837557P967920J508383o185638
$$ plain form
10869 -886349 -3523117 33933 -449329 -8449656 -13243546 -7802175 205949 2597958
10861 2597958 3072618 6572909 7513190 -671489 -12715112 -19010892 -19172030 -17837373
10853 -17837373 -13489452 -3012004 7680613 9970553 6415021 6249098 9341909 7458308
10845 7458308 756161 -593537 6776637 13684855 13227812 9947958 9478647 9721748 8335147
10836 8335147 9364048 15090847 19019240 14520556 4529472 -3782387 -7956741 -7648834
10828 -7648834 -52366 13726387 23187742 18870154 5475693 -3784808 -3842374 -774750
10820 -774750 59409 -26506 431792 -1333789 -7129126 -13366894 -14974853 -10970666 -4193175
10811 -4193175 2549439 8406976 13276453 15814668 13911754 8231599 3565590 3365426
$$ packed form
10869h86349k636768L557050m83262q000327m793890N441371Q008124K392009
10861B597958M74660L500291R40281q184679j2043623o295780j61138J334657
10853a7837373M347921J0477448J0692617K289940l555532j65923L092811j883601
10845G458308o702147j349698P370174O908218m57043l279854m69311K43101j386601
10836H335147J028901N726799L928393m498684r991084q311859m174354L07907
10828g648834P596468J3778753R461355m317588j3394461r260501n7566L067624
10820g74750Q34159q5915M58298j765581n795337o237768j607959M004187O777491
10811d193175O742614N857537M869477K538215j902914n680155m666009k00164
$$ plain form
10803 3365426 4109977 10994 -7283196 -10440383 -8603866 -9241300 -14551019 -15286521 -4836682
10794 -4836682 8353622 11342785 4203943 -2519063 -4001735 -4501324 -6115656 -4567421
10786 -4567421 2153695 8813416 9383501 3699553 -3710162 -7719785 -5398696 1541258
10778 1541258 7156706 7123376 3281020 13816 -1228755 -728193 2263090 6416909 6360032
10769 6360032 -277054 -6932568 -5452521 3078205 10620688 12564885 10157923 6127309
10761 6127309 4287411 9356277 19478930 23140175 12696337 -2610888 -7438744 -1171029
10753 -1171029 3618192 1528530 -222187 2717152 4785942 2596405 1544942 4880912
10745 4880912 7022579 4194948 2246391 6598970 12360536 12330566 8767320 9171122 14227241
$$ packed form
10803C365426P44551m098983p294190l157187J836517o37434n309719p35502J0449839
10794d836682J3190304K989163p138842o723006j482672m99589j614332J548235
10786d567421O721116O659721N70085n683948p409715m009623K321089O939954
10778A541258N615448l3330l842356l267204j242571N00562K991283M153819n6877
10769F360032o637086o655514J480047Q530726P542483J944197k406962m030614
10761F127309j839898N068866J0122653L661245j0443838j5307225m827856O267715
10753a171029M789221k089662j750717K939339K068790k189537j051463L335970
10745D880912K141667k827631j948557M352579N761566k9970l563246M03802N056119
$$ plain form
10736 14227241 17032265 12312105 1383412 -10326539 -17137072 -16476866 -11264849 -7377958
10728 -7377958 -7419289 -8990629 -9026724 -6550449 -1720602 3616234 5424073 2618593 1007890
10719 1007890 5522311 10655921 7543745 -922064 -3399651 946540 -97627 -11598845
10711 -11598845 -21838837 -19775344 -10588649 -5030631 -3127468 1362730 8048426 12175144
10703 12175144 14194688 16960315 17678078 12145431 3673171 -816895 -554070 943343
10695 943343 3650252 8518340 10855267 5711969 -2321807 -3976918 1247632 5190065
10687 5190065 3795695 1219751 1075532 1486259 -249173 -4331279 -9758624 -13317327
10679 -13317327 -9174300 3193251 12689493 7588349 -7474664 -15379235 -8516886 3180004
$$ packed form
10736A4227241K805024m720160j0928693j1709951o810533O60206N212017L886891
10728g377958m1331j571340l6095K476275M829847N336836J807839k805480j610703
10719A007890M514421N133610l112176q465809k477587M346191j044167j1501218
10711a1598845j0239992K063493R186695N558018J903163M490198O685696M126718
10703A2175144K019544K765627P17763n532647q472260m490066K62825J497413
10695I43343K706909M868088K336927n143298q033776j655111N224550L942433
10687E190065j394370k575944j44219M10727j735432m082106n427345l558703
10679a3317327M143027J2367551R496242n101144j5063013p904571O862349J1696890
$$ plain form
10671 3180004 8576786 8867983 9698506 9887197 6131593 1814988 2031583 3919468 372693
10662 372693 -8583297 -15170161 -13795272 -6460396 470571 733996 -7899346 -19211019
10654 -19211019 -21405697 -10615803 2013979 4658058 2541803 10022122 26297789 33442965
10646 33442965 22408073 6624129 1576103 3906754 2781704 624901 5987618 12929930
10638 12929930 6963252 -9825192 -18651973 -11653231 -1592924 1236788 3568632 11411510
10630 11411510 15063842 5796770 -6140166 -6487770 104681 -582254 -7420725 -7004027
10622 -7004027 2043674 6658944 1432496 -4143211 -3075015 89178 1586031 5170875
10614 5170875 10791531 9845973 -579877 -9695944 -7728608 -78062 1699628 -3703258
$$ packed form
10671C180004N396782K91197Q30523J88691l755604m316605K16595J887885l546775
10662C72693q955990o586864J374889P334876O930967K63425q633342j1311673
10654a9211019k194678J0789894J2629782K644079k116255P480319J6275667P145176
10646C3442965j1034892j5783944n048026K330651j125050k156803N362717O942312
10638A2929930n966678j6788444q826781O998742J0060307K829712K331844P842878
10630A1411510L652332r267072j1936936l47604O592451o86935o838471M16698
10622g004027R047701M615270n226448n575707J068196L164193J496853L584844
10614E170875N620656r45558j0425850r116067J967336P650546J777690n402886
$$ plain form
10606 -3703258 -8337765 -7467401 -2945730 3103554 10805401 18972161 23536308 20660545
10598 20660545 10924192 883182 -1506172 3796128 6588933 -1341524 -14000651 -18341714
10590 -18341714 -11981050 -4800410 -3006191 -1971147 2475672 5794115 3090952 -2118472
10582 -2118472 -3659086 -1742670 -677951 -1382842 -864293 3182079 10061579 16367232
10574 16367232 17701540 12860293 6189914 2550075 1165404 -1447680 -4747111 -5916373
10566 -5916373 -5871308 -6915580 -6911894 -3143354 903695 1048352 1395766 7633037 14274234
10557 14274234 10609071 -1975353 -11094813 -11406951 -8934074 -7445735 -4151544 -289283
10549 -289283 -2351213 -10115965 -15792049 -16920361 -17687719 -16760068 -8348245 3072049
$$ packed form
10606c703258m634507Q70364M521671O049284P701847Q166760M564147k875763
10598B0660545r736353j0041010k389354N302300K792805p930457j2659127m341063
10590a8341714O360664P180640J794219J035044M446819L318443k703163n209424
10582b118472j540614J916416J064719p04891N18549M046372O879500O305653
10574A6367232J334308m841247o670379l639839j384671k613084l299431j169262
10566e916373M5065j044272L686L768540M047049J44657L47414O237271O641197
10557A4274234l665163j2584424r119460l12138K472877J488339L294191L862261
10549b89283k061930p764752n676084j128312p67358R27651Q411823J1420294
$$ plain form
10541 3072049 4944929 -3324826 -8313271 -4421603 -1642292 -6573629 -11759073 -10103671
10533 -10103671 -5085064 -955407 2819870 3099453 -5176290 -14839105 -11434711 3368272
10525 3368272 11824459 7945306 4712297 8139825 7127670 -2692030 -8566638 -4523014
10517 -4523014 -2590272 -8776796 -11133766 -4054713 -621658 -7428322 -11554039 -6721867
10509 -6721867 -6740434 -17382763 -21723237 -10855860 -2042562 -8066259 -16561958 -17928563
10501 -17928563 -22840691 -33282004 -31673231 -19585006 -25912301 -52126769 -58709943 -37468551
10493 -37468551 -37895920 -76936683 -93601574 -64392043 -89338601 -250285282 -431381222
10486 -431381222 -422732002 -202769808 19913717 77453697 26860982 7239346 35417284
$$ packed form
10541C072049J872880q269755m988445L891668K779311m931337n185444J655402
10533a0103671N018607M129657L775277K79583q275743r662815L404394J4802983
10525C368272Q456187l879153l233009L427528j012155r819700n874608M043624
10517d523014J932742o186524k356970P079053L433055o806664m125717M832172
10509f721867j8567j0642329m340474J0867377Q813298o023697q495699j366605
10501a7928563m912128j0441313J608773J2088225o327295k6214468o583174K1241392
10493c7468551m27369l9040763j6664891K9209531k4946558j60946681j81095940
10486d31381222Q649220K19962194K22683525N7539980n0592715j9621636K8177938
$$ plain form
10479 35417284 40197511 13488065 10914111 40244065 51638834 28396447 6793653
10472 6793653 7149808 11008427 8892808 14484840 26399644 23603394 4895808 -7106615
10464 -7106615 -5469318 -6296197 -13962114 -13685685 -2752782 2780831 -2473177 -5589123
10456 -5589123 -1656352 -1483552 -8394004 -11416250 -6471742 -3084832 -6009717 -9142535
10448 -9142535 -10024945 -12575185 -14598055 -9969711 -2879555 -2672315 -6064849 -2295202
10440 -2295202 6185227 7066267 626130 -528902 6232543 10221620 6678163 1921526
10432 1921526 -686101 -3347652 -3429205 3057552 9534446 7202110 2086567 5670918
10424 5670918 12829052 10074688 2123399 5998643 19571518 22238581 9909945 2555734
$$ packed form
10479C5417284M780227k6709446k573954K9329954J1394769k3242387k1602794
10472F793653L56155L858619k115619N592032J1914804k796250j8707586j2002423
10464g106615J637297q26879p665917K76429J0932903N533613n254008l115946
10456e589123L932771J72800o910452l022246M944508L386910k924885l132818
10448i142535q82410k550240k022870M628344P090156K07240l392534L769647
10440b295202Q480429Q81040o440137j155032O761445L989077l543457m756637
10432A921526k607627k661551q1553O486757O476894k332336n115543L584351
10424E670918P158134k754364p951289L875244J3572875K667063j2328636p354211
$$ plain form
10416 2555734 9808379 15118933 5731703 -5099861 -1297327 9506936 9640524 -2083382
10408 -2083382 -13453936 -18234219 -18126999 -13406749 -4694435 1511809 -60657 -5123441
10400 -5123441 -6804265 -5960963 -6920880 -8056650 -4712330 1922842 6157168 6231952 5886165
10391 5886165 8238729 11632267 11562802 5840750 -1908709 -5564580 -4652199 -5097573 -8609359
10382 -8609359 -7542293 2906070 13730415 13313688 4666366 -374694 -485314 -4299900
10374 -4299900 -11597277 -10520725 3104073 16969912 18301981 8764516 -1286027 -4864235
10366 -4864235 -797950 7791729 13534904 9963276 -611922 -9812294 -13871326 -14971478
10358 -14971478 -13510517 -8191777 -2810033 -2503537 -3563204 1818748 10697409 11941959
$$ packed form
10416B555734P252645N310554r387230j0831564L802534J0804263J33588j1723906
10408b083382j1370554m780283J07220M720250Q712314O206244j572466n062784
10400e123441j680824Q43302r59917j135770L344320O635172M234326P4784l45787
10391E886165K352564L393538o9465n722052p749459l655871R12381m45374l511786
10382h609359J067066J0448363J0824345m16727q647322n041060j10620l814586
10374d299900p297377J076552J3624798J3865839J332069r537465j0050543l578208
10366d864235M066285Q589679N743175l571628j0575198r200372m059032j100152
10358a4971478J460961N318740N381744L06496j059667N381952Q878661J244550
$$ plain form
10350 11941959 4827538 1257724 6170222 9789784 5070467 -477309 1502391 5792034
10342 5792034 2564115 -6769449 -11671669 -6306215 4613915 10792201 5121061 -7889458
10334 -7889458 -12750140 518042 21262816 29442615 21579666 13101584 13918960 16748304
10326 16748304 14027458 10683566 11903875 12153673 6612501 1776381 3715120 6052557
10318 6052557 1261189 -4933353 -2839877 4238424 4720192 -3772283 -12433835 -13983142
10310 -13983142 -8804842 -1372301 2475176 -1544335 -9906240 -12725083 -6643854 477259
10302 477259 3220228 7551926 17933240 25779938 22596846 15904742 17931952 24935035
10294 24935035 23403804 12926086 6481873 8972279 11508635 8613028 5929722 7026172
$$ packed form
10350A1941959p114421l569814M912498L619562m719317n547776J979700M289643
10342E792034l227919r333564m902220N365454J0920130O178286n671140j3010519
10334g889458m860682J3268182K0744774Q179799p862949q478082Q17376K829344
10326A6748304k720846l343892J220309K49798n541172m836120J938739K337437
10318F052557m791368o194542K093476P078301M81768q492475q661552j549307
10310a3983142N178300P432541L847477m019511q361905k818843O081229P121113
10302D77259K742969M331698J0381314P846698l183092o692104K027210P003083
10294B4935035j531231j0477718o444213K490406K536356k895607k683306J096450
$$ plain form
10286 7026172 6300096 688938 -3386750 -1373358 1256020 -724108 -2868578 -9233
10278 -9233 2891219 -1785943 -10812179 -13555809 -6934668 1296120 4075199 3189548 4802698
10269 4802698 11604628 20728046 26312810 23677934 13990141 5052961 4217571 10025599
10261 10025599 14389987 13764071 13322221 17277936 20363730 15395588 6286873 4410820
10253 4410820 11096803 13698274 4410581 -6049750 -3271679 8469122 11722964 2294807
10245 2294807 -4220808 3741327 16379747 17394681 6619322 -2754522 -3587950 -472874
10237 -472874 810286 -1114489 -6974560 -15987796 -20904544 -13969378 79715 6656099
10229 6656099 724350 -5873213 -2483660 3806855 -885595 -15593490 -25337326 -22101540
$$ packed form
10286G026172p26076n611158m075688K013392K629378j980128k144470K859345
10278i233K900452m677162r026236k743630O621141Q230788K779079q85651J613150
10269D802698O801930R123418N584764k634876r687793q937180q35390N808028
10261A0025599M364388o25916m41850L955715L085794m968142r108715j876053
10253D410820O685983K601471r287693j0460331K778071J1740801L253842r428157
10245B294807o515615P962135J2638420J014934j0775359r373844q33428L115076
10237d72874J283160j924775n860071r013236m916748O935166J4049093O576384
10229F656099n931749o597563L389553O290515m692450j4707895r743836L235786
$$ plain form
10221 -22101540 -13711600 -9793256 -9013251 -5414822 463252 4114454 5833855 9063797
10213 9063797 12169251 9484432 726610 -6923135 -7433473 -1771445 5974031 13479076
10205 13479076 19205915 20661723 16514754 8433154 -498666 -7358373 -9628740 -7127775
10197 -7127775 -3595245 -2506367 -1538654 4053524 12737485 17335484 14831207 8734077
10189 8734077 901093 -10082453 -19559548 -16499765 325593 14822946 12124068 -1373885
10181 -1373885 -7149756 124437 7794526 4935943 -3865703 -6867536 309569 11804573
10173 11804573 18777478 17276906 10916822 6040079 3933951 1159781 -1448693 2882989
10165 2882989 14858283 22898304 17137296 4036458 -2429524 198174 3189757 2803055
$$ packed form
10221b2101540Q389940L918344P80005L598429N878074L651202J719401L229942
10213I063797L105454k684819q757822p649745n10338N662028P745476P505045
10205A3479076N726839J455808m146969q081600q931820o859707k270367K500965
10197g127775L532530J088878R67713N592178Q683961M597999k504277o097130
10189H734077p832984j0983546r477095L059783J6825358J4497353k698878j3497953
10181a373885n775871P274193P670089k858583q801646l001833P177105J1495004
10173A1804573O972905j500572o360084m876743k106128k774170k608474M331682
10165B882989J1975294Q040021n761008j3100838o465982K627698K991583l86702
$$ plain form
10157 2803055 4071906 8721499 10873920 7067297 1292791 -2530610 -5416166 -8443778
10149 -8443778 -9779100 -8438455 -5497771 -1036342 4720527 8127769 6371831 3679945
10141 3679945 6184792 12129624 14945634 14214049 14630299 15569676 11598366 2830883 -4957763
10132 -4957763 -9769631 -12711551 -9442999 5050461 23046275 29345118 22353212 16275802
10124 16275802 18571297 19371838 9752243 -2553939 -4755025 3310683 11934061 14990421
10116 14990421 13332527 10400228 9979154 13290104 15072580 8564333 -3902323 -12869527
10108 -12869527 -15163628 -15669455 -15023610 -8139237 2263849 4815092 -2313260 -6223700
10100 -6223700 449658 7584302 4641825 -3273229 -6701851 -7002093 -8468361 -6222727
$$ packed form
10157B803055J268851M649593K152421l806623n774506l823401k885556l027612
10149h443778j335322J340645K940684M461429N756869L407242j755938k691886
10141C679945K504847N944832K816010p31585M16250R39377l971310q767483p788646
10132d957763m811868k941920L268552J4493460J7995814O298843o991906o077410
10124A6275802K295495Q00541r619595j2306182k201086Q065708Q623378L056360
10116A4990421j657894k932299m21074L310950J782476o508247j2466656q967204
10108a2869527k294101n05827O45845O884373J0403086K551243p128352l910440
10100f223700O673358P134644k942477p915054l428622l00242j466268K245634
$$ plain form
10092 -6222727 4711318 16575360 18067937 10060288 1161748 -5453507 -10062968 -9153611
10084 -9153611 -2379052 376983 -8030055 -17977312 -15446843 -3369785 3344233 385015
10076 385015 -2727056 -319176 2384754 480004 -4148126 -8955370 -13630757 -15764356
10068 -15764356 -11985943 -4195024 2259408 6151570 9672066 11903030 10247893 6894246
10060 6894246 6655453 9359948 10590815 8619022 5226007 1839228 -316940 518267
10052 518267 2760003 1490040 -3285290 -4961436 -2041639 -2679522 -9966658 -12678064
10044 -12678064 -1802287 12508060 13981265 3473181 -5146202 -6873903 -7768698 -8846740
10036 -8846740 -4523910 2985686 3281560 -5702536 -13407933 -11585098 -3230082 4812577
$$ packed form
10092f222727J0934045J1864042J492577q007649q898540o615255m609461R09357
10084i153611O774559K756035q407038r947257K530469J2077058O714018k959218
10076C85015l112071K407880K703930j904750m628130m807244m675387k133599
10068a5764356L778413P790919O454432L892162L520496K230964j655137l353647
10060F894246k38793K704495J230867j971793l393015l386779k156168Q35207
10052E18267K241736j269963m775330j676146K919797o37883p287136k711406
10044a2678064J0875777J4310347J473205j0508084q619383j727701q94795j078042
10036h846740M322830P509596K95874q984096p705397J822835Q355016Q042659
$$ plain form
10028 4812577 8524397 5529143 -3085646 -9615372 -7704048 -2689232 -4424892 -11614894
10020 -11614894 -14330423 -10471974 -7321055 -7206341 -4539133 2002153 6704470 7566991
10012 7566991 7965600 6568297 -1791190 -13233523 -15682036 -6086339 4671872 7569779
10004 7569779 5378851 3634272 2391471 671338 -508407 -2630269 -8338216 -13996450
9996 -13996450 -12848773 -5990264 -61017 4793784 11994000 15236626 4683992 -12615538
9988 -12615538 -17002618 -5137346 4079424 -841267 -7610946 -3306577 4852941 5364159
9980 5364159 2525729 4582939 5586202 -2925095 -12582614 -9440326 2261819 6121372
9972 6121372 -349611 -3303992 4531190 14481813 17373120 15183048 13899217 14724990
$$ packed form
10028D812577L711820k995254q614789o529726J911324N014816j735660p190002
10020a1614894k715529L858449L150919J14714K667208O541286M702317Q62521
10012G566991L98609j397303q359487j1442333k448513R595697J0758211K897907
10004G569779k190928j744579j242801j720133j179745k121862n707947n658234
9996a3996450J147677O858509N929247M854801P200216L242626j0552634j7299530
9988a2615538m387080J1865272R216770m920691o769679M304369Q159518N11218
9980E364159k838430K057210J003263q511297r657519L142288J1702145L859553
9972F121372o470983k954381P835182R950623K891307k190072j283831Q25773
$$ plain form
9964 14724990 15864076 16014585 13913799 9751556 7494088 10722227 16501679 18266712
9956 18266712 14094296 7855341 3660327 3190114 6239365 9823693 9559230 5749320
9948 5749320 4187485 6960007 8155068 4374627 2751218 9832793 18223507 15558713
9940 15558713 3737052 -3106939 289041 3634343 -1289179 -7519374 -4138797 7130815
9932 7130815 14860732 13776697 9812113 9659321 11870991 10974759 6301823 2340275 1503798
9923 1503798 1265278 -328213 -805827 1825638 4175852 2353347 -1109834 -1286681 72750
9914 72750 -3290630 -11173538 -15532481 -11399682 -2859472 3173443 3414730 -1946957 -9500642
9905 -9500642 -12582604 -7806016 -1059671 569159 613317 6427562 13137100 9087742 -3114133
$$ packed form
9964A4724990J139086J50509k100786m162243k257468L228139N779452J765033
9956A8266712m172416o238955m195014m70213L049251L584328k64463l809910
9948E749320j561835K772522J195061l780441j623409P081575Q390714k664794
9940A5558713j1821661o843991L395980L345302m923522o230195L380577J1269612
9932G130815P729917j084035l964584j52792K211670q96232m672936l961548q36477
9923A503798k38520j593491m77614K631465K350214j822505l463181j76847J359431
9914G2750l363380p882908m358943M132799Q540210O032915K41287n361687p553685
9905i500642l081962M776588O746345J628830M4158N814245O709538m049358j2201875
$$ plain form
9896 -3114133 -8891738 -7250165 -12923413 -27173450 -31893687 -25879760 -38318804 -80317012
9888 -80317012 -107239630 -68014732 17908064 73866138 59378327 13169235 -7902529
9881 -7902529 2352302 13242439 11728827 11731273 21194640 29496759 27598863 19866615
9873 19866615 12936673 7813653 5809235 9723151 15483853 13082333 324770 -12414486
9865 -12414486 -15409660 -10620871 -5261775 -1271024 2502929 3085071 -2808050 -9360822
9857 -9360822 -5438384 9539414 21191075 17356546 4325119 -1911677 2441680 5940780
9849 5940780 1447121 -2633536 3246345 13412055 15177333 8283733 4503942 8958772
9841 8958772 13428314 10893214 6432627 7684164 11902058 10419673 2210345 -4955025
$$ packed form
9896c114133n777605J641573n673248j4250037m720237O013927j2439044m1998208
9888h0317012k6922618L9224898Q5922796N5958074j4487811m6209092k1071764
9881g902529J0254831J0890137j513612K446R463367Q302119j897896p732248
9873A9866615o929942n123020k004418L913916N760702k401520j2757563j2739256
9865a2414486k995174M788789N359096L990751L773953N82142n893121o552772
9857i360822L922438J4977798J1651661l834529j3031427o236796M353357L499100
9849E940780m493659m080657N879881J0165710J765278o893600l779791M454830
9841H958772M469542k535100m460587J251537M217894j482385q209328p165370
$$ plain form
9833 -4955025 -6174800 -5134846 -6233667 -6678714 -1114921 8480886 13430635 9858854
9825 9858854 4267504 3877215 5658108 1489783 -7893291 -12869867 -10035536 -7880198
9817 -7880198 -12681945 -17640384 -14087193 -6375332 -4928110 -8895676 -7963257 -8355
9809 -8355 5904051 5730210 6792945 13045412 15756162 7117869 -5708721 -9803100 -3682389
9800 -3682389 4340440 10174504 15566310 18506226 13957066 4751597 571236 3093305
9792 3093305 2450279 -6596260 -14719405 -11998135 -3902749 -3064673 -9913940 -12997117 -7134390
9783 -7134390 73510 1174287 -2069694 -5635523 -9753846 -13946870 -14188747 -10537161
9775 -10537161 -9599870 -13342339 -13867268 -6809916 -798234 -3280151 -5778021 2732512
$$ packed form
9833d955025j219775J039954j098821m45047N563793R595807M949749l571781
9825I858854n591350l90289J780893m168325r383074m976576K834331K155338
9817g880198m801747m958439L553191P711861J447222l967566R32419P954902
9809h355N912406j73841J062735O252467K710750q638293j2826590m094379O120711
9800c682389Q022829N834064N391806K939916m549160r205469m180361K522069
9792C093305o43026r046539q123145K721270Q095386Q38076o849267l083177N862727
9783g134390P207900J100777l243981l565829m118323m193024k41877L651586
9775a0537161R37291l742469n24929P057352O011682k481917k497870Q510533
$$ plain form
9767 2732512 14412728 11804875 -4112004 -13581381 -7214828 2803111 5216934 5132630
9759 5132630 8519049 8392232 -870593 -8960083 -3978456 8426509 14684290 14146359
9751 14146359 15376481 17647149 12252352 -79354 -8178387 -7429445 -5201778 -7559437
9743 -7559437 -10899345 -9088624 -1177368 9116604 15558528 12306942 1158297 -6905216
9735 -6905216 -4869066 -320948 -3573854 -9898625 -6281262 6923758 15884789 15047259
9727 15047259 13730007 17694685 18843404 9912813 -2672793 -8738498 -7993630 -5946391
9719 -5946391 -3573184 1376540 8169310 14488230 19854997 23369205 22752428 19017778
9711 19017778 16588440 15642659 10673573 226360 -8658978 -9964257 -6154015 -1779362
$$ packed form
9767B732512J1680216k607853j5916879r469377O366553J0017939K413823q4304
9759E132630L386419j26817r262825q089490M981627J2404965O257781n37931
9751A4146359J230122K270668n394797j2331706q099033P48942K227667k357659
9743g559437l339908J810721P911256J0293972O441924l251586j1148645q063513
9735f905216K036150M548118l252906o324771L617363J3205020Q961031q37530
9727A5047259j317252L964678J148719q930591j2585606o065705P44868K047239
9719e946391K373207M949724O792770O318920N366767L514208o16777l734650
9711A9017778k429338r45781m969086j0447213q885338j305279L810242M374653
$$ plain form
9703 -1779362 3478532 9998147 12977991 8668623 1329509 -1873879 706337 6296319
9695 6296319 12727672 17588840 16700627 8752948 -1331970 -7435469 -8011663 -5067264
9687 -5067264 -1683751 -1778067 -6371949 -8778498 -1148185 12185332 17204342 9530964
9679 9530964 879973 977425 4241153 2139116 -2296703 -2473454 -912634 -2281982 -2320009
9670 -2320009 3727741 9395248 7381939 4475675 10726897 19759172 17430111 6504449
9662 6504449 3615855 12047102 17031577 11101735 5161384 8097880 12564932 9654552
9654 9654552 2919543 -1697960 -6530231 -12338586 -10205351 4321254 18844428 19114832
9646 19114832 9323604 4723589 9536197 14964950 15568621 14899145 15694868 15291739 11733385
$$ packed form
9703a779362N257894O519615K979844m309368p339114l203388K580216N589982
9695F296319O431353M861168q88213p947679j0084918o103499n76194K944399
9687e067264L383513r4316m593882k406549P630313J3333517N019010p673378
9679I530964q650991R7452L263728k102037m435819j76751J560820j369348l8027
9670b320009O047750N667507k013309k906264O251222R032275k329061j0925662
9662F504449k888594Q431247M984475n929842n940351K936496M467052k910380
9654I654552o735009m617503m832271n808355K133235J4526605J4523174K70404
9646A9114832r791228m600015M812608N428753O03671o69476P95723m03129l558354
$$ plain form
9637 11733385 6866366 3291641 3713901 10804377 21525474 25481817 16800437 3901997
9629 3901997 -1532809 -1543884 -6927853 -17935867 -22922200 -16883499 -8704286 -6749612
9621 -6749612 -8279653 -7339184 -3259412 3173212 12392052 19737597 16118634 1701609
9613 1701609 -9756090 -8045384 -308222 826989 -4286279 -6095882 -2712820 -1006401
9605 -1006401 -2902753 -2199041 3939199 9795252 9682796 4439341 -2490188 -8829320 -11604475
9596 -11604475 -8205241 -1947763 -637547 -6407115 -12029768 -10571160 -4006614 1412952
9588 1412952 4007139 6238677 8592740 9190825 8378451 8918032 11110657 11315815 6822169
9579 6822169 -9850 -4366111 -4746333 -3979920 -4294033 -3817290 71727 5951619 10469911
$$ packed form
9637A1733385m867019l574725M22260P090476J0721097L956343q681380j2898440
9629C901997n434806j1075n383969j1008014m986333O038701Q179213J954674
9621f749612j530041R40469M079772O432624R218840P345545l618963j4417025
9613A701609j1457699J710706P737162J135211n113268j809603L383062J706419
9605a006401j896352P03712O138240N856053j12456n243455o929529o339132k775155
9596a1604475L399234O257478J310216n769568n622653J458608O564546N419566
9588A412952K594187K231538K354063N98085q12374N39581K192625K05158m493646
9579F822169o832019m356261l80222P66413l14113M76743L889017N879892M518292
$$ plain form
9570 10469911 14014323 19045853 22606280 17537890 4328513 -5354836 -2928841 5021078
9562 5021078 6316086 161605 -4216044 -2441094 1523818 4958571 8800111 10664544
9554 10664544 6278962 -949916 -2441399 1744867 2728514 -1246621 -1294253 5412313 8990914
9545 8990914 4005152 -160746 4029223 7883383 1590341 -7209668 -5397650 3215564
9537 3215564 4470492 -2267811 -4649710 222197 1860598 -3684900 -6818335 -1575948
9529 -1575948 4804951 5097418 2216810 211203 -3118265 -7811287 -6726114 3170497
9521 3170497 13316432 15103275 11369792 9378479 9998749 11280081 15147476 21985809
9513 21985809 25193150 20246051 13534412 12819391 14273282 9778765 3060762 5968353
$$ packed form
9570A0469911L544412N031530L560427n068390j3209377r683349K425995P949919
9562E021078J295008o154481m377649J774950L964912L434753L841540J864433
9554A0664544m385582p228878j491483M186266R83647l975135m7632O706566L578601
9545H990914m985762m165898M189969L854160o293042q800009J812018Q613214
9537C215564J254928o738303k381899M871907J638401n545498l133435N242387
9529a575948O380899K92467k880608k005607l329468m693022J085173R896611
9521C170497J0145935J786843l733483j991313O20270J281332L867395O838333
9513B1985809L207341m947099o711639p15021J453891m494517o718003K907591
$$ plain form
9505 5968353 19183458 28561977 23416844 9232301 -1340331 -2721801 2243798 8977944
9497 8977944 14307649 16352678 15118054 11725901 6032841 -2211134 -9397066 -9605464
9489 -9605464 -1972651 7430727 13303066 16695018 20023710 20889952 15892458 7943677
9481 7943677 3820063 4922949 6063571 4140436 2416083 3915755 5857604 4614875
9473 4614875 2010256 1696179 2629158 2057127 2307608 7360353 14196922 15929466 13219148
9464 13219148 12967104 14688257 9955008 -641401 -3181110 8528236 19987214 16488358
9456 16488358 6178347 6931723 17708393 21441884 12928935 4312844 2640904 1675792
9448 1675792 -602278 3842872 14460918 16416246 3898830 -7422478 -3677787 5993617
$$ packed form
9505E968353J3215105R378519n145133j4184543j0572632j381470M965599O734146
9497H977944N329705K045029j234624l392153n693060q243975p185932k08398
9489i605464P632813R403378N872339L391952L328692Q66242m997494p948781
9481G943677m123614J102886J140622j923135j724353J499672J941849j242729
9473D614875k604619l14077R32979n72031K50481N052745O836569J732544k710318
9464A3219148k52044J721153m733249j0596409k539709J1709346J1458978l498856
9456A6488358j0310011P53376J0776670L733491q512949q616091j671940r65112
9448A675792k278070M445150J0618046J955328j2517416j1321308L744691R671404
$$ plain form
9440 5993617 5439083 -4000704 -10277422 -11168474 -11654659 -9513796 -705795 7326079 4859864
9431 4859864 -2419312 -1587307 6067734 9077759 7333408 10357735 16059644 12215229
9423 12215229 492745 -2461136 7221708 12623512 3821367 -5974839 -3257284 4454596
9415 4454596 4185660 -263634 2238415 9350961 10506291 5735099 3679726 5761542
9407 5761542 6814991 7908128 14379146 22784453 22982082 13311319 2579545 -3114029
9399 -3114029 -5283577 -5082430 -1084057 4089568 4830171 1638700 166072 399064 -3322377
9390 -3322377 -10043478 -10895740 -3726560 1461200 -2614609 -9383576 -9228502 -3610703 4542
9381 4542 1336939 5765796 12840581 16062264 13935842 12778688 16465842 19975650 16879784
$$ packed form
9440E993617n54534r439787o276718q91052m86185K140863Q808001Q031874k466215
9431D859864p279176Q32005P655041L010025j744351L024327N701909l844415
9423A2215229j1722484k953881R682844N401804q802145r796206K717555P711880
9415D454596k68936m449294K502049P112546J155330m771192k055373K081816
9407E761542J053449J093137O471018Q405307J97629r670763j0731774n693574
9399c114029k169548K01147L998373N173625P40603l191471j472628K32992l721441
9390c322377o721101q52262P169180N187760m075809o768967J55074N617799L615245
9381D542J332397M428857P074785L221683k126422j157154L687154L509808l095866
$$ plain form
9372 16879784 9214427 5381170 9095378 14027484 11197950 325453 -9312067 -10589752
9364 -10589752 -7562293 -8317673 -11280093 -6675599 6822938 16054641 10434223 -1837500
9356 -1837500 -4102328 5992878 15081445 14731162 11267229 11403830 9983694 618422
9348 618422 -10019277 -10218605 -1731426 1825936 -4708477 -10578419 -5639941 5063425
9340 5063425 9686666 5994371 1560790 1036504 1376860 -301977 -825590 4526464 14890455
9331 14890455 23403442 23288243 14707616 6319559 7856849 19006983 28407978 27184591
9323 27184591 20280772 18645490 22759214 22463726 13587972 5200756 6153147 12626832
9315 12626832 15594717 13997146 11985773 7855115 -3512767 -18109405 -23419996 -14411482
$$ packed form
9372A6879784p665357l833257L714208M932106k829534j0872497r637520j277685
9364a0589752L027459p55380k962420M604494J3498537R231703n620418j2271723
9356a837500k264828J0095206R088567l50283l463933J36601j420136r365272
9348F18422j0637699j99328Q487179L557362o534413n869942M938478J0703366
9340E063425M623241l692295m433581n24286L40356j678837n23613N352054J0363991
9331A4890455Q512987j15199q580627q388057J537290J1150134R400995j223387
9323B7184591o903819j635282M113724k95488q875754q387216R52391O473685
9315A2626832K967885j597571k011373m130658j1367882j4596638n310591R008514
$$ plain form
9307 -14411482 -767821 5522505 2927374 -3262136 -10034536 -15551302 -14626312 -4279393
9299 -4279393 8087747 10515528 1183599 -9508576 -12828164 -11021248 -10112421 -9870025
9291 -9870025 -6128373 884667 6340450 7387889 5276377 1807789 -2110786 -4898816
9283 -4898816 -5437585 -5685517 -8073810 -10256901 -7285317 -31759 3965458 887574 -3158047
9274 -3158047 -791693 5844550 8910088 6849883 5208269 5805696 3182882 -5255251
9266 -5255251 -12517175 -10941826 -3307680 1379665 546347 -713392 -456860 -3852118 -13320767
9257 -13320767 -21399248 -19318256 -9220146 -1499280 -1217973 -3533883 -3246808 -2260865
9249 -2260865 -4060325 -6045350 -3300385 2436485 4109725 -200475 -4303954 -3545680
$$ packed form
9307a4411482J3643661O290326k595131o189510o772400n516766R24990J0346919
9299d279393J2367140K427781r331929j0692175l319588J806916R08827K42396
9291i870025L741652P013040N455783J047439k111512l468588l918575k788030
9283d898816n38769k47932k388293k183091K971584P253558L997217l077884m045621
9274c158047K366354O636243L065538k060205j641614N97427k622814q438133
9266e255251p261924J575349P634146M687345q33318j259739K56532l395258r468649
9257a3320767q078481K080992J0098110P720866K81307k315910K87075R85943
9249b260865j799460j985025K744965N736870J673240m310200m103479P58274
$$ plain form
9241 -3545680 -1928997 -5342352 -11652517 -13422833 -8860391 -3794756 -2304913 -1473767
9233 -1473767 2046619 5524650 4434021 -406020 -4826941 -7870536 -10898677 -11886927
9225 -11886927 -7248760 560222 4338526 2934743 3506080 9161157 11791823 4092633
9217 4092633 -7343236 -10420397 -5455317 -3662821 -8708548 -12078023 -9121695 -6786224
9209 -6786224 -9156508 -7632355 4072817 15215751 12282680 1562574 1209617 12759401
9201 12759401 17863770 6523373 -7730057 -8538959 775775 5959600 3095799 -999283
9193 -999283 -3264114 -6768404 -11227941 -11930400 -7640213 -1503753 4686927 9715934 8893389
9184 8893389 -223846 -9709441 -8925540 -164270 3767746 -1268781 -5051808 231206
$$ packed form
9241c545680J616683l413355o310165j770316M562442N065635J489843Q31146
9233a473767L520386L478031j090629m840041m420921l043595l028141r88250
9225a1886927M638167P808982L778304j403783N71337N655077K630666p699190
9217D092633j1435869l077161M965080J792496n045727l369475K956328K335471
9209f786224k370284J524153J1705172J1142934k933071j0720106l52957J1549784
9201A2759401N104369j1340397j4253430q08902R314734N183825k863801m095082
9193i99283k264831l504290m459537p02459M290187O136460O190680N029007q22545
9184H893389r117235r485595P83901Q761270L932016n036527l783027N283014
$$ plain form
9176 231206 8500254 10872131 8500343 6592510 3680945 -3626304 -10660310 -9591513
9168 -9591513 -1668003 4627438 6385123 8494983 12981688 14563281 9045103 -468629
9160 -468629 -8507649 -13136119 -14218518 -10688807 -3367746 2737275 2885744 -2029809 -7085774
9151 -7085774 -8887324 -7410019 -3951947 -90456 1888216 201544 -4142594 -7686855
9143 -7686855 -7691550 -4252753 563891 4299171 4458171 -715974 -9573430 -15774095 -12937148
9134 -12937148 -2415732 5818612 3275335 -6710440 -12183232 -6700398 3213326 6714766
9126 6714766 1810270 -3668266 -3223150 180712 -1101156 -8535057 -14443711 -11040327
9118 -11040327 -614001 6234113 2727666 -7008592 -14495085 -16451935 -14187080 -7736893
$$ packed form
9176B31206Q269048K371877k371788j907833k911565p307249p034006J068797
9168i591513P923510O295441J757685K109860M486705J581593n518178r513732
9160d68629q039020m628470j082399L529711P321061O105021J48469m915553n055965
9151g085774j801550J477305L458072L861491J978672j686672m344138l544261
9143g686855m695L438797M816644L735280J59000n174145q857456o200665K836947
9134a2937148J0521416Q234344k543277r985775n472792N482834R913724L501440
9126F714766m904496n478536M45116L403862j281868p433901n908654L403384
9118a1040327J0426326O848114l506447r736258p486493j956850K264855O450187
$$ plain form
9110 -7736893 2464401 10135302 8033425 -822860 -5250521 -1582353 1562128 -1794007
9102 -1794007 -5047074 -1438101 2504014 -2988639 -13238743 -14430322 -4652218 3141439
9094 3141439 423819 -6184613 -6991575 -2356396 1170960 531545 -2856323 -6299605 -6332512
9085 -6332512 -1060644 5284672 5465015 -1115302 -8099800 -12896449 -19139471 -25667690
9077 -25667690 -23731014 -11587682 -1591831 -3129167 -6995486 1286651 18597486 28075509
9069 28075509 22878109 12564402 6226189 2665099 -553869 -1094737 352719 -2683828
9061 -2683828 -11007487 -14669271 -6701858 5542397 10922724 10368761 12932630 19734413
9053 19734413 21967357 14773141 4392175 -977507 -1312805 -2399364 -7204451 -13151998
$$ packed form
9110g736893J0201294P670901k101877q856285m427661L668168L144481l356135
9102a794007l253067L608973L942115n492653j0250104j191579R778104P793657
9094C141439k717620o608432q06962M635179L527356o39415l387868l443282l2907
9085f332512N271868O345316J80343o580317o984498m796649o243022o528219
9077b5667690J936676J2143332R995851j537336l866319Q282137J7310835R478023
9069B8075509n197400j0313707o338213l561090l218968n40868J447456l036547
9061b683828q323659l661784P967413J2244255N380327n53963K563869O801783
9053A9734413K232944p194216j0380966n369682l35298j086559m805087n947547
$$ plain form
9045 -13151998 -16325938 -15612047 -12835208 -10325206 -8802649 -7268031 -4528938 -546540
9037 -546540 3510001 6056025 6165543 4476598 2735011 1897800 1447457 1236828 2435773
9028 2435773 5222747 7563330 8564658 10570532 14377842 15099548 8319370 -1471258
9020 -1471258 -5706386 -4569821 -6533265 -13609653 -16708141 -10252315 -2018718 -724430
9012 -724430 -1791849 4009940 13127023 13158279 3009445 -3641941 2063939 11798599 12764204
9003 12764204 4791369 -2164223 -2497082 365497 1649851 1178544 1070334 1667270 1645393
8994 1645393 878751 1709191 6398970 13272023 17484409 17280553 16670600 18237446 16346571
8985 16346571 4223279 -13273818 -22552945 -19023770 -13272687 -14755727 -17511150 -10097056
$$ packed form
9045a3151998l173940P13891K776839K510002J522557J534618K739093L982398
9037e46540M056541K546024J09518j688945j741587q37211m50343k10629J198945
9028B435773K786974K340583J001328K005874L807310P21706o780178r790628
9020a471258m235128J136565j963444p076388l098488O455826Q233597J294288
9012g24430j067419N801789R117083L1256j0148834o651386N705880R734660R65605
9003A2764204p972835o955592l32859K862579J284354m71307j08210N96936k1877
8994A645393p66642Q30440M689779O873053M212386k03856o09953J566846j890875
8985A6346571j2123292j7497097r279127L529175N751083j483040k755423P414094
$$ plain form
8977 -10097056 6134252 18784466 21856482 21031606 21144587 18551022 9785269 -54613
8969 -54613 -3362329 60922 4211596 4982642 2818738 -84512 -1076650 2208314 8095707
8960 8095707 9704404 2369202 -8747735 -13605686 -9820036 -4698903 -3409201 -1312592
8952 -1312592 7292132 17129844 16092906 1945180 -11390494 -8502878 9102187 24080442
8944 24080442 23097418 11199569 3304379 4532841 5301059 -3062945 -14667611 -16837737
8936 -16837737 -7726041 2070063 5413601 7289001 13745550 20019224 17250157 6667982
8928 6667982 -1545106 -2169492 509663 2350927 5076702 9598533 11215345 6507244
8920 6507244 -308835 -3410892 -3899286 -6547774 -10658526 -10265650 -2748127 7820781
$$ packed form
8977a0097056J6231308J2650214L072016q24876J12981k593565q765753r839882
8969e4613l307716L423251M150674P71046k163904k903250r92138L284964N887393
8960H095707J608697p335202j1116937m857951L785650N121133J289702K096609
8952a312592Q604724R837712j036938j4147726j3335674K887616J7605065J4978255
8944B4080442r83024j1897849p895190J228462P68218q364004j1604666k170126
8936a6837737R111696R796104L343538J875400O456549O273674k769067j0582175
8928F667982q213088o24386K679155J841264K725775M521831J616812m708101
8920F507244o816079l102057m88394k648488m110752L92876P517523J0568908
$$ plain form
8912 7820781 15888372 18827267 16355147 10107453 4695344 5147063 11111495 15781519
8904 15781519 12469407 1582197 -9428993 -12550725 -6236718 2957703 6522220 2754989
8896 2754989 -1992019 -1869544 1272103 1667198 -2170925 -6979342 -10401543 -12049753 -9730080
8887 -9730080 -488214 12997227 21702516 18902007 7449045 -3234236 -5934651 -932226
8879 -932226 5371655 6399568 1585080 -3236824 -2896621 914054 2952004 2274287 2825937
8870 2825937 6846646 11929289 14760351 14046123 9986125 4836632 3194649 6600231
8862 6600231 8549386 1483631 -10831707 -15540224 -7487131 3850548 7673085 4311809
8854 4311809 -587876 -6266624 -13392216 -16720108 -11182924 -2252015 -440065 -6309852
$$ packed form
8912G820781Q067591K938895k472120o247694n412109M51719N964432M670024
8904A5781519l312112j0887210j1011190l121732O314007R194421L564517l767231
8896B754989m747008J22475L141647L95095l838123m808417l422201j648210K319673
8887i730080R241866J3485441Q705289k800509j1452962j0683281k700415N002425
8879i32226O303881J027913m814488m821904L40203L810675K037950o77717N51650
8870B825937M020709N082643K831062p14228m059998n149493j641983L405582
8862F600231J949155p065755j2315338m708517Q053093J1337679L822537l361276
8854D311809m899685n678748p125592l327892N537184Q930909J811950n869787
$$ plain form
8846 -6309852 -9977894 -5974566 192079 2336342 2165251 3533733 4925179 3187282
8838 3187282 156672 -431260 24440 -2963369 -8797124 -11438448 -8218042 -4095794 -4634774
8829 -4634774 -8580052 -11185809 -12101184 -14520110 -17282998 -14461537 -5144563 2382612
8821 2382612 1006500 -5108965 -6685189 -2223997 2172067 3371542 3379828 2058083 -3050005
8812 -3050005 -9039941 -9627477 -6895681 -10574744 -21637502 -27599529 -20514287 -8893671
8804 -8893671 -3199435 -66609 7603070 14373055 10906224 2434784 2084532 8833809
8796 8833809 9192420 654704 -3903997 1897077 8601693 8989861 9183484 13317329 12519045
8787 12519045 1104487 -9023810 -4681800 7068362 9123993 4840 -6560615 -4520006
$$ packed form
8846f309852l668042M003328O166645K144263j71091J368482J391446j737897
8838C187282l030610n87932M55700k987809n833755k641324L220406M122248n38980
8829d634774l945278k605757r15375k418926k762888K821461R316974P527175
8821B382612j376112o115465j576224M461192M396064J199475Q286j321745n108088
8812c050005n989936n87536K731796l679063j1062758n962027P085242J1620616
8804h893671N694236L132826P669679O769985l466831q471440l50252O749277
8796H833809L58611q537716m558701N801074O704616L88168J93623M133845p98284
8787A2519045j1414558j0128297M342010J1750162K055631r119153o565455K040609
$$ plain form
8779 -4520006 -1612555 -2054501 1176912 11884138 21029838 18936156 8859222 1436194
8771 1436194 1123059 3962363 4674586 997459 -5946237 -11770213 -12002422 -7777516 -5107427
8762 -5107427 -6368129 -6939890 -3224899 1024683 794901 -2274622 -3512396 -2965647 -3030851
8753 -3030851 -1124916 7366277 19110565 23605347 16270133 4998817 646913 5175779
8745 5175779 12037011 14718376 11783210 6011220 1635099 1346435 4467657 8834391
8737 8834391 13721266 18055679 17276098 8095356 -3155835 -4827922 4107000 10560439
8729 10560439 5638684 -1639367 1916712 12763776 15748085 7021941 -1595959 -1416808
8721 -1416808 3280446 6979525 11186736 15206023 11149717 -2884417 -14685331 -13455863
$$ packed form
8779d520006K907451m41946L231413J0707226R145700k093682j0076934p423028
8771A436194l13135K839304P12223l677127o943696n823976k32209M224906K670089
8762e107427j260702n71761L714991M249582k29782l069523j237774N46749o5204
8753c030851J905935Q491193J1744288M494782p335214j1271316m351904M528866
8745E175779O861232K681365k935166n771990m376121k88664L121222M366734
8737H834391M886875M334413p79581r180742j1251191j672087Q934922O453439
8729A0560439m921755p278051L556079J0847064K984309q726144q617900J79151
8721a416808M697254L699079M207211M019287m056306j4034134j1800914J229468
$$ plain form
8713 -13455863 -5560960 -3418575 -5363822 -195948 11839355 17664475 11962716 5433048
8705 5433048 7754532 13212065 10384028 -1016725 -10507442 -10428707 -2984169 4892996
8697 4892996 8988840 9589167 8166858 4095826 -3702662 -11668354 -11989157 -1704820
8689 -1704820 11507914 17845995 17693585 19230929 24841598 27392302 21220403 9851116
8681 9851116 126203 -5508326 -7621532 -5694787 593078 8929420 16077321 19926396
8673 19926396 18818884 12134594 2722693 -4668956 -8343154 -9590900 -7803132 -955737
8665 -955737 8029044 11404831 5850099 -2975984 -7403461 -4992078 2495636 11734222
8657 11734222 17481186 15746519 9988307 7877345 9334484 5724944 -4862510 -10795100
$$ packed form
8713a3455863P894903K142385j945247N167874J2035303N825120n701759o529668
8705E433048K321484N457533k828037j1400753r490717P8735P444538P877165
8697D892996M095844O00327j422309m071032p798488p965692l20803J0284337
8689a704820J3212734O338081j52410J537344N610669K550704o171899j1369287
8681I851116r724913n634529k113206J926745O287865Q336342P147901L849075
8673A9926396j107512o684290r411901p391649l674198j247746J787768O847395
8665i55737Q984781L375787n554732q826083m427477K411383P487714R238586
8657A1734222N746964j734667n758212k110962J457139l609540j0587454n932590
$$ plain form
8649 -10795100 -2988430 10070641 13410782 6157788 -13229 477351 2086549 1242103
8641 1242103 2549036 9076860 16012602 18272821 17349310 16512986 15225355 12593969 11437806
8632 11437806 14376168 19229138 21969094 21488394 18709584 14179403 9418992 7235984
8624 7235984 7190898 3956152 -5506359 -15631680 -18144442 -12980312 -8024406 -8027670 -9358956
8615 -9358956 -7411632 -3818172 -2438909 -2128395 1013771 5864346 6711749 1992562 -2948402
8606 -2948402 -3937011 -3743631 -6186986 -8896263 -7312354 -3107509 -2246570 -5391971 -6596888
8597 -6596888 -2690335 1578747 312322 -5525192 -9617283 -7467736 -177721 7225535
8589 7225535 10237623 8971863 7439767 7263246 4628747 -2740794 -8914507 -7157618
$$ packed form
8649a0795100P806670J3059071L340141p252994o171017M90580J609198q44446
8641A242103J306933O527824O935742K260219r23511q36324j287631k631386j156163
8632A1437806K938362M852970K739956m80700k778810m530181m760411k183008
8624G235984m5086l234746r462511j0125321k512762N164130M955906l264j331286
8615i358956J947324L593460J379263L10514L142166M850575Q47403m719187m940964
8606b948402r88609J93380k443355k709277J583909M204845Q60939l145401j204917
8597f596888L906553M269082j266425n837514m092091K149547P290015P403256
8589G225535L012088j265760j532096j76521k634499p369541o173713J756889
$$ plain form
8581 -7157618 -2327241 -6475701 -20633649 -30538029 -24724447 -8737166 3956467 8073349
8573 8073349 7703462 7899998 11557610 19250010 26104589 24322045 14699466 9112697 14482480
8564 14482480 21470040 18143953 7752081 1364732 -1139182 -8388829 -18810306 -20306193
8556 -20306193 -9858019 780740 2438192 -929562 -3240387 -5743667 -9589113 -9813011
8548 -9813011 -4069164 1411572 1606967 287502 872485 -1547336 -10209598 -16687466 -11957357
8539 -11957357 -1852780 625927 -4643557 -5123509 4391201 14416462 16372696 14454220
8531 14454220 15878025 17722164 11938524 -724433 -10202010 -9928518 -3583093 2041967
8523 2041967 5303793 7830286 8545630 4804013 -1261615 -2582513 4390886 13808892
$$ packed form
8581g157618M830377m148460j4157948r904380N813582J5987281J2693633M116882
8573H073349l69887J96536L657612P692400O854579j782544r622579n586769N369783
8564A4482480O987560l326087j0391872o387349k503914p249647j0421477j495887
8556b0306193J0448174J0638759J657452l367754k310825k503280l845446k23898
8548i813011N743847N480736J95395j319465N84983k419821q662262o477868M730109
8539a1957357J0104577K478707n269484m79952R514710J0025261J956234j918476
8531A4454220J423805J844139n783640j2662957r477577K73492O345425N625060
8523B041967L261826K526493P15344l741617o065628j320898O973399R418006
$$ plain form
8515 13808892 15812957 7057214 -5676570 -11586316 -4938121 9830914 20591177 17456483
8507 17456483 2585118 -11632246 -15690029 -11334595 -5169605 655139 6369448 8255801
8499 8255801 2478648 -6933747 -11953954 -11343208 -9754380 -7486678 -880003 7110390
8491 7110390 8070096 2326591 440494 6006185 8827743 2345386 -3810330 913679
8483 913679 10021060 10362900 3629943 2811030 10566951 15978854 12838281 7390982 5376256
8474 5376256 3558396 -1560637 -6776558 -8877635 -9870343 -10757386 -7793284 104191 7212089
8465 7212089 9261911 9254129 10124472 8638804 2580486 -2842997 -3137081 -3073251 -8714234
8456 -8714234 -15922743 -16359777 -11232803 -8442523 -8100241 -2799347 7007598 10386278 3166393
$$ packed form
8515A3808892K004065q755743j2733784n909746O648195J4769035J0760263l134694
8507A7456483j4871365j4217364m057783M355434O164990N824744N714309J886353
8499H255801n777153r412395n020207O10746J588828K267702O606675P990393
8491G110390R59706n743505j886097N565691K821558o482357o155716M724009
8483I13679R107381L41840o732957q18913P755921N411903l140573n447299k014726
8474E376256j817860n119033n215921k101077r92708q87043K964102P897475P107898
8465G212089K049822p782Q70343j485668o058318n423483k94084O3830n640983
8456h714234p208509m37034N126974K790280L42282N300894R806945L378680p219885
$$ plain form
8447 3166393 -3111560 2877247 15288947 19303312 11736785 4178773 7000622 18210664
8439 18210664 28586744 31503133 26522296 18235075 12747082 11473016 8266548 -2923851
8431 -2923851 -17799622 -24949632 -20327770 -12062333 -8435418 -7987043 -6017124 -4103087
8423 -4103087 -5860426 -8061818 -4964223 663154 75016 -7873434 -14584303 -14706037 -12580947
8414 -12580947 -12716028 -12485857 -9314328 -7044191 -8144645 -6518590 2983332 13060086
8406 13060086 12499958 3428956 -1365698 1967512 3456610 -3103433 -9324839 -5591354
8398 -5591354 3890607 8185455 5762857 4130311 6642267 9068133 8713004 8642629 11365108
8389 11365108 14649556 15757564 15216661 14488859 13438865 11554920 8863006 5011862
$$ packed form
8447C166393o277953N988807J2411700M014365p566527p558012K821849J1210042
8439A8210664J0376080K916389m980837q287221n487993j274066l206468j1190399
8431b923851j4875771p150010M621862Q265437L626915M48375J969919J914037
8423d103087j757339k201392L097595N627377n88138p948450o710869j21734K125090
8414a2580947j35081K30171L171529K270137j100454J626055R501922J0076754
8406A3060086n60128r071002m794654L333210J489098o560043o221406L733485
8398e591354R481961M294848k422598j632546K511956K425866l55129p0375K722479
8389A1365108L284448J108008n40903p27802j049994j883945k691914l851144
$$ plain form
8381 5011862 191184 -3186144 -2904039 -496573 1221160 2862440 5734991 6020968 -793368
8372 -793368 -9522060 -8502391 3593363 13111999 9258900 -1313860 -5253986 -1076800
8364 -1076800 2398658 1265123 -694482 -2132338 -5738019 -9414086 -6693572 1457381
8356 1457381 5012519 -717067 -7578994 -6984518 -2458060 -2727352 -7725629 -9830050 -6590710
8347 -6590710 -3983063 -6312737 -9446092 -7113918 -261139 3731786 551116 -5454549
8339 -5454549 -6913665 -2868930 1027441 1843349 3826517 10573913 17751547 19234876
8331 19234876 16754222 16248736 17162610 13818025 6300050 681833 -1813765 -6051582
8323 -6051582 -12158069 -14194611 -12339319 -14713404 -22236123 -23837659 -14241501 -4724400
$$ packed form
8381E011862m820678l377328K82105K407466J717733J641280K872551K85977o814336
8372g93368q728692J019669J2095754R518636l853099j0572760l940126M177186
8364a076800L475458j133535j959605j437856l605681l676067K720514Q150953
8356A457381L555138n729586o861927N94476M526458k69292m998277k104421L239340
8347f590710K607647k329674l133355K332174O852779L992925l180670o005665
8339e454549j459116M044735L896371Q15908J983168O747396P177634J483329
8331A9234876k480654n05486R13874l344585p517975n618217k495598m237817
8323f051582o106487k036542J855292k374085p522719j601536R596158R517101
$$ plain form
8315 -4724400 -6051529 -11346491 -8451781 -389918 1294919 -2557333 -575299 9005177
8307 9005177 15548510 13378682 7945206 3462844 -2481747 -9632751 -12409625 -9649259
8299 -9649259 -6477383 -4117800 1406198 8199985 7996034 365664 -4352974 -1180994
8291 -1180994 1856467 -1995510 -7437365 -7554743 -4518039 -1993348 2978491 11233984
8283 11233984 13868700 4320225 -8925192 -12841687 -7879719 -4772543 -7500841 -10153555
8275 -10153555 -8144460 -2595625 4877275 12944601 17522634 15846257 11778103 9609139
8267 9609139 5660658 -4796204 -14971674 -12309498 2734397 14391021 10920578 -2239110
8259 -2239110 -11863115 -12246904 -7552854 -4638794 -7113060 -12672594 -14429448 -8358820
$$ packed form
8315d724400j327129n294962K894710Q061863J684837l852252J982034R580476
8307I005177O543333k169828n433476m482362n944591p151004k776874K760366
8299i649259L171876K359583N523998O793787k03951p630370m718638L171980
8291a180994L037461l851977n441855j17378L036704K524691M971839Q255493
8283A1233984K634716r548475j3245417l916495M961968L107176k728298k652714
8275a0153555K009095N548835P472900Q067326M578033j676377m068154k168964
8267I609139l948481j0456862j0175470K662176J5043895J1656624l470443j3159688
8259b239110r624005l83789M694050K914060k474266n559534j756854O070628
$$ plain form
8251 -8358820 424644 3459465 534355 -685360 3390986 8291335 10744716 13258062
8243 13258062 15730081 11102611 -3820498 -19484323 -23793115 -17808321 -13079043 -14838388
8235 -14838388 -16399553 -11543590 -4475665 -2666039 -4906519 -3335760 3692357 7432921
8227 7432921 230451 -13075876 -19856045 -14332770 -3053163 4102676 3795866 -819961
8219 -819961 -5106261 -5206664 537226 8550655 11133764 4400780 -6714825 -14187205
8211 -14187205 -14990642 -10545512 -2062949 8368252 14984491 13171964 6430017 3040744
8203 3040744 5959947 10621609 12025026 9002969 2224956 -6388596 -12273029 -11719140
8195 -11719140 -7123171 -3865318 -2539996 -257927 999310 -4696263 -16403913 -24269029
$$ packed form
8251h358820Q783464L034821k925110j219715M076346M900349K453381K513346
8243A3258062K472019m627470j4923109j5663825m308792N984794M729278j759345
8235a4838388j561165M855963P067925J809626k240480J570759P028117L740564
8227G432921p202470j3306327o780169N523275J1279607P155839l06810m615827
8219h19961m286300j00403N743890Q013429K583109o732984j1115605p472380
8211a4187205q03437M445130Q482563J0431201O616239j812527o741947l389273
8203C040744K919203M661662J403417l022057o778013q613552n884433N53889
8195a1719140M595969L257853J325322K282069J257237n695573j1707650p865116
$$ plain form
8187 -24269029 -21608888 -12593360 -4659497 159785 2536973 1439341 -2006020 -1943297
8179 -1943297 4557338 11470211 11405257 5456127 -312052 -4002626 -6599430 -5589846 1032885
8170 1032885 6201067 -638085 -17765189 -29825825 -25815855 -11417110 940384 7883708
8162 7883708 14489495 22070820 24791971 18745140 8058458 -592670 -5595468 -9361389
8154 -9361389 -12193757 -11320236 -5987101 40675 2786777 2752741 3230932 5347291 7212641
8145 7212641 7231690 5583595 2590369 -1613088 -5453243 -6756099 -5985583 -5990892 -7653478
8136 -7653478 -8687717 -7890829 -7174512 -7568223 -7030364 -5050055 -5215002 -8599299 -8433784
8127 -8433784 1612236 15398249 18757287 7520922 -6314255 -9931780 -4541029 470839
$$ packed form
8187b4269029K660141R015528P933863M819282K377188j097632l445361O2723
8179a943297O500635O912873o4954n949130n768179l690574k596804J009584O622731
8170A032885N168182o839152j7127104j2060636M009970J4398745J2357494O943324
8162G883708O605787P581325K721151o046831j0686682q651128n002798l765921
8154i361389k832368Q73521N333135O027776K746102l4036M78191K116359J865350
8145G212641J9049j648095k993226m203457l840155j302856P70516n309j662586
8136g653478j034239P96888P16317l93711N37859J980309j64947l384297J65515
8127h433784J0046020J3786013L359038j1236365j3835177l617525N390751N011868
$$ plain form
8119 470839 2286966 5252337 9689191 9998746 5102695 1904730 4462035 7133389 4170549
8110 4170549 -293195 302115 2365123 -2528238 -11426561 -11173354 1451720 12199373
8102 12199373 8622328 -2512493 -6523232 -2483867 -1499772 -6584202 -7683810 1516107
8094 1516107 13564621 18879832 18253992 17337118 15578310 8479202 -2650176 -10209150
8086 -10209150 -8761456 149370 10368692 15481644 13111271 7670082 6036556 7981922
8078 7981922 5160040 -6597242 -19033493 -21503366 -14957133 -8204095 -3432381 4596835
8070 4596835 15156036 18338987 9534248 -1501331 -2981789 2731530 3163192 -5785126
8062 -5785126 -12997310 -6290829 10950574 21834949 14900742 -2299593 -11784609 -6248762
$$ packed form
8119D70839J816127K965371M436854L09555m896051l197965K557305K671354k962840
8110D170549m463744N95310K063008m893361q898323K53207J2625074J0747653
8102A2199373l577045j1134821m010739M039365R84095n084430j099608R199917
8094A516107J2048514N315211o25840r16874j758808p099108j1129378p558974
8086a0209150J447694Q910826J0219322N112952k370373n441189j633526J945366
8078G981922k821882j1757282j2436251k469873O546233O753038M771714Q029216
8070D596835J0559201L182951q804739j1035579j480458N713319M31662q948318
8062e785126p212184O706481J7241403J0884375o934207j7200335r485016N535847
$$ plain form
8054 -6248762 3542623 4285145 -3081409 -7962558 -6609878 -4592338 -4126444 104559 9552981
8045 9552981 16147106 14002854 9185093 10535709 16435350 18488378 14287289 8567022
8037 8567022 4540511 1970157 1761338 4493203 5897754 2182545 -1100167 5110154
8029 5110154 18191414 24609892 18577929 9967832 8661338 10358654 5704689 -3556148
8021 -3556148 -7248295 -2216067 4069208 4821996 1341357 -1987824 -4312254 -7530043
8013 -7530043 -11873031 -14297170 -11091613 -2619351 4975577 5831733 2467249 2878472 7900802
8004 7900802 8358675 -576612 -9524336 -7551264 958872 2806887 -3644491 -6849418
7996 -6849418 -1166835 4984160 4063027 1362645 4995479 12180200 13918996 8324100
$$ packed form
8054f248762R791385P42522p366554m881149J352680K017540M65894M231003R448422
8045I552981O594125k144252m817761J350616N899641K053028m201089n720267
8037H567022m026511k570354k08819K731865J404551l715209l282712O210321
8029E110154J3081260O418478o031963q610097j306494J697316m653965r260837
8021c556148l692147N032228O285275P52788l480639l329181k324430l217789
8013g530043m342988k424139L205557Q472262P594928Q56156l364484M11223N022330
8004G900802M57873q935287q947724J973072Q510136J848015o451378l204927
7996f849418N682583O150995r21133k700382L632834P184721J738796n594896
$$ [...]
##END NTUPLES=NMR SPECTRUM
##END=
