##TITLE=31Pdec_SR166Etrm
 , 64 sc
 20.3.2023
##JCAMPDX= 6.0         $$ Bruker NMR JCAMP-DX V2.0
##DATA TYPE= NMR SPECTRUM
##DATA CLASS= NTUPLES
##ORIGIN= UXNMR, Bruker Analytische Messtechnik GmbH
##OWNER= root
$$ XWIN-NMR		Version 3.5
$$ Mon Mar 20 15:46:52 2023 Russian Standard Time (UT+4h)  she@DPX200
##.OBSERVE FREQUENCY= 81.013821
##.OBSERVE NUCLEUS= ^31P
##.ACQUISITION MODE= SIMULTANEOUS
##.ACQUISITION SCHEME= undefined
##.AVERAGES= 24
##.DIGITISER RES= 16
##SPECTROMETER/DATA SYSTEM= spect
##.PULSE SEQUENCE= zgpg30
##.SOLVENT NAME= DMSO
##.SHIFT REFERENCE= (INTERNAL, DMSO, 0, 248.564)
##AUDIT TRAIL= $$ (NUMBER, WHEN, WHO, WHERE, WHAT)
$$ ##TITLE= Audit trail, XWIN-NMR		Version 3.5
$$ ##JCAMPDX= 5.01
$$ ##ORIGIN= Bruker BioSpin GmbH
$$ ##OWNER= she
$$ F:/spectra/data/she/nmr/P31/1/pdata/1/auditp.txt
$$ ##AUDIT TRAIL=  $$ (NUMBER, WHEN, WHO, WHERE, WHAT)
(   1,<2023-03-20 15:45:59.25 +0400>,<she>,<DPX200>,
      <created by zg, POWCHK disabled, PULCHK disabled
       configuration hash MD5:
       00 E9 B6 7A A2 85 ED C7 34 08 36 98 17 FE 4E 26
       data hash MD5: 32K
       45 D2 75 E2 6F AA CB 41 E0 EC 57 F7 76 CA A9 C3>)
(   2,<2023-03-20 15:46:01.42 +0400>,<she>,<DPX200>,
      <Start of raw data processing
       efp BC_mod = 2 LB = 1 FT_mod = 6 PKNL = 1 PHC0 = -10536.75 PHC1 = -752.39 SI = 64K 
       data hash MD5: 64K
       9D 2D B0 CE 79 E6 F4 7E FE F0 72 11 AF 07 11 1F>)
(   3,<2023-03-20 15:46:13.65 +0400>,<she>,<DPX200>,
      <pk PHC0 = -47.11222 PHC1 = 0 
       data hash MD5: 64K
       75 3A F4 21 19 7F E1 A4 A6 FA F7 27 C1 79 D7 F7>)
(   4,<2023-03-20 15:46:16.82 +0400>,<she>,<DPX200>,
      <abs ABSG = 5 
       data hash MD5: 64K
       2C FB 03 3E FF BA 22 AC AE 71 D7 7A 6C 85 C9 B1>)
$$ ##END=
$$ 
$$ hash MD5
$$ EC 03 E4 B3 68 C0 2A 74 5E 15 7C 79 39 39 C2 27
##$RELAX= 
##$RELAX= 
##$RELAX= 
##$RELAX= 
##$RELAX= 
##$RELAX= 
##$RELAX= 
##$RELAX= 
##$RELAX= 
$$ Bruker specific parameters
$$ --------------------------
##$DU= <F:/spectra>
##$EXPNO= 1
##$NAME= <P31>
##$PROCNO= 1
##$TYPE= <nmr>
##$USER= <she>
##$AMP= (0..31)
100 100 100 100 100 100 100 100 100 100 100 100 100 100 100 100 100 100 
100 100 100 100 100 100 100 100 100 100 100 100 100 100 
##$AQSEQ= 0
##$AQ_mod= 1
##$AUNM= <au_zg>
##$AUTOPOS= <>
##$BF1= 81.014009
##$BF2= 200.13
##$BF3= 200.13
##$BF4= 200.13
##$BF5= 200.13
##$BF6= 200.13
##$BF7= 200.13
##$BF8= 200.13
##$BYTORDA= 1
##$CFDGTYP= 0
##$CFRGTYP= 5
##$CHEMSTR= <none>
##$CNST= (0..31)
1 1 145 1 1 1 1 1 1 1 1 1 1 1 1 1 1 1 1 1 1 1 1 1 1 1 1 1 1 1 1 1 
##$CPDPRG= <waltz16>
##$CPDPRG1= <>
##$CPDPRG2= <waltz16>
##$CPDPRG3= <>
##$CPDPRG4= <mlev>
##$CPDPRG5= <mlev>
##$CPDPRG6= <mlev>
##$CPDPRG7= <mlev>
##$CPDPRG8= <mlev>
##$CPDPRGB= <>
##$CPDPRGT= <>
##$D= (0..31)
0 1 0 0 0 0 0 0 0 0 0 0.03 2e-05 3e-06 0 0 0 0 0 0 0 0 0 0 0 0 0 0 0 0 
0 0 
##$DATE= 1679312758
##$DBL= (0..7)
120 120 120 11 120 120 24 19 
##$DBP= (0..7)
150 150 150 150 150 150 150 150 
##$DBP07= 0
##$DBPNAM0= <>
##$DBPNAM1= <>
##$DBPNAM2= <>
$$ [...]
##$SUBNAM3= <"">
##$SUBNAM4= <"">
##$SUBNAM5= <"">
##$SUBNAM6= <"">
##$SUBNAM7= <"">
##$SUBNAM8= <"">
##$SUBNAM9= <"">
##$SW= 501.771253377433
##$SWIBOX= (0..15)
0 1 3 0 0 0 0 0 0 0 0 0 0 0 0 0 
##$SW_h= 40650.406504065
##$TD= 32768
##$TD0= 1
##$TE= 0
##$TE2= 300
##$TE3= 300
##$TEG= 300
##$TL= (0..7)
0 120 53 12 22 120 120 120 
##$TP= (0..7)
150 150 150 150 150 150 150 150 
##$TP07= 0
##$TPNAME0= <>
##$TPNAME1= <>
##$TPNAME2= <>
##$TPNAME3= <>
##$TPNAME4= <>
##$TPNAME5= <>
##$TPNAME6= <>
##$TPNAME7= <>
##$TPOAL= (0..7)
0.5 0.5 0.5 0.5 0.5 0.5 0.5 0.5 
##$TPOFFS= (0..7)
0 0 0 0 0 0 0 0 
##$TUNHIN= 0
##$TUNHOUT= 0
##$TUNXOUT= 0
##$USERA1= <user>
##$USERA2= <user>
##$USERA3= <user>
##$USERA4= <user>
##$USERA5= <user>
##$V9= 5
##$VALIST= <valist>
##$VCLIST= <CCCCCCCCCCCCCCC>
##$VD= 0
##$VDLIST= <DDDDDDDDDDDDDDD>
##$VPLIST= <PPPPPPPPPPPPPPP>
##$VTLIST= <TTTTTTTTTTTTTTT>
##$WBST= 1024
##$WBSW= 4
##$XGAIN= (0..3)
0 0 0 0 
##$XL= 0
##$YL= 0
##$YMAX_a= 535
##$YMIN_a= -625
##$ZGOPTNS= <>
##$ZL1= 120
##$ZL2= 120
##$ZL3= 120
##$ZL4= 120
##$ABSF1= 248.5645
##$ABSF2= -253.2056
##$ABSG= 5
##$ABSL= 3
##$ALPHA= 0
##$AQORDER= 0
##$ASSFAC= 0
##$ASSFACI= 0
##$ASSFACX= 0
##$ASSWID= 0
##$AUNMP= <proc_1d>
##$AZFE= 0.1
##$AZFW= 0.5
##$BCFW= 0
##$BC_mod= 2
##$BYTORDP= 0
##$COROFFS= 0
##$CY= -3
##$DATMOD= 1
##$DC= 0
##$DFILT= <>
##$DTYPP= 0
##$F1P= 0
##$F2P= 0
##$FCOR= 1
##$FTSIZE= 65536
##$FT_mod= 6
##$GAMMA= 0
##$GB= 0
##$INTBC= 1
##$INTSCL= 6.047779e-11
##$ISEN= 30
##$LB= 1
##$LEV0= 0
##$LPBIN= 0
##$MAXI= 10000
##$MC2= 0
##$MEAN= 0
##$ME_mod= 0
##$MI= 50
##$NCOEF= 0
##$NC_proc= -12
##$NLEV= 6
##$NOISF1= 182.463
##$NOISF2= 159.3651
##$NSP= 0
##$NTH_PI= 0
##$NZP= 0
##$OFFSET= 248.5645
##$PC= 4
##$PHC0= -10583.86
##$PHC1= -752.39
##$PH_mod= 1
##$PKNL= yes
##$PPARMOD= 0
##$PSCAL= 0
##$PSIGN= 0
##$REVERSE= no
##$SF= 81.0140089999694
##$SI= 65536
##$SIGF1= 159.3651
##$SIGF2= -187.1042
##$SINO= 113.3802
##$SIOLD= 16384
##$SREGLST= <1H.CDCl3>
##$SSB= 0
##$STSI= 65536
##$STSR= 0
##$SW_p= 40650.406504065
##$SYMM= 0
##$S_DEV= 0
##$TDeff= 32768
##$TDoff= 0
##$TI= <>
##$TILT= no
##$TM1= 0
##$TM2= 0
##$TOPLEV= 0
##$USERP1= <user>
##$USERP2= <user>
##$USERP3= <user>
##$USERP4= <user>
##$USERP5= <user>
##$WDW= 1
##$XDIM= 65536
##$YMAX_p= 353612803
##$YMIN_p= -107993905
$$ End of Bruker specific parameters
$$ ---------------------------------
##NTUPLES= NMR SPECTRUM
##VAR_NAME=  FREQUENCY,     SPECTRUM/REAL,   SPECTRUM/IMAG
##SYMBOL=    X,             R,               I
##VAR_TYPE=  INDEPENDENT,   DEPENDENT,       DEPENDENT
##VAR_FORM=  AFFN,          ASDF,            ASDF
##VAR_DIM=   65536,         65536,           65536
##UNITS=     HZ,            ARBITRARY UNITS, ARBITRARY UNITS
##FACTOR=    0.620285442955139, 1,           1
##FIRST=     20137.2065510682, 0,            0
##LAST=      -20513.1999529968, 0,           0
##MIN=       -20513.1999529968, -107993905,  0
##MAX=       20137.2065510682, 353612803,    0
$$ Real data points
##PAGE= N=1
##DATA TABLE= (X++(R..R)), XYDATA
$$ [...]
$$ plain form
42676 -550306 1186103 1257607 -1041640 -3039781 -3474845 -4051658 -4794863 -2897961 1570826
42667 1570826 3828484 1441662 -1192837 677083 4893574 6086805 3961121 2991451
42659 2991451 5041184 6858046 5244660 1446186 -618637 1126569 4775606 6313610
42651 6313610 3843485 -193496 -2207819 -2431575 -4184879 -8074272 -10504419 -9398646
42643 -9398646 -7719148 -8685808 -10688996 -10326972 -7933620 -6184984 -5053191 -2446553
42635 -2446553 1003402 2093486 87755 -2190391 -2916234 -3465731 -4932192 -5557620 -3585831
42626 -3585831 -586521 263267 -1669911 -3726625 -3190568 -336696 1854747 849499
42618 849499 -2504284 -4544434 -2848668 733143 2080992 -390884 -4081248 -5376553
$$ packed form
42676e50306J736409P1504k299247j998141m35064n76813p43205J896902M468787
42667A570826K257658k386822k634499J869920M216491J193231k125684r69670
42659B991451K049733J816862j613386l798474k064823J745206L649037J538004
42651F313610k470125m036981k014323k23756j753304l889393k430147J105773
42643i398646J679498r66660k003188L62024K393352J748636J131793K606638
42635b446553L449955J090084k005731k278146p25843n49497j466461o25428J971789
42626c585831K999310Q49788j933178k056714N36057K853872K191443j005248
42618H49499l353783k040150J695766L581811J347849k471876l690364j295305
$$ plain form
42610 -5376553 -3295980 293496 2904550 3224845 1628992 -157576 -341754 1120363
42602 1120363 2095295 373860 -3702395 -7255857 -7663205 -4846833 -683110 2992310
42594 2992310 5063210 4636350 1452474 -2987362 -6024059 -6278263 -4768322 -3278701
42586 -3278701 -2570275 -2511684 -2689733 -2309259 -886579 281375 -932454 -4126883 -6143994
42577 -6143994 -5756202 -6038259 -9423731 -12787128 -11337184 -5970337 -2167174 -1816798 -959853
42568 -959853 3224215 7631340 7820886 4221265 1060954 1029638 3220391 5148794 5276267
42559 5276267 4404558 5064620 8153800 10412065 7824973 1650911 -2339146 -1525870 324034
42550 324034 -903862 -4149383 -6119459 -6319137 -6137039 -5806923 -5425583 -6353355 -8390005
$$ packed form
42610e376553K080573L589476K611054L20295j595853j786568j84178J462117
42602A120363R74932j721435m076255l553462m07348K816372M163723L675420
42594B992310K070900m26860l183876m439836l036697k54204J509941J489621
42586c278701P08426N8591j78049L80474J422680J167954j213829l194429k017111
42577f143994L87792k82057l385472l363397J449944N366847L803163L50376Q56945
42568i59853M184068M407125J89546l599621l160311l1316K190753J928403J27473
42559E276267q71709O60062L089180K258265k587092o174062l990057Q13276J849904
42550C24034j227896l245521j970076j99678J82098L30116L81340r27772k036650
$$ plain form
42541 -8390005 -8283069 -4651852 -1623068 -3284401 -7094890 -7888587 -6258182 -6797015 -9098299
42532 -9098299 -7613181 -1383967 2993237 977072 -3030147 -2409140 2212987 4733028
42524 4733028 2254078 -2318294 -5136896 -5208308 -3613875 -1642085 47720 1717187
42516 1717187 3713683 4877230 3366101 -2772 -1543731 239380 1617626 -1467722
42508 -1467722 -7046307 -9135518 -5624737 -740893 764862 -1091336 -3062107 -3039937
42500 -3039937 -1390473 419706 986461 -266210 -2278913 -3044322 -2060127 -1303996 -2597274
42491 -2597274 -4617120 -4190171 -836439 1623212 -422749 -4817713 -4930965 2230536
42483 2230536 11087335 13400073 8411850 3474791 3845498 6061988 4240347 -840704
$$ packed form
42541h390005J06936L631217L028784j661333l810489p93697J630405n38833k301284
42532i098299J485118O229214M377204k016165m007219O21007M622127K520041
42524D733028k478950m572372k818602p1412J594433J971790J689805J669467
42516A717187J996496J163547j511129l368873j540959J783111J378246l085348
42508a467722n578585k089211L510781M883844J505755j856198j970771K2170
42500c039937J649464J810179N66755j252671k012703p65409R84195P56131j293278
42491b597274k019846M26949L353732K459651k045961m394964j13252P161501
42483B230536Q856799K312738m988223m937059L70707K216490j821641n081051
$$ plain form
42475 -840704 -3747785 -3232412 -3126910 -4787064 -4991650 -2901258 -2890984 -6991223 -9850273
42466 -9850273 -6250891 250413 2065462 -1428467 -3796969 -1430950 2593758 4633229
42458 4633229 4531484 2578156 -1739659 -5907244 -4933638 966964 4141619 -711322
42450 -711322 -8352619 -9646091 -3762210 1734213 1730717 -1088593 -2099814 -930436 82758
42441 82758 101335 -36995 -3975 -251566 -810614 -1113143 -849594 -516033 -1067605 -2724421
42431 -2724421 -4093719 -3595933 -2248215 -3201304 -7022806 -9384324 -6075399 943118
42423 943118 5660296 5612880 3873238 3318775 2830878 725175 -1461049 -1321319 426989
42414 426989 1259219 1063055 2112936 4887639 6509683 4373758 -212778 -3310487 -2659321
$$ packed form
42475h40704k907081N15373J05502j660154k04586K090392J0274m100239k859050
42466i850273L599382O501304J815049l493929k368502K366019M024708K039471
42458D633229j01745j953328m317815m167585R73606N900602L174655m852941
42450g11322p641297j293472N883881N496423l496k819310j011221J169378J013194
42441H2758J8577j38330L3020k47591n59048l02529K63549L33561n51572j656816
42431b724421j369298M97786J347718r53089l821502k361518L308925P018517
42423I43118M717178m7416j739642n54463m87897k105703k186224J39730J748308
42414D26989Q32230j96164J049881K774703J622044k135925m586536l097709O51166
$$ plain form
42405 -2659321 347386 2779442 3171408 2107608 852227 390342 1290213 3196319 4405991
42396 4405991 3133642 -527347 -4833237 -8464454 -10954336 -11229321 -8094553 -2947078
42388 -2947078 457975 482532 -360994 281970 609945 -2260950 -7064191 -9680071 -8850450
42379 -8850450 -7260081 -7124379 -7833658 -8231101 -8356650 -8249622 -7314001 -5549872 -3705474
42370 -3705474 -2108115 -1063310 -1873657 -4991116 -7601341 -6191425 -1714134 1069242
42362 1069242 58704 -1678165 -995665 1062751 1887720 1189629 -107305 -2388339 -5921582
42353 -5921582 -8473861 -7223509 -2565638 1992279 3402123 1231536 -2951152 -6799628
42345 -6799628 -8314308 -7196874 -5027236 -3422474 -2535167 -1912599 -1848925 -2865662 -4555703
$$ packed form
42405b659321L006707K432056L91966j063800j255381m61885Q99871J906106J209672
42396D405991j272349l660989m305890l631217k489882k74985L134768N147475
42388b947078L405053K4557q43526O42964L27975k870895m803241k615880Q29621
42379h850450J590369J35702p09279l97443j25549J07028R35621J764129J844398
42370c705474J597359J044805q10347l117459k610225J409916M477291K783376
42362A069242j010538j736869O82500K058416Q24969o98091j296934k281034l533243
42353e921582k552279J250352M657871M557917J409844k170587m182688l848476
42345f799628j514680J117434K169638J604762Q87307O22568O3674j016737j690041
$$ plain form
42336 -4555703 -5985383 -6823847 -7261641 -7196584 -6279943 -4675330 -3346958 -3527855 -5684516
42327 -5684516 -8673060 -10354351 -9743845 -8135847 -7320432 -7361103 -7254984 -6960857 -7106018
42318 -7106018 -7278649 -6583577 -5608742 -5782801 -6879002 -7310504 -6973231 -7446397 -8854528
42309 -8854528 -8793695 -5479303 -492651 2544847 1336602 -2982885 -6239911 -4610284
42301 -4610284 762572 3665715 -290085 -7665285 -11010494 -7932548 -2957312 -842174
42293 -842174 -1980993 -4587324 -7234532 -8315169 -6821159 -4735559 -5065313 -6816126
42285 -6816126 -6109387 -3065863 -2418568 -5510505 -7299573 -4465579 -1095292 -1834231 -4032392
42276 -4032392 -2333835 2174658 3560322 260901 -2982152 -2206047 1373548 4410709
$$ packed form
42336d555703j429680q38464m37794O5057R16641J604613J328372j80897k156661
42327e684516k988544j681291O10506J607998Q15415m0671J06119K94127j45161
42318g106018j72631O95072R74835j74059j096201m31502L37273m73166j408131
42309h854528O0833L314392M986652L037498j208245m319487l257026J629627
42301d610284N372856K903143l955800p375200l345209L077946M975236K115138
42293h42174j138819k606331k647208j080637J494010K085600l29754j750813
42285f816126P06739L043524O47295l091937j789068K833994L370287p38939k198161
42276d032392J698557M508493J385664l299421l243053P76105L579595L037161
$$ plain form
42268 4410709 5305308 4516545 3517830 3590796 4026907 2389571 -1809101 -5370846 -5457182
42259 -5457182 -3343065 -1553679 375544 3798317 6723314 5990223 2506776 -14951
42251 -14951 -923895 -2843555 -6060897 -7164011 -4316697 -238153 1569742 868766 -373472
42242 -373472 -924751 -892408 -849056 -1258846 -1959239 -2183472 -1920952 -2561808 -4926583 -7572332
42232 -7572332 -8612975 -8227879 -7698591 -7157418 -6127391 -4839324 -2937780 1226024 7210825
42223 7210825 10380838 7001425 176152 -3515877 -2684914 -1945322 -4005640 -5761517
42215 -5761517 -3718592 750354 3757901 3583935 969995 -2846455 -6348653 -7875957
42207 -7875957 -7494078 -7391222 -8805080 -9735210 -7348275 -1994986 2573843 2917910 -863727
$$ packed form
42268D410709Q94599p88763r98715P2966M36111j637336m198672l561745q6336
42259e457182K114117J789386J929223L422773K924997p33091l483447k521727
42251a4951r08944j919660l217342j103114K847314M078544J807895p00976j242238
42242c73472n51279L2343M3352m09790p00393k24233K62520o40856k364775k645749
42232g572332j040643L85096N29288N41173J030027J288067J901544M163804N984801
42223G210825L170013l379413o825273l692029Q30963P39592k060318j755877
42215e761517K042925M468946L007547j73966k613940l816450l502198j527304
42207g875957L81879J02856j413858r30130K386935N353289M568829L44067l781637
$$ plain form
42198 -863727 -5484851 -7546314 -6125652 -2642884 846180 2346149 145032 -5054738
42190 -5054738 -8414990 -4976235 3303968 8264168 5754123 1379891 2295483 6802637
42182 6802637 7632743 3396796 78798 1136523 2689301 551373 -3368240 -4828550
42174 -4828550 -3448796 -1656684 -188118 1842013 4006904 5017571 5467994 7242517
42166 7242517 9951997 10344960 6509778 1318428 -218138 2942498 6370369 5974046
42158 5974046 3345772 2570313 3125586 431662 -6172071 -11054293 -10114866 -6446569 -4972287
42149 -4972287 -5534846 -5278005 -4157072 -3437960 -2005277 758664 1496446 -2078244 -5550481
42140 -5550481 -3671275 607140 324274 -3939000 -4926059 -713292 2742120 2037057 826151
$$ packed form
42198h63727m621124k061463J420662L482768L489064J499969k201117n199770
42190e054738l360252L438755Q280203M960200k510045m374232R15592M507154
42182F802637Q30106m235947l317998J057725J552778k137928l919613j460310
42174d828550J379754J792112J468566K030131K164891J010667M50423J774523
42166G242517K709480L92963l835182n191350j536566L160636L427871l96323
42158E974046k628274p75459N55273k693924o603733m882222R39427L668297J474282
42149d972287n62559K56841J120933P19112J432683K763941P37782l574690l472237
42140e550481J879206M278415k82866m263274r87059M212767L455412p05063j210906
$$ plain form
42131 826151 1733927 1911819 -81532 -514153 2324465 3965897 1374813 -1487930 -724159
42122 -724159 599586 -1749327 -5370720 -5302002 -2031619 544348 1984782 4068885 5119086
42113 5119086 1682849 -5232358 -10726459 -12053825 -9975163 -5370179 1155294 7188345
42105 7188345 10070118 9989205 8477516 5378344 809047 -1803388 804922 6221344
42097 6221344 8680984 6327198 2139342 -1553869 -4886204 -7068915 -6180500 -3148695
42089 -3148695 -1390143 -1081883 1885990 9028879 15221905 14877992 9640874 6158668
42081 6158668 7305928 9367463 8245997 5051960 3638892 4816394 5854692 4991877
42073 4991877 3423015 2475943 1846625 1824659 4082998 8025560 9453661 6134148 1916997
$$ packed form
42131H26151R07776J77892j993351m32621K838618J641432k591084k862743P63771
42122g24159J323745k348913l621393O8718L270383K575967J440434K084103J050201
42113E119086l436237o915207n494101j327366K078662M604984O525473O033051
42105G188345K881773q0913j511689l099172m569297k612435K608310N416422
42097F221344K459640k353786m187856l693211l332335k182711Q88415L031805
42089c148695J758552L08260K967873P142889O193026l43913n237118l482206
42081F158668J147260K061535j121466l194037j413068J177502J038298q62815
42073D991877j568862r47072o29318k1966K258339L942562J428101l319513m217151
$$ plain form
42064 1916997 1245725 2251598 560817 -2335654 -1324060 2750339 3541254 -159191
42056 -159191 -2413848 -860879 -986785 -5742618 -8994571 -5193311 1251797 3180026
42048 3180026 1688750 2327170 4604774 3510363 -1051817 -4158947 -3902509 -2670727
42040 -2670727 -1426691 860108 2866948 2179589 325911 725037 2370472 1598251 -561169
42031 -561169 565625 4834276 6594146 3431683 -646501 -2202534 -2646187 -3645904 -3759640
42022 -3759640 -2124673 -951797 -1878525 -3504379 -4345413 -4697549 -4236680 -1573870 2394685
42013 2394685 4379497 3233045 1125307 -505221 -2150501 -2797524 -116101 4619446
42005 4619446 6641098 4444155 1754759 1068989 364445 -1591024 -2224984 -623856 -648301
$$ packed form
42064A916997o71272J005873j690781k896471J011594M074399P90915l700445
42056a59191k254657J552969j25906m755833l251953L801260O445108J928229
42048C180026j491276O38420K277604j094411m562180l107130K56438J231782
42040b670727J244036K286799K006840o87359j853678L99126J645435p72221k159420
42031e61169J126794M268651J759870l162463m078184j556033m43653r99717j13736
42022c759640J634967J172876r26728j625854q41034l52136M60869K662810L968555
42013B394685J984812j146452k107738j630528j645280o47023K681423M735547
42005D619446K021652k196943k689396o85770p04544j955469o33960J601128k4445
$$ plain form
41996 -648301 -4559895 -8359012 -8025052 -5965799 -6073494 -6344123 -2537482 3618291 6385144
41987 6385144 4742599 2991123 3235796 3260022 2146106 2124911 3369825 2240364 -2710380
41978 -2710380 -7207510 -6996728 -4014456 -3067743 -4298190 -3331268 1136487 4230738 1634360
41969 1634360 -3438929 -3857951 1452413 5412605 2304764 -4285047 -6490627 -2733269
41961 -2733269 1284981 1293029 -849447 -1924150 -2069468 -2513786 -2335949 -415254 1803203
41952 1803203 2071937 137590 -3000883 -6537819 -8904469 -7940492 -4187883 -1514679
41944 -1514679 -2023493 -2870641 -972044 1742481 1455668 -1138465 -1757444 1088502 4595853
41935 4595853 6208292 6018024 4623941 2063620 -598149 -1576584 -956016 -555594 -811498
$$ packed form
41996f48301l911594l799117L33960K059253j07695k70629L806641O155773K766853
41987F385144j642545j751476K44673K4226j113916k1195J244914j129461m950744
41978b710380m497130K10782K982272R46713j230447R66922M467755L094251k596378
41969A634360n073289m19022N310364L960192l107841o589811k205580L757358
41961b733269M018250Q048k142476j074703j45318m44318J77837J920695K218457
41952A803203K68734j934347l138473l536936k366650R63977L752609K673204
41944a514679n08814q47148J898597K714525k86813k594133o18979K845946L507351
41935D595853J612439j90268j394083k560321k661769r78435O20568M00422k55904
$$ plain form
41926 -811498 -295410 1120620 1190947 -1491823 -5094562 -6429791 -3992584 1330614 7113403
41917 7113403 10511401 10084206 7269934 5113841 5184780 6484906 7182089 6368490 4452020
41908 4452020 2956165 3384076 5070751 5206899 2739566 890668 3111286 7592401
41900 7592401 9284109 6994287 4525950 4405415 4827176 4142234 3834783 4501263 3215172
41891 3215172 -1208360 -3917324 -179623 6272034 6925474 269473 -5819929 -4885914
41883 -4885914 -112542 1019660 -3422824 -8817590 -10503369 -7781294 -2663803 2020508
41875 2020508 3629448 1731908 -592391 283247 3944153 6252334 4573025 798808
41867 798808 -1329208 -186970 2975959 5594728 5579404 3163702 1319355 2462122 4630911
$$ packed form
41926h11498N16088J416030P0327k682770l602739j335229K437207N323198N782789
41917G113403L397998m27195k814272k156093P0939J300126O97183q13599j916470
41908D452020j495855M27911J686675J36148k467333j848898K220618M481115
41900G592401J691708k289822k468337j20535M21761o84942l07451O66480j286091
41891C215172m423532k708964L737701O451657O53440o656001o089402R34015
41883d885914M773372J132202m442484n394766j685779K722075N117491M684311
41875B020508J608940j897540k324299Q75638L660906K308181j679309l774217
41867G98808k128016J142238L162929K618769j5324k415702j844347J142767K168789
$$ plain form
41858 4630911 3708603 -15831 -1328436 1964695 4835733 2563229 -1313683 -195210
41850 -195210 4856379 6647408 3721738 2943668 8046867 12863456 10435740 3128410
41842 3128410 -2029144 -3649410 -4868926 -4875936 454281 9620776 14689173 11572252 5374255
41833 5374255 2642830 3036920 2222251 -755938 -3368701 -4687053 -6192374 -8125552
41825 -8125552 -8697481 -7340078 -5983309 -6076236 -6085138 -3283412 2483366 7802362 8965732
41816 8965732 6149569 3390980 3589025 4682080 2805341 -1513464 -3518303 -1066981
41808 -1066981 2288379 2888129 2196786 3324065 5055586 3638040 -733896 -3657747
41800 -3657747 -2803462 -557279 255144 -274748 -1213010 -2942837 -5427652 -6811415 -5736069
$$ packed form
41858D630911r22308l724434j312605L293131K871038k272504l876912J118473
41850a95210N051589J791029k925670p78070N103199M816589k427716p307330
41842C128410n157554j620266j219516p010N330217R166495N068397l116921o197997
41833E374255k731425L94090q14669k978189k612763j318352j505321j933178
41825h125552n71929J357403J356769r2927q902K801726N766778N318996J163370
41816H965732k816163k758589J98045J093055j876739m318805k004839K451322
41808a066981L355360N99750o91343J127279J731521j417546m371936k923851
41800c657747Q54285K246183Q12423n29892r38262j729827k484815j383763J075346
$$ plain form
41791 -5736069 -3356146 -1518095 -497147 223610 656365 1066438 2231564 3587035 2968436
41782 2968436 -253800 -3565152 -4421210 -3208206 -1603799 -117409 965265 654519
41774 654519 -431773 489255 3646979 4345775 -514560 -6048225 -4994372 1560685 5299681
41765 5299681 2779791 -5732 2763536 8318055 10081914 6683926 2180183 41006
41757 41006 602150 2619017 4146455 3150904 -305758 -3676353 -5253072 -5839594 -5648408
41748 -5648408 -2700138 3056112 7227914 6302201 2981770 2088867 3222691 2210901
41740 2210901 -1449632 -3776262 -2784177 -881014 -7005 1255810 4253767 7441968
41732 7441968 8636773 7468517 4428192 -51117 -4561466 -7117475 -7441573 -6727289
$$ packed form
41791e736069K379923J838051J020948P20757M32755M10073J165126J355471o18599
41782B968436l222236l311352q56058J213004J604407J486390J082674l10746
41774F54519j086292R21028L157724O98796m860335n533665J053853O555057L738996
41765E299681k519890k785523K769268N554519J763859l397988m503743k139177
41757D1006N61144K016867J527438r95551l456662l370595j576719n86522J91186
41748e648408K948270N756250M171802r25713l320431q92903J133824j011790
41740B210901l660533k326630R92085J903163Q74009J262815K997957L188201
41732G441968J194805j168256l040325m479309m510349k556009l24098P14284
$$ plain form
41724 -6727289 -4898853 -923365 3769902 5637237 3961611 2096689 2108971 1462533 -2545292
41715 -2545292 -7746492 -9394813 -5898625 25086 4527848 5101939 1574777 -3195871
41707 -3195871 -4951062 -2371875 1340061 2815023 2812462 4161841 7037755 8843203 7896474
41698 7896474 5004143 2063450 862099 2142990 4009249 2818433 -1918831 -5225659
41690 -5225659 -2534865 3347465 5174105 831284 -4350618 -5478074 -3723738 -2133673
41682 -2133673 -148043 4005402 8265837 8557868 4764420 971830 -254602 -291975 -560486
41673 -560486 134379 2415128 3465386 515121 -4290222 -5921178 -3168637 -138792
41665 -138792 -386221 -2586830 -3678273 -3588135 -4060812 -4558253 -2914515 284721 1609047
$$ packed form
41724f727289J828436L975488M693267J867335j675626j864922J2282o46438m007825
41715b545292n201200j648321L496188N923711M502762N74091l527162m770648
41707c195871j755191K579187L711936J474962k561J349379K875914J805448r46729
41698G896474k892331k940693j201351J280891J866259j190816m737264l306828
41690e225659K690794N882330J826640m342821n181902j127456J754336J590065
41682b133673J985630M153445M260435K92031l793448l792590j226432l7373k68511
41673e60486O94865K280749J050258k950265m805343j630956K752541L029845
41665a38792k47429k200609j091443R0138m72677m97441J643738L199236J324326
$$ plain form
41656 1609047 5761 -1045497 1458214 5293944 5981042 3154461 940916 2109454
41648 2109454 4664349 5169979 3253407 1156025 205209 -194027 -515013 -223207 581833
41639 581833 519631 -843959 -1560859 79289 2367780 1917162 -1568078 -4797939 -5741851
41630 -5741851 -6257958 -8354561 -10320552 -9137659 -5168358 -1620842 -219372 -178686 -890198
41621 -890198 -2486600 -3555985 -1450457 3905914 8756450 9448022 6254944 2417109
41613 2417109 619776 1033403 1679996 384090 -2614539 -4301678 -2697208 -347534
41605 -347534 -1455008 -5740079 -8370374 -6611165 -3235209 -2003260 -2946673 -4087691
41597 -4087691 -5004751 -6269447 -7546207 -8511806 -9587737 -9698221 -5924640 1788627 8148295
$$ packed form
41656A609047j603286j051258K503711L835730O87098k826581k213545J168538
41648B109454K554895N05630j916572k097382r50816l99236l20986K91806Q05040
41639E81833o2202j363590p16900J640148K288491m50618l485240l229861r43912
41630e741851n16107k096603j965991J182893L969301L547516J401470M0686p11512
41621h90198j596402j069385K105528N356371M850536O91572l193078l837835
41613B417109j797333M13627O46593j295906k998629j687139J604470K349674
41605c47534j107474m285071k630295J759209L375956J231949r43413j141018
41597d087691r17060j264696j276760r65599j075931j10484L773581P713267O359668
$$ plain form
41588 8148295 8438614 5059922 4041081 6408845 7854471 6624492 6240986 8761156
41580 8761156 10313136 6890477 1347913 55992 3548044 4962273 -921234 -10342538
41572 -10342538 -15049619 -12596157 -8513688 -7735313 -7831470 -3891390 2675643 5437161
41564 5437161 2648552 -98687 1189879 2866802 505642 -2788545 -813788 5608366
41556 5608366 9579732 8508494 6874825 7645391 7440363 3185810 -1863076 -3121724
41548 -3121724 -1908389 -2696675 -5324506 -5109920 -293676 5177017 7078119 5617056
41540 5617056 3490102 2077750 1255529 914556 765825 -67101 -1528482 -1694400 843721
41531 843721 4325429 5561765 4199093 3138339 4194918 5423500 4089707 691573
$$ packed form
41588H148295K90319l378692j018841K367764J445626j229979l83506K520170
41580H761156J551980l422659n542564j291921L492052J414229n883507r421304
41572a0342538m707081K453462M082469P78375r6157L940080O567033K761518
41564E437161k788609k747239J288566J676923k361160l294187J974757O422154
41556E608366L971366j071238j633669P70566k05028m254553n048886j258648
41548c121724J213335p88286k627831K14586M816244N470693J901102j461063
41540E617056k126954j412352q22221l40973j48731q32926j461381j65918K538121
41531H43721L481708J236336j362672j060754J056579J228582j333793l398134
$$ plain form
41523 691573 -1872057 -2210158 -1435554 -636042 416948 1688614 2017404 770767 -1010660
41514 -1010660 -2017435 -2100358 -1496034 195798 3070300 5594732 5418687 1722536 -3393800
41505 -3393800 -5954244 -3361878 2516611 6471501 5747856 3739512 5439360 9983001
41497 9983001 11351962 6890398 1169242 -180454 3096743 7569142 10604692 10609185 6521886
41488 6521886 640426 -1284494 3084032 8461674 8976141 6510306 6631773 8848175
41480 8848175 7936371 3887750 2681700 6177676 8764752 6596996 3309513 2910117
41472 2910117 3215690 1168904 -549517 2032889 6935647 9315675 8945416 8582245 7092930
41463 7092930 1026809 -7504494 -11307153 -7755437 -2366134 -673562 -1262954 362051
$$ packed form
41523F91573k563630l38101P74604P99512J052990J271666L28790j246637j781427
41514a010660j006775q2923O04324J691832K874502K524432j76045l696151n116336
41505c393800k560444K592366N878489L954890p23645k008344J699848M543641
41497I983001J368961m461564n721156j349696L277197M472399L035550M493m087299
41488F521886n881460j924920M368526N377642N14467k465835J21467K216402
41480H848175r11804m048621j206050L495976K587076k167756l287483l99396
41472B910117L05573k046786j718421K582406M902758K380028l70259l63171j489315
41463G092930o066121q531303l802659L551716N389303J692572n89392J625005
$$ plain form
41455 362051 4775035 8883741 10851744 11531400 12009440 12088180 10849301 7590629 2985140
41446 2985140 -153703 1029441 5515004 8478420 6855047 3104807 1482605 2203074
41438 2203074 2020710 -233370 -1766471 121797 4529182 8549978 10803050 12135140
41430 12135140 13562178 14580171 13656134 10235623 6010777 3465718 2916597 2127378
41422 2127378 -394066 -3143781 -4009348 -3312804 -2336967 -410713 3299238 6115259 4268912
41413 4268912 -738199 -2798083 316410 3711664 3100375 1103637 1878765 3654249
41405 3654249 2244354 -757533 78588 4758416 7191869 4522716 979336 504727
41397 504727 1186963 155193 -719470 1715238 5725188 6377501 2302979 -2401840 -2767168
$$ packed form
41455C62051M412984M108706J968003O79656M78040P8740j238879l258672m605489
41446B985140l138843J183144M485563K963416j623373l750240j622202P20469
41438B203074j82364k254080j533101J888268M407385M020796K253072J332090
41430A2135140J427038J017993r24037l420511m224846k545059n49121p89219
41422B127378k521444k749715q65567O96544R75837J926254L709951K816021j846347
41413D268912n007111k059884L114493L395254o11289j996738P75128J775484
41405C654249j409895l001887Q36121M679828K433453k669153l543380m74609
41397E04727O82236j031770q74663K434708M009950O52313m074522m704819l65328
$$ plain form
41388 -2767168 2116199 8043148 8999206 3209877 -3759111 -4550149 826345 4880138
41380 4880138 2754628 -1908126 -3478209 -2088596 -1150200 -1147952 -678768 -688161 -2546965
41371 -2546965 -3999438 -2124762 1211112 1898056 307828 285584 2331598 3257625 2323393
41362 2323393 2158167 3344196 3697353 3646450 6403782 11087421 11552639 5087676 -2627571
41353 -2627571 -4802223 -1789065 1608128 3543933 5563247 8077657 9870474 11022591
41345 11022591 12540370 13485792 11710802 7614357 4620871 5319773 8744395 11958806
41337 11958806 13193094 12815791 11744360 9691364 5700602 426787 -3508532 -4537953
41329 -4537953 -4167181 -4154904 -3069793 1452237 7698267 10595064 7880046 2608275 -1090830
$$ packed form
41388b767168M883367N926949R56058n789329o968988p91038N376494M053793
41380D880138k125510m662754j570083J389613R38396K248M69184r393j858804
41371b546965j452473J874676L335874O86944j590228k2244K046014R26027r34232
41362B323393j65226J186029L53157n0903K757332M683639M65218o464963p715247
41353b627571k174652L013158L397193J935805K019314K514410J792817J152117
41345A1022591J517779R45422j774990m096445k993486O98902L424622L214411
41337A1958806J234288l77303j071431k052996l990762n273815l935319j029421
41329d537953L70772J2277J085111M522030O246030K896797k715018n271771l699105
$$ plain form
41320 -1090830 -1950185 -671269 1862035 4344869 5576106 6196746 7598553 8702914
41312 8702914 6739721 1792042 -2613516 -4098802 -3250549 -514806 4265117 8192417
41304 8192417 6494452 -192837 -4754090 -3095099 84661 -961167 -4181265 -3799142
41296 -3799142 600022 4886229 7385170 8933334 8166506 3431921 -1668178 -1390789
41288 -1390789 3429439 6097951 4088040 1960683 2793425 3200285 -22070 -3904469
41280 -3904469 -4277709 -2618541 -3122831 -5535382 -5680343 -1987891 2679914 5456741 6244547
41271 6244547 5902369 4855564 4350834 6334383 10432221 12975290 11172869 7267531
41263 7267531 6150504 8923449 11406716 10083420 7029354 6589737 9013515 10848811
$$ packed form
41320a090830q59355J278916K533304K482834J231237O20640J401807J104361
41312H702914j963193m947679m405558j485286Q48253K735743M779923L927300
41304H192417j697965o687289m561253J658991L179760j045828l220098L82123
41296c799142M399164M286207K498941J548164p66828m734585n100099K77389
41288a390789M820228K668512k009911k127357Q32742M06860l222355l882399
41280c904469l73240J659168n04290k412551j44961L692452M667805K776827P87806
41271F244547l42178j046805n04730J983549M097838K543069j802421l905338
41263G267531j117027K772945K483267j323296l054066m39617K423778J835296
$$ plain form
41255 10848811 10853028 11242028 12471042 11355291 6610189 2202495 1835589 3418843 3084071
41246 3084071 1958138 4008655 8889690 12353680 13133039 13812754 14534494 11702966 4793974
41237 4793974 -880565 -1252071 918604 1032163 -370794 191050 2556687 3267014 1449725
41228 1449725 58319 1205107 3738891 5858648 7166357 7540088 6646784 5384801
41220 5384801 5430034 6498841 6462354 5208488 5649134 9056460 12125720 11570119 9346808
41211 9346808 9274616 9929643 6378383 -546375 -2883621 3339828 10929329 10765730 4466465
41202 4466465 1043533 3004745 4037814 1144009 242311 5582573 10967800 8269173
41194 8269173 86424 -3624488 523789 6041254 6925194 4710582 3811570 5214445
$$ packed form
41255A0848811M217L89000J229014j115751m745102m407694l66906J583254l34772
41246C084071j125933K050517M881035L463990P79359O79715P21740k831528o908992
41237D793974n674539l71506K170675J13559j402957N61844K365637P10327j817289
41228A449725j391406J146788K533784K119757J307709L73731q93304j261983
41220E384801M5233J068807l6487j253866M40646L407326L069260n55601k223311
41211I346808p2192O55027l551260o924758k337246O223449P589501j63599o299265
41202D466465l422932J961212J033069k893805r01698N340262N385227k698627
41194H269173q182749l710912M148277N517465Q83940k214612q99012J402875
$$ plain form
41186 5214445 7094679 7880435 6567991 2937856 -756982 -831148 3525587 8939833 11714633
41177 11714633 10974501 7878312 4743026 5290341 11829337 20758456 24743230 21606418
41169 21606418 17590501 19251096 25583356 31332061 34593046 36771290 37736484 36425254
41161 36425254 35059883 37203301 41326870 41410809 35335040 28265358 25520714 25787156
41153 25787156 24359729 20391279 17381068 17682569 19720568 20577453 19054430 15932420
41145 15932420 12848425 11242685 11292295 11681906 11195451 10369030 10657284 12145435 13147835
41136 13147835 12148258 9283985 5885052 3393977 2800226 4268223 7017163 9983539
41128 9983539 12508530 14005095 13654543 11499303 9264182 8644349 9129834 9112636 8638059
$$ packed form
41186E214445J880234P85756j312444l630135l694838p4166M356735N414246K774800
41177A1714633p40132l096189l135286N47315O538996Q929119L984774l136812
41169B1606418m015917J660595O332260N748705L260985K178244R65194j311230
41161C6425254j365371K143418M123569Q3939o075769p069682k744644K66442
41153B5787156j427427l968450l010211L01501K037999Q56885j523023l122010
41145A5932420l083995j605740M9610L89611m86455q26421K88254J488151J002400
41136A3147835r99577k864273l398933k491075n93751J467997K748940K966376
41128I983539K524991J496565l50552k155240k235121o19833M85485j7198m74577
$$ plain form
41119 8638059 8792420 8647730 5985337 1737935 184540 2954895 6288679 6925484 7281413
41110 7281413 10817522 15188400 15378889 12137917 11183029 13909489 15179180 12183184
41102 12183184 9611948 12388459 17765453 19281743 15866491 12377000 12299423 13942110
41094 13942110 13741820 10443455 5929607 3857558 7016106 14082728 19456841 18257201
41086 18257201 11443605 4773757 3136795 6843580 12384766 15348751 13510307 8755992
41078 8755992 5638682 6967305 11271865 15049359 16213298 14640393 11096429 7008690
41070 7008690 3989923 2396010 1483028 1478496 3537025 6990196 9182032 9161782 8892381
41061 8892381 9598302 10022356 9800456 10900963 13519895 14402040 12055562 9710254 9835121
$$ packed form
41119H638059J54361j44690k662393m247402j553395K770355L333784O36805L55929
41110G281413L536109M370878J90489l240972r54888K726460J269691k995996
41102A2183184k571236K776511N376994J516290l415252l489491p7577J642687
41094A3942110k00290l298365m513848k072049L158548P066622N374113j199640
41086A8257201o813596o669848j636962L706785N541186K963985j838444m754315
41078H755992l117310J328623M304560L777494J163939j572905l543964m087739
41070G008690l018767j593913r12982m532K058529L453171K191836k0250k69401
41061H892381P05921M24054k21900J100507K618932Q82145k346478k345308J24867
$$ plain form
41052 9835121 10015325 8350045 8257307 12339228 15729596 12546313 5903767 3817089 7044370
41043 7044370 9035664 7139286 5619974 7208340 9686901 12063757 16353514 21360443
41035 21360443 22321159 19316034 18681472 22896238 26302510 24795758 22696094 25067383
41027 25067383 29701733 32486239 34911022 39627507 43382083 41726638 37359647 36317181
41019 36317181 38020002 36519398 30766872 26500952 27296839 29852110 29781154 27342908
41011 27342908 25446401 25385233 26311431 26579298 24520998 19924721 15485391 14881829 18574980
41002 18574980 22821254 23455817 19918478 15430091 13659371 15061090 16614560 15912842
40994 15912842 14641999 15824906 18430527 18545509 16113002 15576206 18131751 18834791
$$ packed form
41052I835121J80204j665280r2738M081921L390368l183283o642546k086678L227281
41043G044370J991294j896378j519312J588366K478561K376856M289757N006929
41035B1360443R60716l005125o34562M214766L406272j506752k099664K371289
41027B5067383M634350K784506K424783M716485L754576j655445m366991j042466
41019C6317181J702821j500604n752526m265920P95887K555271p0956k438246
41011B7342908j896507o1168R26198K67867k058300m596277m439330o03562L693151
41002A8574980M246274O34563l537339m488387j770720J401719J553470p01718
40994A5912842j270843J182907K605621J14982k432507n36796K555545P03040
$$ plain form
40986 18834791 14875772 11335639 13338881 16963727 14953250 8675801 6510191 11076836
40978 11076836 15990260 16465818 15775639 18199043 21646404 21537292 17864074 14092139
40970 14092139 11758809 10099799 9184822 9722322 10734356 10616752 9990505 10649760 11913281
40961 11913281 10978871 7488788 4984589 6221118 9135193 9941306 8985480 10070810
40953 10070810 13665032 14760434 9996289 3679220 2546132 6428233 9203461 8315900
40945 8315900 7353124 8329719 8090750 5369558 4952359 9696834 13772437 10584588 3663645
40936 3663645 2004780 6731451 10609779 10199643 9685511 11201381 10293237 5116014 2366598
40927 2366598 7593829 15038991 14825003 7471588 3266679 7327407 12799477 11532387
$$ packed form
40986A8834791l959019l540133K003242L624846k010477o277449k165610M566645
40978A1076836M913424M75558o90179K423404L447361j09112l673218l771935
40970A4092139k333330j659010r14977N37500J012034j17604o26247O59255J263521
40961A1913281r34410l490083k504199J236529K914075Q06113r55826J085330
40953A0070810L594222J095402m764145o317069j133088L882101K775228q87561
40945H315900r62776R76595k38969k721192m17199M744475M075603l187849o920943
40936C663645j658865M726671L878328m10136n14132J515870r08144n177223k749416
40927B366598N227231P445162k13988p353415m204909M060728N472070j267090
$$ plain form
40919 11532387 5691713 3922233 8815558 13620518 11749337 5321364 1746665 3923603
40911 3923603 7169441 6086561 1675661 -310777 3096500 8494574 10462927 8024622
40903 8024622 5513100 7150441 11896159 14772222 13091752 9579565 8162385 8482618
40895 8482618 7287563 4333660 3046301 4544523 4970302 1242199 -3503212 -3578081 1739472
40886 1739472 7535702 9355877 7282803 4372923 3380706 4910583 7084202 7287800
40878 7287800 5351519 3982174 4924908 6507868 6730059 6584550 7765792 9281394 9714684
40869 9714684 10916569 15157302 19697103 19019796 12651082 6302433 4366478 5281784
40861 5281784 5560355 4549382 3305215 1993427 711608 600621 2172482 4304568
$$ packed form
40919A1532387n840674j769480M893325M804960j871181o427973l574699K176938
40911C923603L245838j082880m410900j986438L407277N398074J968353k438305
40903H024622k511522J637341M745718K876063j680470l512187j417180L20233
40895H482618j195055k953903j287359J498222M25779l728103m745411p4869N317553
40886A739472N796230J820175k073074k909880r92217J529877K173619K03598
40878G287800j936281j369345R42734J582960K22191j45509J181242J515602M33290
40869I714684J201885M240733M539801o77307o368714o348649j935955R15306
40861E281784K78571j010973j244167j311788j281819j10987J571861K132086
$$ plain form
40853 4304568 6171310 8104629 9453077 8286812 4983871 3395466 5910099 9553579
40845 9553579 10005054 7866737 7412316 9798003 11405962 9671306 7008276 6793628 8009279
40836 8009279 7134202 4296837 3685006 6968476 9843083 7736460 2583446 323509
40828 323509 2728498 5734014 5989607 4877815 4674373 4577455 2984070 766814 -417952
40819 -417952 -825139 -1077803 -14156 3293855 7129112 9157088 9178634 7865140 5136796
40810 5136796 2204090 2364777 6438765 9972887 8830557 5346036 4742692 7383889
40802 7383889 9232670 8658743 7942349 8580121 9536460 9961246 9860577 8571462 6071360
40793 6071360 4716831 5997913 7238337 5809192 4458816 6926563 10175968 7891271
$$ packed form
40853D304568J866742J933319J348448j166265l302941j588405K514633L643480
40845I553579M51475k138317m54421K385687J607959j734656k663030k14648J215651
40836H009279q75077k837365o11831L283470K874607k106623n153014k259937
40828C23509K404989L005516K55593j111792k03442r6918j593385k217256j184766
40819d17952m07187k52664J063647L308011L835257K027976K1546j313494k728344
40810E136796k932706J60687M073988L534122j142330l484521o03344K641197
40802G383889J848781n73927p16394O37772R56339M24786j00669j289115k500102
40793F071360j354529J281082J240424j429145j350376K467747L249405k284697
$$ plain form
40785 7891271 1052395 -2377305 956337 5665284 6729072 5911614 6487206 7695735
40777 7695735 7786426 7658378 8285388 8589397 8434835 9825694 12920648 14720621 13694538
40768 13694538 12004830 11649377 12204727 13294696 14979181 15258016 12360672 9729395
40760 9729395 12325902 17448427 17018024 10663545 7712235 12760829 18377585 17471808
40752 17471808 14259960 15803660 20090306 20962857 19226687 19985669 22806263 22962432
40744 22962432 19909317 17107442 15589735 14327305 14618233 17586346 19646218 16996832
40736 16996832 12531353 11928429 14977676 17115239 17349428 17961816 18287214 15796972 12101248
40727 12101248 11260825 13213339 14980672 16765249 20419816 23798852 23797059 23345562 27658032
$$ packed form
40785G891271o838876l429700L333642M708947J063788q17458N75592J208529
40777G695735R0691j28048O27010L04009j54562J390859L094954J799973j026083
40768A3694538j689708l55453N55350J089969J684485K78835k897344k631277
40760I729395K596507N122525m30403o354479k951310N048594N616756r05777
40752A7471808l211848J543700M286646Q72551j736170P58982K820594J56169
40744B2962432l053115k801875j517707j262430K90928K968113K059872k649386
40736A6996832m465479o02924L049247K137563K34189O12388L25398k490242l695724
40727A2101248q40423J952514J767333J784577L654567L379036j793m51497M312470
$$ plain form
40718 27658032 34633336 36959919 33077190 27949299 23600477 17824899 12338191 12366338
40710 12366338 16503737 16723684 11366032 8677678 13351813 18540798 16749152 10802715
40702 10802715 7575538 7424426 6954928 7127062 10999106 16455569 18103278 15038635
40694 15038635 11410665 10288601 11272748 13249873 15796887 18328249 20390334 22138493
40686 22138493 23165786 22552060 21152860 21267881 22808010 22970171 21177413 20485445 21941081
40677 21941081 21767590 17336997 12077341 10554306 11883423 12237836 11298408 11731771 13956646
40668 13956646 15667489 15671707 14782045 13700206 12790966 12837285 13527887 12797621 10295235
40659 10295235 9449941 12797295 17219180 17841480 15264912 14411577 16724501 18302117
$$ packed form
40718B7658032O975304K326583l882729n127891m348822n775578n486708K8147
40710A2366338M137399K19947n357652k688354M674135N188985j791646n946437
40702A0802715l227177j51112m69498J72134L872044N456463J647709l064643
40694A5038635l627970j122064R84147J977125K547014K531362K062085J748159
40686B2138493J027293o13726j399200J15021J540129J62161j792758o91968J455636
40677B1941081j73491m430593n259656j523035J329117L54413r39428M33363K224875
40668A3956646J710843M218q89662j081839r09240M6319O90602p30266k502386
40659A0295235q45294L347354M421885O22300k576568q53335K312924J577616
$$ plain form
40651 18302117 16481188 13785346 13350649 13925412 12271245 8463417 5772357 5998412
40643 5998412 7630980 8873413 10037857 11619952 11985784 9593721 6763778 7843548
40635 7843548 12768748 15813245 12945352 7512967 5478831 7468600 9543849 9964959
40627 9964959 10312910 10801382 9718643 7626542 7067855 7658994 6669473 5137470 7469675
40618 7469675 13295224 15982089 12223076 7162858 6142078 7122529 6352334 6179132 10498269
40609 10498269 16151610 16462188 11851706 9796824 14072195 20250928 23081627 23001666
40601 23001666 23129637 23872740 23547062 22259626 22349949 25026428 27894738 26788254 20672012
40592 20672012 14087540 12855256 17258139 21903014 22811885 21464905 20566347 19610205
$$ packed form
40651A8302117j820929k695842m34697N74763j654167l807828k691060K26055
40643E998412J632568J242433J164444J582095L65832k392063k829943J079770
40635G843548M925200L044497k867893n432385k034136J989769K075249M21110
40627I964959L47951M88472j082739k092101n58687N91139r89521j532003K332205
40618G469675N825549K686865l759013n060218j020780R80451p70195j73202M319137
40609A0498269N653341L10578m610482k054882M275371O178733K830699p9961
40601B3001666J27971P43103l25678j287436R0323K676479K868310j106484o116242
40592B0672012o584472j232284M402883M644875R08871j346980q98558r56142
$$ plain form
40584 19610205 17286285 14919682 14099998 13610682 12349123 12802954 17408119 23212398
40576 23212398 24561812 20303686 14636405 11597245 12114498 15511637 20154279 23017097
40568 23017097 22003932 18622597 15937863 14851403 14911169 16973060 21518324 25854612
40560 25854612 27004623 26324048 27208029 29163941 28575548 24938229 21925258 22104870 24463451
40551 24463451 27190151 29177415 28925502 25903919 22995461 23715576 27031703 28704703
40543 28704703 27350634 25057181 22808521 20454000 20748228 27148154 36685370 41332937
40535 41332937 38504168 34415620 34542415 36516449 35887468 33480640 32486808 32476017 31227652
40526 31227652 29609157 30098050 32469876 34707688 36333888 37623011 37636243 36309545
$$ packed form
40584A9610205k323920k366603q19684m89316j261559M53831M605165N804279
40576B3212398J349414m258126n667281l039160N17253L397139M642642K862818
40568B3017097j013165l381335k684734j086460N9766K061891M545264M336288
40560B5854612J150011o80575Q83981J955912n88393l637319l012971J79612K358581
40551B4463451K726700J987264k51913l021583k908458P20115L316127J673000
40543B8704703j354069k293453k248660k354521K94228O399926R537216M647567
40535D1332937k828769m088548J26795J974034o28981k406828r93832j0791j248365
40526C1227652j618495M88893K371826K237812J626200J289123J3232j326698
$$ plain form
40518 36309545 36381945 39893722 44731624 47876789 49794785 51829399 51513804 45361878
40510 45361878 35396727 28059743 26333658 26993046 26358697 25023400 25312614 26928332
40502 26928332 27419030 25849896 24182041 24754360 26975709 27312942 23311750 17001194
40494 17001194 12649146 11554226 11663108 12331754 15594615 21260566 24935406 23956090
40486 23956090 21784441 22711019 25206000 25012654 22377215 21009307 21468494 21162237 20141877
40477 20141877 21067947 23327747 23186213 20836192 21298526 26200745 30411042 30016200 28389246
40468 28389246 30160301 33728609 34941271 34687888 36809622 40503312 41231824 38902711
40460 38902711 39051680 44605637 51589272 55265338 56513035 59434283 65794054 74802843
$$ packed form
40518C6309545P2400L511777M837902L145165J917996K034614l15595o151926
40510D5361878r965151p336984j726085O59388o34349j335297K89214J615718
40502B6928332M90698j569134j667855N72319K221349L37233m001192o310556
40494A7001194m352048j094920J08882O68646L262861N665951L674840r79316
40486B3956090k171649R26578K494981j93346k635439j367908M59187l06257j020360
40477B0141877R26070K259800j41534k350021M62334M902219M210297l94842j626954
40468B8389246J771055L568308J212662k53383K121734L693690P28512k329113
40460C8902711J48969N553957O983635L676066J247697K921248O359771R008789
$$ plain form
40452 74802843 86050520 99504110 114033761 128657680 143844133 158585888 167437761
40445 167437761 164465837 150537006 133352843 119368518 108702535 98988492 90284989
40438 90284989 83216191 75423166 64510280 53456063 48328298 49965368 52147374 49829577
40430 49829577 45514859 44464129 46295878 45462027 39300731 31727612 28127574 29343009
40422 29343009 32004714 32875215 31353544 28815265 26891320 26087332 25520450 24467401
40414 24467401 24230659 27246243 33720430 40405887 43880052 44244269 44370219 46083237
40406 46083237 48485097 49854411 49781614 49064852 48488150 48246147 48062350 47470263 46160895
40397 46160895 44141478 41554961 38851759 37480719 39454603 44965628 50906486 53390063
$$ packed form
40452G4802843J1247677J3453590J4529651J4623919J5186453J4741755Q851873
40445A67437761k971924j3928831j7184163j3984325j0665983r714043q703503
40438I0284989p068798p793025j0912886j1054217n127765J637070K182006k317797
40430D9829577m314718j050730J831749q33851o161296p573119l600038J215435
40422B9343009K661705Q70501j521671k538279j923945q03988n66882j053049
40414B4467401k36742L015584O474187O685457L474165L64217J25950J713018
40406D6083237K401860J369314p2797p16762n76702k42003j83797n92087j309368
40397D6160895k019417k586517k703202j371040J973884N511025N940858K483577
$$ plain form
40389 53390063 51861360 49244473 47922581 47531853 47356805 48516745 51953566 56136021
40381 56136021 59389885 63457824 71704269 83910909 96048299 106151747 117411365
40374 117411365 133145491 150450826 161524303 161029331 150388302 135065136 119570198
40367 119570198 105604657 93341538 82858493 74354201 67909108 63554228 61346784
40360 61346784 60893248 60771585 59125607 55504489 51840336 50825540 53215449 57158584
40352 57158584 60057509 60628126 59483861 58454161 59116047 61360885 63879488 66643517
40344 66643517 71568000 79125753 85925203 88847983 90926920 98771180 112954258 125164378
40336 125164378 127658569 122210691 116105109 112030624 106854119 99276928 93149489 91872918
$$ packed form
40389E3390063j528703k616887j321892l90728j75048J159940L436821M182455
40381E6136021L253864M067939Q246445J2206640J2137390J0103448J1259618
40374A17411365J5734126J7305335J1073477m94972j0641029j5323166j5494938
40367A19570198j3965541j2263119j0483045q504292o445093m354880k207444
40360F1346784m53536j21663j645978l621118l664153j014796K389909L943135
40352E7158584K898925N70617j144265j029700O61886K244838K518603K764029
40344F6643517M924483P557753O799450K922780K078937P844260J4183078J2210120
40336A25164378K494191n447878o105582m074485n176505p577191o127439j276571
$$ plain form
40328 91872918 93912250 96569140 101312610 111781013 127156156 140505042 144774597 139300828
40320 139300828 129559511 121239057 115887362 112332460 110116662 109236516 107436611 101167422
40312 101167422 90363725 79714930 73493326 71062051 69071773 65898425 61842603 57144021
40304 57144021 52484435 49693472 49222908 48694980 46808866 46425847 50008905 54333512
40296 54333512 54850065 53682487 56923423 64135653 67619479 63979533 59680766 61456863
40288 61456863 66820260 68865325 66165447 62445407 59301122 54955650 49128921 44307040
40280 44307040 42351284 43321007 46929653 51700112 53609523 49704214 43080943 40478713
40272 40478713 44314751 50251354 53159773 52363222 50283252 49167526 50526656 54863954
$$ packed form
40328I1872918K039332K656890M743470J0468403J5375143J3348886M269555n473769
40320A39300828r741317q320454n351695l554902k215798q80146j799905o269189
40312A01167422j0803697j0648795o221604k431275j990278l173348m055822m698582
40304E7144021m659586k790963m70564n27928j886114l83019L583058M324607
40296E4333512N16553j167578L240936P212230L483826l639946m298767J776097
40288F1456863N363397K045065k699878l720040l144285m345472n826729m821881
40280D4307040j955756R69723L608646M770459J909411l905309o623271k602230
40272D0478713L836038N936603K908419p96551k079970j115726J359130M337298
$$ plain form
40264 54863954 59938188 61462739 57750036 52280158 49684851 50294542 50727586 49063522
40256 49063522 46855712 45750624 44656739 41958408 38974755 38591757 40573244 41158788
40248 41158788 38787752 37575060 41993178 49633887 53474491 51374437 48670811 49692051
40240 49692051 51417262 49247481 45378298 46069104 52131327 57731162 59022577 58989962
40232 58989962 61941126 67102928 70347735 69835419 67335328 65358806 65229567 67285597
40224 67285597 71140022 75716823 79921326 83356728 86405293 90062866 95171788 100552624
40216 100552624 102434395 97902615 89081607 81492331 77519827 74037908 67863942 60905083
40208 60905083 57396036 57905786 59231260 59569910 60781833 65163079 72229713 79347889
$$ packed form
40264E4863954N074234J524551l712703n469878k595307O09691M33044j664064
40256D9063522k207810j105088j093885k698331k983653l82998J981487N85544
40248D1158788k371036j212692M418118P640709L840604k100054k703626J021240
40240D9692051J725211k169781l869183O90806O062223N599835J291415l2615
40232E8989962K951164N161802L244807n12316k500091j976522j29239K056030
40224F7285597L854425M576801M204503L435402L048565L657573N108922N380836
40216A00552624J881771m531780q821008p589276l972504l481919o173966o958859
40208F0905083l509047N09750J325474L38650J211923M381246P066634P118176
$$ plain form
40200 79347889 83926402 84491660 81126784 75622641 70290886 66307133 64004652 64310589
40192 64310589 67907969 72725754 74707709 72539056 69754401 70164933 72545196 72358395
40184 72358395 68174102 63583477 62255145 63560859 64472631 64113154 64678024 68543528
40176 68543528 75743254 83841208 89353731 89964238 86568685 82861458 81885672 83182037
40168 83182037 84109578 83494847 82905321 84569494 89032034 94723162 99179102 101300287
40160 101300287 103334363 109746580 122668935 139208173 155054742 170226678 189282801
40153 189282801 216294357 251531546 291735661 329684911 353612803 352662438 326667388
40146 326667388 288162945 251794940 223239705 200032361 179657579 162665979 149799838
$$ packed form
40200G9347889M578513N65258l364876n504143n331755l983753k302481L05937
40192F4310589L597380M817785J981955k168653k784655M10532K380263j86801
40184G2358395m184293m590625j328332J305714R11772l59477N64870L865504
40176F8543528P199726Q097954N512523O10507l395553l707227r75786J296365
40168H3182037R27541o14731n89526J664173M462540N691128M455940K121185
40160A01300287K034076O412217J2922355J6539238J5846569J5171936J9056123
40153A89282801K7011556L5237189M0204115L7949250K3927892r50365k5995050
40146C26667388l8504443l6368005k8555235k3207344k0374782j6991600j2866141
$$ plain form
40139 149799838 140713491 135223675 132242875 128117440 120056452 111015420 106828945 108084875
40131 108084875 109488823 108475497 109371135 116268157 126376905 134668049 141809535 152577603
40123 152577603 168393202 186733847 207347040 233549871 265737774 297206491 318195263
40116 318195263 321957128 306706407 275532359 236454700 199389228 169815944 146382454
40109 146382454 126047844 109251833 97813044 90280972 83100484 75365978 68908085
40102 68908085 64118607 59280530 54230825 51068870 50285059 49580560 48048074 48245802
40094 48245802 51755070 55452037 55363899 52473534 51266054 53218911 54979477 53226609
40086 53226609 48732722 44893395 44093846 46320646 50077889 53815087 56851370 59223135
$$ packed form
40139A49799838r086347n489816k980800m125435q060988r041032m186475J255930
40131A08084875J403948j013326Q95638O897022J0108748Q291144P141486J0768068
40123A52577603J5815599J8340645K0613193K6202831L2187903L1468717K0988772
40116C18195263L761865j5250721l1174048l9077659l7065472k9573284k3433490
40109A46382454k0334610j6796011j1438789p532072p180488p734506o457893
40102F8908085m789478m838077n049705l161955p83811p04499j532486J97728
40094D8245802L509268L696967q8138k890365j207480J952857J760566j752868
40086E3226609m493887l839327p99549K226800L757243L737198L036283K371765
$$ plain form
40078 59223135 61017849 62911743 67225556 76137623 87883019 97522585 103606439 111226111
40070 111226111 125323330 143852015 161883718 179382033 198002732 211518156 208476121
40063 208476121 187137343 160157022 139834787 125080661 108714746 91654445 81288918
40056 81288918 78704736 76795547 71423400 66459416 65645786 66356509 65065043 63608234
40048 63608234 65323692 68481677 68572699 65558915 64457182 68965622 77916327 88348983
40040 88348983 99299998 111592387 125761816 141517347 158645540 177561235 198356372
40033 198356372 218309550 230167248 225263455 201410771 167684565 138479020 121314403
40026 121314403 112055948 102986625 92831373 86006458 84005375 82331352 76846009 69203062
$$ packed form
40078E9223135J794714J893894M313813Q912067J1745396R639566O083854P619672
40070A11226111J4097219J8528685J8031703J7498315J8620699J3515424l042035
40063B08476121k1338778k6980321k0322235j4754126j6365915j7060301j0365527
40056H1288918k584182j909189n372147m963984q13630P10723j291466j456809
40048F3608234J715458L157985R1022l013784j101733M508440Q950705J0432656
40040H8348983J0951015J2292389J4169429J5755531J7128193J8915695K0795137
40033A98356372J9953178J1857698m903793k3852684l3726206k9205545j7164617
40026A21314403r258455r069323j0155252o824915k001083j674023n485343p642947
$$ plain form
40018 69203062 63687332 61467840 60710552 60207338 59721432 58253446 55352173 53148341
40010 53148341 53647609 54887725 53693662 51560983 52932502 57383525 59125454 56035408
40002 56035408 53497970 55928574 59731774 59646123 57875827 60400111 66320157 67902194
39994 67902194 61628398 53308037 50377672 53537733 58250176 61015348 61335244 59583392
39986 59583392 55827589 50392335 44077750 37884508 32944704 30139964 29349206 29452684
39978 29452684 29271755 28427299 27644706 28268362 30560553 32394181 31321851 28505378 28212266
39969 28212266 31815108 34705131 31808027 24417212 18505898 17383253 19149712 20745776
39961 20745776 21297973 21456955 22163740 24304271 27518966 29596623 28996780 27196625 26306830
$$ packed form
40018F9203062n515730k219492p57288n03214m85906j467986k901273k203832
40010E3148341M99268J240116j194063k132679J371519M451023J741929l090046
40002E6035408k537438K430604L803200q5651j770296K524284N920046J582037
39994F7902194o273796q320361k930365L160061M712443K765172L19896j751852
39986E9583392l755803n435254o314585o193242m939804k804740p90758J03478
39978B9452684j80929q44456p82593O23656K292191J833628j072330k816473k93112
39969B8212266L602842K890023k897104p390815n911314j122645J766459J596064
39961B0745776N52197J58982P06785K140531L214695K077657n99843j800155q89795
$$ plain form
39952 26306830 25605340 23459125 21515786 23020495 27164960 29109769 26241022 21000746
39944 21000746 16934000 15320839 16423902 20480350 26037071 30217518 32052319 33251845
39936 33251845 34995612 36660323 38325143 41318584 45136902 46961367 45857844 44859396
39928 44859396 47308839 53241575 60368657 66266458 68762493 66867107 62469806 58744954
39920 58744954 56179054 52768344 48383611 45401353 44254348 42269014 38365663 35290406
39912 35290406 35644623 39105816 44608670 51162076 55529160 54464102 51290823 54286229
39904 54286229 65099748 74697265 75412982 71270562 70427490 72840306 73289390 72714653
39896 72714653 77143889 86440812 93118629 93439649 92065873 93618683 96217076 96197641
$$ packed form
39952B6306830p01490k146215j943339J504709M144465J944809k868747n240276
39944B1000746m066746j613161J103063M056448N556721M180447J834801J199526
39936C3251845J743767J664711J664820K993441L818318J824465j103523r98448
39928D4859396K449443N932736P127082N897801K496035j895386m397301l724852
39920E8744954k565900l410710m384733k982258j147005j985334l903351l075257
39912C5290406L54217L461193N502854O553406M367084j065058l173279K995406
39904E4286229J0813519R597517P15717m142420q43072K412816M49084n74737
39896G2714653M429236R296923O677817L21020j373776J552810K598393j9435
$$ plain form
39888 96197641 93693450 90219363 85198100 78501726 73201259 72251042 74242674 74845062
39880 74845062 71044305 62733323 52226788 43445860 39251349 38213449 36246962 32480981
39872 32480981 30623822 32977623 36414523 37014152 35963541 37315207 41589037 45470964
39864 45470964 47351300 49451370 53841892 59439019 64292178 68355699 71865319 72569819
39856 72569819 67483608 57524751 47963037 42946590 41082552 38059347 32516808 27109885
39848 27109885 24253296 23492594 23482846 23839186 23940057 22666723 21168161 23130651 29414198
39839 29414198 34621642 32813655 25562471 20281595 20693203 23094581 22917347 20820705
39831 20820705 20005624 20813205 21385654 21881574 24312483 28325571 30316702 27864452 23018637
$$ packed form
39888I6197641k504191l474087n021263o696374n300467r50217J991632O02388
39880G4845062l800757q310982j0506535q780928m194511j037900j966487l765981
39872C2480981j857159K353801L436900N99629j050611J351666M273830L881927
39864D5470964J880336K100070M390522N597127M853159M063521L509620P04500
39856G2569819n086211r958857r561714n016447j864038l023205n542539n406923
39848B7109885k856589p60702r748L56340J00871j273334j498562J962490O283547
39839B9414198N207444j807987p251184n280876M11608K401378j77234k096642
39831B0820705q15081Q07581N72449M95920K430909M013088J991131k452250m845815
$$ plain form
39822 23018637 19668571 18908626 18867328 18564588 19525882 22724286 26010859 26647014 25360680
39813 25360680 25537736 28701077 33204577 37491191 41905873 46419868 49181716 48849497
39805 48849497 46273130 42361309 36418434 28485303 21427097 18457829 19771683 23243295
39797 23243295 27013271 29897900 31064355 31016715 31123662 30814759 27784555 22519676 19105791
39788 19105791 19083906 18649698 15652152 14788787 20195366 26873993 27021189 22473285 22296925
39779 22296925 28672328 34301281 35050520 35822292 40374350 43925122 41501865 36903784
39771 36903784 36821811 40832436 43577871 43168227 41277948 38006413 32887311 28599964
39763 28599964 27422756 25872281 19364075 11024612 8971595 14698706 20745254 21094437
$$ packed form
39822B3018637l350066p59945m1298l02740R61294L198404L286573O36155j286334
39813B5360680J77056L163341M503500M286614M414682M513995K761848l32219
39805D8849497k576367l911821n942875p933131p058206k969268J313854L471612
39797B3243295L769976K884629J166455m7640J06947l08903l030204n264879l413885
39788A9105791k1885m34208k997546q63365N406579O678627J47196m547904j76360
39779B2296925O375403N628953P49239P71772M552058L550772k423257m598081
39771C6903784q1973M010625K745435m09644j890279l271535n119102m287347
39763B8599964j177208j550475o508206q339463k053017N727111O046548L49183
$$ plain form
39755 21094437 17875614 15803942 15509234 15308552 15157837 15513283 15459172 14848722 15582385
39746 15582385 18196956 19782612 17818623 13682610 10015904 7229219 5149575 5136639
39738 5136639 7162212 7519121 3628483 -983062 -1160453 2119482 3897689 4128254 7732936
39729 7732936 14858106 18176934 13386458 6494162 5571873 9625474 11668009 9889242
39721 9889242 8800674 10149508 9853674 5628266 1879587 3815305 10290947 15572622
39713 15572622 16020299 12714248 9094085 7765081 8541122 8940485 7837154 7893705 11490471
39704 11490471 15136435 12884221 5860180 2390502 6188243 10565513 8670591 3689546
39696 3689546 2748843 5454459 6254564 5101643 6868451 11007640 10951175 5389730 1872139
$$ packed form
39755B1094437l218823k071672k94708k00682j50715L55446n4111o10450P33663
39746A5582385K614571J585656j963989m136013l666706k786685k079644j2936
39738E136639K025573L56909l890638m611545j77391L279935J778207K30565L604682
39729G732936P125170L318828m790476o892296r22289M053601K042535j778767
39721I889242j088568J348834k95834m225408l748679J935718O475642N281675
39713A5572622M47677l306051l620163j329004P76041L99363j103331N6551L596766
39704A1490471L645964k252214p024041l469678L797741M377270j894922m981045
39696C689546r40703K705616Q00105j152921J766808M139189n6465n561445l517591
$$ plain form
39687 1872139 5738678 12181211 13653386 9997911 6572777 6168977 7359971 8255001
39679 8255001 7969504 6314214 4976520 6708277 10595374 11007862 4745023 -3352888
39671 -3352888 -5960566 -2515573 1294609 1932662 1384450 2451219 4908185 7041766
39663 7041766 7731094 6181635 2365487 -1343187 -1441535 2456701 6303384 5765642 750939
39654 750939 -4827009 -6823554 -3924572 1968148 7440753 9936801 9129338 6460623
39646 6460623 3802581 2541961 3094889 4580584 5220115 3553281 -575197 -5801578
39638 -5801578 -9554705 -9388587 -5356746 -667632 1548168 1743882 2439760 3822967 3633425
39629 3633425 1493919 106429 1129044 2818071 3114245 2328753 1455816 819793 1835349
$$ packed form
39687A872139L866539O442533J472175l655475l425134m03800J190994Q95030
39679H255001k85497j655290j337694J731757L887097M12488o262839q097911
39671c352888k607678L444993L810182O38053n48212J066769K456966K133581
39663G041766O89328j549459l816148l708674r8348L898236L846683n37742n014703
39654G50939n577948j996545K898982N892720N472605K496048q07463k668715
39646F460623k658042j260620N52928J485695O39531j666834m128478n226381
39638e801578l753127J66118M031841M689114K215800J95714O95878J383207j89542
39629C633425k139506j387490J022615J689027K96174p85492q72937o36023J015556
$$ plain form
39620 1835349 6490610 12837713 14806020 9748388 2817025 227866 1573215 3105481
39612 3105481 5007319 9427509 13890553 13861866 11097964 12086723 17419975 19914136 15562114
39603 15562114 9736039 8864903 11499231 12248428 10366343 9275995 10200193 11146041 10844441
39594 10844441 9722164 7994069 6130074 6039681 8518376 10721508 9613006 6816164
39586 6816164 6253100 7778084 7496835 4462822 2493252 4032342 6211287 5213563 1613180
39577 1613180 -939708 -181546 3543084 8380710 11362683 9988418 5796181 4219469
39569 4219469 8102476 13435564 15003685 14271153 16744060 22294762 24221784 19522008
39561 19522008 14217029 14617789 17922835 17035865 11928893 9502361 12383096 14613373
$$ packed form
39620A835349M655261O347103J968307n057632o931363k589159J345349J532266
39612C105481J901838M420190M463044k8687k763902R88759N333252K494161m352022
39603A5562114n826075q71136K634328P49197j882085j090348R24198R45848l01600
39594A0844441j122277j728095j863995r0393K478695K203132j108502k796842
39586F816164n63064J524984k81249l034013j969570J539090K178945r97724l600383
39577A613180k552888P58162L724630M837626K981973j374265m192237j576712
39569D219469L883007N333088J568121p32532K472907N550702J927022m699776
39561A9522008n304979M00760L305046q86970n106972k426532K880735K230277
$$ plain form
39553 14613373 11000231 5456744 5642039 12250635 18440026 18991892 15627890 12682377
39545 12682377 11409273 10661050 10520843 12120785 14722077 16048910 16011560 17391325 21217456
39536 21217456 23679510 20514473 13472428 8860326 9185305 9903710 6422872 1104261
39528 1104261 -73156 4147027 9197450 11137169 10302807 8472531 6346643 4991033
39520 4991033 6349730 10402866 14279314 15981356 16842833 18569286 20057027 19378561
39512 19378561 17182025 15660764 15303526 15049626 14896325 15934624 17935933 18988140
39504 18988140 17917860 15675752 13885981 12952406 12087573 10850181 10206012 11543853
39496 11543853 14315580 15575177 13228164 9121130 6907538 7108251 6853944 4788409
$$ packed form
39553A4613373l613142n543487J85295O608596O189391N51866l364002k945513
39545A2682377j273104p48223j40207J599942K601292J326833l7350J379765L826131
39536B1217456K462054l165037p042045m612102L24979P18405l480838n318611
39528A104261j177417M220183N050423J939719q34362j830276k125888j355610
39520D991033J358697M053136L876448J702042Q61477J726453J487741o78466
39512A9378561k196536j521261l57238k53900j53301J038299K001309J052207
39504A8988140j070280k242108j789771r33575q64833j237392o44169J337841
39496A1543853K771727J259597k347013m107034k213592K00713k54307k065535
$$ plain form
39488 4788409 3134799 3712871 5013205 5245449 5464356 6967496 7987725 6318923 3606615
39479 3606615 3403928 5730512 7090785 5825199 4153165 4309447 5445049 5467122 3970183
39470 3970183 2214789 1465480 2127647 3647996 4886846 5264244 5425667 5998166 6242748
39461 6242748 5228479 3847056 3900099 5143368 5025792 2075007 -1695270 -2776329 -176492
39452 -176492 3301567 4080627 1985857 746568 3582594 8835669 11561865 9567685
39444 9567685 5975160 4949848 6593945 7471431 5095268 526153 -2976030 -3183337
39436 -3183337 -1298117 -1050863 -4258442 -7823579 -7374366 -3496534 -1038551 -1886724 -2583560
39427 -2583560 -707039 807574 -1180688 -4236617 -3752425 298683 3885841 4413021
$$ packed form
39488D788409j653610N78072J300334K32244K18907J503140J020229j668802k712308
39479C606615k02687K326584J360273j265586j672034J56282J135602K2073j496939
39470C970183j755394p49309O62167J520349J238850L77398J61423N72499K44582
39461F242748j014269j381423N3043J243269j17576k950785l770277j081059K599837
39452a76492L478059P79060k094770j239289K836026N253075K726196j994180
39444I567685l592525j025312J644097Q77486k376163m569115l502183k07307
39436c183337J885220K47254l207579l565137M49213L877832K457983q48173o96836
39427b583560J876521J514613j988262l055929M84192M051108L587158N27180
$$ plain form
39419 4413021 2266239 -1278944 -4207814 -3586358 1152915 6148755 7495227 5927562
39411 5927562 4157483 2254589 -420191 -1703561 -155611 524665 -3386350 -8124156
39403 -8124156 -6894659 -808104 2074764 -1144496 -4573704 -3496124 -685626 -36161
39395 -36161 -454599 140487 156086 -2094174 -4253425 -3421412 -757977 757964 589787
39386 589787 -8332 -427253 -387088 270949 56842 -2724339 -5833181 -4514321 1294227
39377 1294227 5828157 5862422 5106207 6963492 8213616 4798026 -412144 -1517332 1471231
39368 1471231 3386513 2014580 47877 -291394 396278 1671210 4195061 7055891
39360 7055891 7647359 5188208 1939394 160224 -437678 -1675833 -4377915 -7089097
$$ packed form
39419D413021k146782l545183k928870O21456M739273M995840J346472j567665
39411E927562j770079j902894k674780j283370J547950O80276l911015m737806
39403h124156J229497O086555K882868l219260l429208J077580K810498O49465
39395c6161m18438N95086J5599k250260k159251Q32013K663435J515941j68177
39386E89787n98119m18921M0165O58037k14107k781181l108842J318860N808548
39377A294227M533930L4265p56215J857285J250124l415590n210170j105188K988563
39368A471231J915282j371933j966703l39271O87672J274932K523851K860830
39360G055891N91468k459151l248814j779170n97902j238155k702082k711182
$$ plain form
39352 -7089097 -7216199 -4119627 -706533 -155643 -1410110 -781740 1997684 3285519 1939258
39343 1939258 1570243 4266157 6675072 5543125 3052422 2890136 4597023 5771449
39335 5771449 6496601 7348681 6268265 2105308 -1562892 -1030372 1598166 1920055 259781
39326 259781 73526 1571644 2304907 2192137 2559110 2055432 -865914 -3374791 -2260327
39317 -2260327 -499433 -2904882 -6883621 -5573421 385960 2965888 -459222 -3246330
39309 -3246330 -804461 2617985 2205434 135734 242185 1537155 2033573 3395693 6583127
39300 6583127 7933371 5123283 2530755 4707334 8350809 7242215 2342273 212479
39292 212479 2978439 6537168 8401072 10952691 15664722 19181121 17465849 10998201
$$ packed form
39352g089097j27102L096572L413094N50890j254467O28370K779424J287835j346261
39343A939258l69015K695914K408915j131947k490703j62286J706887J174426
39335E771449P25152Q52080j080416m162957l668200N32520K628538L21889j660274
39326B59781j86255J498118P33263j12770L66973n03678k921346k508877J114464
39317b260327J760894k405449l978739J310200N959381K579928l425110k787108
39309c246330K441869L422446m12551k069700J06451J294970M96418J362120L187434
39300F583127J350244k810088k592528K176579L643475j108594m899942k129794
39292B12479K765960L558729J863904K551619M712031L516399j715272o467648
$$ plain form
39284 10998201 4271279 1748149 4536215 9314232 10841236 7354089 2767426 1584214
39276 1584214 3013860 3010568 909633 244077 3176329 7837998 11615497 13581209 12934405
39267 12934405 8671056 2434065 -1377288 -467642 2644474 4662661 5901413 8171864
39259 8171864 10343446 9502169 5993100 3994499 6293725 10770485 13160707 11781598
39251 11781598 8517274 6359437 6982784 9692998 11698412 10363101 6315609 3319835
39243 3319835 3709350 5159484 4065336 1084120 264755 2790171 5163828 4727968 3504374
39234 3504374 4340435 6171322 6037684 3575662 338399 -3403978 -7549425 -9397882
39226 -9397882 -6277031 -372675 3253388 3436899 3563935 5248637 5998437 4376831 2897046
$$ packed form
39284A0998201o726922k523130K788066M778017J527004l487147m586663j183212
39276A584214J429646l292k100935o65556K932252M661669L777499J965712o46804
39267A2934405m263349o236991l811353R09646L112116K018187J238752K270451
39259H171864K171582q41277l509069j998601K299226M476760K390222j379109
39251A1781598l264324k157837O23347K710214K005414j335311m047492k995774
39243C319835L89515J450134j094148k981216q19365K525416K373657m35860j223594
39234C504374Q36061J830887j33638k462022l237263l742377m145447j848457
39226i397882L120851N904356L626063J83511J27036J684702P49800j621606j479785
$$ plain form
39217 2897046 3523844 4270446 3118437 1972032 3407684 6059687 6686774 5022721 3326247
39208 3326247 2480678 1663342 928074 1142226 1835237 1584814 107457 -2126408 -5552774
39199 -5552774 -10350335 -14182006 -13765014 -8867722 -2718470 1660729 3758349 4350474
39191 4350474 4036208 3394321 2979213 2628930 1854283 1066783 1310087 2649011 3885664
39182 3885664 4055147 3347936 2495008 2081431 2544999 3998252 5645143 5804505 3134063
39173 3134063 -1663317 -5412243 -4896558 -684370 2659810 2026749 363236 2934471
39165 2934471 9433901 13645737 11752723 6925354 3742006 2050545 -510253 -3286745
39157 -3286745 -3948345 -2823297 -1987103 -1729405 -1563677 -2786260 -5800879 -6723631 -1800840
$$ packed form
39217B897046O26798P46602j152009j146405J435652K652003O27087j664053j696474
39208C326247q45569q17336p35268K14152O93011k50423j477357k233865l426366
39199e552774m797561l831671M16992M897292O149252M379199K097620N92125
39191D350474l14266o41887m15108l50283p74647p87500K43304J338924J236653
39182C885664J69483p07211q52928m13577M63568J453253J646891J59362k670442
39173C134063m797380l748926N15685M212188L344180o33061j663513K571235
39165B934471O499430M211836j893014m827369l183348j691461k560798k776492
39157c286745o61600J125048Q36194K57698J65728j222583l014619r22752M922791
$$ plain form
39148 -1800840 5686436 8398695 4872677 1094338 1415988 3327049 2892686 231918
39140 231918 -2834454 -5912821 -7897514 -6044027 -756712 2424216 -303969 -5136354
39132 -5136354 -5984093 -3239080 -2411699 -5436375 -8328756 -7443534 -3745112 -162262 1790315
39123 1790315 1828297 349049 -782474 596320 3691039 4696423 1431274 -3429989
39115 -3429989 -5183157 -2354734 1934675 3497495 1326097 -1631205 -1853854 724574
39107 724574 2845358 2320715 804609 984565 2571793 3243216 2563918 2321502 3308916
39098 3308916 4544214 5808848 8050591 10569450 10719000 7777224 4552231 3402462
39090 3402462 2959581 909304 -1992487 -3232727 -2398217 -1000975 566615 3034685
$$ packed form
39148a800840P487276K712259l526018l778339L21650J911061m34363k660768
39140B31918l066372l078367j984693J853487N287315L180928k728185m832385
39132e136354q47739K745013Q27381l024676k892381Q85222L698422L582850J952577
39123A790315L7982j479248j131523J378794L094719J005384l265149m861263
39115c429989j753168K828423M289409J562820k171398k957302k22649K578428
39107G24574K120784n24643j516106J79956J587228O71423o79298k42416R87414
39098C308916J235298J264634K241743K518859J49550k941776l224993j149769
39090C402462m42881k050277k901791j240240Q34510J397242J567590K468070
$$ plain form
39082 3034685 5624387 6326555 5176301 4755300 6524160 8452345 7341252 2516144
39074 2516144 -3343191 -6431972 -5126741 -2037041 -2093627 -7028991 -12415772 -12206969 -5683217
39065 -5683217 2409745 7863304 9888552 8491346 3634598 -1651560 -1939985 3844658
39057 3844658 9720412 9786159 5084869 178681 -3769130 -8135129 -11856386 -12700510 -12019312
39048 -12019312 -12808423 -13801675 -11051266 -5216159 -1452696 -1442316 -1495797 54912 -117320
39039 -117320 -3303159 -4875708 -1474543 3093359 3890247 2443085 2963839 4495921 2820433
39030 2820433 -1982335 -5746389 -6751173 -6542964 -5077460 -743353 4588149 5876551
39022 5876551 1472302 -4679039 -8208478 -8032052 -4636884 963563 5611446 5673700 2003998
$$ packed form
39082C034685K589702P02168j150254m21001J768860J928185j111093m825108
39074B516144n859335l088781J305231L089700n6586m935364n386781K08803O523752
39065e683217Q092962N453559K025248j397206m856748n286158k88425N784643
39057C844658N875754O5747m701290m906188l947811m365999l721257q44124O81198
39048a2019312p89111r93252K750409N835107L763463J0380n3481J550709j72232
39039a17320l185839j572549L401165M567902P96888j447162N20754J532082j675488
39030B820433m802768l764054j004784K08209J465504M334107N331502J288402
39022E876551m404249o151341l529439J76426L395168N600447M647883O2254l669702
$$ plain form
39013 2003998 -417276 618758 1657183 -582610 -4184558 -5474479 -4448852 -3729272
39005 -3729272 -4146798 -4252222 -3042224 -929889 1218050 2522337 2410901 1442953 805505
38996 805505 598581 124865 -72199 1201360 2831506 1881875 -2079958 -5994457 -7679664
38987 -7679664 -8148618 -8416066 -7566619 -5828457 -5817022 -8066502 -8835397 -5647048 -1885247
38978 -1885247 -2066117 -5141527 -6672054 -5626383 -4576145 -4422472 -3394013 -873207
38970 -873207 1647423 3299650 4275504 3926294 1678474 -526862 -12205 2551217 3891901
38961 3891901 2799036 1065679 2039 -972971 -2341392 -3874655 -5742497 -7556982
38953 -7556982 -7067568 -2995153 1591652 2373717 -230353 -1926448 -858581 1149450
$$ packed form
39013B003998k421274J036034J038425k239793l601948j289921J025627P19580
39005c729272m17526j05424J209998K112335K147939J304287j11436r67948o37448
38996H05505k06924m73716j97064J273559J630146r49631l961833l914499j685207
38987g679664m68954k67448Q49447J738162J1435k249480p68895L188349L761801
38978a885247j80870l075410j530527J045671J050238J53673J028459K520806
38970h73207K520630J652227R75854l49210k247820k205336N14657K563422J340684
38961C891901j092865j733357j063640r75010j368421j533263j867842j814485
38953g556982M89414M072415M586805P82065k604070j696095J067867K008031
$$ plain form
38945 1149450 3241474 6418857 9318812 8260109 2987189 -2058569 -3666306 -2918866
38937 -2918866 -1387812 780960 1616492 -2143238 -8759234 -11384371 -7621644 -3679544
38929 -3679544 -4825093 -7259637 -5095160 -535604 -61828 -3659878 -5315433 -2716191
38921 -2716191 648023 2551548 4327787 5637683 3546147 -1459239 -4199556 -2032132
38913 -2032132 1165861 819271 -2333310 -4797434 -5804186 -7205914 -9745223 -11938333
38905 -11938333 -11779530 -8267669 -2354504 2869099 4388700 2413752 61869 -299788
38897 -299788 1121945 3123060 4646308 4383992 1883906 -660462 -525044 1205359 575899
38888 575899 -3117278 -5646491 -3930257 -420853 937585 167087 -266767 -56999 -691246
$$ packed form
38945A149450K092024L177383K899955j058703n272920n045758j607737P47440
38937b918866J531054K168772Q35532l759730o615996k625137L762727L942100
38929c679544j145549k434544K164477M559556M73776l598050j655555K599242
38921b716191L364214J903525J776239J309896k091536n005386k740317K167424
38913b032132L197993l46590l152581k464124j006752j401728k539309k193110
38905a1938333J58803L511861N913165N223603J519601j974948k351883l61657
38897b99788J421733K001115J523248k62316k500086k544368J35418J730403o29460
38888E75899l693177k529213J716234L509404J358438p70498m33854K09768o34247
$$ plain form
38879 -691246 -1875975 -1763021 -397200 -109426 -2167436 -4875512 -5292516 -1936424 3696937
38870 3696937 7480281 5736031 -640512 -6287802 -7078627 -4384492 -2009409 -775419
38862 -775419 984594 2949760 2822376 1051465 1711355 6892680 12801923 13703725 8453988
38853 8453988 1305477 -2924824 -2859970 -311696 2183599 3194447 2793380 1865934 1037759
38844 1037759 225387 -864045 -2174352 -3431953 -4491918 -5255784 -5490049 -5035541 -4034846
38835 -4034846 -2706581 -1128785 388888 964534 -127072 -2198486 -3248317 -1835238
38827 -1835238 1447677 4727380 6517919 6035264 2837354 -2102366 -5260701 -3010230
38819 -3010230 3644540 8751679 7663084 2273998 -1875432 -2386775 -1321288 -670860
$$ packed form
38879f91246j184729J12954J365821K87774k058010k708076m17004L356092N633361
38870C696937L783344j744250o376543n647290p90825K694135K375083J233990
38862g75419J760013J965166j27384j770911O59890N181325N909243R01802n249737
38853H453988p148511m230301O4854K548274K495295J010848m01067r27446q28175
38844A037759q12372j089432j310307j257601j059965p63866k34265M54508J000695
38835d034846J328265J577796J517673N75646j091606k071414j049831J413079
38827a835238L282915L279703J790539m82655l197910m939720l158335K250471
38819c010230O654770N107139j088595n389086m149430n11343J065487O50428
$$ plain form
38811 -670860 30929 1091310 896039 -1523400 -4292010 -4944429 -3555034 -2011681 -1232021
38802 -1232021 -714454 -145048 153513 174785 356903 657425 410104 -551943 -1121677 105304
38792 105304 2797536 4388546 2787565 -426217 -1419830 434522 951670 -2866037 -7635123
38783 -7635123 -7999863 -4574426 -2783768 -4288268 -4983535 -2532166 -386766 -1850586
38775 -1850586 -5041451 -7082010 -8813063 -11146446 -10772783 -4957932 2020767 3133703
38767 3133703 -1751346 -5833870 -4749136 -1088025 747491 -286958 -2729025 -4879961
38759 -4879961 -5278202 -3939251 -3441243 -5579490 -7091179 -2936824 5550834 10496806
38751 10496806 7355523 766016 -2115096 -460895 1538378 2019808 2993470 5296738
$$ packed form
38811f70860P01789J060381j95271k419439k768610o52419J389395J543353P79660
38802a232021N17567N69406K98561K1272J82118L00522k47321r62047n69734J226981
38792A05304K692232J591010j600981l213782r93613J854352N17148l817707m769086
38783g635123l64740L425437J790658j504500o95267K451369K145400j463820
38775a850586l190865k040559j731053k333383L73663N814851O978699J112936
38767C133703m885049m082524J084734L661111J835516j034449k442067k150936
38759d879961l98241J338951M98008k138247j511689M154355Q487658M945972
38751A0496806l141283o589507k881112J654201J999273M81430R73662K303268
$$ plain form
38743 5296738 6101748 2763648 -2993088 -6546320 -5760003 -3527098 -3832834 -5947517 -5077760
38734 -5077760 233777 4582438 2754395 -2214802 -2898468 1680272 4841774 2515704
38726 2515704 -1258643 -1442738 862718 2111313 2569842 4124710 5164589 2964171
38718 2964171 -743828 -1748166 25728 755630 -684790 -1189933 771677 2162970
38710 2162970 1454 -4138453 -6294640 -4891323 -1822204 -83994 -1238031 -4036969
38702 -4036969 -5183780 -2867111 382525 325878 -3244819 -5921553 -4805023 -2430679
38694 -2430679 -2415326 -3551130 -1813261 2535255 4064088 -108489 -5135692 -4309356 1577237
38685 1577237 5037071 2461171 -621685 2344344 9045636 11276049 6527631 1305845
$$ packed form
38743E296738Q05010l338100n756736l553232P86317K232905l05736k114683Q69757
38734e077760N311537M348661j828043m969197o83666M578740L161502k326070
38726B515704l774347j84095K305456J248595M58529J554868J039879k200418
38718B964171l707999j004338J773894P29902j440420n05143J961610J391293
38710B162970k161516m139907k156187J403317L069119J738210j154037k798938
38702d036969j146811K316669L249636n6647l570697k676734J116530K374344
38694b430679J5353j135804J737869M348516J528833m172577n027203Q26336N886593
38685A577237L459834k575900l082856K966029O701292K230413m748418n221786
$$ plain form
38677 1305845 2008496 7225707 11383660 12128016 10769144 8172558 4141977 -272482
38669 -272482 -3118306 -3810719 -2979506 -1041156 1084318 1333486 -926587 -3071929 -2572964
38660 -2572964 -566529 904272 3178910 8184847 12707424 10893216 2859188 -4281539
38652 -4281539 -5316945 -2315553 478059 2329052 3824538 3280894 -657153 -5405874
38644 -5405874 -7095546 -5192069 -1697618 2245136 5914880 7142389 4522456 476815
38636 476815 -1149480 134916 1919638 3168047 4861097 6959741 7997318 7649951
38628 7649951 6899331 5853914 4243744 3633669 5720441 8516186 8117461 4861979 3576331
38619 3576331 6216391 8449556 6275107 2481742 2649780 6846116 9474348 6860462
$$ packed form
38677A305845P02651N217211M157953P44356j358872k596586m030581m414459
38669b72482k845824o92413Q31213J938350K125474K49168k260073k145342M98965
38660b572964K006435J470801K274638N005937M522577j814208q034028p140727
38652d281539j035406L001392K793612J850993J495486n43644l938047m748721
38644e405874j689672J903477L494451L942754L669744J227509k619933m045641
38636D76815j626295J284396J784722J248409J693050K098644J037577l47367
38628G649951p50620j045417j610170o10075K086772K795745l98725l255482j285648
38619C576331K640060K233165k174449l793365J68038M196336K628232k613886
$$ plain form
38611 6860462 1419773 -2231809 -2654725 -1953375 -2285529 -3294715 -2976712 -718058 1289454
38602 1289454 719743 -1328150 -1612596 176340 571802 -2007005 -3914194 -1518205 2669230
38593 2669230 3021448 -1299233 -5591269 -6457378 -5272093 -4238162 -2955099 -573637
38585 -573637 1695213 2255526 1256109 -517511 -2992167 -5613604 -6600725 -4908863 -1580082
38576 -1580082 1863546 4781959 6413654 5699637 3399581 2278491 3631344 5504430
38568 5504430 5795905 5006588 4341995 3541087 2710170 3820010 7569274 10803314 10183966
38559 10183966 6904815 4715003 4659986 4889740 4275336 2793894 -414439 -5567927 -9717225
38550 -9717225 -9679436 -6969193 -5821994 -6799777 -6737177 -4766804 -3391026 -3136988 -1538411
$$ packed form
38611F860462n440689l651582m22916P01350l32154j009186L18003K258654K007512
38602A289454n69711k047893k84446J788936L95462k578807j907189K395989M187435
38593B669230L52218m320681m292036q66109J185285J033931J283063K381462
38585e73637K268850N60313r99417j773620k474656k621437r87121J691862L328781
38576a580082L443628K918413J631695p14017k300056j121090J352853J873086
38568E504430K91475p89317o64593q00908q30917J109840L749264L234040o19348
38559A0183966l279151k189812n5017K29754o14404j481442l208333n153488m149298
38550i717225L7789K710243J147199r77783O2600J970373J375778K54038J598577
$$ plain form
38541 -1538411 1192424 907999 -3680772 -7889887 -7635404 -4549037 -1398507 2750958
38533 2750958 8584403 12274478 10638274 7235388 7437455 9780963 8410488 2680741
38525 2680741 -2123174 -3267021 -3331403 -3826089 -2350070 1877802 5120893 4526700 2039009
38516 2039009 253258 -1406842 -3354149 -2919646 1143531 4623605 3059978 -1306680
38508 -1306680 -2705240 -454771 837399 -747704 -1784506 51060 1865286 360877
38500 360877 -3039629 -4955352 -5136153 -5401826 -5430286 -3369736 44230 1533370 -174798
38491 -174798 -2589737 -2982569 -1499355 69327 800392 972690 1229090 2043854 2871027
38482 2871027 1853437 -1713152 -4665548 -2712926 3114153 6139671 2487503 -3191592
$$ packed form
38541a538411K730835k84425m588771m209115K54483L086367L150530M149465
38533B750958N833445L690075j636204l402886K02067K343508j370475n729747
38525B680741m803915j143847o4382m94686J476019M227872L243091n94193k487691
38516B039009j785751j660100j947307M34503M063177L480074j563627m366658
38508a306680j398560K250469J292170j585103j036802J835566J814226j504409
38500C60877l400506j915723j80801k65673k8460K060550L413966J489140j708168
38491a74798k414939l92832J483214J568682P31065J72298K56400Q14764Q27173
38482B871027j017590l566589k952396J952622N827079L025518l652168n679095
$$ plain form
38474 -3191592 -3843783 467531 3421545 1535370 -2297385 -4235707 -3740466 -1466876
38466 -1466876 2578130 6737539 7338699 3346915 -1338097 -2760654 -1632443 -657604
38458 -657604 228603 2487140 4680788 3622587 -513128 -3674483 -2986157 209953 2814214
38449 2814214 3309426 2125908 547579 -85799 479563 598569 -1584768 -5218576 -7015459
38440 -7015459 -5303451 -2554773 -2456518 -4900768 -5552170 -1303916 4775732 5929714 -128384
38431 -128384 -7402599 -8157569 -2342203 2546575 1251837 -3014567 -3886530 -435084 2682161
38422 2682161 2182637 -180670 -1081416 -102585 438116 -941324 -2510484 -783216 5393582
38413 5393582 12532680 15461801 12782885 8067911 5401635 5496577 6628468 7037352 5272738
$$ packed form
38474c191592o52191M311314K954014j886175l832755j938322M95241K273590
38466a466876M045006M159409O01160l991784m685012j422557J128211R74839
38458f57604Q86207K258537K193648j058201m135715l161355O88326L196110K604261
38449B814214M95212j183518j578329o33378N65362J19006k183337l633808j796883
38440g015459J712008K748678R8255k444250o51402M248254O079648J153982o058098
38431a28384p274215p54970N815366M888778j294738m266404q71963L451446L117245
38422B682161m99524k363307r00746R78831N40701j379440j569160J727268O176798
38413E393582P139098K929121k678916m714974k666276R4942J131891M08884j764614
$$ plain form
38404 5272738 653995 -4789485 -7045331 -4890011 -1905986 -1521782 -2321501 -1234549
38396 -1234549 701223 -321233 -4704634 -8502843 -8731617 -6413150 -3950228 -2283541
38388 -2283541 -1422662 -1655576 -3232959 -5761031 -8031844 -8172334 -5264999 -1593808 -1089569
38379 -1089569 -3962836 -5491877 -2459975 2183451 4289820 4837832 6691769 7957463
38371 7957463 4623205 -1772213 -5623294 -5841890 -6279245 -7451791 -5141528 1190896
38363 1190896 5815202 5540266 4713300 7691481 12025126 13397101 12254878 10850813
38355 10850813 8283972 3690051 439726 1531766 3869767 2807413 -124999 36844
38347 36844 3109925 4296631 2653928 2719753 6815123 11058884 10885837 6681167 2156458
$$ packed form
38404E272738m618743n443480k255846K155320K984025L84204p99719J086952
38396a234549J935772j022456m383401l798209k28774K318467K462922J666687
38388b283541Q60879k32914j577383k528072k270813j40490K907335L671191N04239
38379a089569k873267j529041L031902M643426K106369N48012J853937J265694
38371G957463l334258o395418l851081k18596m37355j172546K310263O332424
38363A190896M624306k74936q26966K978181M333645J371975j142223j404065
38355A0850813k566841m593921l250325J092040K338001j062354k932412J61843
38347C6844L073081J186706j642703O5825M095370M243761j73047m204670m524709
$$ plain form
38338 2156458 551 626434 3014431 5507296 7025035 7764019 7683375 5356958 409084
38329 409084 -4053035 -4407953 -1522049 95385 -1915042 -5421231 -7200600 -6185504
38321 -6185504 -3335553 -583360 197336 -836938 -1220657 115784 469025 -2290729 -4933987
38312 -4933987 -2931253 1915668 3399294 409405 -1469506 863310 3233798 1295282
38304 1295282 -2769141 -4192567 -2140743 1260107 4751603 7297904 7133176 5011621
38296 5011621 4788522 7036838 6349676 -155601 -6189178 -4856308 -149410 -1378085
38288 -1378085 -8097367 -10411742 -4891732 -51517 -2545489 -7154201 -6333540 -2193927
38280 -2193927 -1468103 -3921284 -4115677 -1589453 -887053 -2632019 -2527813 334008 1434209
$$ packed form
38338B156458k155907O25883K387997K492865J517739P38984q0644k326417m947874
38329D09084m462119l54918K885904J617434k010427l506189j779369J015096
38321f185504K849951K752193P80696j034274l83719J336441L53241k759754k643258
38312d933987K002734M846921J483626k989889j878911K332816K370488j938516
38304A295282m064423j423426K051824L400850L491496K546301j64728k121555
38296E011621k23099K248316o87162o505277o033577J332870M706898j228675
38288a378085o719282k314375N520010M840215k493972m608712Q20661M139613
38280b193927P25824k453181j94393K526224P02400j744966J04206K861821J100201
$$ plain form
38271 1434209 -1156386 -2962526 -62392 5052507 7686230 7281917 6490474 6618383 6722268
38262 6722268 5442212 2066875 -2420097 -4663895 -2057622 2796198 4295031 1534338
38254 1534338 -465328 1116026 2644590 1026425 -265370 2887535 7477585 7631084
38246 7631084 3939375 2088446 3614514 4506379 2733636 943171 929624 1025845 299133
38237 299133 376393 1605684 1934244 999247 765992 690263 -2614698 -8629531 -11106007
38228 -11106007 -6446529 669179 4116116 4649871 6413641 8533377 6577945 1237124
38220 1237124 -824030 3950104 10683889 12054009 6808449 216139 -2310099 -68690
38212 -68690 3766372 5947820 5296876 1913884 -3672593 -9263152 -10617712 -5449422 2299208
$$ packed form
38271A434209k590595j806140K900134N114899K633723m04313p91443J27909J03885
38262F722268j280056l375337m486972k243798K606273M853820J498833k760693
38254A534338j999666J581354J528564j618165j291795L152905M590050J53499
38246G631084l691709j850929J526068Q91865j772743j790465j3547R6221p26712
38237B99133P7260J229291L28560r34997k33255p5729l304961o014833k476476
38228a1106007M659478P115708L446937N33755J763770K119736j955432n340821
38220A237124k061154M774134O733785J370120n245560o592310k526238K241409
38212f8690L835062K181448o50944l382992n586477n590559j354560N168290P748630
$$ plain form
38203 2299208 5514961 2210712 -2365016 -3201457 -1487210 -776124 -950297 96103 1488144
38194 1488144 820786 -879687 -504691 1340571 839903 -2278565 -3480402 -662884 1868480
38185 1868480 -305934 -4887466 -6211215 -3396898 -926327 -1649235 -3351835 -3232572
38177 -3232572 -2259890 -2768429 -4046920 -3464709 -1181424 -446239 -2595385 -4643437 -3573680
38168 -3573680 -826417 15827 -1251986 -1246833 1759622 5154551 5510841 2968982 871512
38159 871512 1817078 4715645 5525245 1390698 -5308825 -8359692 -4847165 579804 1343897
38150 1343897 -2357795 -4391560 -1913417 1044019 496910 -1692158 -1705348 345214 1893820
38141 1893820 2393458 2573892 1426553 -2074580 -5602229 -5760868 -3102548 -1223108 -1109070
$$ packed form
38203B299208L215753l304249m575728q36441J714247P11086j74173J046400J392041
38194A488144o67358j700473L74996J845262n00668l118468j201837K817518K531364
38185A868480k174414m581532j323749K814317K470571p22908j702600J19263
38177c232572R72682n08539j278491N82211K283285P35185k149146k048052J069757
38168c573680K747263Q42244j267813N153L006455L394929L56290k541859k097470
38159H71512R45566K898567Q09600m134547o699523l050867L512527N426969P64093
38150A343897l701692k033765K478143K957436n47109k189068j3190K050562J548606
38141A893820M99638J80434j147339l501133l527649j58639K658320J879440J14038
$$ plain form
38132 -1109070 -30970 3456892 6776713 6909950 4291950 1602457 335001 122117
38124 122117 459091 1478123 3063356 4325292 4537542 4137741 3978236 3686365 2122275
38115 2122275 37149 384683 4146232 7513517 6144331 1254639 -1967364 -1531393
38107 -1531393 -215866 103095 968467 2968949 3669523 2222186 1616981 3399396 4316856
38098 4316856 1817759 -921665 280158 3960001 5552764 4078836 1831045 -419688
38090 -419688 -3287539 -5586320 -5821297 -5431242 -6270359 -6531876 -3782807 -337947 -326109
38081 -326109 -2601902 -2249633 1439225 4400644 5220282 6876725 9995318 10526300 6509748
38072 6509748 1887553 631348 1525326 2031029 3387088 7829629 13351227 15394235
$$ packed form
38132a109070J078100L487862L319821J33237k618000k689493j267456k12884
38124A22117L36974J019032J585233J261936K12250l99801j59505k91871j564090
38115B122275k085126L47534L761549L367285j369186m889692l222003M35971
38107a531393J315527L18961Q65372K000482P00574j447337o05205J782415R17460
38098D316856k499097k739424J201823L679843J592763j473928k247791k250733
38090d19688k867851k298781k34977L90055q39117k61517K749069L444860J1838
38081c26109k275793L52269L688858K961419Q19638J656443L118593N30982m016552
38072F509748m622195j256205Q93978N05703J356059M442541N521598K043008
$$ plain form
38064 15394235 12781119 8793751 6712339 6705647 7221250 7588071 8401852 9892633 10763040
38055 10763040 9418407 6319441 3859053 3363859 3776437 4205399 5641830 8406293
38047 8406293 10162807 9089521 7136118 7108843 8108329 7137094 3898467 621520 -1584042
38038 -1584042 -2617943 -1020845 4136416 9918279 12345278 11916619 12068793 12876146 11184911
38029 11184911 6898990 4009891 4624229 6530289 7530181 7807111 7100008 3944023 -965776
38020 -965776 -4542763 -5604759 -5913828 -6365919 -5978366 -5139212 -5740716 -7487432 -8139533
38011 -8139533 -7707424 -8016594 -8161719 -5610886 -1943663 -1419105 -3131106 -1392352 4353328
38002 4353328 7175135 3244210 -2029556 -2529805 -13284 628555 -499977 -111091 2275695
$$ packed form
38064A5394235k613116l987368k081412o692N15603L66821Q13781J490781Q70407
38055A0763040j344633l098966k460388m95194M12578M28962J436431K764463
38047H406293J756514j073286j953403k7275R99486r71235l238627l276947k205562
38038a584042j033901J597098N157261N781863K426999m28659J52174Q07353j691235
38029A1184911m285921k889099O14338J906060R99892K76930p07103l155985m909799
38020i65776l576987j061996l09069m52091L87553Q39154o01504j746716o52101
38011h139533M32109l09170j45125K550833L667223N24558j712001J738754N745680
38002D353328K821807l930925n273766n00249K516521O41839j128532L88886K386786
$$ plain form
37993 2275695 4925569 7283062 8867133 7976376 4798264 2283732 1157128 -1438000
37985 -1438000 -5336662 -5036763 1708614 8651875 9809326 8107624 8938422 10106067
37977 10106067 6041636 -1427708 -4975329 -2986766 -1199138 -3441530 -7364771 -9535342
37969 -9535342 -8996083 -5527303 397193 5559722 6495567 4307471 3123568 4179365
37961 4179365 5308381 5413819 5144198 3951005 966647 -1808666 -1598556 484731 1131396
37952 1131396 257865 167429 409895 -1218312 -3231502 -1889716 1708807 1877181 -3146059
37943 -3146059 -8307811 -9054586 -6720862 -4631079 -3217617 -1522049 -111104 24377
37935 24377 -853248 -2285684 -4234905 -5673180 -4841527 -1690264 2035701 5274343 7754024
$$ packed form
37993B275695K649874K357493J584071q90757l178112k514532j126604k595128
37985a438000l898662K99899O745377O943261J157451j701702Q30798J167645
37977A0106067m064431p469344l547621J988563J787628k242392l923241k170571
37969i535342N39259L468780N924496N162529R35845k188096j183903J055797
37961D179365J129016J05438k69621j193193k984358k775313K10110K083287O46665
37952A131396q73531r0436K42466j628207k013190J341786L598523J68374n023240
37943c146059n161752p46775K333724K089783J413462J695568J410945J35481
37935B4377q77625j432436j949221j438275Q31653L151263L725965L238642K479681
$$ plain form
37926 7754024 7993592 4616216 -161331 -2051148 -478044 662186 -994543 -3060816
37918 -3060816 -2663469 -698706 154174 -707189 -1688477 -966088 2501322 8024921 12400938
37909 12400938 12135019 7396319 1986941 -1077189 -1822780 -933670 1805427 5319261
37901 5319261 6379602 3468795 -43417 705501 5636894 8874040 5465433 -2018896
37893 -2018896 -5592912 -1265742 5704507 7374880 3347875 309482 1753354 3812808
37885 3812808 3062091 2296050 4328745 5416918 1001151 -5660309 -7420424 -3693458
37877 -3693458 -257570 148159 251805 1625935 2383691 2236165 3722789 6917112 8043720
37868 8043720 4934621 -239147 -4373680 -5614825 -2535448 3861406 7736878 3992934
$$ packed form
37926G754024K39568l377376m777547j889817J573104J140230j656729k066273
37918c060816L97347J964763Q52880q61363r81288P22389L467410N523599M376017
37909A2400938k65919m738700n409378l064130p45591Q89110K739097L513834
37901E319261J060341k910807l512212P48918M931393L237146l408607p484329
37893b018896l574016M327170O970249J670373m027005l038393J443872K059454
37885C812808p50717p66041K032695J088173m415767o661460j760115L726966
37877c693458L435888M05729J03646J374130P57756j47526J486624L194323J126608
37868H043720l109099n173768m134533j241145L079377O396854L875472l743944
$$ plain form
37860 3992934 -3596278 -6332068 -3224034 -2212119 -6990304 -10751534 -7088352 62519
37852 62519 2881384 547289 -2262731 -3597047 -4817360 -5535723 -3727843 -65178 2031559
37843 2031559 457792 -3655302 -7022109 -6021481 159888 6900694 7885145 3161138
37835 3161138 -279977 1901502 5571134 5045605 1462883 -213810 845073 1411187
37827 1411187 134949 -1353295 -2113387 -2600274 -2468277 -1081780 425452 396853 -810943
37818 -810943 -1775818 -2239466 -2326078 -1368845 106199 -617697 -4425308 -7220277 -4317342
37809 -4317342 3091709 9112508 10112604 7621827 4834983 3099791 2029492 1034451
37801 1034451 347238 1294497 4918392 9732289 12255446 10736178 6881191 3102298
$$ packed form
37860C992934p589212k735790L108034J011915m778185l761230L663182P150871
37852F2519K818865k334095k810020j334316j220313p18363J807880L662665K096737
37843B031559j573767m113094l366807J000628O181369O740806R84451m724007
37835C161138l441115K181479L669632n25529l582722j676693J058883N66114
37827A411187j276238j488244p60092m86887J31997J386497J507232k8599j207796
37818h10943r64875m63648q6612R57233J475044p23896l807611k794969K902935
37809d317342P409051O020799J000096k490777k786844j735192j070299r95041
37801A034451o87213R47259L623895M813897K523157j519268l854987l778893
$$ plain form
37793 3102298 -60976 -2870368 -4924922 -5911545 -5788326 -3519714 1745976 7541199
37785 7541199 9445694 6764449 3321286 1357637 -1065934 -4651457 -5753567 -2038080
37777 -2038080 3016044 5168096 5261294 6029166 6726952 5456417 3529022 2619260 526419
37768 526419 -4883821 -9875779 -8672804 -1760201 4795837 7275789 6727145 4597214
37760 4597214 1155736 -2041095 -2884057 -2103499 -2104006 -2726308 -1904765 102534 1217697
37751 1217697 1813608 4229416 7978984 9482457 7181551 3696050 2304994 3634187
37743 3634187 5789827 5887780 2322973 -2691626 -4580685 -2316581 -169135 -1142945 -2458037
37734 -2458037 -1210874 -159478 -2564790 -5368364 -4162588 -1474094 -2361411 -4558945
$$ packed form
37793C102298l163274k809392k054554r86623J23219K268612N265690N795223
37785G541199J904495k681245l443163j963649k423571l585523j102110L715487
37777b038080N054124K152052R3198P67872O97786j270535j927395r09762k092841
37768E26419n410240m991958J202975O912603O556038K479952n48644k129931
37760D597214l441478l196831q42962P80558n07o22302Q21543K007299J115163
37751A217697N95911K415808L749568J503473k300906l485501j391056J329193
37743C634187K155640R7953l564807n014599j889059K264104K147446r73810j315092
37734b458037J247163J051396k405312k803574J205776K688494q87317k197534
$$ plain form
37726 -4558945 -1909428 4058981 5836564 2991656 3069985 7907442 9731865 4597413
37718 4597413 -331859 1547661 6032930 6255117 3812666 4226202 6868743 7259159 5433401
37709 5433401 4519306 3794978 303921 -4488279 -6292673 -5097756 -4628650 -5488016 -4585152
37700 -4585152 -1136090 2119584 3761042 4723043 4313394 490865 -4809221 -5806580 -684123
37691 -684123 4898081 5113395 1622836 344922 2646410 4036490 1511628 -1916390
37683 -1916390 -1981591 456477 1244997 -99072 221940 2991120 2975965 -3058456 -9116738
37674 -9116738 -6711025 2620798 8290416 4978030 -701378 -699233 3386019 4659743 1987893
37665 1987893 523946 3108452 6976241 8886443 8781002 7773399 6479689 6353465
$$ packed form
37726d558945K649517N968409J777583k844908P8329M837457J824423n134452
37718D597413m929272J879520M485269K22187k442451M13536K642541L90416j825758
37709E433401r14095p24328l491057m792200j804394J194917M69106q59366R02864
37700d585152L449062L255674J641458R62001m09649l822529n300086r97359N122457
37691f84123N582204K15314l490559j277914K301488J390080k524862l428018
37683a916390o5201K438068P88520j344069L21012K769180j5155o034421o058282
37674i116738K405713R331823N669618l312386n679408K145M085252J273724k671850
37665A987893j463947K584506L867789J910202j05441j007603j293710j26224
$$ plain form
37657 6353465 9219769 13896752 15974676 12917089 7591266 4756765 5215718 5622737
37649 5622737 3793942 1850507 2926488 6354861 8453928 7921325 7738892 10410663
37641 10410663 13720985 13751661 10501833 7349655 5788583 4249552 2046302 726234
37633 726234 760762 452445 -594387 -215740 2512394 5300474 6262634 6540609 7363615
37624 7363615 7554186 6398896 6060227 8104606 10067172 8803922 5437120 3655711
37616 3655711 4461789 5752838 6021862 5442713 4157031 2355592 1326245 1768999 1947918
37607 1947918 269970 -1276002 532458 4904956 7523781 6355363 3819486 2716590
$$ packed form
37657F353465K866304M676983K077924l057587n325823k834501M58953M07019
37649E622737j828795j943435J075981L428373K099067n32603j82433K671771
37641A0410663L310322L0676l249828l152178j561072j539031k203250j320068
37633G26234L4528l08317j046832L78647K728134K788080R62160K77975Q23006
37624G363615J90571j155290l38669K044379J962566j263250l366802j781409
37616C655711Q06078J291049K69024n79149j285682j801439j029347M42754J78919
37607A947918j677948j545972J808460M372498K618825j168418k535877j102896
$$ [...]
##END NTUPLES=NMR SPECTRUM
##END=
