##TITLE=31Pdec_SR166Et_TFA
 DMSO-d6, 64 sc
 18.4.2023
##JCAMPDX= 6.0         $$ Bruker NMR JCAMP-DX V2.0
##DATA TYPE= NMR SPECTRUM
##DATA CLASS= NTUPLES
##ORIGIN= UXNMR, Bruker Analytische Messtechnik GmbH
##OWNER= root
$$ XWIN-NMR		Version 3.5
$$ Tue Apr 18 13:53:24 2023 Russian Standard Time (UT+4h)  she@DPX200
##.OBSERVE FREQUENCY= 81.013821
##.OBSERVE NUCLEUS= ^31P
##.ACQUISITION MODE= SIMULTANEOUS
##.ACQUISITION SCHEME= undefined
##.AVERAGES= 64
##.DIGITISER RES= 16
##SPECTROMETER/DATA SYSTEM= spect
##.PULSE SEQUENCE= zgpg30
##.SOLVENT NAME= DMSO
##.SHIFT REFERENCE= (INTERNAL, DMSO, 0, 248.564)
##AUDIT TRAIL= $$ (NUMBER, WHEN, WHO, WHERE, WHAT)
$$ ##TITLE= Audit trail, XWIN-NMR		Version 3.5
$$ ##JCAMPDX= 5.01
$$ ##ORIGIN= Bruker BioSpin GmbH
$$ ##OWNER= she
$$ F:/spectra/data/she/nmr/P31/1/pdata/1/auditp.txt
$$ ##AUDIT TRAIL=  $$ (NUMBER, WHEN, WHO, WHERE, WHAT)
(   1,<2023-04-18 13:52:33.07 +0400>,<she>,<DPX200>,
      <continue with go, POWCHK disabled, PULCHK disabled
       configuration hash MD5:
       00 E9 B6 7A A2 85 ED C7 34 08 36 98 17 FE 4E 26
       data hash MD5: 32K
       A2 70 A6 21 B7 99 E9 88 74 B5 85 25 31 E3 79 AB>)
(   2,<2023-04-18 13:52:35.85 +0400>,<she>,<DPX200>,
      <Start of raw data processing
       efp BC_mod = 2 LB = 1 FT_mod = 6 PKNL = 1 PHC0 = -11184.66 PHC1 = 535.8849 SI = 64K 
       data hash MD5: 64K
       01 7C 1B 92 D1 BF 9E DC 94 74 F4 18 8D E5 0A D2>)
(   3,<2023-04-18 13:52:49.62 +0400>,<she>,<DPX200>,
      <pk PHC0 = 4.942758 PHC1 = 0 
       data hash MD5: 64K
       E1 2F 7C 2F 8E BA F3 22 FB C8 CC E0 A0 77 9E 3B>)
$$ ##END=
$$ 
$$ hash MD5
$$ 10 08 77 B5 12 F7 69 75 54 7E F3 A2 81 8B B4 56
##$RELAX= 
##$RELAX= 
##$RELAX= 
##$RELAX= 
##$RELAX= 
##$RELAX= 
##$RELAX= 
##$RELAX= 
##$RELAX= 
$$ Bruker specific parameters
$$ --------------------------
##$DU= <F:/spectra>
##$EXPNO= 1
##$NAME= <P31>
##$PROCNO= 1
##$TYPE= <nmr>
##$USER= <she>
##$AMP= (0..31)
100 100 100 100 100 100 100 100 100 100 100 100 100 100 100 100 100 100 
100 100 100 100 100 100 100 100 100 100 100 100 100 100 
##$AQSEQ= 0
##$AQ_mod= 1
##$AUNM= <au_zg>
##$AUTOPOS= <>
##$BF1= 81.014009
##$BF2= 200.13
##$BF3= 200.13
##$BF4= 200.13
##$BF5= 200.13
##$BF6= 200.13
##$BF7= 200.13
##$BF8= 200.13
##$BYTORDA= 1
##$CFDGTYP= 0
##$CFRGTYP= 5
##$CHEMSTR= <none>
##$CNST= (0..31)
1 1 145 1 1 1 1 1 1 1 1 1 1 1 1 1 1 1 1 1 1 1 1 1 1 1 1 1 1 1 1 1 
##$CPDPRG= <waltz16>
##$CPDPRG1= <>
##$CPDPRG2= <waltz16>
##$CPDPRG3= <>
##$CPDPRG4= <mlev>
##$CPDPRG5= <mlev>
##$CPDPRG6= <mlev>
##$CPDPRG7= <mlev>
##$CPDPRG8= <mlev>
##$CPDPRGB= <>
##$CPDPRGT= <>
##$D= (0..31)
0 1 0 0 0 0 0 0 0 0 0 0.03 2e-05 3e-06 0 0 0 0 0 0 0 0 0 0 0 0 0 0 0 0 
0 0 
##$DATE= 1681811468
##$DBL= (0..7)
120 120 120 11 120 120 24 19 
##$DBP= (0..7)
150 150 150 150 150 150 150 150 
##$DBP07= 0
##$DBPNAM0= <>
##$DBPNAM1= <>
##$DBPNAM2= <>
##$DBPNAM3= <>
##$DBPNAM4= <>
##$DBPNAM5= <>
##$DBPNAM6= <>
##$DBPNAM7= <>
##$DBPOAL= (0..7)
0.5 0.5 0.5 0.5 0.5 0.5 0.5 0.5 
##$DBPOFFS= (0..7)
$$ [...]
##$SUBNAM2= <"">
##$SUBNAM3= <"">
##$SUBNAM4= <"">
##$SUBNAM5= <"">
##$SUBNAM6= <"">
##$SUBNAM7= <"">
##$SUBNAM8= <"">
##$SUBNAM9= <"">
##$SW= 501.771253377433
##$SWIBOX= (0..15)
0 1 3 0 0 0 0 0 0 0 0 0 0 0 0 0 
##$SW_h= 40650.406504065
##$TD= 32768
##$TD0= 1
##$TE= 0
##$TE2= 300
##$TE3= 300
##$TEG= 300
##$TL= (0..7)
0 120 53 12 22 120 120 120 
##$TP= (0..7)
150 150 150 150 150 150 150 150 
##$TP07= 0
##$TPNAME0= <>
##$TPNAME1= <>
##$TPNAME2= <>
##$TPNAME3= <>
##$TPNAME4= <>
##$TPNAME5= <>
##$TPNAME6= <>
##$TPNAME7= <>
##$TPOAL= (0..7)
0.5 0.5 0.5 0.5 0.5 0.5 0.5 0.5 
##$TPOFFS= (0..7)
0 0 0 0 0 0 0 0 
##$TUNHIN= 0
##$TUNHOUT= 0
##$TUNXOUT= 0
##$USERA1= <user>
##$USERA2= <user>
##$USERA3= <user>
##$USERA4= <user>
##$USERA5= <user>
##$V9= 5
##$VALIST= <valist>
##$VCLIST= <CCCCCCCCCCCCCCC>
##$VD= 0
##$VDLIST= <DDDDDDDDDDDDDDD>
##$VPLIST= <PPPPPPPPPPPPPPP>
##$VTLIST= <TTTTTTTTTTTTTTT>
##$WBST= 1024
##$WBSW= 4
##$XGAIN= (0..3)
0 0 0 0 
##$XL= 0
##$YL= 0
##$YMAX_a= 2229
##$YMIN_a= -3358
##$ZGOPTNS= <>
##$ZL1= 120
##$ZL2= 120
##$ZL3= 120
##$ZL4= 120
##$ABSF1= 0
##$ABSF2= 0
##$ABSG= 0
##$ABSL= 0
##$ALPHA= 0
##$AQORDER= 0
##$ASSFAC= 0
##$ASSFACI= 0
##$ASSFACX= 0
##$ASSWID= 0
##$AUNMP= <proc_1d>
##$AZFE= 0.1
##$AZFW= 0.5
##$BCFW= 0
##$BC_mod= 2
##$BYTORDP= 0
##$COROFFS= 0
##$CY= -3
##$DATMOD= 1
##$DC= 0
##$DFILT= <>
##$DTYPP= 0
##$F1P= 0
##$F2P= 0
##$FCOR= 1
##$FTSIZE= 65536
##$FT_mod= 6
##$GAMMA= 0
##$GB= 0
##$INTBC= 1
##$INTSCL= 6.047779e-11
##$ISEN= 30
##$LB= 1
##$LEV0= 0
##$LPBIN= 0
##$MAXI= 10000
##$MC2= 0
##$MEAN= 0
##$ME_mod= 0
##$MI= 50
##$NCOEF= 0
##$NC_proc= -8
##$NLEV= 6
##$NOISF1= 182.463
##$NOISF2= 159.3651
##$NSP= 0
##$NTH_PI= 0
##$NZP= 0
##$OFFSET= 248.5645
##$PC= 4
##$PHC0= -11179.72
##$PHC1= 535.8849
##$PH_mod= 1
##$PKNL= yes
##$PPARMOD= 0
##$PSCAL= 0
##$PSIGN= 0
##$REVERSE= no
##$SF= 81.0140089999694
##$SI= 65536
##$SIGF1= 159.3651
##$SIGF2= -187.1042
##$SINO= 113.3802
##$SIOLD= 16384
##$SREGLST= <1H.CDCl3>
##$SSB= 0
##$STSI= 65536
##$STSR= 0
##$SW_p= 40650.406504065
##$SYMM= 0
##$S_DEV= 0
##$TDeff= 32768
##$TDoff= 0
##$TI= <>
##$TILT= no
##$TM1= 0
##$TM2= 0
##$TOPLEV= 0
##$USERP1= <user>
##$USERP2= <user>
##$USERP3= <user>
##$USERP4= <user>
##$USERP5= <user>
##$WDW= 1
##$XDIM= 65536
##$YMAX_p= 307424179
##$YMIN_p= -32387656
$$ End of Bruker specific parameters
$$ ---------------------------------
##NTUPLES= NMR SPECTRUM
##VAR_NAME=  FREQUENCY,     SPECTRUM/REAL,   SPECTRUM/IMAG
##SYMBOL=    X,             R,               I
##VAR_TYPE=  INDEPENDENT,   DEPENDENT,       DEPENDENT
##VAR_FORM=  AFFN,          ASDF,            ASDF
##VAR_DIM=   65536,         65536,           65536
##UNITS=     HZ,            ARBITRARY UNITS, ARBITRARY UNITS
##FACTOR=    0.620285442955139, 1,           1
##FIRST=     20137.2065510682, 0,            0
##LAST=      -20513.1999529968, 0,           0
##MIN=       -20513.1999529968, -32387656,   0
##MAX=       20137.2065510682, 307424179,    0
$$ Real data points
##PAGE= N=1
##DATA TABLE= (X++(R..R)), XYDATA
$$ [...]
$$ plain form
41639 339051 -1927389 -8686152 -11763322 -4751136 7409451 13753863 9468917 -562032
41631 -562032 -8433528 -10393884 -8043731 -4643166 -1282299 2687812 5975137 5377625
41623 5377625 1555428 897881 6942051 12988656 9909740 -197602 -5953280 -2566292
41615 -2566292 2569183 2363560 -248298 469703 3380677 4145082 3190178 3469438 4103837
41606 4103837 2671598 1020885 2507341 5316454 4599598 372758 -2134511 170955
41598 170955 4957676 8368827 8523277 5456028 738758 -3233052 -5737768 -8113203
41590 -8113203 -10033948 -8627203 -3847915 -423708 -595615 135986 4767852 7944175
41582 7944175 4998394 2547683 9536255 20891960 22500721 12229746 3150811 3448573
$$ packed form
41639C39051k266440o758763l077170P012186J2160587O344412m284946j0030949
41631e62032p871496j960356K350153L400565L360867L970111L287325n97512
41623E377625l822197o57547O044170O046605l078916j0107342n755678L386988
41615b566292N135475k05623k611858P18001K910974P64405r54904K79260O34399
41606D103837j432239j650713J486456K809113p16856m226840k507269K305466
41598A70955M786721L411151J54450l067249m717270l971810k504716k375435
41590h113203j920745J406745M779288L424207j71907P31601M631866L176323
41582G944175k945781k450711O988572J1355705J608761j0270975r078935K97762
$$ plain form
41574 3448573 6011240 3228413 -166482 2431579 6100445 2249195 -6413894 -9621662
41566 -9621662 -4766623 1519755 4955451 7153991 7917049 3319174 -6174181 -12865529
41558 -12865529 -10866200 -3645364 787593 -494809 -3597891 -4384119 -3678349 -4600147
41550 -4600147 -6218490 -3463685 4696612 10740410 7625136 309911 616804 10176174
41542 10176174 17299582 13923015 6587407 4738105 6498015 4476266 -833446 -3398158
41534 -3398158 -2999078 -3822809 -4243397 1354279 10986407 15143824 9559244 -134096 -7187797
41525 -7187797 -9554444 -6811044 191866 5588267 3002312 -4351984 -6275332 -292736
41517 -292736 4742631 2395188 -2848028 -4676516 -3988636 -3783168 -2784974 27446 1281482
$$ packed form
41574C448573K562667k782827l394895K598061L668866l851250q663089l207768
41566i621662M855039O286378L435696K198540P63058m597875r493355o691348
41558a2865529J999329P220836M432957j282402l103082p86228P05770r21798
41550d600147j618343K754805Q160297O043798l115274p315225L06893R559370
41542A0176174P123408l376567p335608j849302J759910k021749n309712k564712
41534c398158L99080q23731m20588N597676R632128M157417n584580r693340p053701
41525g187797k366647K743400P002910N396401k585955p354296j923348N982596
41517b92736N035367k347443n243216j828488O87880K05468R98194K812420J254036
$$ plain form
41508 1281482 -494730 -668134 3421729 6326912 3037669 -2060818 -2001121 2104852 4889965
41499 4889965 6552839 10298722 13585201 11218644 5316928 3208537 6044033 7849740
41491 7849740 5831799 3323131 1675637 -2450729 -9316833 -13003078 -9800203 -4176658
41483 -4176658 -2493088 -4774418 -6278206 -4386022 -883556 955646 -212404 -2057223
41475 -2057223 -97810 6899716 13565465 13258534 6540191 474428 -547677 1206530
41467 1206530 2476567 3324573 3898034 2088101 -2303205 -5232891 -3973716 -1565144
41459 -1565144 -1778383 -2778189 -619801 3029924 2116044 -5179183 -13825028 -18529055 -18721779
41450 -18721779 -15990217 -11050476 -5866099 -4931640 -9957394 -14845186 -10834812 2552008
$$ packed form
41508A281482j776212j73404M089863K905183l289243n098487N9697M105973K785113
41499D889965J662874L745883L286479k366557n901716k108391K835496J805707
41491G849740k017941k508668j647494m126366o866104l686245L202875N623545
41483d176658J683570k281330j503788J892184L502466J839202j168050j844819
41475b057223J959413O997526O665749l06931o718343o065763j022105J754207
41467A206530J270037Q48006N73461j809933m391306k929686J259175K408572
41459a565144k13239r99806K158388L649725r13880p295227q645845m704027j92724
41450a8721779K731562M939741N184377R34459n025754m887792M010374J3386820
$$ plain form
41442 2552008 15516348 18752851 13174243 6377521 2394429 -534557 -3235711 -2603249
41434 -2603249 2568327 7387654 6652639 2515230 1897676 6772776 11227456 9287084
41426 9287084 2355523 -3287766 -4265742 -2586779 -1228930 -596177 -508023 -2770171 -8407386
41417 -8407386 -13338822 -11196356 -1963194 5901504 4792760 -3577830 -12441666 -19295977
41409 -19295977 -25457770 -28699633 -24026692 -12431059 -1645280 3984932 7705026 11702213
41401 11702213 11643333 4819851 -2802126 -4351736 -1889270 -1185468 -877748 4376285 12117806
41392 12117806 13162449 5483003 -1296153 1616208 11140716 17245357 14790422 7210200
41384 7210200 1047477 -299848 1627182 3269232 3529889 4300611 6052709 6009124 3352541
$$ packed form
41442B552008J2964340L236503n578608o796722l983092k928986k701154O32462
41434b603249N171576M819327p35015m137409o17554M875100M454680j940372
41426I287084o931561n643289r77976J678963J357849O32753Q8154k262148n637215
41417h407386m931436K142466R233162P864698j108744q370590q863836o854311
41409a9295977o161793l241863M672941J1595633J0785779N630212L720094L997187
41401A1702213n8880o823482p621977j549610K462466P03802L07720N254033P741521
41392A2117806J044643p679446o779156K912361R524508O104641k454935p580222
41384G210200o162723j347325J927030J642050K60657P70722J752098m3585k656583
$$ plain form
41375 3352541 2822911 8404252 15856116 17270720 11823248 6063403 4159073 4268277
41367 4268277 4885171 7902332 13309730 16771779 15498427 12111254 9924696 8111645
41359 8111645 4202953 -1503563 -6195221 -7176351 -3541947 2288432 4852625 896701
41351 896701 -5770712 -8479159 -6351789 -4212382 -4228263 -3188515 1367249 7799600 13862258
41342 13862258 18054778 17222065 9482905 498925 -722231 5531674 8865716 3665305
41334 3665305 -3067087 -3093661 1469229 3720918 2671534 1943473 2831920 4614563 7257015
41325 7257015 8523436 3575040 -6677925 -12186865 -5676140 6535475 12654458 10106796
41317 10106796 4750937 -246932 -5854189 -10203312 -9456830 -5070116 -2466317 -2748983
$$ packed form
41375C352541n29630N581341P451864J414604n447472n759845j904330J09204
41367D268277O16894L017161N407398L462049j273352l387173k186558j813051
41359H111645l908692n706516m691658r81130L634404N830379K564193l955924
41351H96701o667413k708447K127370K139407j5881J039748M555764O432351O062658
41342A3862258M192520q32713p739160q983980j221156O253905L334042n200411
41334C665305o732392k6574M562890K251689j049384p28061Q88447J782643K642452
41325G257015J266421m948396j0252965n508940O510725J2211615O118983k547662
41317A0106796n355859m997869n607257m349123P46482M386714K603799k82666
$$ plain form
41309 -2748983 -2415938 -522939 519942 353926 211991 -1701823 -7206474 -11730716 -8907927
41300 -8907927 -1127158 2848428 1000499 -4662 2911960 4436513 1270579 -1610836
41292 -1610836 180342 2915217 1788626 -618333 728206 4282467 4287306 -218523 -4344744
41283 -4344744 -4290554 -1185342 1421636 877259 -3206544 -8613173 -12015583 -12205299 -11098937
41274 -11098937 -10895093 -11723621 -12773027 -13833971 -14610051 -13997434 -11152092 -6605094 -2235455
41265 -2235455 -592063 -2843953 -6072877 -4923355 1464471 6836639 5915252 2159038
41257 2159038 1974494 3828531 823234 -6618394 -9535805 -3903772 2889777 2861920 -2210099
41248 -2210099 -5922105 -6790900 -7318453 -8303310 -9694647 -13341496 -19215411 -21730853 -15414890
$$ packed form
41309b748983L33045J892999J042881j66016j41935j913814n504651m524242K822789
41300h907927P780769L975586j847929j005161K916622J524553l165934k881415
41292a610836J791178K734875j126591k406959J346539L554261M839m505829m126221
41283d344744N4190L105212K606978n44377m083803n406629l402410j89716J106362
41274a1098937K03844q28528j049406j060944p76080O12617K845342M546998M369639
41265b235455J643392k251890l228924J149522O387826N372168r21387l756214
41257B159038j84544J854037l005297p441628k917411N632033O793549k7857n072019
41248b210099l712006q68795n27553r84857j391337l646849n873915k515442O315963
$$ plain form
41239 -15414890 -2541443 9394091 15856020 16670868 11968864 2555299 -6825019 -10531553
41231 -10531553 -8921728 -7725852 -9980463 -12654709 -12015056 -8309104 -3716208 738075
41223 738075 4089764 4137917 67040 -5150943 -7665068 -7457626 -7696015 -9392192 -9416607
41214 -9416607 -5108033 1438710 6008464 7408133 6719655 2995210 -4978449 -12473213
41206 -12473213 -11368873 -2198568 3190610 -2899708 -11695575 -9628554 1666324 7661495
41198 7661495 2033482 -6169664 -8354879 -7784353 -9906342 -11367402 -6766261 477036
41190 477036 2673890 -728027 -3935139 -4185177 -3286987 -1706745 2108977 6924516 8574822
41181 8574822 4840752 -2792973 -11087389 -15883225 -13518478 -5343933 1456667 1589235
$$ packed form
41239a5414890J2873447J1935534O461929Q14848m702004r413565r380318l706534
41231a0531553J609825J195876k254611k674246O39653L705952M592896M454283
41223G38075L351689M8153m070877n217983k514125K07442k38389j696177k4415
41214i416607M308574O546743M569754J399669o88478l724445p973659p494764
41206a2473213J104340R170305N389178o090318q795867K067021J1294878N995171
41198G661495n628013q203146k185215N70526k121989j461060M601141P243297
41190D77036K196854l401917l207112k50038Q98190J580242L815722M815539J650306
41181H574822l734070p633725q294416m795836K364747Q174545O800600J32568
$$ plain form
41173 1589235 -2139044 -4182864 -4358742 -5175683 -4513194 1427952 9155712 10041629 2638706
41164 2638706 -4258709 -3491142 1408622 2737850 -188218 -1067554 4002215 11279479
41156 11279479 13848773 9007383 99078 -8052943 -13718159 -17364441 -18035375 -13806923
41148 -13806923 -5823318 1668111 6344919 9432941 11121063 8708640 1820564 -4832906
41140 -4832906 -7469767 -8322739 -10881584 -13659469 -13134193 -9674100 -5730095 -1000919
41132 -1000919 5486394 10910359 11533071 8307126 5137604 3715529 4112193 7003447
41124 7003447 10309131 7949762 -1348154 -8140454 -3405187 7707053 12606333 9258732
41116 9258732 6772899 9028382 9634342 4895624 372367 722264 2891391 3790197 5689892
$$ packed form
41173A589235l728279k043820j75878q16941O62489N941146P727760Q85917p402923
41164B638706o897415P67567M899764J329228k926068q79336N069769P277264
41156A1279479K569294m841390q908305q152021n665216l646282o70934M228452
41148a3806923P983605P491429M676808L088022J688122k412423o888076o653470
41140d832906k636861q52972k558845k777885N25276L460093L944005M729176
41132a000919O487313N423965O22712l225945l169522j422075L96664K891254
41124G003447L305684k359369r297916o792300M735267J1112240M899280l347601
41116I258732k485833K255483O05960m738718m523257L49897K169127Q98806J899695
$$ plain form
41107 5689892 9272153 10052781 7011681 6293173 10331396 11670472 4785157 -3730404
41099 -3730404 -5063381 -1278547 846214 2787492 9610125 16226063 11366445 -4223642
41091 -4223642 -15150470 -10650522 1949964 7665219 1644371 -8435181 -13699860 -12443446
41083 -12443446 -8388195 -4895094 -2236310 842880 4451300 7181273 7852624 6340237
41075 6340237 2938731 -1304417 -3909938 -3249290 -1528272 -2235283 -4454127 -3973305 -686575
41066 -686575 631754 -1228231 -1222795 2428180 2889336 -4842117 -13914912 -14315233 -7765911
41057 -7765911 -4694097 -8103512 -10244112 -6016915 -404706 409999 -2324270 -4270788
41049 -4270788 -4978148 -5922004 -6038245 -3902164 -1457124 -1498316 -3403465 -4599895 -4522552
$$ packed form
41107E689892L582261P80628l041100p18508M038223J339076o885315q515561
41099c730404j332977L784834K124761J941278O822633O615938m859618j5590087
41091d223642j0926828M499948J2600486N715255o020848j0079552n264679J256414
41083a2443446M055251L493101K658784L079190L608420K729973O71351j512387
41075F340237l401506m243148k605521O60648J721018p07011k218844M80822L286730
41066f86575J318329j859985N436L650975M61156p731453r072795m00321O549322
41057g765911L071814l409415k140600M227197N612209Q14705k734269j946518
41049d270788p07360r43856j16241K136081K445040m1192j905149j196430P7343
$$ plain form
41040 -4522552 -4195340 -3321863 -495973 4493585 10288311 14827915 15691075 11903185 6971626
41031 6971626 7104561 13406765 18413029 14565485 4597107 -1612374 -485626 696733
41023 696733 -4970683 -13494711 -15714940 -10498925 -5734922 -6430440 -8512445 -6855663
41015 -6855663 -3376188 -2207878 -1365892 3804909 10882113 11892771 5365910 -424779
41007 -424779 907044 5213641 4964461 -130645 -4959083 -7584657 -9727134 -10672026 -7131836
40998 -7131836 577981 7138767 7973607 3230837 -3848455 -9153463 -8703903 -1641371
40990 -1641371 7092890 10791340 8796564 7097643 10067498 14923776 16153858 12554524
40982 12554524 7450195 3825763 1893958 841332 750074 2190536 4767821 6857672
$$ packed form
41040d522552L27212Q73477K825890M989558N794726M539604Q63160l787890m931559
41031F971626J32935O302204N006264l847544r968378o209481J126748J182359
41023F96733n667416q524028k220229N216015M764003o95518k082005J656782
41015f855663L479475J168310Q41986N170801P077204J010658o526861n790689
41007d24779J331823M306597k49180n095106m828438k625574k142477r44892L540190
40998g131836P709817O560786Q34840m742770p079292n305008M49560P062532
40990a641371Q734261L698450j994776j698921K969855M856278J230082l599334
40982A2554524n104329l624432j931805j052626r1258J440462K577285K089851
$$ plain form
40974 6857672 7148882 6165179 5348762 4648478 2575323 -831141 -3143717 -2963666 -2184154
40965 -2184154 -3097109 -5291661 -7499212 -10100687 -12878161 -12724444 -7634608 -1213259
40957 -1213259 1468947 1441899 4054063 9848748 12915991 9509548 2926830 -2293948
40949 -2293948 -5952257 -8887156 -8787837 -3858758 2294341 4251979 1866654 -439526
40941 -439526 -698095 -1516267 -4852432 -8578882 -10067514 -10599566 -13495030 -18505160 -20534945
40932 -20534945 -15154068 -4498131 3905910 4658221 -224285 -4371628 -4464317 -3069029
40924 -3069029 -4361286 -8744122 -12457343 -11681173 -6268613 386662 4708534 5895942
40916 5895942 5605892 5468958 5811892 6370677 6931002 7310602 7673810 8039599 6164356
$$ packed form
40974F857672K91210r83703q16417p00284k073155l406464k312576J80051P79512
40965b184154r12955k194552k207551k601475k777474J53717N089836O421349
40957a213259K682206k7048K612164N794685L067243l406443o582718n220778
40949b293948l658309k934899R9319M929079O153099J957638k385325k306180
40941d39526k58569q18172l336165l726450j488632n32052k895464n010130k029785
40932b0534945N380877J0655937Q404041P52311m882506m147343r2689J395288
40924c069029j292257m382836l713221P76170N412560O655275M321872J187408
40916E895942k90050j36934L42934N58785N60325L79600L63208L65789j875243
$$ plain form
40907 6164356 -1728894 -14375123 -21882930 -15427644 -608000 6870179 1358679 -5428716
40899 -5428716 -2233163 5464259 5354520 -2733978 -8733132 -8646507 -6972687 -5019949 688516
40890 688516 8105759 9916679 6208034 5607924 10809111 14064131 11087368 8200841
40882 8200841 10062872 11151856 6638400 1679172 1403454 788045 -5762169 -12697661
40874 -12697661 -11898146 -6415456 -4489350 -5420880 -3367428 -787370 -5019639 -13702500
40866 -13702500 -16649598 -11879594 -7394180 -6445689 -3550181 2697692 5127769 433705
40858 433705 -4665437 -4581927 -2557453 -2170481 -611837 3512609 4617985 -286425 -4227335
40849 -4227335 -637091 5400564 4998373 -698300 -3710290 -2295751 -1244449 -1620305
$$ packed form
40907F164356p893250j2646229p507807O455286J4819644P478179n511500o787395
40899e428716L195553P697422j09739q088498n999154Q6625J673820J952738N708465
40890F88516P417243J810920l708645o00110N201187L255020k976763k886527
40882H200841J862031J088984m513456m959228k75718o15409o550214o935492
40874a2697661P99515N482690J926106r31530K053452K580058m232269q682861
40866a3702500k947098M770004M485414R48491K895508O247873K430077m694064
40858D33705n099142Q3510K024474L86972J558644M124446J105376m904410l940910
40849d227335L590244O037655m02191n696673l011990J414539J051302l75856
$$ plain form
40841 -1620305 -90750 2176406 -380595 -7391503 -10862620 -6372205 1302753 6723954
40833 6723954 10933609 15729762 17161516 11241679 2360872 -1132271 1381590 2100854
40825 2100854 -3380232 -9439642 -8491074 -1375457 4537329 5225084 3150593 1182620
40817 1182620 -1345069 -4892140 -6642620 -4646662 -1977972 -2675595 -5528268 -6356032
40809 -6356032 -5170263 -5826429 -8606234 -8796960 -4274802 583622 1229816 -1101372 -2811770
40800 -2811770 -3299922 -3199680 -1025379 3603961 6163955 2251838 -4868423 -7304880
40792 -7304880 -2997503 2162452 3508869 3732547 7458210 13643221 16769706 13730541
40784 13730541 6827152 826977 -1069138 1035086 4435301 6241615 5696271 4095117
$$ packed form
40841a620305J529555K267156k557001p010908l471117M490415P674958N421201
40833F723954M209655M796153J431754n919837q880807l493143K513861P19264
40825B100854n481086o059410R48568P115617N912786O87755k074491j967973
40817A182620k527689l547071j750480J995958K668690o97623k852673q27764
40809f356032J185769o56166k779805j90726M522158M858424O46194k331188j710398
40800b811770m88152J00242K174301M629340K559994l912117p120261k436457
40792g304880M307377N159955J346417K23678L725663O185011L126485l039165
40784A3730541o903389o000175j896115K104224L400215J806314n45344j601154
$$ plain form
40776 4095117 2791819 2136804 1994453 1954763 1169660 -645269 -2302186 -2828131 -3616884
40767 -3616884 -6659790 -10712319 -11875548 -8532430 -3126583 1678695 5692529 8800134
40759 8800134 9079133 5723133 1523534 -36918 1680763 5701163 11210654 15116958
40751 15116958 11396025 -1681214 -15503952 -18779224 -11500713 -5022881 -6736760 -11248084
40743 -11248084 -10303127 -5319430 -3954181 -8041659 -12060903 -12376861 -11228171 -10759596
40735 -10759596 -9002316 -4272255 551248 1168802 -2866687 -8034392 -10346652 -7718552
40727 -7718552 -834334 6722992 10511140 8759982 3511454 -1427725 -2486380 2295990
40719 2295990 10738052 16002819 12702807 3925197 -1902186 -1563230 507290 1156639
$$ packed form
40776D095117j303298o55015j42351l9690p85103j814929j656917n25945p88753
40767c616884l042906m052529j163229L343118N405847M805278M013834L107605
40759H800134K78999l356000m199599j560452J717681M020400N509491L906304
40751A5116958l720933j3077239j3822738l275272P278511O477832j713879m511324
40743a1248084R44957M983697J365249m087478m019244l15958J148690M68575
40735a0759596J757280M730061M823503O17554m035489n167705k312260K628100
40727g718552O884218P557326L788148j751158n248528m939179j058655M782370
40719B295990Q442062N264767l300012q777610n827383L38956K070520O49349
$$ plain form
40711 1156639 3237645 8378232 11890463 10138766 6991853 6480358 4912978 -1058038
40703 -1058038 -3643177 6919381 24007138 28542741 13983439 -4403436 -10526076 -7132188
40695 -7132188 -6617546 -11057923 -12431915 -8146272 -4660423 -5672635 -6295527 -1656855
40687 -1656855 5412696 8815880 7211633 4434860 4163272 6465647 8568297 7864090
40679 7864090 4732463 2444376 3593737 7295201 10846333 12815066 12880156 10233136
40671 10233136 4759168 -980854 -3516514 -2037687 1558616 5385791 8343211 9220168
40663 9220168 7580260 5072728 3662517 3099807 2104932 973585 575019 -33418 -1989077
40654 -1989077 -3563798 -2117918 1346167 3062489 1836637 15405 -1043798 -2814250
$$ packed form
40711A156639K081006N140587L512231j751697l146913n11495j567380n971016
40703a058038k585139J0562558J7087757M535603j4559302j8386875o122640L393888
40695g132188N14642m440377j373992M285643L485849j012212o22892M638672
40687a656855P069551L403184j604247k776773k71588K302375K102650p04207
40679G864090l131627k288087J149361L701464L551132J968733O5090k647020
40671A0233136n473968n740022k535660J478827L596303L827175K957420Q76957
40663I220168j639908k507532j410211n62710r94875j131347l98566o08437j955659
40654a989077j574721J445880L464085J716322j225852j821232j059203j770452
$$ plain form
40646 -2814250 -6094810 -8960563 -9409743 -7408096 -3400503 2532072 8932183 12726118
40638 12726118 11972780 7569355 2262431 -577212 1430884 6472057 8616923 5161847
40630 5161847 2058713 6093809 12743452 10017479 -3915575 -15509948 -12785962 -362467
40622 -362467 8314839 7804635 2887398 -1086648 -2021473 1586964 8706574 12416565 6330030
40613 6330030 -5647299 -12727326 -10415594 -3829083 1775322 6164714 8999870 7752737
40605 7752737 3679802 2749500 6713202 9270937 5295233 -1583348 -5064529 -4737274
40597 -4737274 -3636912 -2110305 115752 -32337 -4267754 -7512609 -4347506 1352251
40589 1352251 1027074 -5266346 -8554957 -4903748 -1203769 -3612211 -7602686 -5269196
$$ packed form
40646b814250l280560k865753m49180K001647M007593N932575O400111L793935
40638A2726118p53338m403425n306924k839643K008096N041173K144866l455076
40630E161847l103134M035096O649643k725973j3933054j1594373K723986J2423495
40622c62467Q677306n10204m917237l974046r34825L608437P119610L709991o086535
40613F330030j1977329p080027K311732O586511N604405M389392K835156j247133
40605G752737m072935r30302L963702K557735l975704o878581l481181L27255
40597d737274J100362J526607K226057j48089m235417l244855L165103N699757
40589A352251l25177o293420l288611L651209L699979k408442l990475K333490
$$ plain form
40581 -5269196 2382236 7119729 5233238 1296878 376672 2094112 4241425 8005320
40573 8005320 15877114 25767237 30779239 25965592 13668089 897045 -7424272 -10910747
40565 -10910747 -10627072 -7069464 -2140296 439467 -521260 -1440679 533220 2037701
40557 2037701 -1766822 -8305686 -9687624 -4702258 -2238377 -9002317 -18994926 -21018364
40549 -21018364 -13892751 -7502864 -8599712 -11928070 -8743440 -113870 3567570 -3732139
40541 -3732139 -14982442 -18059462 -10378993 -1284433 565491 -2670966 -3709905 -1655815
40533 -1655815 -1551490 -4172149 -4034178 896228 4799320 3188260 442608 2720516
40525 2720516 7913242 9062455 4840420 -20945 -2976054 -5404041 -6599781 -3203019
$$ packed form
40581e269196P651432M737493j886491l936360r20206J717440K147313L763895
40573H005320P871794R890123N012002m813647j2297503j2771044q321317l486475
40565a0910747K83675L557608M929168K579763r60727r19419J973899J504481
40557B037701l804523o538864j381938M985366K463881o763940r992609k023438
40549b1018364P125613O389887j096848l328358L184630Q629570L681440p299709
40541c732139j1250303l077020P680469R094560J849924l236457j038939K054090
40533a655815J04325k620659J37971M930406L903092j611060k745652K277908
40525B720516N192726J149213m222035m861365k955109k427987j195740L396762
$$ plain form
40517 -3203019 3885698 8165795 5885126 1259857 529007 4212869 8062096 9245242
40509 9245242 8967247 10029274 13120552 15082981 11635577 3396039 -2839507 -2302323
40501 -2302323 425749 -2292599 -9094354 -11361704 -7209933 -4550245 -7025514 -6590772
40493 -6590772 2792131 12044026 8007626 -6395937 -14311033 -7204303 5122886 9416018
40485 9416018 5305355 1751690 3163702 5534026 4022445 -1199351 -6680091 -9542344
40477 -9542344 -8827501 -5376812 -1505797 422111 106962 -498944 221717 1299732 603947
40468 603947 -1667276 -2639683 -646793 2443078 4402991 6048103 8503202 8836391 3052617
40459 3052617 -6567356 -12011407 -8985244 -1827957 2663136 2266530 -1689393 -7664411
$$ packed form
40517c203019P088717M280097k280669m625269p30850L683862L849227J183146
40509I245242k77995J062027L091278J962429l447404q239538o235546N37184
40501b302323K728072k718348o801755k267350M151771K659688k475269M34742
40493f590772R382903R251895m036400j4403563p915096P106730J2327189M293132
40485I416018m110663l553665J412012K370324j511581n221796n480740k862253
40477i542344P14843L450689L871015J927908l15149o05906P20661J078015o95785
40468F03947k271223r72407J992890L089871J959913J645112K455099L33189n783774
40459C052617r619973n444051L026163P157287M491093l96606l955923n975018
$$ plain form
40451 -7664411 -12847617 -12773703 -6273858 1679254 5466149 4633535 1430137 -3750631 -10417132
40442 -10417132 -14873203 -14048854 -10347880 -8452729 -9409383 -11505912 -13878606 -14974473
40434 -14974473 -11195597 -2664056 2987951 -999776 -10744823 -16462822 -14472011 -8319399
40426 -8319399 -1286142 4648799 5474406 -292602 -5787117 -3771607 1513619 687458
40418 687458 -4450489 -3293910 5036409 9470477 5837987 3630987 8620685 12457073
40410 12457073 7519736 17667 -1198133 1495265 1923001 2088972 5779932 8377035
40402 8377035 4787602 658986 3427860 7999989 4342521 -5062840 -8885139 -5229416
40394 -5229416 -2514424 -3335856 -1484814 3970713 5113936 -1103516 -7226832 -7506535
$$ packed form
40451g664411n183206P3914O499845P953112L786895q32614l203398n180768o666501
40442a0417132m456071Q24349L700974J895151r56654k096529k372694j095867
40434a4974473L778876Q531541N652007l987727r745047n717999J990811O152612
40426h319399P033257N934941Q25607n767008n494515K015510N285226q26161
40418F87458n137947J156579Q330319M434068l632490k207000M989698L836388
40410A2457073m937337p502069j215800K693398M27736J65971L690960K597103
40402H377035l589433m128616K768874M572129l657468r405361l822299L655723
40394e229416K714992q21432J851042N455527J143223o217452o123316k79703
$$ plain form
40386 -7506535 -5643866 -5869157 -5356585 -717345 5238367 8086870 7417392 4564874 551820
40377 551820 -1260105 2907197 10070812 12253783 8258440 6108645 10221939 14163556
40369 14163556 11038316 3537086 -2060610 -4761789 -5373545 -1236680 7590797 12804850
40361 12804850 7677538 -1690738 -4320784 -565574 -78627 -4639793 -4366681 5959903
40353 5959903 16459628 14434676 1618319 -7610325 -3337578 9959317 20578682 22326380
40345 22326380 18179307 13921520 11741031 10531632 9301100 7528840 3902129 -1498671
40337 -1498671 -4279759 353352 9668916 14282194 9844020 3497072 4164525 9716410
40329 9716410 10043349 2057552 -5081958 -2050036 8307804 14955284 12532657 6371880
$$ packed form
40386g506535J862669k25291N12572M639240N955712K848503o69478k852518m013054
40377E51820j811925M167302P163615K182971l995343k149795M113294L941617
40369A4163556l125240p501230n597696k701179o11756M136865Q827477N214053
40361A2804850n127312r368276k630046L755210M86947m561166K73112J0326584
40353E959903J0499725k024952j2816357r228644M272747J3296895J0619365J747698
40345B2326380m147073m257787k180489j209399j230532j772260l626711n400800
40337a498671k781088M633111R315564M613278m438174o346948O67453N551885
40329I716410L26939p985797p139510L031922J0357840O647480k422627o160777
$$ plain form
40321 6371880 3594552 4055505 3288514 1375585 3329543 10190912 15225234 12523527
40313 12523527 5762884 3491636 7436230 10910722 8936107 4688945 3896485 6665356
40305 6665356 7857923 3889491 -3102645 -7464266 -5555167 717708 6060189 7491162
40297 7491162 6380878 4562515 1702814 -1652532 -2487842 -296785 375372 -2970885
40289 -2970885 -5437449 -2603103 815087 -1382626 -4462886 912383 11653621 14395332
40281 14395332 6095454 -585781 3231571 10139631 10092474 5649187 5047976 8698546
40273 8698546 11499465 11848872 10200388 5110802 -1266524 -453046 10653973 21341045
40265 21341045 19757025 8899526 664198 -851148 -53303 1179133 3868757 4681143
$$ packed form
40321F371880k777328M60953p66991j912929J953958O861369N034322k701707
40313A2523527o760643k271248L944594L474492j974615m247162p92460K768871
40305F665356J192567l968432o992136m361621J909099O272875N342481J430973
40297G491162j110284j818363k859701l355346q35310K191057O72157l346257
40289b970885k466564K834346L418190k197713l080260N375269J0741238K741711
40281A4395332q299878o681235L817352O908060m7157m443287o01211L650570
40273H698546K800919L49407j648484n089586o377326Q13478J1107019J0687072
40265B1341045j584020j0857499q235328j515346P97845J232436K689624Q12386
$$ plain form
40257 4681143 -129032 -5515622 -3366637 4201799 8146161 7457706 9108579 13807061
40249 13807061 14352752 9264791 5771287 6662560 5726260 -79305 -4629982 -3326108
40241 -3326108 -211826 395715 707320 2917990 3771542 789477 -2926499 -4633096 -6153669
40232 -6153669 -8232499 -7600330 -3859179 -2471011 -6424529 -11276093 -12598568 -11871349
40224 -11871349 -10977880 -7853157 -2176921 1516908 1329716 1907004 6003802 9138212
40216 9138212 7917817 6463192 8611562 10971936 10321037 10584168 14862106 17573678
40208 17573678 13333273 7490842 8211421 13046076 13349188 8174404 3831093 2792710
40200 2792710 3121986 6302395 14862794 23378832 22656669 13420469 6087683 5827283 7138957
$$ packed form
40257D681143m810175n386590K148985P568436L944362o88455J650873M698482
40249A3807061N45691n087961l493504Q91273r36300n805565m550677J303874
40241c326108L114282O07541L11605K210670Q53552k982065l715976j706597j520573
40232f153669k078830O32169L741151J388168l953518m851564j322475P27219
40224a1871349Q93469L124723N676236L693829j87192N77288M096798L134410
40216I138212j220395j454625K148370K360374o50899K63131M277938K711572
40208A7573678m240405n842431P20579M834655L03112n174784m343311j038383
40200B792710L29276L180409Q560399Q516038p22163r236200p332786k60400J311674
$$ plain form
40191 7138957 4997178 2133109 1982785 2391325 533025 -1982176 -2638398 -1578290 1258808
40182 1258808 7242804 13939038 14067794 4363257 -7663483 -10582812 -1809834 9628710
40174 9628710 13111841 7392533 804854 913836 5701235 7478752 4369598 2413313
40166 2413313 4854823 6427333 3145345 894086 6148867 13288234 11555766 2169489
40158 2169489 -2796167 1306871 5751755 3116368 -2594571 -4766224 -3898589 -2990436
40150 -2990436 -870229 3821107 8298787 11155612 16284788 24958213 29559303 22851760
40142 22851760 9726351 2049530 4100479 10121070 14339640 15832546 14117083 7954550
40134 7954550 359625 -1748358 3878663 11059686 13140391 11197597 10884722 13746610
$$ packed form
40191G138957k141779k864069j50324M08540j858300k515201o56222J060108K837098
40182A258808N983996O696234J28756r704537j2026740k919329Q772978J1438544
40174I628710L483131n719308o587679J08982M787399J777517l109154j956285
40166B413313K441510J572510l281988k251259N254781P139367j732468r386277
40158B169489m965656M103038M444884k635387n710939k171653Q67635R08153
40150b990436K120207M691336M477680K856825N129176Q673425M601090o707543
40142B2851760j3125409p676821K050949O020591M218570J492906j715463o162533
40134G954550p594925k107983N627021P181023K080705j942794l12875K861888
$$ plain form
40126 13746610 15886214 14467891 11436670 9684125 8684809 6462007 4154973 5232182
40118 5232182 9982857 13830059 12513462 6786752 560036 -3324576 -3606777 495020
40110 495020 7825463 14415778 17302781 18221064 20785997 25384303 29657470 32139332
40102 32139332 32041040 27849148 20737743 17100791 21709128 29566877 31164695 25578155
40094 25578155 21380186 23854834 28575452 29555257 26672091 22070621 15801805 8891040
40086 8891040 5280031 6982300 11840965 18376513 27029130 34408111 34102949 27235624
40078 27235624 23811815 27643044 28519659 17769093 3724460 552967 7197370 10246916
40070 10246916 5213457 1483349 5313515 10757302 11525982 11085439 14742684 19652371
$$ packed form
40126A3746610K139604j418323l031221j752545r99316k222802k307034J077209
40118E232182M750675L847202j316597n726710o226716l884612k82201M101797
40110D95020P330443O590315K887003R18283K564933M598306M273167K481862
40102C2139332r8292m191892p111405l636952M608337P857749J597818n586540
40094B5578155m197969K474648M720618R79805k883166m601470o268816o910765
40086H891040l611009J702269M858665O535548Q652617P378981l05162o867325
40078B7235624l423809L831229Q76615j0750566j4044633l171493O644403L049546
40070A0246916n033459l730108L830166N443787P68680m40543L657245M909687
$$ plain form
40062 19652371 19800531 15956752 14069419 16417599 19638495 20226691 18065898 14993787
40054 14993787 12405447 10375499 8514857 7978972 11309454 18102385 22597116 19713870
40046 19713870 12628309 9346304 11915516 14850908 14942776 15713877 19510543 22141013
40038 22141013 20221212 18125974 21395427 27311045 28907837 25745567 23326279 22848753
40030 22848753 19455806 12098293 7799156 12019715 19886845 22274167 17824910 13440374
40022 13440374 13751072 15710837 14801919 11474146 8252637 4579567 -364930 -2126971
40014 -2126971 4990804 17966525 25949723 23884197 18992892 19094592 20467878 14820545
40006 14820545 4346131 122588 5844274 12680910 12893782 10246861 12242455 18597814
$$ packed form
40062A9652371J48160l843779j887333K348180L220896N88196k160793l072111
40054A4993787k588340k029948j860642n35885L330482O792931M494731k883246
40046A9713870p085561l282005K569212K935392R1868P71101L796666K630470
40038B2141013j919801k095238L269453N915618J596792l162270k419288m77526
40030B2848753l392947p357513m299137M220559P867130K387322m449257m384536
40022A3440374L10698J959765r08918l327773l221509l673070m944497j762041
40014b126971P117775J2975721P983198k065526m891305J01700J373286n647333
40006A4820545j0474414m223543N721686O836636K12872k646921J995594O355359
$$ plain form
39998 18597814 23460339 24785719 25376053 26897356 28163097 28195485 26852793 23442880
39990 23442880 18245772 14362408 14784703 18476346 21966940 23475460 22945825 20093945
39982 20093945 15832681 13823329 16598953 21197815 22606489 20920039 21071529 25377330
39974 25377330 30045326 29936942 24226381 16623622 11613788 10588230 10902202 9886938
39966 9886938 10053597 16642530 27970457 33351344 25799925 12660539 6553968 8665464
39958 8665464 9682244 6071420 4990459 10785912 16557760 14593201 7844312 4697472
39950 4697472 7502642 12305170 15826570 16856912 14138159 8712683 5772050 8707013
39942 8707013 13524340 14167490 10848027 7805616 5671681 2606256 958336 5273709
$$ packed form
39998A8597814M862525J325380N90334J521303J265741L2388j342692l409913
39990B3442880n197108l883364M22295L691643L490594J508520n29635k851880
39982B0093945m261264k009352K775624M598862J408674j686450J51490M305801
39974B5377330M667996j08384n710561p602759n009834j025558L13972j015264
39966I886938J66659O588933J1327927N380887p551419j3139386o106571K111496
39958H665464J016780l610824j080961N795453N771848j964559o748889l146840
39950D697472K805170M802528L521400J030342k718753n425476k940633K934963
39942H707013M817327O43150l319463l042411k133935l065425j647920M315373
$$ plain form
39934 5273709 14012571 20327515 21539607 21166427 21038491 18958191 15925991 17446218
39926 17446218 23494246 24644075 14612240 1345672 -1858889 6652822 16099571 18004546
39918 18004546 14156631 9383712 4197800 -1591114 -3819493 1173165 8887500 10403883
39910 10403883 4752326 1971887 10109786 22708565 24874078 11388783 -6693355 -15273271
39902 -15273271 -12300948 -6495179 -5119312 -7994622 -11408676 -12457244 -9786557 -4543974
39894 -4543974 -754458 -982009 -2027793 778433 5574175 5844885 1027997 -845547
39886 -845547 6216610 17817565 24858145 23900986 18549420 13417346 10024222 7035419
39878 7035419 2575584 -2442698 -3484166 1985560 8840340 9723481 6224688 7369652
$$ packed form
39934E273709Q738862O314944J212092l73180j27936k080300l032200J520227
39926A7446218O048028J149829j0031835j3266568l204561Q511711R446749J904975
39918A8004546l847915m772919n185912n788914k228379M992658P714335J516383
39910A0403883n651557k780439Q137899J2598779K165513j3485295j8082138q579916
39902a5273271K972323N805769J375867k875310l414054j048568K670687N242583
39894d543974L789516k27551j045784K806226M795742K70710m816888j873544
39886h45547P062157J1600955P040580r57159n351566n132074l393124k988803
39878G035419m459835n018282j041468N469726O854780Q83141l498793J144964
$$ plain form
39870 7369652 15162962 20070001 15074125 5837873 771091 -911711 -3278564 -3567861
39862 -3567861 1618238 6071074 2123621 -4706767 -2282016 8485753 14024295 8861071
39854 8861071 2450858 2319465 3721938 1635523 654159 4661236 6855027 339183
39846 339183 -8393128 -7440550 2638179 8709071 1978196 -12136186 -20938097 -16469944
39838 -16469944 -1496694 12658919 15585725 8038148 804239 1661294 7549036 11817713
39830 11817713 12913279 11377924 5114921 -5033497 -10451508 -4404311 6829800 11358975
39822 11358975 7803556 4867346 6527545 7990799 6799752 7470040 12144656 15712706
39814 15712706 14475025 12077600 12038197 11057927 5460344 -1014851 -2116377 1731084
$$ packed form
39870G369652P793310M907039m995876r236252n066782j682802k366853k89297
39862c567861N186099M452836l947453o830388K424751J0767769N538542n163224
39854H861071o410213j31393J402473k086415r81364M007077K193791o515844
39846C39183q732311R52578J0078729O070892o730875j4114382q801911M468153
39838a6469944J4973250J4155613K926806p547577p233909Q57055N887742M268677
39830A1817713J095566j535355o263003j0148418n418011O047197J1234111M529175
39822A1358975l555419k936210J660199J463254j191047O70288M674616L568050
39814A5712706j237681k397425l9403r80270n597583o475195j101526L847461
$$ plain form
39806 1731084 5020881 5508354 5242895 4607646 1096110 -5330299 -10135685 -9452855 -5133755
39797 -5133755 -2642604 -4551924 -7432368 -5776664 1321594 8701757 11141730 9326132
39789 9326132 7982079 9521470 12513067 15589488 18894015 21221994 19793612 14599997
39781 14599997 9814239 8849906 10424875 11272267 10437326 9105711 8303011 8501054 9551233
39772 9551233 9582680 6282187 841128 -2065430 -409867 1764531 -47479 -4048973
39764 -4048973 -4570909 103199 6177509 10248976 12978331 15972718 18127364 17162573
39756 17162573 13310301 9311280 6880324 4989982 2701736 2330977 7042812 14750595
39748 14750595 17735171 11295167 544314 -5495326 -5147587 -4147017 -4850536 -2452194
$$ packed form
39806A731084L289797M87473k65459o35249l511536o426409m805386O82830M319100
39797e133755K491151j909320k880444J655704P098258P380163K439973j815598
39789I326132j344053J539391K991597L076421L304527K327979j428382n193615
39781A4599997m785758r64333J574969Q47392q34941j331615q02700J98043J050179
39772I551233L1447l300493n441059k906558J655563K174398j812010m001494
39764d048973n21936M674108O074310M071467K729355K994387K154646r64791
39756A7162573l852272l999021k430956j890342k288246l70759M711835P707783
39748A4750595K984576o440004j0750853o039640L47739J000570p03519K398342
$$ plain form
39740 -2452194 5343369 11617877 8952612 646749 -3359671 155199 4735934 4275161
39732 4275161 137716 -2877414 -3030007 -2072669 -2167620 -4082690 -6699003 -7598364 -5558888
39723 -5558888 -2204046 397427 2462260 4363034 3790420 -747958 -5047795 -3477098
39715 -3477098 1910484 2792041 -3442309 -9517869 -8969730 -4689620 -2298651 -921735
39707 -921735 2872381 6385374 4331203 -675908 405913 10174370 20342359 22155975
39699 22155975 15676144 6869258 1164275 2377200 11972649 24964984 31211477 25977477
39691 25977477 16097570 10936561 10544487 8603767 4446707 4476487 11394538 19038640
39683 19038640 20317572 15192873 8266085 2804459 17158 499944 3033703 4534919
$$ packed form
39740b452194P795563O274508k665265q305863m006420L514870M580735m60773
39732D275161m137445l015130j52593R57338r4951j915070k616313q99361K039476
39723e558888L354842K601473K064833J900774n72614m538378m299837J570697
39715c477098N387582Q81557o234350o075560N48139M280110K390969J376916
39707i21735L794116L512993k054171n007111J081821R768457J0167989J813616
39699B2155975o479831q806886n704983J212925R595449J2992335O246493n234000
39691B5977477r879907n161009l92074j940720m157060K9780O918051P644102
39683A9038640J278932n124699o926788n461626k787301M82786K533759J501216
$$ plain form
39675 4534919 3935714 3564188 4288485 2772659 -2738070 -7149846 -4294168 3657347 8171999
39666 8171999 5664389 1423572 985738 2536442 851049 -4347651 -7374382 -3052698
39658 -3052698 7480641 16795859 16786128 6200332 -6952969 -12976611 -11219670 -10205033
39650 -10205033 -15703044 -22660468 -22385137 -14478103 -6576824 -3812915 -4247766 -4964597
39642 -4964597 -6647141 -9573488 -10151984 -5876195 -590128 228898 -2090833 -1022373
39634 -1022373 5070128 9856303 8037053 2835702 988662 3491745 5847149 5907207
39626 5907207 6409559 9225488 11537579 9936915 5505654 2240777 1901745 2736723 2658316
39617 2658316 1710438 1335269 2427759 4336500 5238412 3553123 -697578 -6026824 -10777318
$$ packed form
39675D534919n99205l71526P24297j515826n510729m411776K855678P951515M514652
39666H171999k507610m240817m37834J550704j685393n198700l026731M321684
39658c052698J0533339R315218r731j0585796j3153301o023642J756941J014637
39650a0205033n498011o957424K75331P907034P901279K763909m34851p16831
39642d964597j682544k926347n78496M275789N286067Q19026k319731J068460
39634a022373O092501M786175j819250n201351j847040K503083K355404O0058
39626E907207N02352K815929K312091j600664m431261l264877l39032Q34978p8407
39617B658316r47878l75169J092490J908741R01912j685289m250701n329246m750494
$$ plain form
39608 -10777318 -13696903 -13719057 -10756390 -6987240 -5590949 -7145055 -8578265 -7010099
39600 -7010099 -3743076 -2994376 -6916186 -12955022 -16270021 -14321581 -9049179 -4584845
39592 -4584845 -2866236 -2207149 -672359 606588 -563454 -3030536 -2821024 1497150
39584 1497150 6540076 8245353 6331954 3538616 1877088 574991 -2919162 -9533592
39576 -9533592 -15356394 -13948951 -4594479 4353944 5178987 1580344 2754273 8043532
39568 8043532 7358152 -1327008 -6226433 453210 9288961 7773901 -296289 -1480582
39560 -1480582 6159466 11567762 8736003 3499462 1134915 -1152974 -5862069 -8900051
39552 -8900051 -6147175 839907 9006944 16744428 19954389 13311296 -134877 -8066762
$$ packed form
39608a0777318k919585k2154K962667L769150J396291j554106j433210J568166
39600g010099L267023P48700l921810o038836l314999J948440N272402M464334
39592d584845J718609O59087J534790J278947j170042k467082K09512M318174
39584A497150N042926J705277j913399k793338j661528j302097l494153o614430
39576i533592n822802J407443R354472Q948423Q25043l598643J173929N289259
39568H043532o85380q685160m899425O679643Q835751j515060q070190j184293
39560a480582P640048N408296k831759n236541k364547k287889m709095l037982
39552h900051K752876O987082Q167037P737484L209961o643093j3446173p931885
$$ plain form
39544 -8066762 -3243173 7093064 11440330 8167375 3786344 2160797 1948383 1485117
39536 1485117 325571 -1869261 -3601836 -1555060 3661411 5568905 436968 -6008049
39528 -6008049 -6163952 -1284073 2038084 3190002 7090627 12979488 12308691 835954
39520 835954 -13225301 -17624060 -9871356 1085564 6019621 5080614 5140560 9291440
39512 9291440 12445021 9162126 2710418 1440215 7026802 12302069 11936390 9033672
39504 9033672 8124423 7584164 3944015 -698276 -1290630 2603691 6625867 7301598 4355548
39495 4355548 -438743 -3531775 -1421639 4664339 8973673 9019946 9249200 13760014 20235601
39486 20235601 25022915 28494669 30309895 25983736 15309149 7666757 9659150 13029177
$$ packed form
39544h066762M823589J0336237M347266l272955m381031j625547k12414m63266
39536A485117j159546k194832j732575K046776N216471J907494n131937o445017
39528f008049j55903M879879L322157J151918L900625N888861o70797j1472737
39520H35954j4061255m398759P752704J0956920M934057r39007N9946M150880
39512I291440L153581l282895o451708j270203N586587N275267l65679k902718
39504I033672r09249n40259l640149m642291n92354L894321M022176O75731k946050
39495D355548m794291l093032K110136O085978M309334M6273K29254M510814O475587
39486B0235601M787314L471754J815226m326159j0674587p642392J992393L370027
$$ plain form
39478 13029177 6060705 -7064919 -11207167 -2974318 5050545 3937498 -836573 -1723611
39470 -1723611 -157165 140574 684599 2669188 2140112 -3030455 -8368775 -10588545 -13091976
39461 -13091976 -17818784 -18784792 -10971336 256462 6283528 7135529 8630931 11508130
39453 11508130 11409282 7508295 3799552 2752935 3557529 5426097 7191908 5272664
39445 5272664 -1900349 -8414129 -6207674 3772596 11437606 9851891 2980050 -666619
39437 -666619 1582617 5018108 4531735 906358 -190883 4705956 11776141 14032722
39429 14032722 10357025 6663393 6602743 5748164 -1016622 -10004465 -12371143 -5930511
39421 -5930511 2222484 5248397 4077671 4000941 7213088 10861954 10968173 6899676 2332654
$$ packed form
39478A3029177o968472j3125624m142248Q232849Q024863j113047m774071q87038
39470a723611J566446K97739N44025J984589n29076n170567n338320k219770k503431
39461a3091976m726808r66008P813456J1227798O027066Q52001J495402K877199
39453A1508130r8848l900987l708743j046617Q04594J868568J765811j919244
39445E272664p173013o513780K206455R980270P665010j585715o871841l646669
39437f66619K249236L435491m86373l625377j097241M896839P070185K256581
39429A4032722l675697l693632o0650q54579o764786q987843k366678O440632
39421e930511Q152995L025913j170726p6730L212147L648866J06219m068497m567022
$$ plain form
39412 2332654 1804544 5955750 10969410 13184451 12705001 11554386 10474690 9481151 9660084
39403 9660084 11836477 14517854 15418677 14335412 12847516 12056445 11924055 11586062 9257586
39394 9257586 3769741 -2499114 -4711214 -1474571 2905539 4318655 4173370 5859559
39386 5859559 8586732 8687765 5484522 2007837 561554 613445 501420 -1124977 -4627168
39377 -4627168 -8237162 -9142353 -7404919 -6405612 -7496163 -7586700 -4763819 -2288819 -3113276
39368 -3113276 -4531822 -3212055 -1352533 -1664925 -422478 6336384 12813321 9828477
39360 9828477 576697 -963573 10031271 20825545 17768009 3701944 -7283407 -6992362
39352 -6992362 996650 8689776 11115255 8441525 5039421 5310169 8286299 8733095
$$ packed form
39412B332654n28110M151206N013660K215041m79450j150615j079696r93539J78933
39403I660084K176393K681377R00823j083265j487896p91071j32390l37993k328476
39394I257586n487845o268855k212100L236643M380110J413116j45285J686189
39386E859559K727173J01033l203243l476685j446283N1891j12025j626397l502191
39377d627168l609994r05191J737434R99307j090551r0537K822881K475000q24457
39368c113276j418546J319767J859522l12392J242447O758862O476937k984844
39360I828477r251780j540270J0994844J0794274l057536j4066065j0985351K91045
39352f992362P989012P693126K425479k673730l402104K70748K976130M46796
$$ plain form
39344 8733095 5085107 2283096 4355205 8811793 11851478 14281741 17420780 17560839
39336 17560839 11062924 2361431 -111526 4623789 8978108 7594187 3608333 2521048
39328 2521048 4509561 5533521 3247546 -759552 -3310559 -2536024 1025790 5385861
39320 5385861 9136174 12163027 14260073 14531739 13134744 11815720 11074004 8699459
39312 8699459 3555887 -800668 589592 7818830 15808431 19723260 18292051 12881969
39304 12881969 6656779 4130066 7596755 13246502 14155908 8411254 1629636 224168
39296 224168 4610854 10436455 14264881 16232419 18451470 22231457 26133013 26463970
39288 26463970 21219461 13753089 10272577 12772531 16689474 16945602 14234337 13466893
$$ packed form
39344H733095l647988k802011K072109M456588L039685K430263L139039J40059
39336A7560839o497915q701493k472957M735315M354319j383921l985854j087285
39328B521048J988513J023960k285975m007098k551007P74535L561814M360071
39320E385861L750313L026853K097046K71666j396995j319024p41716k374545
39312H699459n143572m356555J390260P229238P989601L914829j431209n410082
39304A2881969o225190k526713L466689N649747R09406n744654o781618j405468
39296B24168M386686N825601L828426J967538K219051L779987L901556L30957
39288B6463970n244509p466372l480512K499954L916943K56128k711265p67444
$$ plain form
39280 13466893 17619166 25181155 32641618 37524698 39454045 39648758 39118292 36958756
39272 36958756 31769243 25299836 22312613 25004177 29677537 31408543 30191156 29500629
39264 29500629 30444759 31200703 31322931 32111914 32575748 29788309 24570832 22178676 24872646
39255 24872646 27898089 26104550 20979156 17137614 15039141 12334299 10331420 12980040
39247 12980040 19550840 24084159 23316777 20230353 18143355 16170255 13043453 10868002
39239 10868002 11477877 12628744 11802591 10970695 13282920 17199930 18565917 17154831
39231 17154831 16335504 16780290 15511173 11816312 9438796 11099445 14489246 15954223
39223 15954223 15536441 16085176 19120519 23578232 27607357 30174323 31506367 32562136
$$ packed form
39280A3466893M152273P561989P460463M883080J929347J94713n30466k159536
39272C6958756n189513o469407k987223K691564M673360J731006j217387o90527
39264B9500629R44130P55944J22228P88983M63834k787439n217477k392156K693970
39255B4872646L025443j793539n125394l841542k098473k704842k002879K648620
39247A2980040O570800M533319p67382l086424k086998j973100l126802k175451
39239A0868002O09875J150867q26153q31896K312225L917010J365987j411086
39231A7154831q19327M44786j269117l694861k377516J660649L389801J464977
39223A5954223m17782N48735L035343M457713M029125K566966J332044J055769
$$ plain form
39215 32562136 33358172 32065997 27420684 21930611 20364257 24287949 30007315 32780436
39207 32780436 31467453 28305989 25631196 23614700 20387035 14577860 8690754 8373104
39199 8373104 15745306 25030585 28738783 27046434 25908682 26474146 23422545 15479731
39191 15479731 9950101 12327920 17770952 18869583 16833442 17904439 22197660 23909475
39183 23909475 21167078 18467209 19478244 23485972 28887264 34467048 37297128 35285136
39175 35285136 32183209 34249252 41231988 46367851 46162454 44351709 45179686 49078155
39167 49078155 56653504 70264276 88823404 107124774 123408517 141680233 163516525
39160 163516525 184423654 202591688 223984242 252353687 280327760 297913452 304984917
$$ packed form
39215C2562136P96036j292175m645313n490073j566354L923692N719366K773121
39207C2780436j312983l161464k674793k016496l227665n809175n887106l17650
39199H373104P372202R285279L708198j692349j137752N65464l051601p942814
39191A5479731n529630K377819N443032J098631k036141J070997M293221J711815
39183B3909475k742397k699869J011035M007728N401292N579784K830080k011992
39175C5285136l101927K066043O982736N135863k05397j810745Q27977L898469
39167D9078155P575349J3610772J8559128J8301370J6283743J8271716K1836292
39160A63516525K0907129J8168034K1392554K8369445K7974073J7585692P071465
$$ plain form
39153 304984917 307424179 305387997 295062669 279696475 268812363 266415203 268550169
39146 268550169 272367403 278030502 280395103 269321428 242904788 212102407 186784023
39139 186784023 164413309 138882155 113799457 98117976 92156926 87210136 78479431
39132 78479431 70238790 66797554 65446725 61632562 55809058 50766568 45610550 37519378
39124 37519378 28197080 23381317 24900422 27405492 25533493 21212447 20063705 22397096
39116 22397096 22852964 19359091 17219213 21538031 29350532 32987555 29068683 20878734
39108 20878734 13714621 11064162 13450617 17490272 17676047 12514708 7075334 6047184
39100 6047184 7136679 6097598 5045464 8765565 14631835 14472659 6683017 -1385236
$$ packed form
39153C04984917K439262k036182j0325328j5366194j0884112k397160K134966
39146B68550169L817234N663099K364601j1073675k6416640l0802381k5318384
39139A86784023k2370714k5531154k5082698j5681481n961050m946790q730705
39132G8479431q240641l441236j350829l814163n823504n042490n156018q091172
39124C7519378r322298m815763J519105K505070j871999m321046j148742K333391
39116B2397096M55868l493873k139878M318818P812501L637023l918872q189949
39108B0878734p164113k650459K386455M039655J85775n161339n439374j028150
39100F047184J089495j039081j052134L720101N866270j59176p789642q068253
$$ plain form
39092 -1385236 -4076597 -2737606 657554 6391361 11376052 10287048 6083560 9264925
39084 9264925 20963770 27255819 18677440 5717246 4009420 12342419 18500058 20490038
39076 20490038 25990638 33399406 31013000 17742258 8717611 13726693 23013736 23032385
39068 23032385 15920809 13199918 17616817 22408586 24618399 28209378 34323648 37470039
39060 37470039 33667406 26625464 23086177 24993458 28160880 27352645 21824390 16057406
39052 16057406 14638605 16937496 18834436 19091502 20115695 22102524 22037429 20927063
39044 20927063 25584307 37674480 46226872 39200760 20175016 4837925 957622 928944
39036 928944 -3227151 -6669059 -302486 13461621 22470754 20882336 15464191 14567077
$$ packed form
39092a385236k691361J338991L395160N733807M984691j089004m203488L181365
39084I264925J1698845O292049q578379j2960194j707826Q332999O157639J989980
39076B0490038N500600P408768k386406j3270742r024647N009082R287043J8649
39068B3032385p111576k720891M416899M791769K209813L590979O114270L146391
39060C7470039l802633p041942l539287J907281L167422q08235n528255n766984
39052A6057406j418801K298891J896940K57066J024193J986829o5095j110366
39044B0927063M657244J2090173Q552392p026112j9025744j5337091l880303k8678
39036I28944m156095l441908O366573J3764107R009133j588418n418145q97114
$$ plain form
39028 14567077 17330368 17144698 11354269 3332824 -2679857 -4927608 -3572322 -266639
39020 -266639 2076515 1860654 1015788 2488553 6112793 9287636 10981633 12347826 14011752
39011 14011752 15653624 17620992 19864638 20220798 17356969 14148818 13689124 13670334 10837308
39002 10837308 9383197 16292928 28114413 32561904 26048349 19127939 19928807 23420444
38994 23420444 24180752 27840968 38680227 46214914 38762624 23360353 16319781 18430096
38986 18430096 16571087 8109632 5192747 12233335 16732653 9097515 -2847359 -7241457
38978 -7241457 -4457333 -1588711 -127505 2412372 5572036 7763000 9631864 11037462
38970 11037462 10452276 9960335 13349421 17572446 15928685 11430280 14265435 22619929
$$ packed form
39028A4567077K763291j85670n790429q021445o012681k247751J355286L305683
39020b66639K343154k15861q44866J472765L624240L174843J693997J366193J663926
39011A4011752J641872J967368K243646L56160k863829l208151m59694j8790k833026
39002A0837308j454111O909731J1821485M447491o513555o920410Q00868L491637
38994B3420444P60308L660216J0839259P534687p452290j5402271p040572K110315
38986A8430096j859009q461455k916885P040588M499318p635138j1944874m394098
38978g241457K784124K868622J461206K539877L159664K190964J868864J405598
38970A1037462n85186m91941L389086M223025j643761m498405K835155Q354494
$$ plain form
38962 22619929 21427357 6991685 -3613991 1558252 10036461 6001608 -3731948 -2962013
38954 -2962013 5776260 6882837 -1263995 -5717008 -2335223 101665 -1197922 1463460
38946 1463460 10053888 16644048 18125418 20033487 22826101 18949964 7419911 -2086299
38938 -2086299 -3820747 -2541680 -2339066 -1376509 -825692 -5613365 -12204447 -9466927 2930519
38929 2930519 10787903 6646853 1084597 4454732 10544542 8975393 2624183 757380
38921 757380 3316817 3695426 771537 -2232694 -5340735 -8966896 -9062859 -4022761 -758550
38912 -758550 -4990050 -11208409 -11356801 -7469621 -5899944 -5273631 -1631433 24708 -7269995
38903 -7269995 -17319622 -17029064 -7131196 -2346528 -8776140 -14733443 -9174806 2296792
$$ packed form
38962B2619929j192572j4435672j0605676N172243Q478209m034853r733556P69935
38954b962013Q738273J106577q146832m453013L381785K436888j299587K661382
38946A463460Q590428O590160J481370J908069K792614l876137j1530053r506210
38938b086299j734448J279067K02614R62557N50817m787673o591082K737520J2397446
38929B930519P857384m141050n562256L370135O089810j569149o351210j866803
38921G57380K559437L78609k923889l004231l108041l626161r5963N040098L264211
38912g58550m231500o218359j48392L887180J569677O26313L642198J656141p294703
38903g269995j0049627K90558R897868M784668o429612n957303N558637J1471598
$$ plain form
38895 2296792 7234014 3733535 -269939 76529 2464562 4182360 5994067 8660905
38887 8660905 10276971 9241526 7821634 10104079 15880710 18733965 13037244 2302888
38879 2302888 -3407634 471142 7740100 10448876 8537853 6475440 4559326 -282967
38871 -282967 -6998362 -10061450 -6965101 -1468350 1363979 103562 -3361249 -6302640
38863 -6302640 -6950108 -5646029 -4210440 -3590046 -3678267 -5695237 -11168803 -17120638 -16871928
38854 -16871928 -8759216 198106 2994755 736328 -1876682 -3968376 -5918726 -4643401
38846 -4643401 1140710 4949071 133440 -9383758 -14558082 -14938363 -17127429 -20870106
38838 -20870106 -18120022 -7727338 -40691 -2310453 -8403407 -8663000 -2908902 2365585
$$ packed form
38895B296792M937222l500479m003474L46468K388033J717798J811707K666838
38887H660905J616066j035445j419892K282445N776631K853255n696721j0734356
38879B302888n710522L878776P268958K708776j911023k062413j916114m842293
38871b82967o715395l063088L096349N496751K832329j260417l464811k941391
38863f302640o47468J304079J435589O20394q8221k016970n473566n951835K48710
38854a6871928Q112712Q957322K796649k258427k613010k091694j950350J275325
38846d643401N784111L808361m815631r517198n174324l80281k189066l742677
38838b0870106K750084J0392684P686647k269762o092954k59593N754098N274487
$$ plain form
38830 2365585 4030118 3302386 989948 -2070088 -2646033 1266264 6291243 7741838
38822 7741838 6106303 5089929 4826446 2098028 -2914208 -5063175 -1176836 4761142
38814 4761142 6208082 2672226 799893 5830948 14085134 16951412 12018695 6169141
38806 6169141 5806052 8357395 7662688 4196578 3497419 5948058 5655656 587983 -3373634
38797 -3373634 -1708120 1483619 247290 -3643788 -3720262 753581 3290235 -582628
38789 -582628 -7131175 -9335834 -5462022 -323678 1396945 695835 1514251 3801013 3067968
38780 3067968 -1636812 -3373033 4388917 16982750 21933622 13790821 445989 -7053613
38772 -7053613 -6170184 -1549299 3405625 8648614 13148834 13662906 8911414 2073337
$$ packed form
38830B365585J664533p27732k312438l060036n75945L912297N024979J450595
38822G741838j635535j016374k63483k728418n012236k148967L886339N937978
38814D761142J446940l535856j872333N031055Q254186K866278m932717n849554
38806F169141l63089K551343o94707l466110o99159K450639k92402n067673l961617
38797c373634J665514L191739j236329l891078p6474M473843K536654l872863
38789e82628o548547k204659L873812N138344J720623p01110Q18416K286762p33045
38780C067968m704780j736221P761950J2593833M950872q142801j3344832p499602
38772g053613Q83429M620885M954924N242989M500220N14072m751492o838077
$$ plain form
38764 2073337 -2625344 -4755682 -7461694 -12009599 -14140629 -8504821 2886716 10100594
38756 10100594 5988395 -4877010 -11521552 -9065689 -1839953 4272154 7045603 5789662
38748 5789662 301238 -6244262 -8567884 -6030973 -4020720 -6319709 -10046584 -10522737
38740 -10522737 -7217524 -2354419 2385503 5103437 4007390 1754985 4739267 13578972
38732 13578972 18939428 13017910 1866799 -1163764 6911408 15186304 13999885 6724219
38724 6724219 3309757 7162142 13013753 15471830 15128534 15712029 17845404 17601166 11399392
38715 11399392 1187467 -6841766 -8779503 -6333428 -2945903 770707 5520100 9509215
38707 9509215 9632042 5721587 606041 -3544624 -5970805 -5214169 -316006 5486486
$$ packed form
38764B073337m698681k130338k706012m547905k131030N635808J1391537P213878
38756A0100594m112199j0865405o644542K455863P225736O112107K773449j255941
38748E789662n488424o545500k323622K536911K010253k298989l726875m76153
38740a0522737L305213M863105M739922K717934j096047k252405K984282Q839705
38732A3578972N360456n921518j1151111l030563Q075172Q274896j186419p275666
38724F724219l414462L852385N851611K458077l43296N83495K133375k44238o201774
38715A1399392j0211925q029233j937737K446075L387525L716610M749393L989115
38707I509215J22827l910455n115546m150665k426181P56636M898163N802492
$$ plain form
38699 5486486 6516931 1856234 -2731811 -2304895 968022 1777927 -961118 -4325024
38691 -4325024 -6612079 -7782607 -5994992 754596 9011165 11472859 6578647 1616064
38683 1616064 2701957 6051464 4345437 -1641621 -4665348 -2863875 -2067828 -4949652
38675 -4949652 -5691705 327494 7795719 8539365 3391075 282420 2440787 5266882
38667 5266882 4872317 3284899 3272303 3091823 -307531 -5693885 -8338146 -5488602 759076
38658 759076 5736934 6594227 4640470 3294648 3662724 3497528 1460194 295076 3233398
38649 3233398 8569804 10972530 7999350 2735085 -109560 1206790 4376675 4802064
38641 4802064 -620615 -9463111 -14757988 -12258600 -5175339 620923 3628763 5607292
$$ packed form
38699E486486J030445m660697m588045M26916L272917Q09905k739045l363906
38691d325024k287055j170528J787615O749588Q256569K461694m894212m962583
38683A616064J085893L349507j706027n987058l023727J801473P96047k881824
38675d949652p42053O019199P468225P43646n148290l108655K158367K826095
38667E266882l94565j587418j2596j80480l399354n386354k644261K849544O247678
38658G59076M977858Q57293j953757j345822L68076j65196k037334j165118K938322
38649C233398N336406K402726k973180n264265k844645J316350L169885M25389
38641D802064n422679q842496n294877K499388P083261N796262L007840J978529
$$ plain form
38633 5607292 6433741 5216420 4505320 7379022 11270089 10875582 6883874 5314879 7919402
38624 7919402 10152437 9755264 9998324 12051835 11391062 5549857 -814500 -2878502 -2235792
38615 -2235792 -2165743 -1455468 2128912 6438158 7868684 6224394 2592288 -3646744 -11372804
38606 -11372804 -15605597 -13964955 -11386860 -12841185 -14883826 -10716438 -1078922 6312637
38598 6312637 6677936 1724417 -5384722 -12786198 -18155591 -19356257 -16926623 -12502683
38590 -12502683 -6412742 -658704 -1126057 -10530710 -20970755 -20693855 -8410686 5358986
38582 5358986 11523552 10793295 8116074 5445091 2686696 821286 1015700 3490568
38574 3490568 8369358 14433073 17074633 12223515 2924071 -3130452 -3622731 -3535342 -5650647
$$ packed form
38633E607292Q26449j217321p11100K873702L891067l94507l991708j568995K604523
38624G919402K233035l97173K43060K053511o60773n841205o364357k064002O42710
38615b235792P0049P10275L584380M309246J430526j644290l632106o239032p726060
38606a1372804m232793J640642K578095j454325k042641M167388R637516P391559
38598F312637L65299m953519p109139p401476n369393j200666K429634M423940
38590a2502683O089941N754038m67353r404653j0440045K76900J2283169J3769672
38582E358986O164566p30257k677221k670983k758395j865410J94414K474868
38574C490568M878790O063715K641560m851118r299444o054523m92279Q7389k115305
$$ plain form
38565 -5650647 -6011826 -2413160 -768906 -7095459 -17725541 -24046698 -24056605 -22590570 -21870590
38556 -21870590 -18976459 -12826273 -6881941 -2988809 1795496 9200159 15174289 15250821
38548 15250821 11152206 7665247 5354757 1582147 -2370883 -1391493 4930645 9551233
38540 9551233 7097414 1280665 -1346072 -1472508 -4713595 -10949577 -13360125 -9363816
38532 -9363816 -5754031 -9069417 -15501463 -15433879 -6093790 4577144 6481935 -2544207
38524 -2544207 -14859609 -19949658 -14115674 -4029735 602914 -2152698 -5569341 -4165591
38516 -4165591 -305320 770241 -1695054 -4594308 -5839392 -5592346 -4947920 -5595169 -8287315
38507 -8287315 -10322504 -8223940 -4021488 -3500720 -6520511 -6450470 -2725547 -4696998 -15825471
$$ packed form
38565e650647l61179L598666J644254o326553j0630082o321157r907J466035P19980
38556b1870590K894131O150186N944332L893132M784305P404663N974130P6532
38548A5250821m098615l486959k310490l772610l953030R79390O322138M620588
38540I551233k453819n816749k626737j26436l241087o235982k410548L996309
38532i363816L609785l315386o432046O7584R340089J0670934J904791r026142
38524b544207j2315402n090049N833984J0085939M632649k755612l416643J403750
38516d165591L860271J075561k465295k899254j245084K47046O44426o47249k692146
38507h287315k035189K098564M202452N20768l019791P0041L724923j971451j1128473
$$ plain form
38498 -15825471 -23216131 -14142275 3662918 11782726 7260373 3722098 7096907 6975895
38490 6975895 -3306162 -13140788 -10032748 2369035 11280247 11955115 8397061 3015965
38482 3015965 -4411841 -10675168 -10939608 -5689417 361974 4965980 8767711 10951423
38474 10951423 9754867 6117570 2624833 396120 291490 4103328 10470709 13350977
38466 13350977 9828727 5833081 7834714 12296154 11113931 5094220 2741858 5911043
38458 5911043 6516797 96866 -6248793 -4387265 3029987 7022187 3933565 -3018244
38450 -3018244 -10375734 -16616284 -19552136 -17448372 -12771265 -10305718 -10961921 -11015500 -8079043
38441 -8079043 -4421461 -3207661 -4344492 -5618394 -5668115 -4211516 -1356365 1497025
$$ packed form
38498a5825471p390660R073856J7805193Q119808m522353l538275L374809j21012
38490F975895j0282057r834626L108040J2401783Q911212O74868l558054n381096
38482C015965p427806o263327k64440N250191O051391M604006L801731K183712
38474A0951423j196556l637297l492737k228713j04630L811838O367381K880268
38466A3350977l522250l995646K001633M461440j182223o019711k352362L169185
38458E911043O05754o419931o345659J861528P417252L992200l088622o951809
38450c018244p357490o240550k935852K103764M677107K465547o56203n3579K936457
38441h079043L657582J213800j136831j273902m9721J456599K855151K853390
$$ plain form
38433 1497025 1955633 24692 -560917 2716714 6159730 3480626 -5748754 -15026863
38425 -15026863 -18813019 -17490966 -13250901 -5861842 4006940 11145569 10599893 4536183
38417 4536183 -115752 31952 2758044 5204885 6291234 4853474 495991 -3499148
38409 -3499148 -3150778 -282420 -818906 -5552680 -8426239 -6087693 -2970319 -3246763 -3687552
38400 -3687552 58025 4836324 4409277 -325720 -2654553 -678096 147427 -4080161
38392 -4080161 -9990808 -12075358 -9154328 -3439258 3327062 9873002 13723895 12724174
38384 12724174 8069140 3924752 3471381 6021935 8554085 9628055 10403066 11167202
38376 11167202 9103277 2476023 -4319137 -4680888 681211 3592544 155454 -2996230
$$ packed form
38433A497025M58608j930941n85609L277631L443016k679104r229380r278109
38425a5026863l786156J322053M240065P389059R868782P138629n45676o063710
38417D536183m651935J47704K726092K446841J086349j437760m357483l995139
38409c499148L48370K868358n36486m733774k873559K338546L117374k76444m40789
38400c687552L745577M778299m27047m734997k328833J976457Q25523m227588
38392d080161n910647k084550K921030N715070O766320O545940L850893r99721
38384A2724174m655034m144388m53371K550554K532150J073970P75011P64136
38376A1167202k063925o627254o795160l61751N362099K911333l437090l151684
$$ plain form
38368 -2996230 1274918 9185960 11104344 5071630 -1851399 -4507029 -4848507 -6087804
38360 -6087804 -8132165 -9835304 -10183280 -6668025 1439748 7610725 3281176 -9270806
38352 -9270806 -16980953 -12644715 -3850969 -86528 1097016 6797317 14024447 13341412
38344 13341412 4797883 -1043774 1016296 3919028 636026 -4997909 -4971731 1089651
38336 1089651 6371115 5850623 393510 -5793226 -8319235 -5366439 -205882 1205644
38328 1205644 -2391996 -5242079 -2171387 4748440 10301158 13092034 13872268 10599638
38320 10599638 1788469 -6994619 -7361255 593896 7593820 7143510 2229038 -1834532
38312 -1834532 -4852117 -8252735 -9666339 -6551529 -1963077 -1037668 -3274461 -3428480
$$ packed form
38368b996230M271148P911042J918384o032714o923029k655630l41478j239297
38360f087804k044361j703139l47976L515255Q107773O170977m329549j2551982
38352i270806p710147M336238Q793746L764441J183544N700301P227130o83035
38344A3341412q543529n841657K060070K902732l283002n633935K6178O061382
38336A089651N281464n20492n457113o186736k526009K952796N160557J411526
38328A205644l597640k850083L070692O919827N552718K790876P80234l272630
38320A0599638q811169q783088l66636P955151O999924m50310m914472m063570
38312a834532l017585l400618j413604L114810M588452R25409k236793j54019
$$ plain form
38304 -3428480 401055 4212701 4149726 1300065 -808097 -845862 -353507 -1232128 -3586874
38295 -3586874 -5482306 -4784717 -1763517 843234 1237869 921115 2209503 4588385 5663096
38286 5663096 5055924 4907982 6393022 7899442 7385636 5041568 2741573 1674628 1260555
38277 1260555 202094 -1812256 -3742837 -4538938 -4114278 -2520432 436696 3292223
38269 3292223 2602564 -2257096 -5542899 -1323876 7108892 10142782 5409769 1440397
38261 1440397 4432992 8761359 6752573 1535845 1656392 7001219 9623318 6781218
38253 6781218 3539322 2285945 -1017847 -8253605 -15093493 -18367523 -20263913 -22077187
38245 -22077187 -20611481 -14528071 -8033416 -4230060 -720049 3855763 5027906 -160345
$$ packed form
38304c428480L829535L811646o2975k849661k108162l7765M92355q78621k354746
38295c586874j895432O97589L021200K606751L94635l16754J288388K378882J074711
38286E663096o07172j47942J485040J506420n13806k344068k299995j066945m14073
38277A260555j058461k014350j930581p96101M24660J593846K957128K855527
38269C292223o89659m859660l285803M219023Q432768L033890m733013l969372
38261A440397K992595M328367k008786n216728J20547N344827K622099k842100
38253F781218l241896j253377l303792p235758o839888l274030j896390j813274
38245b2077187J465706O083410O494655L803356L510011M575812J172143n188251
$$ plain form
38237 -160345 -6397305 -7258544 -4784498 -4600620 -4903913 776510 10609079 13648031 5037812
38228 5037812 -5239593 -4474354 5766714 11335097 4087443 -7265792 -8576891 1040358
38220 1040358 8268065 3637791 -6457500 -10050054 -6015490 -2587160 -2700738 -543524
38212 -543524 6698947 13007945 12840670 8699192 5164360 2013017 -1895242 -4018389
38204 -4018389 -3091086 -3323530 -7464033 -10472789 -7025464 -1222885 -927324 -5100348 -5196327
38195 -5196327 1564903 8190591 8022173 2397754 -3097670 -4707746 -1642061 3940467
38187 3940467 6694396 2382464 -5706117 -8409482 -1029831 10550004 16124692 12087298
38179 12087298 4634136 2455732 6744771 9330207 2538958 -9739012 -15105577 -8163407
$$ packed form
38237a60345o236960q61239K474046J83878l03293N680423R832569L038952q610219
38228E037812j0277405P65239J0241068N568383p247654j1353235j311099R617249
38220A040358P227707m630274j0095291l592554M034564L428330j13578K157214
38212e43524P242471O308998j67275m141478l534832l151343l908259k123147
38204d018389R27303k32444m140503l008756L447325N802579K95561m173024r5979
38195e196327O761230O625688j68418n624419n495424j610076L065685N582528
38187C940467K753929m311932q088581k703365P379651J1579835N574688m037394
38179A2087298p453162k178404M289039K585436o791249j2277970n366565O942170
$$ plain form
38171 -8163407 2229615 4832790 125269 -2976881 -308388 4757054 9084441 12400780
38163 12400780 12861933 7820060 64911 -3364740 -331480 3910623 4745729 3335896
38155 3335896 2207506 1182618 174852 1446494 6111207 11342505 13035914 9110362
38147 9110362 14141 -10841057 -17424334 -16098485 -10474912 -7026363 -6148932 -2858436
38139 -2858436 3568034 7021815 3230191 -4653472 -10830510 -11871083 -5947453 6142602
38131 6142602 17108305 17770291 9140576 2859651 5407260 9463757 6697870 1199619
38123 1199619 1592690 6081650 6184340 1969128 1817479 7073757 8426451 1052446 -6210279
38114 -6210279 -3039590 7268229 12018279 5597504 -4678601 -8679695 -4142104 3853924
$$ packed form
38171h163407J0393022K603175m707521l102150K668493N065442M327387L316339
38163A2400780M61153n041873p755149l429651L033260M242103Q35106j409833
38155C335896j128390j024888j007766J271642M664713N231298J693409l925552
38147I110362r096221j0855198o583277J325849N623573L448549Q77431L290496
38139b858436O426470L453781l791624p883663o177038j040573N923630J2090055
38131F142602J0965703O61986q629715o280925K547609M056497k765887n498251
38123A199619L93071M488960J02690m215212j51649N256278J352694p374005p262725
38114f210279L170689J0307819M750050o420775j0276105m001094M537591P996028
$$ plain form
38106 3853924 9878822 11852978 10078829 6214391 3175598 3048430 4121943 2608552
38098 2608552 -1335798 -2515286 1743713 6445873 5954467 3260851 5644907 12472666
38090 12472666 15382546 11312127 6474745 4493617 91209 -9386107 -14989389 -8101994
38082 -8101994 4703636 9680749 5519689 3408251 8220245 11662010 6899224 -772856
38074 -772856 -3355807 -1886102 -1989717 -3729077 -3171638 -353563 1208486 865264 701223
38065 701223 515972 -1403624 -3441381 -2316729 528393 2721 -4248427 -6323430 -3291428
38056 -3291428 -568208 -3951299 -10262263 -11339569 -5501559 539010 1170546 -1855184
38048 -1855184 -4064236 -4662960 -5541766 -7119305 -8494567 -9697783 -10661454 -9664412 -6111227
$$ packed form
38106C853924O024898J974156j774149l864438l038793j27168J073513j513391
38098B608552l944350j179488M258999M702160m91406k693616K384056O827759
38090A2472666K909880m070419m837382j981128m402408r477316n603282O887395
38082h101994J2805630M977113m161060k111438M811994L441765m762786p672080
38074g72856k582951J469705j03615j739360N57439K818075J562049l43222j64041
38065G01223j85251j919596k037757J124652K845122n25672m251148k075003L032002
38056c291428K723220l383091o310964j077306N838010O040569O31536l025730
38048a855184k209052n98724q78806j577539j375262j203216r63671R97042L553185
$$ plain form
38039 -6111227 -3258325 -4160908 -6069514 -3842604 1185932 1632472 -4885817 -11013461
38031 -11013461 -9836687 -4982148 -5068626 -11098157 -15583256 -13253303 -6837288 -1900630
38023 -1900630 -1088093 -4399349 -10160191 -13883149 -10801125 -2327616 3826194 3117981
38015 3117981 216641 1661261 5704585 5128755 -992703 -4647983 267831 9171428
38007 9171428 12133991 5641794 -3963801 -7814656 -3069825 5411149 10281197 8614680
37999 8614680 4445397 4201674 9507030 15716461 17952053 16485593 14582438 13057842
37991 13057842 9883687 4488092 -524537 -2344605 -567109 3386687 7412737 9066508
37983 9066508 7055367 3181303 1046614 2333709 6057441 11212887 17043514 20213279
$$ packed form
38039f111227K852902r02583j908606K226910N028536M46540o518289o127644
38031a1013461J176774M854539q6478o029531m485099K329953O416015M936658
38023a900630Q12537l311256n760842l722958L082024Q473509O153810p08213
38015C117981k901340J444620M043324n75830o121458l655280M915814Q903597
38007I171428K962563o492197r605595l850855M744831Q480974M870048j666517
37999H614680m169283k43723N305356O209431K235592j466460j903155j524596
37991A3057842l174155n395595n012629j820068J777496L953796M026050J653771
37983I066508k011141l874064k134689J287095L723732N155446N830627L169765
$$ plain form
37975 20213279 16032178 5297925 -3328984 -1716691 8491368 18312112 21552725 18736175
37967 18736175 12343681 3608570 -4894533 -8614455 -6546646 -4597295 -9350068 -19181775
37959 -19181775 -25134806 -21225237 -10984928 -2308331 1571053 3100546 4230890 3879926
37951 3879926 2156860 2108673 4253067 3738639 -2134680 -7026011 -3109032 6049636 8395125
37942 8395125 60749 -9272241 -10670205 -7274825 -6111590 -6243952 -2883585 2135907
37934 2135907 3065248 697498 1452086 6808118 11177356 10395292 5965750 764544 -3704451
37925 -3704451 -5812838 -4928705 -3629956 -3846357 -2487252 3046630 7395836 3487895
37917 3487895 -5111355 -7675630 -2347114 1661078 -259743 -1288089 3571561 7945330
$$ packed form
37975B0213279m181101j0734253q626909J612293J0208059R820744L240613k816550
37967A8736175o392494q735111q503103l719922K067809J949351m752773r831707
37959a9181775n953031L909569J0240309Q676597L879384J529493J130344l50964
37951C879926j723066m8187K144394n14428n873319m891331L916979R158668K345489
37942H395125q334376r332990j397964L395380J163235j32362L360367N019492
37934B135907R29341k367750P54588N356032M369238p82064m429542n201206m468995
37925c704451k108387Q84133J298749k16401J359105N533882M349206l907941
37917C487895q599250k564275N328516M008192j920821j028346M859650M373769
$$ plain form
37909 7945330 4871117 -1255464 -1816328 2903746 5990468 5175793 3998862 4179627 3740233
37900 3740233 1677363 -562333 -1483867 -340003 2520134 3921114 -53046 -7856250
37892 -7856250 -12712353 -11634549 -8938940 -7876931 -5530452 -430819 2297429 -112541
37884 -112541 -1148270 4869368 12213343 12724762 9664684 11517972 16119482 13499336
37876 13499336 3035422 -4768025 -4359055 -1303442 -230197 2278603 8813842 14750403
37868 14750403 15692936 13645068 11176402 6588441 -172875 -3377651 849469 7626351
37860 7626351 9715044 7326443 6460447 9924412 14465669 15711600 13089129 10331453
37852 10331453 11626162 15780390 15486964 6170940 -5810055 -9553349 -3661434 3037809
$$ packed form
37909G945330l074213o126581n60864M720074L086722q14675j176931J80765m39394
37900C740233k062870k239696r21534J143864K860137J400980l974160p803204
37892g856250m856103J077804K695609J062009K346479N099633K728248k409970
37884a12541j035729O017638P343975N11419l060078J853288M601510k620146
37876A3499336j0463914p803447M08970L055613J073245K508800O535239N936561
37868A4750403R42533k047868k468666m587961o761316l204776M227120O776882
37860G626351K088693k388601q65996L463965M541257J245931k622471k757676
37852A0331453J294709M154228k93426r316024j1980995l743294N891915O699243
$$ plain form
37844 3037809 4921597 5061755 5495918 2143967 -5532717 -9238011 -3714500 3787755
37836 3787755 4471296 1675535 3547365 7525951 4347929 -4860456 -8323151 -1591466
37828 -1591466 5657524 4111051 -3644586 -10454116 -14587026 -16434980 -12759212 -2084379
37820 -2084379 8890184 12298599 10157522 11059918 16759042 19133807 11597449 -2163178
37812 -2163178 -12995335 -15827735 -12373469 -7599488 -5891479 -8534281 -12785444 -14495943
37804 -14495943 -12541486 -9244536 -6383958 -3624675 -1490338 -1964987 -4101430 -3204022
37796 -3204022 1940736 4753051 -904937 -10603299 -13772128 -7463178 860909 4681733
37788 4681733 5551037 6756848 6858786 3894972 634681 350585 1098218 -656920 -3642928
$$ packed form
37844C037809J883788J40158M34163l351951p676684l705294N523511P502255
37836C787755O83541k795761J871830L978586l178022r208385l462695O731685
37828a591466P248990j546473p755637o809530m132910j847954L675768J0674833
37820b084379J0974563L408415k141077R02396N699124K374765p536358j3760627
37812b163178j0832157k832400L454266M773981J708009k642802m251163j710499
37804a4495943J954457L296950K860578K759283K134337m74649k136443Q97408
37796c204022N144758K812315n657988r698362l168829O308950Q324087L820824
37788D681733Q69304J205811J01938k963814l260291k84096P47633j755138k986008
$$ plain form
37779 -3642928 -3999133 -1394619 2007517 6329573 12307705 16653040 14904620 8181021
37771 8181021 1868910 -1673472 -3855951 -4274608 -716277 4965232 7277749 4841289
37763 4841289 2259676 2761451 4382637 5262859 6973277 9593202 8789332 2099921 -5560900
37754 -5560900 -7169490 -2428799 2151718 988267 -4938870 -9356374 -6856418 803535
37746 803535 5020134 -158169 -9627188 -12863688 -7653646 -1885445 -377656 2410017
37738 2410017 12037624 22904303 24144796 13409392 -1029384 -9759852 -9190784 -1611346
37730 -1611346 6719124 9376015 5949583 2535313 2849171 2854403 -1035407 -3608076 1352599
37721 1352599 8703224 7639890 -1199499 -5378737 618480 7152757 4891823 -973200
$$ packed form
37779c642928l56205K604514L402136M322056N978132M345335j748420o723599
37771H181021o312111l542382k182479m18657L558331N681509K312517k436460
37763D841289k581613N01775J621186Q80222J710418K619925q03870o689411p660821
37754e560900j608590M740691M580517j163451n927137m417504K499956P659953
37746H03535M216599n178303r469019l236500N210042N768201J507789K787673
37738B410017R627607J0866679J240493j0735404j4438776q730468N69068P579438
37730a611346Q330470K656891l426432l414270L13858N232l889810k572669M960675
37721A352599P350625j063334q839389m179238N997217O534277k260934n865023
$$ plain form
37713 -973200 320514 8619651 14243155 12303806 7142947 3810610 2688142 2752673 3748617
37704 3748617 4010517 1240664 -3419722 -6312906 -6607982 -6110940 -3853669 2724380 9793106
37695 9793106 7938697 -4592067 -16076760 -15508266 -7846990 -6875659 -15492350 -22480072
37687 -22480072 -19080957 -9492881 -1996218 2021854 4937071 5327787 661581 -5849811
37679 -5849811 -7858552 -4278235 8403 1080303 -702100 -3515560 -5911179 -6007174
37671 -6007174 -2545211 3072525 8291630 12024924 13294501 9529490 365204 -8567964
37663 -8567964 -10595887 -6030651 -749466 2104005 3753904 4328503 2482161 623991
37655 623991 3282061 8678423 9153693 2795403 -2407516 -152231 4938814 5093075 908699
$$ packed form
37713i73200J293714Q299137N623504j939349n160859l332337j122468O4531R95944
37704C748617K61900k769853m660386k893184k95076M97042K257271O578049P068726
37695I793106j854409j2530764j1484693N68494P661276R71331q616691o987722
37687b2480072L399115R588076P496663M018072K915217L90716m666206o511392
37679e849811k008741L580317M286638J071900j782403k813460k395619r5995
37671f007174L461963N617736N219105L733294J269577l765011r164286q933168
37663h567964k027923M565236N281185K853471J649899N74599j846342j858170
37655F23991K658070N396362M75270o358290n202919K255285N091045J54261m184376
$$ plain form
37646 908699 -1452965 -656570 -636607 -2634428 -3495864 -1527718 1478861 4266435 7448296
37637 7448296 10258825 10085717 6558048 3303840 4248397 9416564 14815068 15934852
37629 15934852 12008995 7070842 5260076 5300252 2956400 -788565 434248 7760831
37621 7760831 12551461 8007848 189555 -166453 6588931 10445499 7662879 5290841
37613 5290841 8019048 10121377 5447789 -2033082 -4553145 -2767415 -4135743 -10716969
37605 -10716969 -15530560 -12354842 -4366865 -223988 -3502723 -8718435 -8367834 -2562510
37597 -2562510 714952 -3819027 -10481621 -9079653 895099 8135865 3977970 -6226387
37589 -6226387 -11059854 -8525939 -6510692 -8942304 -9829341 -3973409 3377063 3558769
$$ packed form
37646I08699k361664P96395J9963j997821q61436J968146L006579K787574L181861
37637G448296K810529j73108l527669l254208R44557N168167N398504J119784
37629A5934852l925857m938153j810766M0176k343852l744965J222813P326583
37621G760831M790630m543613p818293l56008O755384L856568k782620k372038
37613E290841K728207K102329m673588p480871k520063J785730j368328o581226
37605a0716969m813591L175718P987977M142877l278735n215712L50601N805324
37597b562510L277462m533979o662594J401968R974752P240766m157895j0204357
37589f226387m833467K533915K015247k431612q87037N855932P350472J81706
$$ plain form
37581 3558769 -2755070 -6738098 -4153852 -221897 -837780 -4884725 -7742373 -7566849
37573 -7566849 -4896920 -247201 4077414 3558842 -2516512 -7743853 -6415548 -1791909
37565 -1791909 -578774 -1796849 1044412 7762625 10585374 6770347 3068747 4134711
37557 4134711 5110755 1262839 -2661933 -239588 5059909 4611877 -2203565 -7729034
37549 -7729034 -7540170 -5055544 -4993770 -8150450 -12524162 -14869847 -12153606 -6104865 -4277694
37540 -4277694 -10948267 -19216460 -18980867 -10808856 -3814664 -1098152 2843616 9471801
37532 9471801 11739636 6026577 -1024533 -3128595 -3705017 -8092248 -13317238 -13116742
37524 -13116742 -8023586 -3084942 268542 2854518 2224214 -3466378 -8958109 -7618104
$$ packed form
37581C558769o313839l983028K584246L931955o15883m046945k857648J75524
37573g566849K669929M649719M324615n18572o075354n227341J328305M623639
37565a791909J213135j218075K841261O718213K822749l815027l701600J065964
37557D134711R76044l847916l924772K422345N299497m48032o815442n525469
37549g729034J88864K484626O1774l156680m373712k345685K716241O048741J827171
37540d277694o670573q268193K35593Q172011O994192K716512L941768O628185
37532I471801K267835n713059p051110k104062n76422m387231n224990K00496
37524a3116742N093156M938644L353484K585976o30304n690592n491731J340005
$$ plain form
37516 -7618104 -1961783 -239716 -3651218 -5634750 -3765299 -3103419 -6096301 -8196467
37508 -8196467 -6734610 -5702738 -7171899 -5862413 1419436 7459342 3625802 -6824821
37500 -6824821 -12388849 -8517979 -2244890 -2019216 -8502210 -15570809 -16300346 -8405472
37492 -8405472 2802667 8348582 5930520 3457308 7615826 12967144 9957333 589870
37484 589870 -4097528 -1528293 -983646 -7088227 -11648412 -7689453 -1116550 -108371
37476 -108371 -1522125 1958738 7402440 5777748 -2648873 -7951909 -4648699 3211661
37468 3211661 10549358 15811733 16965184 12020712 4906473 2671185 5259824 5809534
37460 5809534 2530667 1729584 6262747 9488959 5260727 -2885387 -7299036 -5623723
$$ packed form
37516g618104N656321J722067l411502j983532J869451O61880k992882k100166
37508h196467J461857J031872j469161J309486P281849O039906l833540j0450623
37500f824821n564028L870870O273089K25674o482994p068599p29537P894874
37492h405472J1208139N545915k418062k473212M158518N351318l009811r367463
37484E89870m687398K569235N44647o104581m560185L958959O572903J008179
37476a08371j413754L480863N443702j624692q426621n303036L303210P860360
37468C211661P337697N262375J153451m944472p114239k235288K588639N49710
37460E809534l278867q01083M533163L226212m228232q146114m413649J675313
$$ plain form
37452 -5623723 -743702 3601430 3962135 -608633 -4612519 -604957 9281678 13609201
37444 13609201 7633395 1054540 3672406 10946957 11979169 5713264 -213037 -2658886
37436 -2658886 -5309141 -9747833 -13069360 -14062435 -14508647 -14260459 -11030795 -5149664 124967
37427 124967 2287042 -37355 -7566851 -16608432 -18650128 -10012196 1463790 6313074
37419 6313074 6458049 9897252 15497898 13754123 2527134 -8403708 -10722984 -6962204
37411 -6962204 -3883837 -3909292 -5921477 -8186490 -7942579 -3692626 472744 -1349230 -7722744
37402 -7722744 -10997937 -8593573 -5744699 -5412095 -3830414 728819 3104038 7594
37394 7594 -3450686 -1465428 4125770 8461676 11011644 12675901 10701817 2957897 -6308910
$$ packed form
37452e623723M880021M345132L60705m570768m003886M007562R886635M327523
37444A3609201n975806o578855K617866P274551J032212o265905n926301k445849
37436b658886k650255m438692l321527r93075m46212K48188L229664N881131N274631
37427A24967K162075k324397p529496r041581k041696Q637932J1475986M849284
37419F313074J44975L439203N600646j743775j1226989j0930842k319276L760780
37411f962204L078367k5455k012185k265013K43911M249953M165370j821974o373514
37402g722744l275193K404364K848874L32604J581681M559233K375219l096444
37394G594l458280J985258N591198M335906K549968J664257j974084p743920r266807
$$ plain form
37385 -6308910 -10917738 -10273654 -7625726 -4018499 837096 4545580 4406235 1906628
37377 1906628 -28595 -2468637 -8333800 -16126026 -20394230 -18077988 -11195028 -4026944
37369 -4026944 -41592 -35756 -1193631 -217185 936963 -3599789 -13749229 -20032002 -15025743
37360 -15025743 -4003893 2216783 1751376 1562748 4893104 7164909 4861338 771117
37352 771117 -1751005 -3318488 -4516859 -3062534 1316395 3694050 74211 -6249319
37344 -6249319 -8788395 -6465655 -3891940 -3875623 -3984702 -1471733 1846530 2069138 -960775
37335 -960775 -3023144 -1091917 2353315 2108406 -3209293 -9019466 -9750794 -4969356 479317
37326 479317 2196649 878234 295381 1246313 -94378 -6043320 -11743615 -10002847 -2034335
$$ packed form
37385f308910m608828O44084K647928L607227M855595L708484j39345k499607
37377A906628j935223k440042n865163p792226m268204K316242O882960P168084
37369d026944L985352N836j157875R76446J154148m536752j0149440o282773N006259
37360a5025743J1021850O220676m65407j88628L330356K271805k303571m090221
37352G71117k522122j567483j198371J454325M378929K377655l619839o323530
37344f249319k539076K322740K573715J6317j09079K512969L318263K22608l029913
37335i60775k062369J931227L445232k44909n317699n810173p31328M781438N448673
37326D79317J717332j318415n82853R50932j340691n948942n700295J740768P968512
$$ plain form
37317 -2034335 2043520 -3453526 -10848129 -9108690 529528 6300373 2351683 -4440041
37309 -4440041 -5688825 -2276090 -299246 -1873195 -4408750 -5184820 -2685163 3344081
37301 3344081 9627165 10480069 4843708 -1152141 -2438632 -1901723 -4006769 -5473631
37293 -5473631 254564 10762648 15130261 8374077 -1270579 -3060826 2878501 7150719
37285 7150719 3475346 -4687406 -9163168 -5562260 3318302 10282245 9571753 1885045
37277 1885045 -5572238 -5422248 2487986 10930085 13118601 9090193 3253096 -1649852
37269 -1649852 -4953483 -4963516 -1014407 2154077 -821177 -5481868 -273721 15943249
37261 15943249 27646219 21763682 6136966 -1398042 2509036 5471454 515762 -5004969
$$ packed form
37317b034335M077855n497046p394603J739439R638218N770845l948690o791724
37309d440041j248784L412735J976844j573949k535555p76070K499657O029244
37301C344081O283084Q52904n636361n995849j286491N36909k105046j466862
37293e473631N728195J0508084M367613o756184r644656j790247N939327M272218
37285G150719l675373q162752m475762L600908Q880562O963943p10492p686708
37277A885045p457283J49990P910234Q442099K188516m028408n837097m902948
37269a649852l303631j0033L949109L168484k975254m660691N208147J6216970
37261A5943249J1702970n882537j5626716p535008L907078K962418m955692n520731
$$ plain form
37253 -5004969 -3322044 3158940 8895224 12269656 11600582 4468581 -4117626 -3303692
37245 -3303692 7548425 14213880 6639115 -6257991 -9442069 -1703983 6499198 8741258
37237 8741258 6758854 3871244 2777653 5488062 8562157 4457180 -5642008 -8940571
37229 -8940571 66454 7896213 1788087 -8847907 -7237364 2607752 2987875 -6561697
37221 -6561697 -8628142 911628 5080992 -4209807 -11036117 -2270691 9828972 7776362
37213 7776362 -3133087 -4990224 4339425 11318846 9931041 7422550 8308471 7910262
37205 7910262 3356183 -1153193 -2674705 -3739799 -5965237 -7263512 -7315554 -8885854
37197 -8885854 -11939389 -12642765 -9797904 -6697743 -5350980 -4217097 -2744152 -2804800 -4415162
$$ packed form
37253e004969J682925O480984N736284L374432o69074p132001q586207Q13934
37245c303692J0852117O665455p574765j2897106l184078P738086Q203181K242060
37237H741258j982404k887610j093591K710409L074095m104977j0099188l298563
37229h940571R007025P829759o108126j0635994J610543R845116L80123r549572
37221f561697k066445R539770M169364r290799o826310Q765426J2099663k052610
37213G776362j0909449j857137R329649O979421j387805k508491Q85921l98209
37205G910262m554079m509376j521512j065094k225438j298275n2042j570300
37197h885854l053535p03376K844861L100161J346763J133883J472945o0648j610362
$$ plain form
37188 -4415162 -5167023 -5036507 -6503737 -8754639 -7608516 -3185378 -1595163 -5720848
37180 -5720848 -9815024 -7717595 -2078895 -154174 -3237906 -5704100 -3457738 1367529
37172 1367529 4249927 3346606 234942 -2099518 -1746316 176493 445475 -2151403 -4749428
37163 -4749428 -4076376 -717778 2456020 4596793 6746586 8526201 8246078 5812073
37155 5812073 2393650 -2152362 -7924656 -11747889 -10011715 -4906027 -2477698 -3470202
37147 -3470202 -2375718 1961172 2182968 -5711633 -13062440 -9560643 763510 4686691
37139 4686691 -714930 -4816521 -1208513 2540053 -1602853 -8021134 -5516977 5532444
37131 5532444 13079450 9225268 -1002206 -7315920 -5543405 86157 3064521 1643229
$$ packed form
37188d415162p51861J30516j467230k250902J146123M423138J590215m125685
37180e720848m094176K097429N638700J924721l083732k466194K246362M825267
37172A367529K882398r03321l111664k334460L53202J922809K68982k596878k598025
37163d749428O73052L358598L173798K140773K149793J779615k80123k434005
37155E812073l418423m546012n772294l823233J736174N105688K428329r92504
37147c470202J094484M336890K21796p894601p350807L501797J0324153L923181
37139D686691n401621m101591L608008L748566m142906o418281K504157J1049421
37131E532444P547006l854182j0227474o313714J772515N629562K978364j421292
$$ plain form
37123 1643229 304245 3648913 9301817 10354897 5703142 2555598 5123028 6488297
37115 6488297 -1423927 -13364580 -15072390 -2073470 13954598 20001394 16194762 11624510
37107 11624510 11158967 12134516 11593957 10758888 11500720 12413404 10840430 7284829 5378979
37098 5378979 7152165 9988504 9595911 5192141 93036 -2577338 -2948162 -3142715 -4857184
37089 -4857184 -8326623 -11620372 -10862634 -3711102 6947607 15318076 18813631 18792786
37081 18792786 15706089 8577933 78678 -4071995 -3390214 -4219505 -9328763 -12456663
37073 -12456663 -8925967 -5425453 -10819182 -21123408 -23210841 -12592278 1155248 7462038
37065 7462038 5721728 1507138 -1448071 -2517958 -2155389 -1542653 -1636021 -1433615 256999
$$ packed form
37123A643229j338984L344668N652904J053080m651755l147544K567430J365269
37115F488297p912224j1940653j707810J2998920J6028068O046796l806632m570252
37107A1624510m65543R75549n40559q35069P41832R12684j572974l555601j905850
37098E378979J773186K836339l92593m403770n099105k670374l70824j94553j714469
37089d857184l469439l293749P57738P151532J0658709Q370469L495555k0845
37081A8792786l086697p128156q499255m150673O81781q29291n109258l127900
37073a2456663L530696L500514n393729j0304226k087433J0618563J3747526O306790
37065G462038j740310m214590k955209j069887L62569O12736r3368K02406J690614
$$ plain form
37056 256999 1522444 -604371 -4832247 -6232819 -2504297 3820358 9206346 11415126
37048 11415126 8618150 1060745 -6102766 -6604763 -995832 3386369 1807935 -2201970
37040 -2201970 -2185646 3282213 9558740 10854412 5496131 -2127321 -5258410 -2136307
37032 -2136307 1727507 911713 -2643016 -3299960 -215835 2636567 3118678 2201094 -214554
37023 -214554 -4947004 -9376613 -9363518 -5743524 -3903309 -6368751 -10092099 -11061129 -7655497
37014 -7655497 -491152 6598506 7252930 -126562 -7507066 -6030366 1866792 6224953
37006 6224953 4012041 1582976 3244983 6281434 8177685 10162226 12028616 11556745
36998 11556745 10498856 12871514 16114779 13236285 5503182 2540405 6444766 6810516
$$ packed form
37056B56999J265445k126815m227876j400572L728522O324655N385988K208780
37048A1415126k796976p557405p163511n01997N608931M382201j578434m009905
37040b201970J6324N467859O276527J295672n358281p623452l131089L122103
37032b136307L863814q15794l554729o56944L084125K852402M82111r17584k415648
37023b14554m732450m429609J3095L619994J840215k465442l723348r69030L405632
37014g655497P164345P089658O54424p379492p380504J476700P897158M358161
37006F224953k212912k429065J662007L036451J896251J984541J866390m71871
36998A1556745j057889K372658L243265k878494p733103k962777L904361L65750
$$ plain form
36990 6810516 -2712839 -13073084 -12802722 -4433416 475887 -2805424 -8959320 -11416169
36982 -11416169 -8160591 -1676177 2673761 1392127 -1792484 -233093 4679022 4411295
36974 4411295 -2656637 -7649914 -5881671 -4485318 -8567487 -10400566 -2328542 8340653
36966 8340653 9162939 1220311 -4114744 -3128305 -2427985 -5293102 -6566471 -1970000 5989279
36957 5989279 12526662 14915442 12497693 7512381 4600740 4863944 3290293 -2759769
36949 -2759769 -6845079 -2297649 6349297 9556360 7476129 8591383 14724704 17652342
36941 17652342 12223982 4031913 746738 2308353 3361078 1218564 -1681319 -1174008
36933 -1174008 4109116 10551747 12608418 9191854 4757318 2560571 703807 -2549540
$$ packed form
36990F810516r523355j0360245K70362Q369306M909303l281311o153896k456849
36982a1416169L255578O484414M349938j281634l184611J559391M912115k67727
36974D411295p067932m993277J768243J396353m082169j833079Q072024J0669195
36966H340653Q22286p942628n335055R86439P00320k865117j273369M596471P959279
36957E989279O537383K388780k417749m985312k911641K63204j573651o050062
36949b759769m085310M547430Q646946L207063k080231J115254O133321K927638
36941A7652342n428360q192069l285175J561615J052725k142514k899883N07311
36933a174008N283124O442631K056671l416564m434536k196747j856764l253347
$$ plain form
36925 -2549540 -4494272 -3217957 -2103564 -3693188 -3776174 2090722 10427021 15009847
36917 15009847 16175634 17566675 17549650 12426775 5263291 2470524 3453329 2636662 405683
36908 405683 2444774 8269851 10101631 4925146 -805892 -1271097 973316 765344 -1408068
36899 -1408068 -596469 5703611 13865851 16838305 11598517 4449374 5030302 13281421
36891 13281421 18215843 13043255 3938868 -1785059 -6982532 -14861670 -17006279 -4796930
36883 -4796930 13275177 21017346 17939378 17450733 23316867 25156704 18856045 13871340
36875 13871340 15129680 13859767 4302612 -4381034 -2526925 4851012 7379343 5090720
36867 5090720 4924425 8023296 9728856 7676834 2604445 -4628573 -10869423 -10435325
$$ packed form
36925b549540j944732J276315J114393j589624q2986N866896Q336299M582826
36917A5009847J165787J391041j7025n122875p163484k792767R82805q16667k230979
36908D05683K039091N825077J831780n176485n731038m65205K244413k07972k173412
36899a408068Q11599O300080Q162240K972454n239788p149143N80928Q251119
36891A3281421M934422n172588r104387n723927n197473p879138k144609J2209349
36883d796930J8072107P742169l077968m88645N866134J839837o300659m984705
36875A3871340J258340j269913r557155q683646J854109P377937K528331k288623
36867E090720j66295L098871J705560k052022n072389p233018o240850M34098
$$ plain form
36859 -10435325 -3013960 2898104 250921 -7207811 -11098410 -9347295 -5588965 -2121394
36851 -2121394 793603 2202691 2309849 3990221 8071706 10369078 7411684 1718132
36843 1718132 -2256772 -3723391 -3730735 -1983643 761679 1224550 -1663733 -4247889 -3465702
36834 -3465702 -600049 2718375 6950614 10365705 8865567 4082515 4653386 13915303
36826 13915303 23053964 23310421 18814176 18955708 22903882 21486336 12328528 3756419
36818 3756419 3276021 9433041 16048481 18781976 16557494 11289643 7326257 7699386
36810 7699386 10449600 11377702 9902619 9107611 10537420 12219863 11875466 9491880 6591074
36801 6591074 4733359 4478803 4519427 2576382 -1722096 -5848459 -7139297 -5425618 -2555632
$$ packed form
36859a0435325P421365N912064k647183p458732l890599J751115L758330L467571
36851b121394K914997J409088J07158J680372M081485K297372k957394n693552
36843A718132l974904j466619p344J747092K745322M62871k888283k584156P82187
36834c465702K865653L318424M232239L415091j500138m783052N70871R261917
36826A3915303R138661K56457m496245J41532L948174j417546r157808q572109
36818C756419m80398O157020O615440K733495k224482n267851l963386L73129
36810G699386K750214R28102j475083p95008J429809J682443l44397k383586k900806
36801F591074j857715k54556M0624j943045m298478m126363j290838J713679K869986
$$ plain form
36792 -2555632 -942250 -2580066 -7037162 -10166845 -7665733 -527101 5716826 7524350
36784 7524350 6282139 4680845 3457984 2087833 -186117 -3839613 -7108066 -6366499
36776 -6366499 -1930019 -335133 -5530366 -11446338 -10608178 -6249707 -6061884 -7308371
36768 -7308371 -1113254 9647718 12080166 5089220 3345800 13737149 23489772 20512533
36760 20512533 11179676 6803426 5496354 899183 -2138367 3923536 13001157 13289560
36752 13289560 6267727 2914170 4849820 4093520 -704659 -2474727 258334 1221790
36744 1221790 -861723 204806 6131067 10761550 10473667 7916047 4111672 -2805105
36736 -2805105 -9202718 -6930624 3986539 12874337 12275308 6228909 1505490 -1303208
$$ packed form
36792b555632J613382j637816m457096l129683K501112P138632O243927J807524
36784G524350j242211j601294j222861j370151k273950l653496l268453P41567
36776f366499M436480J594886n195233n915972Q38160M358471J87823j246487
36768g308371O195117J0760972K432448o990946j743420J0391349R752623k977239
36760B0512533r332857m376250j307072m597171l037550O061903R077621K88403
36752A3289560p021833l353557J935650p56300m798179j770068K733061R63456
36744A221790k083513J066529N926261M630483k87883k557620l804375o916777
36736b805105o397613K272094J0917163Q887798n99029o046399m723419k808698
$$ plain form
36728 -1303208 -3950479 -5127856 -3723833 -2165932 -2419475 -2629101 -423840 4056562
36720 4056562 9777994 15456689 18141580 15889405 12009869 11251513 11612695 6069804
36712 6069804 -6665051 -18961483 -22935042 -17305334 -5869543 4930243 7673925 647450
36704 647450 -7041840 -4776339 4988373 10024978 6351223 2280668 2579475 923413
36696 923413 -6393215 -11029049 -5651727 2925280 4103197 252686 1921075 10417725
36688 10417725 16383786 14295578 8405094 4103107 2137081 2477446 6014066 10337144
36680 10337144 10534048 6553885 3787992 3874152 1230110 -7369491 -15586885 -15627321 -9488838
36671 -9488838 -5450367 -5692669 -4921845 -1010357 1206905 -562905 -300326 7085136 16184895
$$ packed form
36728a303208k647271j177377J404023J557901k53543k09626K205261M480402
36720D056562N721432N678695K684891k252175l879536p58356L61182n542891
36712F069804j2734855j2296432l973559N629708J1435791J0799786K743682p026475
36704F47450p689290K265501R764712N036605l673755m070555K98807j656062
36696I23413p316628m635834N377322Q577007J177917l850511J668389Q496650
36688A0417725N966061k088208n890484m301987j966026L40365L536620M323078
36680A0337144J96904l980163k765893Q6160k644042q599601q217394m0436O138483
36671i488838M038471k42302P70824L911488K217262j769810K62579P385462R099759
$$ plain form
36662 16184895 17741058 11532728 5116680 1640637 -2654708 -8685604 -11118934 -7471527
36654 -7471527 -3257492 -4174583 -8877206 -12925703 -14283664 -11626510 -3601298 5864398
$$ packed form
36662A6184895J556163o208330o416048l476043m295345o030896k433330L647407
36654g471527M214035r17091m702623m048497j357961K657154Q025212R465696
$$ [...]
##END NTUPLES=NMR SPECTRUM
##END=
