##TITLE=31Pdec_SR166Et
 DMSO-d6, 128 sc
 20.4.2023
##JCAMPDX= 6.0         $$ Bruker NMR JCAMP-DX V2.0
##DATA TYPE= NMR SPECTRUM
##DATA CLASS= NTUPLES
##ORIGIN= UXNMR, Bruker Analytische Messtechnik GmbH
##OWNER= root
$$ XWIN-NMR		Version 3.5
$$ Thu Apr 20 14:49:44 2023 Russian Standard Time (UT+4h)  she@DPX200
##.OBSERVE FREQUENCY= 81.013821
##.OBSERVE NUCLEUS= ^31P
##.ACQUISITION MODE= SIMULTANEOUS
##.ACQUISITION SCHEME= undefined
##.AVERAGES= 128
##.DIGITISER RES= 16
##SPECTROMETER/DATA SYSTEM= spect
##.PULSE SEQUENCE= zgpg30
##.SOLVENT NAME= DMSO
##.SHIFT REFERENCE= (INTERNAL, DMSO, 0, 248.564)
##AUDIT TRAIL= $$ (NUMBER, WHEN, WHO, WHERE, WHAT)
$$ ##TITLE= Audit trail, XWIN-NMR		Version 3.5
$$ ##JCAMPDX= 5.01
$$ ##ORIGIN= Bruker BioSpin GmbH
$$ ##OWNER= she
$$ F:/spectra/data/she/nmr/P31/1/pdata/1/auditp.txt
$$ ##AUDIT TRAIL=  $$ (NUMBER, WHEN, WHO, WHERE, WHAT)
(   1,<2023-04-20 14:48:57.51 +0400>,<she>,<DPX200>,
      <continue with go, POWCHK disabled, PULCHK disabled
       configuration hash MD5:
       00 E9 B6 7A A2 85 ED C7 34 08 36 98 17 FE 4E 26
       data hash MD5: 32K
       AC FB A8 20 1F A7 2E 5A D1 05 7C 6B 51 C9 43 9C>)
(   2,<2023-04-20 14:49:00.12 +0400>,<she>,<DPX200>,
      <Start of raw data processing
       efp BC_mod = 2 LB = 1 FT_mod = 6 PKNL = 1 PHC0 = -11051.32 PHC1 = 227.0848 SI = 64K 
       data hash MD5: 64K
       BC 7D 55 F4 29 AF FD DE D3 6B 32 CB 2E 4D 81 06>)
(   3,<2023-04-20 14:49:14.89 +0400>,<she>,<DPX200>,
      <pk PHC0 = -77.31686 PHC1 = 198.4001 
       data hash MD5: 64K
       DD 73 C6 96 59 37 8A D7 24 CF 25 DF EF DB 73 63>)
(   4,<2023-04-20 14:49:21.06 +0400>,<she>,<DPX200>,
      <abs ABSG = 5 
       data hash MD5: 64K
       43 52 C0 2C F3 1B AC 15 0B D6 E1 8D 9E 98 72 DB>)
$$ ##END=
$$ 
$$ hash MD5
$$ 36 24 7D FE CB 30 FB 08 E2 6E DC 91 D2 03 0F 4F
##$RELAX= 
##$RELAX= 
##$RELAX= 
##$RELAX= 
##$RELAX= 
##$RELAX= 
##$RELAX= 
##$RELAX= 
##$RELAX= 
$$ Bruker specific parameters
$$ --------------------------
##$DU= <F:/spectra>
##$EXPNO= 1
##$NAME= <P31>
##$PROCNO= 1
##$TYPE= <nmr>
##$USER= <she>
##$AMP= (0..31)
100 100 100 100 100 100 100 100 100 100 100 100 100 100 100 100 100 100 
100 100 100 100 100 100 100 100 100 100 100 100 100 100 
##$AQSEQ= 0
##$AQ_mod= 1
##$AUNM= <au_zg>
##$AUTOPOS= <>
##$BF1= 81.014009
##$BF2= 200.13
##$BF3= 200.13
##$BF4= 200.13
##$BF5= 200.13
##$BF6= 200.13
##$BF7= 200.13
##$BF8= 200.13
##$BYTORDA= 1
##$CFDGTYP= 0
##$CFRGTYP= 5
##$CHEMSTR= <none>
##$CNST= (0..31)
1 1 145 1 1 1 1 1 1 1 1 1 1 1 1 1 1 1 1 1 1 1 1 1 1 1 1 1 1 1 1 1 
##$CPDPRG= <waltz16>
##$CPDPRG1= <>
##$CPDPRG2= <waltz16>
##$CPDPRG3= <>
##$CPDPRG4= <mlev>
##$CPDPRG5= <mlev>
##$CPDPRG6= <mlev>
##$CPDPRG7= <mlev>
##$CPDPRG8= <mlev>
##$CPDPRGB= <>
##$CPDPRGT= <>
##$D= (0..31)
0 1 0 0 0 0 0 0 0 0 0 0.03 2e-05 3e-06 0 0 0 0 0 0 0 0 0 0 0 0 0 0 0 0 
0 0 
##$DATE= 1681987562
##$DBL= (0..7)
120 120 120 11 120 120 24 19 
##$DBP= (0..7)
150 150 150 150 150 150 150 150 
##$DBP07= 0
##$DBPNAM0= <>
##$DBPNAM1= <>
$$ [...]
##$SUBNAM3= <"">
##$SUBNAM4= <"">
##$SUBNAM5= <"">
##$SUBNAM6= <"">
##$SUBNAM7= <"">
##$SUBNAM8= <"">
##$SUBNAM9= <"">
##$SW= 501.771253377433
##$SWIBOX= (0..15)
0 1 3 0 0 0 0 0 0 0 0 0 0 0 0 0 
##$SW_h= 40650.406504065
##$TD= 32768
##$TD0= 1
##$TE= 0
##$TE2= 300
##$TE3= 300
##$TEG= 300
##$TL= (0..7)
0 120 53 12 22 120 120 120 
##$TP= (0..7)
150 150 150 150 150 150 150 150 
##$TP07= 0
##$TPNAME0= <>
##$TPNAME1= <>
##$TPNAME2= <>
##$TPNAME3= <>
##$TPNAME4= <>
##$TPNAME5= <>
##$TPNAME6= <>
##$TPNAME7= <>
##$TPOAL= (0..7)
0.5 0.5 0.5 0.5 0.5 0.5 0.5 0.5 
##$TPOFFS= (0..7)
0 0 0 0 0 0 0 0 
##$TUNHIN= 0
##$TUNHOUT= 0
##$TUNXOUT= 0
##$USERA1= <user>
##$USERA2= <user>
##$USERA3= <user>
##$USERA4= <user>
##$USERA5= <user>
##$V9= 5
##$VALIST= <valist>
##$VCLIST= <CCCCCCCCCCCCCCC>
##$VD= 0
##$VDLIST= <DDDDDDDDDDDDDDD>
##$VPLIST= <PPPPPPPPPPPPPPP>
##$VTLIST= <TTTTTTTTTTTTTTT>
##$WBST= 1024
##$WBSW= 4
##$XGAIN= (0..3)
0 0 0 0 
##$XL= 0
##$YL= 0
##$YMAX_a= 6583
##$YMIN_a= -7407
##$ZGOPTNS= <>
##$ZL1= 120
##$ZL2= 120
##$ZL3= 120
##$ZL4= 120
##$ABSF1= 248.5645
##$ABSF2= -253.2056
##$ABSG= 5
##$ABSL= 3
##$ALPHA= 0
##$AQORDER= 0
##$ASSFAC= 0
##$ASSFACI= 0
##$ASSFACX= 0
##$ASSWID= 0
##$AUNMP= <proc_1d>
##$AZFE= 0.1
##$AZFW= 0.5
##$BCFW= 0
##$BC_mod= 2
##$BYTORDP= 0
##$COROFFS= 0
##$CY= -3
##$DATMOD= 1
##$DC= 0
##$DFILT= <>
##$DTYPP= 0
##$F1P= 0
##$F2P= 0
##$FCOR= 1
##$FTSIZE= 65536
##$FT_mod= 6
##$GAMMA= 0
##$GB= 0
##$INTBC= 1
##$INTSCL= 6.047779e-11
##$ISEN= 30
##$LB= 1
##$LEV0= 0
##$LPBIN= 0
##$MAXI= 10000
##$MC2= 0
##$MEAN= 0
##$ME_mod= 0
##$MI= 50
##$NCOEF= 0
##$NC_proc= -7
##$NLEV= 6
##$NOISF1= 182.463
##$NOISF2= 159.3651
##$NSP= 0
##$NTH_PI= 0
##$NZP= 0
##$OFFSET= 248.5645
##$PC= 4
##$PHC0= -11128.64
##$PHC1= 425.4849
##$PH_mod= 1
##$PKNL= yes
##$PPARMOD= 0
##$PSCAL= 0
##$PSIGN= 0
##$REVERSE= no
##$SF= 81.0140089999694
##$SI= 65536
##$SIGF1= 159.3651
##$SIGF2= -187.1042
##$SINO= 113.3802
##$SIOLD= 16384
##$SREGLST= <1H.CDCl3>
##$SSB= 0
##$STSI= 65536
##$STSR= 0
##$SW_p= 40650.406504065
##$SYMM= 0
##$S_DEV= 0
##$TDeff= 32768
##$TDoff= 0
##$TI= <>
##$TILT= no
##$TM1= 0
##$TM2= 0
##$TOPLEV= 0
##$USERP1= <user>
##$USERP2= <user>
##$USERP3= <user>
##$USERP4= <user>
##$USERP5= <user>
##$WDW= 1
##$XDIM= 65536
##$YMAX_p= 387105072
##$YMIN_p= -42569831
$$ End of Bruker specific parameters
$$ ---------------------------------
##NTUPLES= NMR SPECTRUM
##VAR_NAME=  FREQUENCY,     SPECTRUM/REAL,   SPECTRUM/IMAG
##SYMBOL=    X,             R,               I
##VAR_TYPE=  INDEPENDENT,   DEPENDENT,       DEPENDENT
##VAR_FORM=  AFFN,          ASDF,            ASDF
##VAR_DIM=   65536,         65536,           65536
##UNITS=     HZ,            ARBITRARY UNITS, ARBITRARY UNITS
##FACTOR=    0.620285442955139, 1,           1
##FIRST=     20137.2065510682, 0,            0
##LAST=      -20513.1999529968, 0,           0
##MIN=       -20513.1999529968, -42569831,   0
##MAX=       20137.2065510682, 387105072,    0
$$ Real data points
##PAGE= N=1
##DATA TABLE= (X++(R..R)), XYDATA
$$ [...]
43742 3716082 560168 1584817 4922902 4193379 -1126807 -4189779 -1960134 -283395
43734 -283395 -4097367 -9520676 -10543543 -7873609 -5743561 -4560223 -2488520 -884589
43726 -884589 -2242287 -4792844 -4495843 -1234185 1581005 2681114 3813397 5277014
43718 5277014 4727636 1083475 -3369502 -5565512 -4512359 -1506648 877867 459468
43710 459468 -2116501 -3207508 -368332 3956722 5162749 2367375 -1014901 -2407517
43702 -2407517 -2756362 -3348810 -3076932 -1041701 328432 -1971955 -6168593 -6567561 -1190630
43693 -1190630 4049080 1717260 -7461951 -14578282 -13006548 -6104929 -2408903 -5046786
43685 -5046786 -8888242 -7901082 -2590958 1046544 -1308115 -7512294 -11468132 -9918220
43677 -9918220 -5827586 -4287870 -6204662 -8224718 -8285072 -7657676 -6796210 -3557470 1861511
43668 1861511 4414787 897398 -4075490 -4041165 -448032 -431670 -5832535 -10915047 -11473595
43659 -11473595 -9782260 -8736519 -7147852 -3933985 -1854757 -3087964 -4793263 -3072827
43651 -3072827 1243188 4192358 3870079 1042972 -3258737 -7787482 -10570057 -11023766
43643 -11023766 -10786200 -10229182 -6736211 593995 7144804 7603140 2974902 -1037208
43635 -1037208 -1536080 -569824 -567050 -1478094 -2399298 -2714917 -1526804 1097884 2447058
43626 2447058 671 -3839841 -3361436 3030600 9964822 11228799 6454583 164464
43618 164464 -3757267 -4610907 -3275802 -482615 3103849 6377369 8100150 7820438 6480156
43609 6480156 5701775 5989421 6057721 4691676 2830721 2691246 4925658 7760650 9079462
43600 9079462 8411112 6681654 4857782 3130194 897598 -2457854 -6265738 -8417091
43592 -8417091 -7562455 -5278261 -4610752 -6106511 -6786030 -4070565 488258 3009782 2215530
43583 2215530 579956 390316 926140 915245 1769202 5613480 10817511 12726040 9534324
43574 9534324 4632742 1844812 1038309 297643 -346771 -190566 -464512 -2052720 -2433558
43565 -2433558 767023 4328218 2719313 -3066437 -5520324 -1151029 4167432 3464925
43557 3464925 -1920552 -5234481 -3722257 -808594 -291869 -2224197 -4201469 -3994692
43549 -3994692 -1215573 1757669 1568617 -1516607 -2613116 1341860 5955772 4373780
43541 4373780 -2602821 -6186059 -911381 7725848 10061073 4362945 -1728095 -1578028
43533 -1578028 2442019 3363608 -419625 -3339060 -845205 4423439 6966311 6105926
43525 6105926 5601595 6893502 7160774 4625830 1904304 2409584 5992510 9462297 9386523
43516 9386523 4001511 -4750348 -10624898 -8226506 38611 5896555 5398822 2817711
43508 2817711 2644003 3260677 2168888 1961294 5482627 9251115 8204284 4074001 2226228
43499 2226228 2301678 -503082 -5735061 -7257516 -3404320 -32555 -1149161 -3219332
43491 -3219332 -2148524 -102998 -1076143 -4106120 -5523139 -4881191 -4328234 -4206622 -3219598
43482 -3219598 -1620772 -931748 -1427525 -2498613 -4465237 -7678322 -10837333 -12311165
43474 -12311165 -12092844 -10706459 -7817056 -4105744 -2635897 -5242223 -8773077 -8430825
43466 -8430825 -4453580 -1906877 -3442928 -5793859 -4837160 -1069633 2220777 3859196
43458 3859196 4718476 3951778 -864696 -8947143 -14784265 -13816752 -8162729 -4130032 -4552536
43449 -4552536 -6229505 -5288513 -2396092 -1142731 -3132064 -6622088 -9034926 -9056350 -6857219
43440 -6857219 -3811615 -1716132 -1167509 -1082292 -480835 344038 1370930 3862328 7899966
43431 7899966 10226256 7069195 -1302603 -10822719 -17727641 -20319529 -17788017 -10689566
43423 -10689566 -2822154 615117 -1877070 -6653038 -9296610 -8710393 -6476762 -4341977
43415 -4341977 -3308996 -3514694 -3981902 -3606063 -2759366 -2691544 -3523169 -4695574 -7130430
43406 -7130430 -12164456 -17851729 -19401612 -14774281 -7288113 -1000613 3866984 8547713
43398 8547713 11330937 9328180 3786770 -164002 241830 2349336 2534366 1130712
43390 1130712 606813 555850 -2027328 -7243260 -10460621 -8019596 -2340774 1635224 3399407
43381 3399407 6176350 9863606 9912686 4918459 377262 1380832 5368330 6544414
43373 6544414 4680273 4387692 7203388 9717269 9290843 6873681 3886109 657692
43365 657692 -1517294 -899551 1313287 1846073 296604 -392812 1037270 2516631 2690125
43356 2690125 2584204 2414783 933334 -1082784 -1164358 -65122 -1310068 -4304128 -3726587
43347 -3726587 1417431 4244312 -44436 -6035319 -5735747 -207237 3017961 1506466
43339 1506466 21321 2055064 5751748 8608692 10551508 11075220 8155062 2106731
43331 2106731 -2879579 -3198982 254175 3929680 5514156 4899959 2888211 192040
43323 192040 -2825872 -5800308 -7584344 -6692218 -3437771 -492960 203683 89226 1697012
43314 1697012 4584649 5777542 4101087 1983382 2399984 5258646 7457878 6257310
43306 6257310 2411264 -519414 -574635 -40024 -1825843 -4366965 -3612634 126465 1819835
43297 1819835 -714900 -3710954 -4098035 -4177331 -6167005 -7033107 -3731325 457745 597913
43288 597913 -2139015 -3598347 -4654693 -8704566 -12778840 -9481967 1535550 11534055
43280 11534055 13914341 11004578 7634722 4451188 761741 -1704869 -1866807 -1794321
43272 -1794321 -2578863 -1619609 2506914 6255176 5927806 2967315 750880 -639114 -2411388
43263 -2411388 -2926409 -311566 2982734 3149890 1196980 1386418 4273137 6034512 4745881
43254 4745881 2795348 2217304 1628706 -630163 -3404546 -4589649 -3967980 -2710482 -1689239
43245 -1689239 -1427924 -2263900 -3552629 -3942376 -3157266 -2243035 -1517650 124131 2991427
43236 2991427 5218276 4852136 2263587 -631483 -2588356 -3387778 -2972478 -1602479 -258292
43227 -258292 367408 798006 1602600 2028338 1249586 329174 1045484 3002406 3985526
43218 3985526 3347811 2823170 3438367 4039783 3966129 4559004 6062427 5506490 705348
43209 705348 -5269215 -7178455 -4581214 -2161548 -2943863 -4643498 -3771539 -410135 2677371
43200 2677371 3631179 2781000 1799672 2349717 4142305 4226587 304188 -5189845 -7130018
43191 -7130018 -4379070 -1332254 -1754412 -4323133 -5915323 -6133911 -6318165 -6676429 -6733541
43182 -6733541 -6597795 -6093033 -4859387 -4394654 -6729329 -9730094 -8003689 -840881 5361814
43173 5361814 5902191 4140314 4698701 5356029 1960905 -2602724 -2035659 2817530 4679350
43164 4679350 615519 -4820319 -7353729 -7427403 -6268262 -3649157 -741786 162819 -146347
43155 -146347 1268872 3920018 4438483 2903978 2731473 3721344 1803492 -2962981 -5064168
43146 -5064168 -2559862 -628476 -2746019 -4682430 -1533596 4712792 9139322 10661851
43138 10661851 10312110 7184802 992957 -4918814 -7739481 -9205317 -11357432 -11964842
43130 -11964842 -8864278 -5250659 -5044500 -5756142 -2099660 4842680 8292201 5525224
43122 5525224 1395346 934183 2809460 2314484 -1668559 -5043757 -3510500 1981620
43114 1981620 5930137 5033673 2512957 3166297 5727783 4709951 -516206 -4328438
43106 -4328438 -3925599 -3665262 -7287000 -11459798 -11360295 -8018371 -5452857 -4417834 -3610132
43097 -3610132 -3442866 -3971799 -2657337 1012011 2364658 -1691240 -6322458 -5134722
43089 -5134722 141123 2643222 663497 -1546090 -1519717 -693640 165177 1644230 2552081
43080 2552081 1552166 947405 3487752 6610029 5405428 157970 -4656006 -7500581
43072 -7500581 -9893780 -10678348 -6760325 845926 7636330 11585407 12925246 9908154
43064 9908154 1839142 -5362719 -4895777 326995 1337463 -3008977 -5253283 -2958319
43056 -2958319 -2673939 -7773755 -12525380 -12551565 -12035748 -15121221 -17897029 -14745710 -6573577
43047 -6573577 2049029 8176112 9290753 3733445 -3725425 -4360323 1854299 4277581
43039 4277581 -2193853 -8038097 -3871003 4515007 5925398 1408871 424132 4167740
43031 4167740 5115138 1074453 -2102712 -1737452 -1684073 -3455362 -3378594 -339386 1869312
43022 1869312 1803931 2475242 4380739 3764406 83155 -1794411 390939 2578120 1814066
43013 1814066 1196460 3572723 5896078 4598629 2296945 3915294 8596672 10272677
43005 10272677 5597043 -1933995 -5773946 -2700398 4223339 8499368 6774415 2265264
42997 2265264 216619 1077482 1000380 -1741694 -4676987 -5497847 -4556178 -2473120 787037
42988 787037 3604964 3479751 1275586 679440 2117595 1625996 -2287707 -5317908 -3885239
42979 -3885239 -753609 -262753 -1385729 -37231 3959842 6750997 6168305 3661015
42971 3661015 1170276 -454222 -338831 1765616 3599895 2074968 -2618707 -6818137
42963 -6818137 -7808164 -6475966 -4907870 -3137396 326120 5318376 8658736 6836043
42955 6836043 257394 -6009474 -6859628 -2199178 3780623 7654896 9025879 8282905
42947 8282905 5344225 1431672 -977667 -1460553 -2215981 -3869314 -3835258 -943315 1684513
42938 1684513 1405666 503884 1928412 3398189 727121 -4837845 -8195219 -8456011 -9411803
42929 -9411803 -11636118 -10508097 -4193695 2130502 3393623 1449297 1057328 2842172
42921 2842172 4276263 4430699 3424706 18464 -5456887 -8299358 -5115750 -418325
42913 -418325 -1144787 -5535258 -5006247 1926945 5690545 -726525 -11238544 -15402577
42905 -15402577 -12288955 -8731577 -7507478 -5374038 -1583699 -92024 -2004705 -2864350
42897 -2864350 -161595 2220870 507695 -2825372 -3443590 -1752902 -487639 1184214
42889 1184214 5632767 10421609 9902878 3661649 -1687957 -1016070 2835503 3600857 -189772
42880 -189772 -4698915 -6933928 -7742242 -8290347 -6750425 -923463 6977400 11097839 8505959
42871 8505959 3024803 573275 1842431 2272611 -869260 -4631578 -4972033 -2457145
42863 -2457145 -783989 -1180733 -1265765 847260 3995374 6040572 6397838 5430224 2768621
42854 2768621 -2172689 -8189841 -12055494 -11246854 -6944187 -3421087 -3617650 -5872747
42846 -5872747 -6294372 -3982004 -1988331 -2754364 -4651446 -4269094 -742458 3393579 4651428
42837 4651428 1197420 -5473374 -10520977 -9185892 -1798751 5861359 8557241 6750567
42829 6750567 4732787 5342507 8015172 10258073 9155501 3096519 -5739785 -11917692
42821 -11917692 -11944567 -7892362 -4187057 -2617513 -2662396 -4392667 -7610677 -9767497 -8734485
42812 -8734485 -6866967 -8315079 -12470301 -14041438 -10141710 -3734687 796009 2246396
42804 2246396 1683413 17669 -1768769 -2083845 -203864 2618423 4326918 3810106 1767062
42795 1767062 645366 2642526 6446877 7715974 4971807 2830433 5848410 10946375
42787 10946375 10646902 3313083 -4593126 -6742053 -3001789 3121930 8420554 10338202
42779 10338202 7990982 4478449 4217250 6605136 6494390 2336490 -956937 427060
42771 427060 3469003 3279899 -217852 -4025635 -7016606 -9464989 -10400388 -9004885 -6555166
42762 -6555166 -4098331 -471053 4685214 8494731 8373657 5661841 3018328 770701
42754 770701 -1265256 -1180712 2196632 6044793 6660155 4158267 1152952 -1182005 -2726648
42745 -2726648 -2395205 85828 2328027 2437881 2056935 3239336 4744929 4828205 5038475
42736 5038475 7230290 9256398 8100095 5271072 4508392 5794225 6160264 4913583
42728 4913583 3641004 2572227 1266554 1037838 2200030 1334619 -3440298 -7229255
42720 -7229255 -4876424 -234441 -1025835 -5946008 -6030995 822310 6291924 4859006 1415439
42711 1415439 1622377 2898456 505699 -4038857 -6689905 -7815092 -9433616 -9794554
42703 -9794554 -6701709 -2848484 -1962704 -2311020 205651 4530310 5762035 2867168
42695 2867168 -181676 -534581 855920 2515250 4228484 5276168 4396686 2045251
42687 2045251 212977 3384 1352960 4218108 7605187 8642799 5696544 1577186
42679 1577186 470625 2287776 3323459 2013347 400625 -64238 -250204 -174098 1907714
42670 1907714 5456962 6179034 1410878 -5268298 -7896354 -5395787 -1935446 -521724
42662 -521724 295780 2301133 3486586 1006305 -3500123 -5457758 -4183914 -3916897 -6475962
42653 -6475962 -7334543 -2641844 3540806 4448567 782786 -908715 790974 578866 -2774219
42644 -2774219 -2413725 5338308 12940701 11674997 4604291 1516955 4095443 5032961
42636 5032961 1236810 -1240241 2166657 6591843 5003316 -1553122 -6013786 -4916697
42628 -4916697 -1427421 107200 -1165468 -3392522 -4665389 -4084347 -1800629 952166
42620 952166 2344934 1277804 -1415780 -3348236 -2842212 -863581 204152 -208582 -340596
42611 -340596 770088 1785864 1892008 2590450 4436632 4526858 755964 -3269743 -2096842
42602 -2096842 3357506 6206110 2884105 -2394861 -3998582 -1667136 1286974 3057989
42594 3057989 3715920 3116129 1537093 626953 882526 -344290 -5487433 -12515588 -16832564
42585 -16832564 -16656274 -13823896 -10024006 -5481290 -1368653 -52410 -1763199 -3752886
42577 -3752886 -4244493 -4740832 -6454422 -6896426 -3248825 2161475 3640797 -360777 -5151366
42568 -5151366 -6456254 -5611390 -5634913 -5422045 -2094548 2660693 3753625 349499 -2472028
42559 -2472028 -1103617 1915434 2799048 1956053 1344227 -364 -3538423 -6803502 -6092210
42550 -6092210 -2395528 -347689 -1843144 -4599851 -6580143 -7843844 -8167259 -6836393
42542 -6836393 -4989264 -4278928 -3066964 1716054 8334196 10680638 6624232 1452333
42534 1452333 532594 2472239 2634913 264374 -1426522 -399797 1848408 1964683 -2667103
42525 -2667103 -11082039 -17409778 -15378003 -5935353 2663142 4322756 1200078 -1839910
42517 -1839910 -4274649 -7457331 -9356224 -7416244 -3976017 -2916892 -2740489 796661
42509 796661 6244344 7481638 3452745 68931 788116 1783342 -605400 -3486887 -2730997
42500 -2730997 -70019 191121 -1461902 -1043464 1672034 2333414 -1212012 -5385926 -5567329
42491 -5567329 -1781773 2022119 3172838 2988929 3904565 4912625 1897007 -6280198
42483 -6280198 -13942218 -14068389 -7127791 -527859 1409165 2276062 6042795 9516348
42475 9516348 7131961 126040 -5001575 -5902744 -6103293 -7149607 -5521016 297093
42467 297093 5349046 4921402 1692517 1367242 3846776 4122181 804440 -1867415 -1112370
42458 -1112370 500720 298915 191022 2648355 5114848 2905817 -3384009 -7584989
42450 -7584989 -5580327 -79605 3307907 2427761 -299394 -1476902 -179200 1324603
42442 1324603 -136196 -4505455 -6937899 -2754941 5662753 10136237 6491188 -88606
42434 -88606 -2220502 271419 2253071 2133595 2949829 5015663 4027645 -1298028 -5327496
42425 -5327496 -3293474 980207 48797 -6651795 -12230232 -11563254 -6689646 -2789212
42417 -2789212 -2527118 -5072568 -7554526 -6649360 -1547644 3829077 4331540 92764 -3571676
42408 -3571676 -3853702 -4186824 -7819484 -11441199 -9575372 -3168320 1222356 374362 -2216338
42399 -2216338 -2557491 -1249731 -587894 -617562 -866634 -2681366 -6229109 -7697175 -3887497
42390 -3887497 1789590 2796553 -1272805 -4182685 -3012286 -3028536 -9093133 -16817834
42382 -16817834 -17890926 -11887048 -6502768 -6255000 -7340324 -5735376 -4487217 -8305102
42374 -8305102 -14550401 -15513230 -8992889 -1509158 79350 -3782467 -7929454 -9494210
42366 -9494210 -9438845 -8924588 -7634612 -5731486 -4624424 -4590610 -3546558 -14685 3674644
42357 3674644 3414478 -1216080 -5611244 -5482479 -1934840 752836 1315326 2529806 5783548
42348 5783548 7753021 4554171 -2596090 -8231655 -8432790 -3972372 1547875 4664066
42340 4664066 3615560 -775320 -5416419 -7581041 -7215497 -5448539 -1923772 3732229
42332 3732229 8460822 7839630 2775082 172127 4108296 9380692 7775697 -960817
42324 -960817 -8876350 -10176111 -7189090 -4795777 -3420520 -892327 1673407 563634
42316 563634 -4324820 -8222848 -7877436 -5974630 -6629634 -8667850 -7038147 -443261 6254009
42307 6254009 8417670 7153233 6090582 5322182 2261710 -2576581 -4903751 -2576482
42299 -2576482 1115530 1669655 -1478758 -5574437 -8172002 -8306707 -5866365 -2048043
42291 -2048043 587784 470682 -1199907 -2338636 -2555651 -2460313 -1817954 -337619 897193
42282 897193 904396 673979 1378354 1834789 337220 -1951955 -2456954 -1434626 -1459114 -2834371
42272 -2834371 -3071009 -1321872 300203 765147 1834142 4188154 5373208 3821959
42264 3821959 1820490 1821052 2488797 1421129 -456290 -544297 1067287 2302409 2854305
42255 2854305 3604598 3156648 -924516 -7094793 -9929464 -6764381 -1523656 -90872
42247 -90872 -3503307 -7327469 -6890928 -1999853 3154720 4296009 1408208 -1560783 -1686387
42238 -1686387 -521245 -1280151 -4031258 -6085757 -6236990 -5515911 -3950790 -229566 4446794
42229 4446794 5764223 1807628 -3425705 -4743527 -2290913 -579478 -2088008 -4909354
42221 -4909354 -6707825 -7963307 -9816639 -10580000 -6931622 950450 7161669 5163004
42213 5163004 -4410798 -12933961 -12586666 -4875966 1836955 2375750 -854301 -3224001
42205 -3224001 -3374457 -1931592 1009638 4024834 3362559 -2052593 -6786774 -4602112
42197 -4602112 3035673 8554659 7987050 4699012 3281114 4278198 6017963 7335965
42189 7335965 6768788 2996134 -1848796 -3138642 -453374 659051 -3074457 -6546885
42181 -6546885 -3053656 5684400 11660000 11086597 7208438 3471691 52945 -2152308
42173 -2152308 -336330 4759117 7104953 2756170 -4271502 -6900227 -3405744 2045877
42165 2045877 5116954 4476086 983472 -3132335 -5172341 -4401603 -2667419 -1099138
42157 -1099138 1611426 5514713 7019815 3860303 -211331 -503750 838156 -1815287
42149 -1815287 -7140523 -6936204 1516085 9822808 9292889 2471598 -1249518 1591333
42141 1591333 5731060 5956465 3267818 1333801 743000 -875968 -4508505 -7490479
42133 -7490479 -6052646 102843 6580982 8790277 7198629 6095554 7152480 7191355
42125 7191355 3556252 -1363171 -3428185 -2417772 -1681951 -3468824 -6895489 -9402563
42117 -9402563 -8378820 -2980869 3656953 6034679 2565257 -1841591 -2239612 -240019
42109 -240019 -470295 -2781164 -2856953 596860 4330017 5865196 5574510 3608094 -305045
42100 -305045 -3813373 -3845390 -2086427 -3186256 -6719407 -6986640 -2446682 1224275 286760
42091 286760 -1623994 -1331314 -2476352 -7888416 -11643969 -6951573 1921050 4597523
42083 4597523 -284544 -3917394 -1317518 2419630 1874986 -786230 -1460011 -1048337 -1917648
42074 -1917648 -2424979 -299388 2047359 1018716 -1623967 -1100992 2563746 4316152
42066 4316152 2002044 -152516 2273624 7564703 10143378 7410978 2063930 -1755875
42058 -1755875 -2738776 -2554032 -2930027 -3672096 -3733793 -3378998 -3955413 -5258498 -4671056
42049 -4671056 -506339 4508725 5360050 1011028 -3421404 -2459554 2966512 6916236
42041 6916236 6306138 4399939 5230933 7418153 6491625 1778550 -2780995 -4467685 -4489039
42032 -4489039 -3905109 -886050 5446202 11616930 13652013 12260824 10701947 9270404
42024 9270404 6125320 2604410 2692014 6495313 8887700 6557297 2547077 1244467
42016 1244467 2221703 2443934 2049673 3658370 6915875 8083412 5721647 3274217 4362122
42007 4362122 8000843 10554199 10720672 10069097 9420536 7609133 4429594 2174741 2326464
41998 2326464 2474579 -664778 -5751545 -7610498 -4292229 -164022 152802 -1680340
41990 -1680340 -529701 4306906 7978155 7052247 3914963 2622027 3105826 2018890
41982 2018890 -1835499 -5346044 -4721771 -104828 4238364 4457990 1439192 -362485
41974 -362485 1420054 4162682 4172235 1793566 359931 1273662 3014664 4389138 5438428
41965 5438428 5172312 2105204 -2196746 -3869313 -2520784 -2520974 -6292350 -9915834 -8652498
41956 -8652498 -3880187 -563446 121408 1237038 4184528 6818120 7576708 7521020 7407769
41947 7407769 6146254 3491550 1441724 1322228 1702152 886752 -417702 -857901 -1381971
41938 -1381971 -4038430 -8188033 -10097401 -7118305 -1189865 2895887 2604544 184577
41930 184577 -347019 2052250 4957088 6353742 6912736 7598487 7264276 4728298 1675975
41921 1675975 620698 611769 -1812524 -7018441 -10773153 -9715753 -5758171 -3122819 -3046625
41912 -3046625 -3758930 -4183695 -4816057 -5498488 -5152685 -4018897 -3816631 -5053993 -6236668
41903 -6236668 -6500920 -6839106 -7431585 -5989127 -944564 5282478 8813218 9118119 8530106
41894 8530106 7725017 5206711 1440706 -405318 785705 2125736 1457218 508211 615884
41885 615884 -1017602 -6566105 -11865223 -10824879 -4397037 215877 -776395 -3985783
41877 -3985783 -5258753 -4636740 -3314432 -433479 4394085 8688052 9613557 6639333
41869 6639333 835943 -5410960 -7762160 -3564594 2950685 4434535 956235 561499
41861 561499 6649675 11955111 9838234 4486146 3027930 3674223 353442 -5481226
41853 -5481226 -7545843 -6402191 -7972291 -11427175 -9416775 -1429943 3623590 1100264
41845 1100264 -2784890 -2308061 -1275590 -4906253 -10112939 -10809584 -7617658 -5608274
41837 -5608274 -6275428 -7713477 -9308186 -10522869 -8277428 -1549077 4045494 2414960
41829 2414960 -4064248 -7603875 -5511079 -1747958 814595 3134303 4901249 3367184
41821 3367184 -832515 -2232902 2024965 7216097 6823512 902256 -4402204 -4430591 -496743
41812 -496743 2908641 3338757 1948385 565143 -1338620 -5458394 -10798472 -13128064
41804 -13128064 -9464818 -1720570 5336131 8460355 7112639 2064014 -4940581 -10900815
41796 -10900815 -13052743 -10934603 -6469225 -2586243 -1707046 -3738251 -5074766 -1956019
41788 -1956019 4235942 7723475 5711091 1895714 661982 1313349 1129147 781070 2511959
41779 2511959 5374404 6819487 7296647 8677621 9475961 6650163 1588401 -836186
41771 -836186 437568 1099999 -1581477 -4391716 -2718495 3281781 8822851 9283451 4292453
41762 4292453 -1621982 -2800217 1547205 6059277 5713841 1718605 -1646402 -3411359
41754 -3411359 -4983169 -5306179 -2761478 -687732 -4358301 -12019492 -15429721 -10941969
41746 -10941969 -4090374 -914563 -499817 661432 2109859 1523645 -209703 -182492 2392811
41737 2392811 6036934 8866858 8732589 4455062 -1016168 -2026280 2633343 7112501
41729 7112501 5720283 -213575 -5332435 -7002299 -6154250 -4407060 -3572950 -5385660
41721 -5385660 -8572259 -8676465 -3734467 2505306 5784155 6452434 6123182 3169576 -3562222
41712 -3562222 -9704896 -9946211 -6059665 -4685359 -7800559 -10805649 -10104138 -7421048
41704 -7421048 -5656842 -4865472 -3960484 -3266405 -3860279 -6264407 -10195407 -13877475 -14141982
41695 -14141982 -9605405 -3314001 152189 -391053 -2976166 -6330096 -10237551 -13010942
41687 -13010942 -12349313 -8654258 -4406628 -705307 2368895 2949164 -639647 -5257153
41679 -5257153 -5207648 -224730 3260120 653063 -4878772 -7285239 -5135068 -1630487
41671 -1630487 261940 -117647 -2116895 -4067305 -3483677 722991 6412373 10103246
41663 10103246 10735518 10640829 12535831 15890479 16906193 12971016 6839532 4344948
41655 4344948 7218974 10763436 10451736 7936872 7334254 8183293 6684475 2401957 -1454144
41646 -1454144 -3950107 -7185935 -10618489 -10198906 -5005058 129409 1038007 -927310
41638 -927310 -2957930 -5347498 -8438789 -8706019 -2617117 7250799 14116967 14628997 11585525
41629 11585525 9185143 8130655 6170212 2192563 -1360434 -970258 2909187 5206892
41621 5206892 2708131 -695099 1063920 7126493 10370263 7216486 1444548 -2721358
41613 -2721358 -5396730 -6777792 -4509608 716739 2780477 -1302148 -5351797 -2826157
41605 -2826157 2566258 2552805 -2331474 -3762497 682774 3821877 715385 -3791665
41597 -3791665 -3382927 -12471 -77922 -4581366 -8430277 -7934051 -4450177 -805071 2195497
41588 2195497 4656059 5402358 2826633 -2433325 -6980114 -7593864 -4301255 347448
41580 347448 4613588 8455451 11132325 10732904 7430588 4407820 3306965 1563534
41572 1563534 -2597290 -5423857 -2661754 2593902 3042758 -2008692 -5284956 -2588852
41564 -2588852 789284 -1865085 -8932057 -13277358 -11806882 -7520490 -3706408 -786778
41556 -786778 1154849 766719 -2150288 -4746510 -3367004 2384996 8198677 8367091 1802157
41547 1802157 -5534007 -6439065 -1121123 2871268 643340 -3753200 -4049486 -1391143
41539 -1391143 -2092214 -7246885 -10666481 -8223910 -3819763 -3140097 -5539538 -6065391 -3004763
41530 -3004763 897134 3520367 5268458 5874288 3645797 -683800 -3099909 -1828513
41522 -1828513 -739666 -3698104 -7501488 -5133262 3954108 11558351 10727908 4304089
41514 4304089 276101 1295578 3118681 2435645 1404594 3207002 6963895 9582191
41506 9582191 10204045 9935606 8572345 4848687 -64685 -2285382 156331 4152962
41498 4152962 4838731 1449119 -2039439 -2430239 -1510780 -3026463 -6633322 -7882688 -4878424
41489 -4878424 -1739184 -2845351 -6057042 -5818319 -2060326 -720290 -4117001 -6253661
41481 -6253661 -1628335 5279572 5046066 -3757346 -12585697 -14236385 -10638079 -7581965
41473 -7581965 -6790786 -6657453 -6953781 -8145393 -8107090 -4378447 766588 1924367 -2014145
41464 -2014145 -5724397 -4347411 218463 2089160 -1080140 -5459545 -5616293 -472259
41456 -472259 5488987 6747672 2487326 -2649997 -3863263 -1077419 2461241 4637510
41448 4637510 5105350 3108418 -1445116 -5159856 -3941425 537023 1745223 -2552575
41440 -2552575 -6841488 -6494917 -4943310 -7366917 -11168655 -9298012 -1422853 4927920
41432 4927920 4794757 1645276 1311571 4678525 8467063 9915949 8686817 6337599
41424 6337599 5045721 5151767 4173801 582586 -2599310 -1749838 871260 -174721 -4478987
41415 -4478987 -5776322 -2335091 -616473 -5260449 -11491578 -12231791 -7964192 -4173980
41407 -4173980 -2665815 -1119804 1124307 2303646 2002856 1312534 336125 -970217 -1175202
41398 -1175202 100511 347043 -1661013 -2829759 -1037746 -2344 -3503155 -8015683
41390 -8015683 -7593435 -3404464 -965209 106811 4896278 12245970 14347044 8921420
41382 8921420 3219933 3027783 5473747 6172099 5930462 5960837 3478015 -2433278 -6367902
41373 -6367902 -3761921 2151244 5664621 6145518 5175972 1488194 -4941777 -8667697
41365 -8667697 -5992083 -2389592 -4855023 -10327039 -10553499 -5919970 -4470248 -8005679
41357 -8005679 -9691419 -6670860 -4577855 -6311875 -6299026 -1079608 3388253 1949728
41349 1949728 124803 5002002 11793875 9706155 -1117852 -8653307 -5581284 2005066
41341 2005066 4993821 2912195 1024424 1397010 2273424 3239860 5562652 8223230 8078175
41332 8078175 4504629 698791 -625501 -343621 -366613 -134789 1960739 4705344 4699336
41323 4699336 1514830 -679972 1224177 4244718 3332867 -800714 -2454250 67574
41315 67574 1436447 -2155991 -6265900 -4577395 1464376 5039562 3769362 819367
41307 819367 -2583529 -8222210 -13792495 -12864310 -5247741 -160459 -3954945 -10711960
41299 -10711960 -11296146 -6667708 -4512535 -6257586 -6394857 -3437625 -2404129 -5367728
41291 -5367728 -7830685 -7016035 -6385202 -8228926 -8179097 -1983127 6846752 11041926 8227156
41282 8227156 1829027 -3697841 -5270893 -2088404 2345074 2254107 -2906538 -6476723
41274 -6476723 -3923001 -173124 -2550272 -9828247 -14434080 -13224868 -9571234 -6015566
41266 -6015566 -1651394 3055204 5123218 4027256 2833755 3144437 3213974 2032585 1060143
41257 1060143 914067 334009 -672737 -607517 -153381 -1890752 -5360571 -6649859 -4228072
41248 -4228072 -1207958 -453047 -1327125 -2528109 -4005554 -4636339 -2299860 1933013 3795862
41239 3795862 1771613 -1105026 -2906066 -5326064 -8385057 -8084542 -2811065 2785028
41231 2785028 4258756 3334116 3346581 3208053 708595 -2248681 -3058333 -3504061 -5839115
41222 -5839115 -7148327 -3932771 523417 492875 -2331633 -990967 5235371 9298976
41214 9298976 7321875 3622111 2540445 2070226 -775328 -3940570 -4262438 -3341329 -4622985
41205 -4622985 -7168505 -6955118 -3123452 1104884 3356060 4497346 5737987 6194241
41197 6194241 4648092 2123112 1125951 2629129 4962610 6093443 6137096 6519831 7144824
41188 7144824 6323819 4003914 2838936 4477174 6659996 6282414 3954858 2815937
41180 2815937 3698994 4581947 4652882 5555421 7672592 8142171 4572659 -954947 -3773452
41171 -3773452 -2149989 657305 395019 -2777177 -3972074 585096 8212706 12190945
41163 12190945 9663370 4735879 2697970 3866262 5270751 5821641 6359980 6207204
41155 6207204 3828545 753874 914765 5086502 9047330 8798573 5532234 3813066
41147 3813066 5983160 9650097 10374047 6288251 -36912 -4619686 -6638012 -8497728
41139 -8497728 -11216618 -12374267 -10166197 -6868204 -5734709 -6511843 -6777195 -5784365 -4000210
41130 -4000210 -937152 2964880 4295086 696164 -4706200 -7305246 -7656003 -8928909
41122 -8928909 -9576369 -5411542 1431440 3364118 -1282284 -5113045 -2741798 1864113
41114 1864113 3018454 1918151 2435954 3601632 2375815 194557 550422 2464361
41106 2464361 2181871 -222232 -1380950 -788953 -1281613 -3642543 -5243195 -4251597 -1666522
41097 -1666522 656764 959018 -2410247 -8324389 -11492350 -8228439 -2807508 -2883740 -8538455
41088 -8538455 -11631678 -7485568 -1499362 -1046089 -5576691 -9172538 -9657444 -10021191 -12050707
41079 -12050707 -13430990 -11785541 -8094958 -4829388 -2970983 -2121958 -1881846 -1803471 -1070631
41070 -1070631 593057 2404637 3810194 5383179 7203840 7327439 4052677 -381352
41062 -381352 -1026477 3567747 8516782 8051760 2414674 -2980354 -4196496 -1936185 1149533
41053 1149533 3063205 2462775 -403415 -2153689 663590 5776482 6495156 964111
41045 964111 -4198795 -3197866 -21038 -2511897 -9912911 -13335786 -8859787 -3192773
41037 -3192773 -3518117 -7445421 -7779913 -3540925 -363076 -1149524 -2245284 -296349 1804596
41028 1804596 -812575 -7293583 -11618677 -10546797 -7440979 -6862051 -8104948 -6879285
41020 -6879285 -2328985 923029 -1242523 -6598034 -8730492 -4521510 2121386 4360548
41012 4360548 -482354 -8300526 -12356005 -9762763 -3958316 -1228794 -5169428 -14011454
41004 -14011454 -22072217 -23612559 -17045244 -6808385 -86399 -203806 -4045693 -7039447
40996 -7039447 -8600818 -10087680 -9640690 -4027700 4476609 8507735 5045391 29868
40988 29868 466781 5500019 9124165 8963330 7814040 8003492 8894062 9723833 10697626
40979 10697626 10690120 7561853 2020199 -1764873 -1040284 2063476 3496237 2284421 1052954
40970 1052954 2268204 5190497 6691174 4781688 911758 -1980938 -3426815 -5446551
40962 -5446551 -7960132 -7148705 -1069542 5543395 6333273 2149993 -26560 2672321
40954 2672321 5068108 2378004 -2212664 -2460704 1611988 4205491 2269319 -1293744
40946 -1293744 -3201398 -4144739 -5823138 -6963001 -5055374 -433946 3858629 5571019
40938 5571019 4729041 2315206 -453634 -1812663 -683859 1369221 1428984 -868116 -2742697
40929 -2742697 -2566826 -2342598 -3847090 -4426666 23483 8482870 14484729 13011168 5556953
40920 5556953 -2029922 -4761652 -1540559 4512590 8225654 7136713 4528804 5409559
40912 5409559 9451640 11200422 7836161 2756762 -91841 -1292506 -2796854 -3612861
40904 -3612861 -2206364 -118919 558798 679817 1336718 561952 -2975976 -5808015 -4259371
40895 -4259371 -752075 139835 -347860 2121528 5965697 5367096 765074 -1077030 1043781
40886 1043781 40713 -6719436 -11032511 -6309829 1337362 2449604 -1194300 -585215
40878 -585215 5520302 9441625 7330755 3716288 2373571 1149835 -1500026 -1988480
40870 -1988480 2585831 9317013 13736500 14916532 13382079 8548647 1954239 -1271042
40862 -1271042 1213331 4506330 3314006 299510 1856815 7607854 10819457 8967013
40854 8967013 6957503 8320636 9798637 8064613 6113440 7869883 10517111 8432385
40846 8432385 2733671 336955 3526135 6723994 5360344 2345033 2396421 4406905
40838 4406905 4090097 1414909 127845 869827 5774 -3969870 -7380484 -6647712 -3152016
40829 -3152016 -295971 1573754 4080679 6320351 5308340 1071644 -2010979 -475312
40821 -475312 3623964 5230528 2407351 -1868360 -3633017 -1723142 2717740 8435374
40813 8435374 14043599 16993097 15169666 9948521 5505211 3919190 2712390 -1106186
40805 -1106186 -6151420 -8361048 -6838472 -4988681 -5437891 -6726129 -6428578 -5050465
40797 -5050465 -4483367 -4238281 -2224100 1032299 1931259 -1320627 -5442721 -5581868 -1224759
40788 -1224759 3341317 4545065 3596957 3867307 5599272 5621613 2554172 -105946 2046281
40779 2046281 8369884 13321003 12502467 6930518 1113305 -1600802 -1380626 -980070 -2945760
40770 -2945760 -6740192 -8719614 -6582932 -3611997 -5536572 -12056735 -14889289 -7517995
40762 -7517995 5104579 10798954 4029518 -8130781 -14695340 -12056666 -4983409 499627
40754 499627 2141655 966751 -810891 -1048953 1018414 4054653 6126419 6747122 6352942
40745 6352942 4510096 728138 -3121282 -3871010 -1501461 -91835 -2531826 -6241332
40737 -6241332 -6696973 -3955765 -2422730 -4160783 -5865475 -4008323 -270201 877209
40729 877209 -1272162 -2624589 -134891 3903703 4993079 2361502 -449514 -745178
40721 -745178 -116030 -1467221 -4317487 -5565779 -4581431 -4469801 -6998447 -9090150 -7202555
40712 -7202555 -3405012 -3209963 -7593004 -11268580 -10173273 -6978466 -6629898 -9174998
40704 -9174998 -10426423 -8393040 -5642406 -5330803 -7413842 -9147969 -7774563 -2862472
40696 -2862472 2568297 3873507 -369063 -5801099 -6619679 -2105563 3391575 6576457
40688 6576457 8363822 10418638 11568547 9498826 4461167 -274454 -1197582 2344010
40680 2344010 6790602 6675157 400553 -6600871 -7309223 -1842083 2640525 1360969
40672 1360969 -2882940 -5565786 -6714101 -7959995 -7791664 -4959534 -3419643 -7460568
40664 -7460568 -13411318 -13110280 -5782175 460692 539318 -1053450 1131099 4785711 4914332
40655 4914332 2578379 2124683 2920116 934797 -2863252 -2971499 1302794 3711233 415613
40646 415613 -4158840 -3943297 728688 5252856 7436531 8087338 7339726 4526611 747589
40637 747589 -1602525 -1324859 1614031 7120656 13438555 16155971 12092440 3664269
40629 3664269 -3314174 -5610087 -4064379 -560134 3095845 4246866 1473303 -2280643
40621 -2280643 -2504023 488925 1819858 -449595 -2231282 228348 4512615 5315239
40613 5315239 1124684 -4901130 -8919710 -9130981 -6170436 -2714118 -1294197 -1158566
40605 -1158566 808811 4790922 6433920 2851312 -2385956 -3581660 -561475 1681814
40597 1681814 421468 -1240973 1031759 6991291 11810203 11258356 6469463 3253526
40589 3253526 5677097 10560825 10535758 3100932 -6062891 -10094453 -8339211 -4759906
40581 -4759906 -2077031 -625799 -679553 -2249011 -3812701 -4161373 -4159580 -4278151 -2787698
40572 -2787698 353368 709133 -4787428 -11366797 -11475264 -5229535 103784 720103 -83150
40563 -83150 397507 -116770 -2904638 -4043574 -362476 4983379 7363693 7542550 8954854
40554 8954854 10775797 8992820 3411671 -1277620 -1841628 -38640 1298402 2536394
40546 2536394 5423306 8752598 8735914 4243975 -426600 -265392 3523422 4414590 -420944
40537 -420944 -5389873 -3992453 1642475 3707873 39993 -3478987 -2654259 -1026569
40529 -1026569 -3263408 -7562288 -8987187 -6923375 -4451239 -2469503 591066 3989333
40521 3989333 4404518 1228291 -1520327 -163240 4037647 6854371 6274857 4084488
40513 4084488 2733706 2183472 684510 -1990584 -3720814 -3039065 -1321562 -427853 335355
40504 335355 2426909 4441092 3727075 1277232 873650 2621253 1795645 -3714774 -8963207
40495 -8963207 -8457064 -4074103 -2174604 -4442132 -6112635 -3311775 1752720 4267944
40487 4267944 2957161 825221 676818 1626970 755772 -2393208 -4507727 -2571414 2118223
40478 2118223 5755683 6737432 6098551 4177866 360991 -3793894 -5004847 -2910062
40470 -2910062 -899801 -1115962 -1980064 -1931402 -1790657 -1607783 724687 5065193 7169835
40461 7169835 4589559 905757 331169 1357409 146361 -2513810 -2628386 366166
40453 366166 3293615 4586472 5291444 5169809 2274098 -3148433 -7825666 -9044840 -6600668
40444 -6600668 -1589539 3992263 7002609 5507714 1297538 -2196030 -3808274 -4382449
40436 -4382449 -4167694 -3346059 -3612814 -5887086 -7725848 -6358200 -2825475 422771 4010506
40427 4010506 9097717 12249884 8816111 926809 -4070486 -3772677 -3266616 -6027433
40419 -6027433 -8274390 -5388137 784673 4630200 3699306 102705 -2642812 -2194530
40411 -2194530 857282 2581988 -163164 -4453116 -3980288 1724691 5338699 1463749
40403 1463749 -6137957 -10432964 -10178967 -8643711 -6487280 -1601824 4912884 7902814
40395 7902814 4461648 -2126103 -6232313 -6133366 -5283678 -7573769 -11761359 -11842428 -4484270
40386 -4484270 5186799 8694199 4991851 1503024 2924346 4359520 -427317 -8398193
40378 -8398193 -10954566 -6201836 -1079264 -1050658 -3396492 -2728429 1156815 4010600 3367235
40369 3367235 989532 -390272 -618579 -1675160 -4339533 -6466587 -5620223 -2818335
40361 -2818335 -1412441 -1843823 -595147 3770269 6847699 4378468 -470716 -948210
40353 -948210 3073094 4570327 38152 -5041228 -4212220 1265220 5800641 7825809
40345 7825809 9606750 10904883 8726189 3427715 -199392 449870 2077425 523550
40337 523550 -3481151 -5917656 -4600857 -556145 3791960 5737488 3563853 -875434
40329 -875434 -2582391 839653 5329572 5270700 939295 -2551500 -2924463 -3035885 -5126765
40320 -5126765 -7082443 -6115150 -2894040 -50058 1021457 392454 -985575 -919910 2266074
40311 2266074 6400306 7055137 4045386 2661549 5949097 9477810 7381007 588422
40303 588422 -5087795 -6873509 -6835366 -7372558 -9008650 -11542936 -13650082 -12491883 -7388697
40294 -7388697 -2496621 -1881518 -3425517 -2133594 1906115 4196950 3720943 4173771 6783496
40285 6783496 7718625 4405948 -392082 -2833729 -2427291 -652294 1188461 1696155 825465
40276 825465 2144495 8857206 16875104 17858110 11091330 5861893 8594599 13937921
40268 13937921 13501497 7732842 2866474 702454 -1164686 -1979672 1149964 5771986
40260 5771986 5507153 -51364 -3695058 -961891 3860299 5264932 4929192 7969212
40252 7969212 14012591 17260761 14630402 9353885 5928932 5240317 6252304 9129461
40244 9129461 13371677 14861696 9437277 -215089 -5695330 -2932766 2809104 4883921
40236 4883921 4080198 4685973 5396642 1495866 -5077947 -6196800 202970 5933067 4225910
40227 4225910 -884146 -1698335 1922822 4319581 3343184 1788532 1508458 1556858 1240904
40218 1240904 626701 -1067600 -3691510 -3890028 1400165 9792087 15198440 14259361 8585981
40209 8585981 2116292 -1136724 1014579 5865117 6941429 1957878 -2927483 -1248194
40201 -1248194 4201220 5618840 1719870 -1822148 -2308513 -2845676 -4761452 -4593370 -671631
40192 -671631 3618715 5609127 6789504 8088674 7332612 4294919 2817950 4446084
40184 4446084 5122673 2166314 -510017 1108472 4067172 3545408 1200056 1803459 4067196
40175 4067196 2106606 -4460769 -8736732 -5970240 924507 7027813 11487492 15188260
40167 15188260 16510850 13331589 7320344 2962206 2902123 6202612 10331011 12930209
40159 12930209 12325446 8556668 4263608 2937949 5431841 8875821 9651987 7056293
40151 7056293 3583850 2002559 2911377 5191371 7871061 10649528 12938367 13628558
40143 13628558 12390147 10534428 9783121 10344628 10896849 10511459 9769880 9371237 8365131
40134 8365131 5366372 1908971 2601847 9774010 18843373 22062256 17504121 11416432
40126 11416432 10105602 12449760 13287808 11662018 11213307 13207602 14200368 12008462
40118 12008462 9967947 12571821 19148803 24323454 23525532 16509529 6918642 -9186
40110 -9186 -697641 3981539 9893853 14438135 18619988 23536089 27502697 28948994 29730133
40101 29730133 32224625 34759027 33794983 29849251 26994329 26452061 25297043 22656887
40093 22656887 22265727 25855729 28215960 23641835 15080552 11476325 16229694 23346356
40085 23346356 26324557 26178757 27572334 30517610 30753517 27500861 25976915 30375468
40077 30375468 37393830 39648817 34505639 26878070 23123638 24453909 27519062 29685307
40069 29685307 31381408 33525626 35066247 34227167 30783492 25806425 20215806 15056063
40061 15056063 12212780 12765428 14985805 16176747 16461862 18166072 20919419 20559233
40053 20559233 14979246 8611881 7965799 13654223 19707001 20654477 16889962 12685238
40045 12685238 10835547 10108382 7284548 1595753 -2904115 -960268 6965194 13774119
40037 13774119 14113556 11330131 12190516 16332810 16415180 9115876 400995 -2414339 751323
40028 751323 5132741 8077348 9699666 9750895 8629687 9778228 16069112 24036320 26205421
40019 26205421 20064436 11180075 6201295 5958104 7341304 9195259 13058742 18789912
40011 18789912 22629953 21109894 15707115 11890770 13278759 17945343 21321740 21634706
40003 21634706 20825094 20718956 20761949 20112571 19609760 20113295 20527829 19312141 16975205
39994 16975205 15334389 14865919 14386868 13159875 11989457 12120884 13867851 16471331
39986 16471331 19016923 21525083 24887433 29129084 32205164 31854800 28534652 24964733
39978 24964733 22736955 21162779 19649882 19099386 20302317 22812594 25903054 28724349
39970 28724349 29452297 27016862 24027372 24535705 27846260 28380789 23603759 18188414
39962 18188414 17511779 20632862 23221308 24156358 24964846 25364259 24209709 23187228 24645368
39953 24645368 26586854 24525387 18169941 12019739 9210355 8745947 9078682 10320413
39945 10320413 11887244 11538522 8407105 4635409 2823004 3556621 5875617 8375014
39937 8375014 9664101 9405662 8756713 8375812 7090405 4545592 3468010 6081972 9591813
39928 9591813 9233883 5316621 3039168 5151974 8936515 11145334 11852178 12099117 11513755
39919 11513755 10229271 10205528 12560686 15658436 17353799 17316161 16114698 13985066 11485441
39910 11485441 9563985 8275861 7184353 7190772 9597183 13032881 14099218 12014320
39902 12014320 10124862 11590673 15552377 18606895 18396326 15060481 10792183 8410121
39894 8410121 8834238 9926946 9346941 7852820 7626688 8366247 8083005 6962358 6782782
39885 6782782 6991244 5534359 3559001 4593835 8295617 9880332 7446361 5236987
39877 5236987 7182660 11285932 13353750 12868433 11958424 11280541 10176799 8968344 8195426
39868 8195426 7009182 4737201 2925438 3878345 7944279 13277056 17186951 17336706
39860 17336706 13450681 8391047 5661831 5608992 6114253 6483739 7410759 7503043 4301361
39851 4301361 -569753 -1976432 1344210 4353589 2850844 -907464 -2159468 278472
39843 278472 4214318 7161175 7185495 3852317 -21860 -891097 263926 -515795 -2634702
39834 -2634702 -920312 5008315 8313157 5472815 2309512 4527734 8914603 10202243
39826 10202243 10318001 12904826 13970362 7519111 -2621051 -6394627 -1891450 2865777
39818 2865777 2505908 171026 -259970 103400 -520472 -1020121 -646894 -680520 -961533
39809 -961533 491801 3039536 3504711 2025678 2693625 6673784 9819829 9283580 7578849
39800 7578849 7474946 7445098 5310772 2493895 1288436 1008817 74559 -504201 1339715
39791 1339715 5394790 9408148 11108588 9010925 3634433 -1114207 -792498 4016414
39783 4016414 8036462 8317521 7210437 7003919 6420715 5181299 6900724 12824816 16985702
39774 16985702 13650338 6789668 5338033 10267697 13609211 10850815 6930050 7119544
39766 7119544 8622268 6374194 2531804 3526484 9568345 13744204 11965357 7880480
39758 7880480 5920774 4820260 1877433 -424349 2412602 8761475 11684071 8536996
39750 8536996 4871169 6640165 12263179 15478416 13751436 10471830 9542906 10614121
39742 10614121 10247713 6529674 1853720 832322 4916231 9847878 10306970 6718396
39734 6718396 4634167 6889152 9811819 9040135 5898316 4925490 7116789 9054312
39726 9054312 8027551 5190614 3620398 5021458 8306969 10558122 10072741 8855417
39718 8855417 10355382 14071256 15031980 10355939 3822467 1516568 4799309 9843557
39710 9843557 12325365 10382747 4871582 -871201 -3139688 -1767664 -117077 246366
39702 246366 1751215 5628448 8561863 8015266 6922531 8411097 9503753 5964379
39694 5964379 668592 271922 4711530 6943611 3362775 -1902740 -4324611 -4966688
39686 -4966688 -6985330 -10309374 -12130328 -10378443 -5744619 -1806146 -2303365 -6242628
39678 -6242628 -7854073 -4401124 -758419 -1627080 -3114542 896571 7126868 6838780
39670 6838780 254160 -3187096 -90524 1756880 -3161231 -9249658 -9638541 -6447265
39662 -6447265 -4819283 -3689755 292037 4906039 5696623 3469884 1964017 1087933
39654 1087933 -1531297 -4995067 -6872011 -8049926 -10327820 -11488849 -8451706 -3481299
39646 -3481299 -1640357 -3439615 -5355703 -6283309 -7801863 -8874554 -6302913 -877509
39638 -877509 2274195 686480 -2363595 -2977224 -1159603 1047902 2752193 3918932
39630 3918932 4140329 3198249 1776994 1002355 1779056 4046009 6001408 5357423 2424053
39621 2424053 255970 503642 1398209 1480981 2349507 5050529 6788783 4906899 1687782
39612 1687782 1105518 2784941 3459428 2646231 2226617 1827762 -350105 -2985683 -3000051
39603 -3000051 -954636 6128 168775 2604067 6448225 6973933 3467863 926785 1924771
39594 1924771 2721023 252613 -2682530 -2863944 -2031165 -2434806 -1769442 2093659 5180292
39585 5180292 2398534 -4064765 -7671251 -7336719 -7672966 -9773626 -8804719 -2492267 4243744
39576 4243744 6436815 6049974 7726342 11030091 11618511 8438481 5256066 5101429 6546486
39567 6546486 6033494 1712109 -5240323 -11302538 -12743222 -9001179 -3883761 -1630105
39559 -1630105 -2135475 -2120742 -381973 1104610 1219553 1267630 1637820 487628 -2526843
39550 -2526843 -4503623 -3508031 -1538103 -821198 -263259 1343291 1730862 -1180808 -4632721
39541 -4632721 -4683569 -2556783 -2400391 -4341907 -5232985 -5085404 -6573146 -8601059 -7185689
39532 -7185689 -3224213 -2062877 -3720924 -1417762 6780473 12594351 9178839 1606928
39524 1606928 -860043 2217632 4463772 3656054 2568622 1188825 -3477650 -10051140
39516 -10051140 -12728115 -9641304 -5143765 -2576351 -365270 3192509 6452876 7677203
39508 7677203 7376128 5668756 1509533 -3666588 -5722585 -3416590 -403991 532540
39500 532540 1311415 3940927 6088524 5091668 3324147 4974783 9024542 9944275 5373376
39491 5373376 -433229 -1647915 2818094 8684776 10551719 6520584 -169230 -3824887
39483 -3824887 -1486629 4302462 8202829 7305069 3476455 1176809 3268913 8170640
39475 8170640 10844439 7742140 1237080 -2313487 213341 4978694 5924266 1598891
39467 1598891 -4568555 -9133927 -10869918 -9016939 -3158193 4093937 7488750 4630408
39459 4630408 -550101 -2133644 786901 3507293 1730079 -3766716 -8577059 -9163140
39451 -9163140 -5516460 -471708 3206508 5394752 7668470 9378456 6891107 -773385
39443 -773385 -7642554 -6742111 93579 3836550 796791 -2581979 -451351 3324010
39435 3324010 2287920 -1819675 -2956874 -1585375 -2514486 -4024194 386862 8874694
39427 8874694 10908108 3523326 -2534311 1039108 7171849 5182457 -1920874 -2643622
39419 -2643622 4664159 10009117 7355139 1521752 -1870141 -3876959 -6175637 -5366350
39411 -5366350 1267294 9178292 11212541 6590907 1153418 -161785 2004097 3774825
39403 3774825 2835324 553840 -36556 1845721 3651594 3129155 1561939 1445138 2432467
39394 2432467 2569215 2450063 4272554 6919550 6196519 940257 -4813086 -7138541 -6313355
39385 -6313355 -4011327 50320 5981832 10852118 11207511 7478515 3543181 2443159
39377 2443159 4157033 7000702 9540101 10907354 10096251 5823134 -1818629 -9288851
39369 -9288851 -11291332 -6668548 -940643 193536 -1434365 369632 5786377 7660888
39361 7660888 2436582 -3376108 -1940985 4921189 9063403 7933060 6877041 9643484
39353 9643484 12626506 10937985 5945441 3143544 4510492 6450424 5086262 1015583
39345 1015583 -1914707 -1099438 2448840 5551304 6014495 4557169 3889421 5684703 8551166
39336 8551166 9672471 8451232 7222323 7648267 7972027 5641261 1601974 -528004
39328 -528004 684241 3150553 5077738 7125172 9570994 10187803 7047273 1509831
39320 1509831 -3466851 -6256805 -6207274 -2671324 3235927 7893882 8894313 8027562 8128791
39311 8128791 8707119 7559880 5058875 3505541 3390649 3556254 4018518 5277207 5822552
39302 5822552 3977715 1563733 2063494 5585470 9248105 11994659 14983572 17447523
39294 17447523 16609353 12316487 7803711 5144973 3631870 3080949 4526363 6679790
39286 6679790 6064799 2401603 -8539 1667143 4693453 4890153 2061999 -821740
39278 -821740 -1679746 -745114 422395 254215 -1149395 -1649864 -74099 1474149 1044039
39269 1044039 885275 3806605 7047160 5585307 928629 -178778 3734741 7040602
39261 7040602 7084440 7904426 10975775 10922236 5521102 1892454 5875758 12137788 12767923
39252 12767923 9769884 9850772 11449420 7537211 -812959 -4286909 970235 8828794
39244 8828794 13608678 16427253 18881686 18462204 14053802 9706263 8833366 9451240 8739675
39235 8739675 7981766 9375645 11757676 13210459 14815929 18234901 22102861 24218444
39227 24218444 25217451 26964355 29206578 30842320 32662911 35528746 37269080 35052729
39219 35052729 30285595 27676293 29224211 32129046 33225267 32611009 31633497 29896127
39211 29896127 26632321 23657065 24179635 28571207 33470943 35915480 36740741 38605224
39203 38605224 41725926 43232896 40557546 34338650 28131998 25941600 29167969 34647731
39195 34647731 36549803 32107641 25057896 21550715 23239937 26661188 28703922 29477781
39187 29477781 29735652 29050357 27542323 26315637 25098847 22387377 18736481 16476754
39179 16476754 15259760 12099791 7394139 6008751 9545376 12389688 9567000 4373648
39171 4373648 3363767 7187448 11631547 14750944 17063114 16928268 12397948 6898152
39163 6898152 6573318 11385962 14561790 12280396 9042365 11211235 18621169 24886787
39155 24886787 24499700 18579495 14100422 16624537 23337034 25965986 21883137 17892948
39147 17892948 19958181 24620792 26077075 26257818 29791110 33363754 30502762 24773063
39139 24773063 26661586 37075685 45629369 47404411 49504699 56899550 63797528 65819339
39131 65819339 69662333 81435122 94529563 100136649 103221477 116104186 140058334
39124 140058334 165268876 187763722 215021438 253306563 298332273 340473804 371953400
39117 371953400 387105072 382795544 362362609 335210233 310440956 293472550 287837598
39110 287837598 294694055 309890620 326719691 342430789 356964779 364950323 356004921
39103 356004921 326247606 284430257 243249951 208646610 180443653 158463146 142880590
39096 142880590 131289737 120403782 109773313 100461971 91346494 80410905 69149716
39089 69149716 61950523 60273566 60122290 56820661 50786758 46617862 46557164 46880365 42523963
39080 42523963 34377143 28892056 29527560 31932646 30368670 26100203 25118137 28972638
39072 28972638 32769675 32296896 28572745 24564726 21627086 20387605 21233054 22465197
39064 22465197 21515272 19077141 18144762 18107690 14922328 8978526 6898896 11952382 18273811
39055 18273811 19554608 18439319 20929746 25435520 25097677 19016268 13287353 11175654
39047 11175654 9818326 7664700 7851357 11578091 14418299 12959420 10375655 11506685
39039 11506685 16030249 20208497 22330850 22750200 21221339 18192895 16785261 19430360
39031 19430360 23665097 24978615 23151329 22228633 24551258 28462245 32299115 37013400
39023 37013400 43255380 48635177 50293253 48912881 47951696 49125838 50468026 49471896
39015 49471896 46961450 46441315 49563753 53509478 53818589 49170312 42233213 36264272
39007 36264272 32400248 30265375 29460567 29686035 30490250 31438233 31682226 29498046 23915495
38998 23915495 17105106 13263932 14343363 18360288 22272434 24470975 24003446 20220818
38990 20220818 14679984 10763864 9523140 8331515 5549473 3515316 4238659 5464509
38982 5464509 5022002 6077308 12557950 21127486 24216698 21046021 18963175 22160368
38974 22160368 25609898 23798764 19786488 20011817 23739177 24247477 19488029 15279972
38966 15279972 16529578 20116776 19480028 13573737 8027030 8257992 14091877 21358254
38958 21358254 26595115 29065363 29721751 30198885 32425519 37125723 42209080 44395677
38950 44395677 43082831 40657321 38092780 32918274 23723252 14219256 9565077 10279853
38942 10279853 13256085 17136752 22082404 25134384 21692869 12817104 5739261 4743587
38934 4743587 6076474 4790029 2359174 3612107 9295224 15810368 20118188 21229374
38926 21229374 18992111 15232035 14168803 17725744 22199412 23715771 24829814 30108166
38918 30108166 36386213 34518499 22362477 9705254 6778634 12414335 17650500 17672403
38910 17672403 15340219 14581373 15311698 15391399 13973454 11565819 8996150 7493691 8142577
38901 8142577 10150036 11081471 10059114 9406129 11389635 14350089 14513761 11451081 8755157
38892 8755157 8284738 6887645 1510084 -4796195 -5887310 -719459 5479598 8309754
38884 8309754 8334783 7253532 4467314 -89758 -3549652 -4025597 -4139196 -6803150 -9545644
38875 -9545644 -7416372 -776313 4032833 2330952 -3672292 -8078213 -7557455 -3790199
38867 -3790199 -1144158 -2174838 -4696675 -4241733 -316107 2000839 -1063391 -5919629
38859 -5919629 -6146519 -1366374 3083225 4679314 6509469 10550913 13392177 11416759
38851 11416759 6479915 3205708 3141918 4521598 5772546 6225693 4786631 1065286
38843 1065286 -2648110 -3175742 -336606 2800630 3580590 2137029 137497 -1250721
38835 -1250721 -1708955 -1252451 -123741 1104399 1614692 624353 -1923913 -4553966 -4796063
38826 -4796063 -1584418 2949263 5144071 3713864 1228567 1109720 3847117 7094343
38818 7094343 8820278 8762362 6949748 3034603 -2016354 -5648288 -6623750 -6300546 -5368558
38809 -5368558 -1897225 4526469 9443728 8769657 5475235 5497850 8086012 6965545 1380982
38800 1380982 -1753161 1044054 4370727 3588676 2393202 5013041 7657527 5119723
38792 5119723 491672 43413 2504767 2084733 -950885 -1749287 -679274 -2237516 -5384128
38783 -5384128 -4682349 -880596 -487773 -4003528 -4559830 -149789 2780483 904785 -664896
38774 -664896 1271162 1863193 -2161325 -5389599 -2614721 2558781 4482554 4186795 4934491
38765 4934491 5499575 4514424 5181589 8571038 8573377 1516706 -5194879 -3059733 4141019
38756 4141019 6746588 4543395 4772352 7808041 6662034 256731 -4027517 -2377967
38748 -2377967 652004 1201912 1003688 1048614 -1037403 -4351764 -3349855 3300005 9305979
38739 9305979 9709077 7080807 5474591 4267608 1704916 -936596 -2426051 -3847336
38731 -3847336 -4614258 -1596831 4304143 6393416 1352111 -5025952 -6052005 -3241357
38723 -3241357 -1909439 -2176499 -558341 2770891 4672056 4903772 5508411 6008789 4682651
38714 4682651 3078706 3644647 4108174 276882 -6039128 -8233144 -4677093 -1118020
38706 -1118020 -1502310 -2194941 1444376 7411837 10254521 8940917 7115295 6958724 6960110
38697 6960110 5648914 3966099 3013412 2203003 1319492 2561098 8143147 16296774 21925298
38688 21925298 22039327 19064015 17645139 19322729 21777338 22339139 20242048 15943424
38680 15943424 10701028 7042865 7011657 8876866 7962723 2423165 -3719513 -5264069
38672 -5264069 -1926626 2597000 6249642 9935823 13271808 12740956 6399052 -1526368
38664 -1526368 -3950182 833997 6777131 7549532 4414390 3483072 5843569 5219510 -2321241
38655 -2321241 -10744141 -10941070 -2759574 5587220 8988618 9630655 9343875 5664836 -1002935
38646 -1002935 -3512826 2575000 10580121 10731429 3503409 -2200208 -2099244 1444
38638 1444 1157954 3347370 6964306 7921598 4669261 1928280 3361682 5740763 4965689
38629 4965689 3307898 5201298 9225177 10315188 8090739 7067927 9173298 11458917
38621 11458917 11550203 10510413 9424733 7570846 5417431 5473100 8201513 10498225 10517518
38612 10517518 10960014 14561998 18529955 17145245 9443456 1255373 -1155541 2218064
38604 2218064 5698797 4406497 -729060 -4632505 -4178121 -1290221 690762 1965935
38596 1965935 5152897 9888199 11829594 8019226 711223 -5467654 -8040982 -7163114
38588 -7163114 -4155441 -1574877 -2378079 -6194828 -7980229 -3387087 5322829 11494030
38580 11494030 11708913 8557583 6046173 5063211 4065535 2242976 947484 2449052
38572 2449052 6948288 10539092 8088119 -215013 -7374092 -7379775 -2487811 765933 703280
38563 703280 648326 1233779 -845411 -5430282 -6853203 -2295404 3291369 4504699 3023917
38554 3023917 3171092 4003491 1645425 -3037647 -5342092 -4444747 -4374758 -6901282 -8693219
38545 -8693219 -6996324 -3840974 -2492508 -2810723 -2292741 341715 4341448 8179850
38537 8179850 10333940 10000879 7886422 5340042 2630939 -478094 -2671290 -1921280
38529 -1921280 1139661 3119316 2285399 1005225 2248080 5367050 7286029 6820990
38521 6820990 5692034 5335714 4507564 966220 -5046918 -10013651 -10459568 -6926898 -3701769
38512 -3701769 -4036117 -6487814 -6973437 -3733952 1137544 4820101 6837149 8547962
38504 8547962 10512397 11097690 7994985 1544305 -3824757 -3146533 3408052 10142438
38496 10142438 12224358 10469675 8184100 5957791 2863323 755717 2744077 7708515
38488 7708515 10794196 10020447 8347172 8107284 7520712 4663109 1132235 -815964 -1587934
38479 -1587934 -1903880 -247322 3702449 5619667 1122798 -7143228 -11484943 -8548886
38471 -8548886 -3019186 -1038948 -3178717 -5499071 -5023931 -2007661 1744988 4643301
38463 4643301 5808033 5286034 3757105 1362676 -2593783 -7789377 -11330832 -9770703
38455 -9770703 -3166154 4073912 7243403 5559192 1784117 -1136466 -1708591 629258
38447 629258 5080288 8558407 7921155 4011731 923518 59062 -1957648 -7113799 -11069390
38438 -11069390 -8619984 -2120985 722856 -2798274 -7404962 -8104823 -6427835 -6044227
38430 -6044227 -6462658 -4730435 -744075 2889920 5034022 6917737 9270231 10860128
38422 10860128 10001719 6457550 2098826 -218568 331931 832774 -1812696 -5660812
38414 -5660812 -5510440 -633877 3565087 3578305 2798930 5072569 7774335 6371996 2389482
38405 2389482 803934 1848282 1907350 1140000 3015862 6314552 5098639 -1638451 -7190324
38396 -7190324 -6818167 -4079730 -3997725 -5588309 -5542390 -4313985 -3406127 -830381 4900414
38387 4900414 9495234 7885630 2373050 -586972 -400197 -2380751 -7916179 -11468957
38379 -11468957 -8931712 -3029219 1865634 5026265 6766320 5535884 1334274 -1930327
38371 -1930327 -1494392 -3521 -784090 -1917350 241622 4004197 4373514 1215713 -164355
38362 -164355 2973534 7290476 9098270 8952153 8510340 7080335 4266011 2546941 3482337
38353 3482337 3892944 157826 -5052140 -5060575 1553235 8280366 8785028 4160143 -260503
38344 -260503 -2387987 -4076411 -5908149 -5798290 -3554035 -2892629 -6371127 -10802755 -11009208
38335 -11009208 -6902309 -3210645 -2339651 -1526768 1568201 4265353 2831279 -1518869
38327 -1518869 -4245417 -3822733 -2779495 -2855309 -2798623 -1424650 464172 2171355 4127132
38318 4127132 5564067 4113621 -339894 -3843289 -2844392 1120194 3537387 2623929
38310 2623929 747765 870868 3588347 7341319 9766656 8814635 3972341 -3094648
38302 -3094648 -9466634 -12614585 -11583426 -7636280 -3610454 -1146435 1349987 5909122
38294 5909122 10253067 9245842 2416238 -3589662 -2931588 1912458 4165720 2023546
38286 2023546 -599738 -1396485 -2409135 -4605795 -4608082 292877 6886259 9389519 7006397
38277 7006397 4831047 6655661 9604216 8164660 2259516 -2121056 -1108214 1864694
38269 1864694 1843264 -37508 405922 2177521 924192 -1523929 1931450 10930315 14995722
38260 14995722 8845358 1761334 3823670 10364670 10569615 5727626 5960754 11618287
38252 11618287 12385840 5833947 2471810 7940541 13324912 10351163 4897906 6026280
38244 6026280 10514235 9115057 2137248 -2160271 -1045895 1039275 2050228 3824475
38236 3824475 5040295 1946475 -3662988 -5564987 -3037211 -1976299 -4841115 -6841667
38228 -6841667 -4092730 1130330 5412701 8090189 7877841 2309072 -6144564 -9608793
38220 -9608793 -4622005 2868198 6424337 7535108 9998735 11279395 6668124 -1104951
38212 -1104951 -4083752 -81769 5081040 6322985 4336191 1386371 -1986425 -4389558
38204 -4389558 -2984398 1823901 5115178 3624027 -104557 -2251028 -3002912 -4100448
38196 -4100448 -4180672 -827920 4336904 6740466 4540168 -1796 -4178979 -6580841
38188 -6580841 -5764977 -1043524 5028220 8395957 8438537 8094430 8686400 8350060 6532283
38179 6532283 5724653 6528886 5118099 -950446 -7558317 -8703000 -4381103 2766
38171 2766 710425 -1359042 -3562254 -3928528 -1694913 1331170 1183817 -3042030 -5966440
38162 -5966440 -2239803 5216180 8513195 5839073 3209393 4363768 5267848 1507439
38154 1507439 -4251057 -6474750 -4892040 -3927350 -5848037 -8297945 -8050962 -4672423
38146 -4672423 -719143 472265 -1983017 -4960645 -4560160 -1117809 1425598 1400076 1120295
38137 1120295 1663232 235335 -4506208 -8255322 -6169471 123987 4673426 5084378
38129 5084378 4416919 5510895 6815829 4813316 -1203882 -7788450 -10573228 -8742904
38121 -8742904 -5634901 -4109263 -2868941 251286 3193227 2383942 -291666 731955
38113 731955 5125109 5757788 137887 -4393453 -1899894 2243099 -133508 -6394555
38105 -6394555 -6719563 957635 8412023 9517044 7232650 6630095 7688596 7804770 6410136
38096 6410136 4110068 857811 -2470853 -3553741 -1871728 -196266 -949329 -2870966
38088 -2870966 -2935102 -376344 2416183 2540303 -170976 -2404833 -866046 2958054 3629697
38079 3629697 -1046550 -6118681 -5496919 208902 5086016 5334960 1678426 -3983029
38071 -3983029 -9992340 -13684870 -12789344 -8170416 -2455602 2973828 6773470 5815861
38063 5815861 -880472 -8274212 -10599429 -9084119 -8660221 -8529304 -3379617 6064487
38055 6064487 11837149 10003713 5650377 3753985 2440539 -474191 -1267784 3273896
38047 3273896 8510241 7890054 2844693 27932 945376 1239644 -535876 -468081 3130516
38038 3130516 5703157 3053192 -2169229 -4414162 -3305222 -3420571 -6265837 -6798262
38030 -6798262 -350173 9632430 14600670 11105413 4078659 -674820 -2875522 -4554942
38022 -4554942 -5054160 -3415484 -2236902 -3819995 -4845104 -780327 5895059 8371491
38014 8371491 5968293 4961620 8030238 9799246 5390656 -2503640 -8160787 -9456053
38006 -9456053 -7012246 -1579065 4323513 6399956 3763715 648211 200982 580854
37998 580854 -33115 534161 3427078 4418269 -243476 -7067594 -9588789 -6777633 -2398894
37989 -2398894 1388529 4639239 6081947 4555737 2720328 4160137 7687156 9332924
37981 9332924 8856962 8880447 8355935 3279802 -5303399 -10333847 -8269431 -4272390 -4289018
37972 -4289018 -6265973 -4101297 2294365 6705643 6280730 5773025 9402549 12866097
37964 12866097 8800710 -1286521 -7016132 -2913007 3712777 3146717 -3121286 -5852479
37956 -5852479 -2470720 165992 -2491183 -6345726 -6502527 -4348385 -3166479 -2749451
37948 -2749451 -2466387 -4118886 -7217804 -6804155 -1217790 3059078 407923 -4663247
37940 -4663247 -4233017 840766 3212604 893595 -1430262 -1567246 -2007473 -3098978 -2114583
37931 -2114583 26390 -1108952 -4927193 -5014536 319403 3876838 53678 -6591277
37923 -6591277 -8255992 -4751980 -2130659 -3680579 -7416521 -10444354 -11140582 -8351628
37915 -8351628 -2751656 1784847 2213783 1399481 5049082 12978201 17552832 13123623
37907 13123623 4037771 -336839 2536137 5671250 2865007 -2385564 -2289064 3022031
37899 3022031 4644749 -2444910 -11503149 -12822778 -6603156 -1575273 -2574304 -5459061
37891 -5459061 -4845550 -1530702 110470 -1391815 -3457331 -3136030 -196199 2502060
37883 2502060 1210560 -4694391 -10812020 -11873401 -8041473 -4668345 -5237036 -7267222
37875 -7267222 -6452013 -2260302 2460771 5388172 5968958 4206111 690742 -2670857
37867 -2670857 -4131194 -4408310 -5838666 -8797395 -10342973 -7428114 -882381 4866390
37859 4866390 6195415 3711816 945981 343193 1296230 1586595 -329635 -4178330 -7779538
37850 -7779538 -8313715 -5070491 -775598 1338412 1393071 1749040 2565641 1687664 -610643
37841 -610643 -472198 4171593 10048613 12436618 10183652 5178222 -279503 -3506484
37833 -3506484 -1993950 3232689 7396663 7731509 6692937 6914830 6711269 4304885 2664286
37824 2664286 4971136 8244001 7363461 3447094 2007933 3912279 4617070 2304912
37816 2304912 461467 1460213 3339027 4461755 6205920 9059691 10558399 9341026
37808 9341026 7589737 7356288 7514065 6185533 3756647 2110600 2557135 4627313 5291458
37799 5291458 1045752 -6187602 -7925412 753658 12075357 13797253 5765080 -405976
37791 -405976 830836 1480629 -5298132 -12571426 -9700093 1273676 8468837 6382819
37783 6382819 814022 -1421662 -11030 2437171 5090880 7639849 8521083 6942127
37775 6942127 4480555 3121323 3208920 4147628 5610413 7122665 7474943 5652794 2392046
37766 2392046 241263 1159976 3596025 3198852 -1993402 -8105572 -9510941 -5735007
37758 -5735007 -1409248 312360 632725 971605 200398 -1978327 -2452937 1447145 7553025
37749 7553025 11026945 9862333 6321162 3708337 3066990 2622618 126959 -3739501
37741 -3739501 -5222932 -2331458 1658338 2354640 494116 192472 2128126 3342136
37733 3342136 3302826 4551539 7025708 7710604 6760877 7477227 8765181 4914543 -4357097
37724 -4357097 -11050800 -9977074 -5518179 -2769526 300907 5543021 7158001 294182
37716 294182 -8621381 -9827517 -4542264 -1444115 -1807972 930151 7633498 10764270
37708 10764270 7140571 3416675 5034100 7928098 6194851 1668605 148556 2115457
37700 2115457 2775725 -301801 -3916832 -3754012 -51138 1999190 -2154329 -10288045
37692 -10288045 -14723647 -11307173 -4555273 -1014348 -397682 2062988 6674167 8712402
37684 8712402 6318738 3166840 2693200 4623762 7606648 10300999 9613211 3445652
37676 3445652 -4032318 -5714038 -1489858 1137938 -1778132 -5269192 -4283381 -1518027
37668 -1518027 -1798247 -3867012 -3494879 -1374222 -2153568 -7134951 -12529839 -14356340 -12017501
37659 -12017501 -7950997 -5921619 -8093073 -11907561 -12050649 -7342509 -2742347 -2255745
37651 -2255745 -3485155 -2551684 -666174 -1028828 -2065657 468173 5890972 8723140
37643 8723140 6401838 2033679 -895160 -2046458 -1852927 -114047 1780513 1417260
37635 1417260 -173990 1254445 6075785 7988205 2143529 -6863164 -10016019 -5790395
37627 -5790395 -2019267 -5097339 -11803945 -14433307 -11028005 -6891342 -6957666 -10087709
37619 -10087709 -11483457 -8377768 -2241562 3229916 5371784 4642330 3915694 4997757
37611 4997757 6282909 5439645 3669321 4188519 6285167 5095858 -650188 -4794809
37603 -4794809 -1434851 6650268 11925562 12297351 11924161 12816395 11821336 7129218 2349139
37594 2349139 1438453 3276355 3983115 2125147 -596356 -2020255 -1375288 105588 2613
37585 2613 -2014579 -2305264 2148899 7855542 8148598 2713419 -1744137 -1743074 -1624166
37576 -1624166 -4753564 -6621286 -2283701 4323724 5508963 1350374 -1034326 1526326
37568 1526326 4900085 5411474 4558126 4460651 3955353 1748023 -346336 -62931 1649618
37559 1649618 1770407 -1102205 -5186573 -6808384 -3321177 4062035 10823017 13735711
37551 13735711 13726398 12716475 10066654 5256485 1662500 2835263 6141393 5477585 264232
37542 264232 -3804409 -3701372 -2749241 -3292376 -1774867 4777703 12045085 13324650 8419092
37533 8419092 2837989 -70298 -1544926 -2882950 -3037473 -1293068 892602 1675032
37525 1675032 605909 -1711743 -4406188 -6847321 -9268649 -12173328 -14492249 -14103821
37517 -14103821 -11368967 -9624152 -9927809 -8145235 -997142 7150577 8507736 2288925
37509 2288925 -4049301 -4489213 -624181 2986577 4645522 4178260 297175 -6672684
37501 -6672684 -12392502 -13174743 -11319242 -11558425 -13250303 -10843071 -2532822 6051981
37493 6051981 8820438 6502480 4116893 3468293 1934634 -1785790 -4691301 -3949478
37485 -3949478 -1622466 -1853014 -4312984 -4023827 1404830 7529068 8449191 4316428 350020
37476 350020 -431258 196650 161537 142907 952108 1510430 1455254 2593600 5224500 5976364
37466 5976364 2666904 -1078739 -172930 4388433 6687136 4096466 15743 -1802580
37458 -1802580 -1341600 192683 2669099 4868033 3823225 -839720 -4756357 -4196653
37450 -4196653 -1625360 -2609317 -8256081 -13877152 -14951223 -11778026 -7901400 -6027456
37442 -6027456 -6316935 -7425620 -8143085 -7982571 -6514096 -3013078 2085219 5882664 5326235
37433 5326235 1369845 -1400567 -540991 1046349 -355366 -3474436 -3665703 453936
37425 453936 4917463 5335364 1758631 -2223580 -3828753 -3355367 -2515435 -1682988 35384
37416 35384 1943517 1082260 -3396764 -6722420 -3275094 5088390 9949730 7049955 1616927
37407 1616927 405321 2931661 4530270 3967035 2810359 629547 -2887417 -3440316
37399 -3440316 2971280 11559766 12884237 6127278 652212 2463930 6777181 7459890
37391 7459890 6365733 7678276 8971510 5081756 -2538941 -7298569 -6692250 -4097646
37383 -4097646 -2310920 -834191 648722 1168891 1257859 2668553 5032456 6544061 7782523
37374 7782523 10622279 13420349 12260347 7783828 5482509 7239065 7846533 3285450
37366 3285450 -2261290 -2468532 1446582 2870563 -564 -2216519 -651455 1219230
37358 1219230 -688133 -4784553 -6763133 -5733174 -3839961 -2000589 -78849 25825
37350 25825 -3713788 -8105368 -6112509 4174072 15579607 19909545 17249984 13688712
37342 13688712 12067970 9906841 5977597 3570379 5384480 9183528 11217375 11097928
37334 11097928 10349335 8453316 4056035 -968919 -2644586 -565572 892727 -1392183
37326 -1392183 -4543476 -3480888 1719670 5304120 3288941 -1251682 -2658696 -872537
37318 -872537 -1382005 -6480312 -10754389 -8341486 -1664029 1682737 -650448 -3814108
37310 -3814108 -4315519 -4572360 -6748388 -7670689 -4143639 815742 2286265 1276265 2554245
37301 2554245 6102988 6885931 3355285 210172 782819 1861925 -573278 -4288099
37293 -4288099 -3851201 903506 3692098 -488336 -9111023 -14900709 -13886090 -9475265
37285 -9475265 -8064061 -11110030 -13233592 -9297226 -1623588 2642649 775599 -2506998
37277 -2506998 -2143436 642520 1099834 -2244530 -6557831 -9046290 -9232649 -7371976 -3518628
37268 -3518628 1239921 4553318 4639345 1560547 -3165177 -7200718 -8215385 -5777220
37260 -5777220 -2306384 -525430 -150942 917299 2269245 760724 -4252018 -8288950
37252 -8288950 -6864748 -1540072 2011088 1236301 -843408 -347855 3059281 6981747
37244 6981747 8894648 7040129 1393813 -4648605 -5927565 -1042847 5611582 9411565
37236 9411565 10813229 12182352 11965612 7109840 341178 -1107615 4460674 9861243
37228 9861243 8522038 2565654 -2307787 -5418202 -9020386 -10862169 -6067780 3823039
37220 3823039 10393882 8727402 3070191 -225873 -865654 -2380567 -5237005 -6401005
37212 -6401005 -4266297 -440500 2872217 4528839 3761894 344393 -4152556 -6986164
37204 -6986164 -6738363 -4350883 -1593814 572088 1813341 1382829 -1677783 -6577734
37196 -6577734 -9488102 -6191729 2649767 10497546 11548931 7352082 4077818 4165008
37188 4165008 4566654 3161268 2008720 2629868 2686403 205301 -2711846 -3597455 -3593464
37179 -3593464 -4342911 -4451267 -3011981 -2993347 -6101292 -7666655 -2916366 4134040 5180814
37170 5180814 -305880 -5102263 -5951645 -6978279 -10191954 -11177816 -7570309 -4145436
37162 -4145436 -4757706 -5568930 -1634459 4972796 9050807 9838076 9330477 7170680 2942043
37153 2942043 33495 1352747 4070781 4137136 2962959 3831593 4905716 2476977 -1500972
37144 -1500972 -2244986 -332440 328261 681981 4374952 8691849 6830678 -575380 -5384363
37135 -5384363 -4543217 -3514523 -5058013 -4260150 1329990 5571348 3176047 -1994072
37127 -1994072 -3615582 -1679980 553689 2428436 3693556 2336179 -434095 823517
37119 823517 6740656 9933088 6703588 4421158 9568916 15658567 12633702 2604849
37111 2604849 -4170213 -4656984 -3811915 -3587906 -2358883 -2757765 -8345476 -13699477 -9717477
37102 -9717477 1256752 7456660 5569283 4323470 8251859 10717111 7398904 4547167
37094 4547167 7449476 11119143 9641547 5824565 4175543 2411844 -2292066 -6026316
37086 -6026316 -5346372 -5109912 -10338425 -15942853 -13934778 -6498159 -2279447 -2725257 -1796202
37077 -1796202 2264620 4341127 1948798 -800275 -349959 1314785 608969 -2961415
37069 -2961415 -6988722 -8076246 -4168093 2063766 3891030 -1774747 -9384521 -11467732
37061 -11467732 -8032570 -4731904 -4119304 -4097354 -3231033 -2117906 -779709 371170 -1208613
37052 -1208613 -5882320 -8313157 -4340459 1225860 955378 -3262241 -3260883 1465963 2693615
37043 2693615 -2561965 -6829209 -4218487 1054397 2824606 2206990 3045038 4080695
37035 4080695 1969182 -1781453 -2764711 -387209 1973519 2125024 1107953 1319443 4559775
37026 4559775 10232631 14469344 13762922 10178736 9111307 10954802 10123478 4452245
37018 4452245 -129791 1875438 7310632 9409582 7057729 3926071 1695449 -334705
37010 -334705 -1254575 240178 1988411 785737 -2263890 -3493760 -2873322 -3564535 -5673606
37001 -5673606 -5556104 -1979141 1747497 3221077 4326521 6886890 8312452 4942578
36993 4942578 -1707133 -5329495 -2144317 3991827 5567921 470798 -5002231 -4003215
36985 -4003215 1598823 3523171 -1336856 -6391952 -4778709 998191 3105788 -749174
36977 -749174 -5557012 -6795404 -4737689 -952851 4289823 9416534 10528408 5885956
36969 5885956 -812351 -4110048 -2601001 552368 1779073 232043 -2437543 -3913391
36961 -3913391 -2932241 -66440 3060972 5394330 6913098 7621887 7001908 4799855 1568191
36952 1568191 -2052461 -5900947 -9575352 -11840899 -11789923 -10437405 -10010905 -11163257 -11818814
36943 -11818814 -9712111 -5318365 -851123 3024864 7174879 10667632 10737050 7649005
36935 7649005 6257515 9503207 13002740 10482484 2949875 -2678053 -3418659 -2832348
36927 -2832348 -3172516 -1440677 3882265 7890902 5563299 -875400 -5438820 -6241250
36919 -6241250 -5423102 -3893186 -1186069 1010651 123618 -3054296 -5340573 -5611575 -4523607
36910 -4523607 -1147315 5299079 10929439 9826896 2208088 -4639428 -5175003 -1548881
36902 -1548881 928571 668278 -134223 354807 1828115 2832378 2201040 658031 1164900
36893 1164900 5544576 10629825 10753297 4957247 -1261815 -2709213 -65966 2914734
36885 2914734 4719283 6047541 6798589 6015499 3719294 734654 -2198691 -3682351
36877 -3682351 -1910622 2364434 5127499 3924173 1619386 2318175 5065069 5369949
36869 5369949 2300323 -185000 472404 1841024 917695 -1169065 -1443265 126911 997314
36860 997314 211378 -349231 1201494 4313754 6418870 4983283 -71394 -4991620 -4594915
36851 -4594915 2032932 9286665 10914257 7490585 5212577 7571807 11731063 13647312
36843 13647312 12716959 9635145 3971214 -2695947 -4907134 359737 7424177 7370626
36835 7370626 -618261 -8392017 -9507528 -5727029 -1938139 71628 475827 -1137013
36827 -1137013 -3769899 -4098009 -986308 2119153 2584853 3056686 6499016 9954510 8610712
36818 8610712 4190337 3310668 7677507 11540615 10053423 5384110 2567241 3145438
36810 3145438 5377892 7864058 10198347 11641127 11478816 10082216 8332578 6664817
36802 6664817 5472803 5615150 7651441 10907102 13578085 13674127 10574706 6355161 4456647
36793 4456647 5699628 6836854 4933767 1817725 1398437 3487022 3804635 256883
36785 256883 -4272012 -6263251 -5607949 -4037990 -2315999 -743186 -302069 -1391435 -2768857
36776 -2768857 -3081154 -2279536 -750047 1421749 3538046 4311176 3674287 3032640 3104961
36767 3104961 3325556 3934905 6382243 10673113 14584709 16638480 17463747 17013326 13458674
36758 13458674 7084799 2378546 2839252 5560268 4777126 37652 -2987362 -206553
36750 -206553 5734739 9308087 8593398 5939462 3583163 1079819 -2587434 -6113721
36742 -6113721 -6723584 -3753427 169425 2266313 2623307 2896566 3475511 4017688 5565250
36733 5565250 9013928 11845838 10043436 3981649 -1122161 -1990830 -1028374 -1372889 -1876472
36724 -1876472 -81917 2869664 4210760 4374550 5778565 8032944 8383027 6333536
36716 6333536 4067648 2576301 1073681 104574 1173532 2776547 981980 -4576085
36708 -4576085 -8987556 -8366570 -4702115 -2121219 -1243356 -191012 1159753 1568845 1794333
36699 1794333 3815646 6824135 7339755 4031836 -292552 -2579597 -3072021 -3527489 -3972251
36690 -3972251 -3364260 -2179073 -1832259 -1935580 -631460 1960836 2990233 769107 -2372504
36681 -2372504 -2792462 59177 3655869 5955405 7007124 7384566 6992994 5633358 3282448
36672 3282448 -224858 -4403227 -7269409 -7093797 -4890703 -3135201 -2063314 266205
36664 266205 4031027 6852457 7868278 9219779 11603091 11714200 7210582 1608453
36656 1608453 407164 3811534 7077297 7212570 5529643 3869440 2220817 667339
36648 667339 340166 1577301 3944001 8418807 15936745 22754768 21613896 10593954
36640 10593954 -2129749 -6152515 -166370 7797270 10592204 8956545 7988379 9828330
36632 9828330 11803248 10664053 6924091 4571208 6717066 11909576 15405411 14210846
36624 14210846 9904633 6037946 4133369 3489615 3629845 4784192 6355490 7131858
36616 7131858 7250082 7942209 8920515 8227351 5641243 3941236 5035420 6833469 6457729
36607 6457729 5079828 6295800 10103928 12022045 9066263 3719796 599455 1536943
36599 1536943 5297957 9634034 11752937 9310517 3625153 -17734 1855840 6418628
36591 6418628 8721512 8432463 8513403 8761010 5894737 179597 -3256461 -1244376 3517631
36582 3517631 7016573 8373741 7985219 5512516 2256915 1464227 3174039 2614703 -2666612
36573 -2666612 -7793665 -7036635 -2014154 1636650 3064317 5736607 9710707 10791722
36565 10791722 7645602 4124217 3301956 3727301 2953974 1034579 -699199 -1151647 854969
36556 854969 5135507 8135411 6169309 1179295 -672642 3184369 9400736 14723347
36548 14723347 19345888 22739224 21559630 15045579 8483163 7613756 12163341 17546591
36540 17546591 20233488 19064647 14375251 8606012 5111710 4024784 2218622 -757973
36532 -757973 -912414 3232903 6720157 5461843 2987067 4467689 7890697 7725453 4566243
36523 4566243 3755787 5770139 5589514 1793834 -960703 197783 2684508 4535865
36515 4535865 7623221 11759343 11659566 4375163 -4590715 -7594350 -4570726 -1806473
36507 -1806473 -2699235 -4265887 -2614342 1758877 5099172 4972207 2824257 2269385 4754220
36498 4754220 7424091 6648508 3169371 1210068 2296956 3290397 1828601 146564
36490 146564 840005 1908721 -102994 -3785158 -4017902 770423 6415567 8893750 8990308
36481 8990308 9398054 9971597 8766892 6442377 6161505 8587012 9969804 7204248 2680327
36472 2680327 1087702 2496685 2554088 -188113 -1693172 799907 3816107 3081936 325801
36463 325801 -44335 1793039 2694658 3248566 6176710 9116617 6660882 212691 -2231758
36454 -2231758 1501960 3508458 -1965852 -9414499 -10899146 -7689504 -6120186 -6696196
36446 -6696196 -5131107 -1143304 1541329 2219664 3065821 3248320 339597 -3221720 -2555392
36437 -2555392 757211 -37166 -5449441 -7498948 -1910137 4418024 2807877 -5280051
36429 -5280051 -10767028 -8512547 -2085182 1505051 -1140043 -7133808 -10204156 -7325235
36421 -7325235 -2467258 -1515296 -4214085 -5187182 -2642068 -458927 -521004 655118 4714620
36412 4714620 7100325 4472530 1175604 2572999 6153778 5852149 2263436 1321681
36404 1321681 4064713 4980437 1167330 -3124476 -2868156 1665720 7041909 10752014
36396 10752014 11327502 8215886 3918020 3126382 7133687 11447338 11386088 7901142 5101308
36387 5101308 3865423 1652682 -1707841 -2132112 2805093 8628478 8004546 -152594
36379 -152594 -8575798 -9858388 -4509150 1086132 2658551 955142 -1979541 -5178518
36371 -5178518 -7062491 -5505664 -1253507 1932742 2286630 2167216 3396812 3848596 1224012
36362 1224012 -2902244 -5751848 -7064514 -6963115 -3500392 3205848 7244186 2992742
36354 2992742 -6299099 -11519116 -9006196 -3744970 -1173592 -1146624 -1213195 -920988 -560709
36345 -560709 653974 2695521 3606656 2236110 84431 -902502 -479504 767317 2275279
36336 2275279 2788101 1135345 -1450957 -2102367 -239123 1517667 1205309 82280 392845
36327 392845 2580248 5698522 8948948 11989243 14823912 17504010 19076040 17889079
36319 17889079 14439111 12099520 12621526 13072199 10500479 7100469 6286062 6294371 3666659
36310 3666659 874676 2938525 7587241 7597960 3291418 2956404 8618512 11641286 6988772
36301 6988772 1989217 4299584 9886938 11057980 9047567 9556090 11747674 11227407
36293 11227407 9173645 8860967 7328545 751646 -5501745 -3478381 2974897 2446288
36285 2446288 -5976023 -11094333 -7239057 -1475399 -329828 -863788 554217 1243354
36277 1243354 -263348 806768 6378217 9804732 6312492 1621224 2576029 6042392
36269 6042392 5400432 2088453 1720243 3667048 3928173 4302049 8547978 12321771 8055634
36260 8055634 -952567 -2676513 5748028 12681238 8213007 -3026486 -10094449 -9569933
36252 -9569933 -5643188 -2100427 -345598 -1593942 -5128692 -6589002 -2999931 2047458
36244 2047458 2669372 -1068786 -3495730 -1338117 2797978 5199987 5432266 4659421 2700383
36235 2700383 -886424 -4283865 -4543215 -1522677 926174 -1032560 -6488233 -10565881
36227 -10565881 -10294897 -7961167 -7277095 -7970295 -6829205 -3237959 -260823 138534 -382831
36218 -382831 22592 629207 746005 2175865 6199581 10107422 9995665 6104399 2465379
36209 2465379 1626099 2282682 2056420 309843 -2017161 -3533753 -3154181 -1148443 687649
36200 687649 1186125 1486084 2949953 4422893 4020820 2886634 3866146 6268319 5598477
36191 5598477 44972 -5833289 -6423794 -2257830 741532 -1429313 -6429139 -8673912
36183 -8673912 -5668276 -609749 1457397 -167973 -977280 2226419 5952459 4500168
36175 4500168 -1147424 -3653303 483438 5905131 6099116 1766530 -2125430 -3755796
36167 -3755796 -4168838 -2758074 1042013 3396879 67727 -5400608 -4232563 5322835
36159 5322835 14445988 15153602 9725952 4997833 2255312 -1648514 -6143814 -6301057
36151 -6301057 -270894 7450904 11355822 10463916 7528838 5072292 3475338 1731340
36143 1731340 -873483 -3558898 -4671498 -3778481 -2141135 -371337 2749027 7403975
36135 7403975 10374475 8519333 4016178 2592274 5701728 7779824 3549113 -4239839
36127 -4239839 -7627859 -3379466 3196611 5252478 2443857 -251732 38263 1175751
36119 1175751 508240 -1119041 -1532391 -1039186 -1660512 -3783559 -5752698 -5982455 -3652003
36110 -3652003 1555634 8141082 12271817 11301823 7245213 4196759 3080394 1871779
36102 1871779 105322 -582410 -43325 208458 317651 1373889 1494353 -2274549 -7611158
36093 -7611158 -8306004 -3539725 387969 39022 -183752 3031238 4952305 959824 -4111819
36084 -4111819 -2560808 4013898 7227221 4432945 812242 -68853 -71366 -662863 -409267
36075 -409267 587426 -170156 -2735070 -4374447 -4966817 -7307282 -11021312 -11780236 -8131344
36066 -8131344 -3839901 -1764891 -610269 418618 -798774 -4457094 -6638861 -5101442
36058 -5101442 -2858632 -2805938 -2911661 -386209 2802490 2455156 -2019504 -7263915 -9669540
36049 -9669540 -7549744 -2037163 2522327 1878558 -2751127 -5594988 -4026650 -1682172
36041 -1682172 -2120690 -3671126 -3461963 -2622680 -3697236 -5589868 -4631433 784531 8434204
36032 8434204 13161965 9333888 -3298908 -15322498 -15192791 -3624255 5750800 3731712
36024 3731712 -3215319 -4293805 209582 2761304 2041398 2556068 4015750 1812478
36016 1812478 -2435437 -1030863 7496206 15105709 15950008 13517514 12676487 11889522 8224996
36007 8224996 4287395 4162347 5913675 3836625 -3282682 -10703959 -14046275 -13575116
35999 -13575116 -12031841 -10803010 -9223527 -6649369 -4217149 -3801158 -4932417 -4101324
35991 -4101324 1152032 8241648 11832009 9871725 5158553 1063686 -1831385 -4532329
35983 -4532329 -7478153 -10464176 -13042685 -14271192 -13221176 -10099514 -6134959 -2717820
35975 -2717820 -1331380 -3020649 -6486285 -8192183 -6326859 -3217193 -1695575 -903608
35967 -903608 1482210 4609728 5481431 3387987 -64988 -4051426 -8034987 -9630697
35959 -9630697 -7150136 -3194034 -1454816 -1206360 348457 1910431 263956 -2471310
35951 -2471310 -864724 4481436 7198483 5834751 6106479 10014611 11316150 6416103
35943 6416103 1788254 4070279 9282164 9515512 5454891 3991201 6618354 8685323
35935 8685323 8551910 9028639 9676394 5848794 -2500744 -7843626 -4474302 3663350 8135309
35926 8135309 5987695 1218801 -1803330 -2961004 -4429784 -6426896 -6454021 -2844641
35918 -2844641 2106301 4213897 2569372 547678 1045266 3209301 5182497 7152831
35910 7152831 9229972 8977882 4587706 -1072818 -3122564 -591679 3242182 5471958
35902 5471958 5552458 3745465 919584 -725479 112109 1506717 1190732 572402 2116278
35893 2116278 3939392 1970836 -2753543 -4575631 -2124946 -1077097 -5343254 -10538007
35885 -10538007 -10298604 -5481385 -2360289 -3763073 -6677260 -7906696 -7799386 -7885511 -8253441
35876 -8253441 -8557043 -9340899 -10833693 -11588251 -9591645 -4470450 1892769 6802344 8776964
35867 8776964 8391336 7153366 5743404 3969031 2349770 2345203 4090699 5008290 2279890
35858 2279890 -3456210 -8173917 -8436768 -4467372 759435 4411447 5405579 4137491
35850 4137491 1615821 -1201423 -3684574 -5296576 -5359571 -3751865 -1940332 -2203901 -4900798
35841 -4900798 -7302269 -6523100 -3233909 -837333 -1010011 -2038835 -2042980 -1531024 -1436276
35832 -1436276 -861572 1045729 2783665 2771442 2529575 4375719 6912489 6614439 3651035
35823 3651035 1863476 2288860 1263519 -3167542 -7332394 -7502489 -5754237 -6330947 -8791527
35814 -8791527 -9261991 -7066548 -5518627 -6251955 -6848568 -5007237 -2012067 -674733 -1609857
35805 -1609857 -2640615 -1175944 2924409 6445736 5790046 1672688 -946911 760952
35797 760952 3430314 2584266 -245470 448408 5707978 9975590 8055069 878537 -6475606
35788 -6475606 -9669974 -7355079 -1468616 3563352 4215211 1468126 -607229 110882
35780 110882 2324043 4408226 5786528 5213768 1496404 -3215979 -4585811 -1895418
35772 -1895418 814842 881891 524519 2272429 4860728 6444670 8136330 10775123 11429491
35763 11429491 7331880 915072 -3323604 -5014070 -6578810 -7500466 -5137990 -681259
35755 -681259 969022 -1994324 -5906061 -7045298 -5743127 -4242935 -4100811 -6564124
35747 -6564124 -11661320 -15737675 -14031518 -7503024 -2891108 -3491403 -4230842 410126
35739 410126 7546479 9941958 6115505 773048 -3087992 -6136365 -7142309 -2549029
35731 -2549029 6263451 11427046 8138216 1292013 -1616703 -430609 -147680 -1730266
35723 -1730266 -1381042 1811039 3796376 2292957 248517 345179 562073 -1629858 -4229755
35714 -4229755 -3815497 -1387951 -776157 -2042179 -687664 5773490 13518837 16290808
35706 16290808 12052299 4590438 -640394 -1329558 661806 2267111 2593240 2935241
35698 2935241 3983688 4638979 4245706 4416232 6995072 10858147 12355849 9155325 2960513
35689 2960513 -1643296 -1061714 3909713 8547959 9143155 7381400 8048496 12268536 15615452
35680 15615452 13993435 8771959 4342963 2917603 3729634 5133651 5279288 2914125
35672 2914125 -225650 -334908 2670023 3417558 -1412955 -7087086 -6884151 -1420555 3293723
35663 3293723 4564237 3618089 -297783 -8688686 -17111579 -17802188 -10383552 -2742034
35655 -2742034 387751 2179198 4769767 3956406 -2531646 -8734241 -8464298 -4130514
35647 -4130514 -1661822 -1471927 -703359 -302744 -3106916 -7660916 -10114804 -10158793 -9782344
35638 -9782344 -8643702 -5937219 -3993416 -4338438 -3231176 2446103 7804588 5886226
35630 5886226 -1231917 -5284812 -4198505 -2868485 -2351221 1659000 8133586 8772189
35622 8772189 912054 -6362607 -4703966 1796236 3695779 -353247 -4061125 -3932365
35614 -3932365 -2586778 -3146210 -5661910 -8610905 -10090652 -8159911 -3096633 1491956
35606 1491956 2474885 1147978 997145 2657229 3513067 1387173 -3507148 -9313257 -13196687
35597 -13196687 -12263756 -6116968 1638939 5944998 4604270 2016 -2820890 -311460
35589 -311460 5694498 8687739 4501583 -2834401 -5510567 -2030696 1405190 363781
35581 363781 -2022130 -1136006 1880453 2781329 885687 -893201 -673325 1105356 3517379
35572 3517379 5626528 6474898 6351338 6251632 5180418 1310247 -2943157 -1769067 5389131
35563 5389131 11058870 9632295 5181878 4341001 6153450 5586930 3199028 3293469 4733099
35554 4733099 2198416 -3844717 -6824406 -4700865 -3089211 -5659548 -8719964 -8607027
35546 -8607027 -7938194 -10078918 -12593556 -11434722 -8212470 -7963319 -11267612 -13234333
35538 -13234333 -10292701 -4656837 -1141127 -1317001 -2132171 -312910 2901335 3201993
35530 3201993 -431259 -3750098 -3457674 -2072831 -3037601 -4205076 -1626988 2412741
35522 2412741 2065814 -1906394 -2189465 3439553 7905063 5506760 420179 5347 4421629
35513 4421629 7808382 6589089 2229179 -1975523 -3282411 -634707 3754626 5863245
35505 5863245 4900354 4397751 6687673 9714065 11208190 11914900 12195156 10006399 5543738
35496 5543738 3129841 4394838 4471298 131186 -3190439 650838 7337666 7110051 -709209
35487 -709209 -6557140 -4336076 1320149 3302755 1056265 -1673474 -3293151 -4928092
35479 -4928092 -7070552 -8424790 -7276157 -3302887 1177631 2671527 877463 -117739
35471 -117739 2334904 4564180 1503936 -5207191 -8988550 -7385291 -4138095 -2240656
35463 -2240656 -398745 2546853 4663443 4209210 1999808 -921051 -4437248 -7233362
35455 -7233362 -7294495 -5521561 -5026505 -5906746 -4813092 -824018 2531882 2574649 671704
35446 671704 -1298279 -3430870 -5171200 -4552760 -1865657 -7414 70231 -408251 -3008690
35437 -3008690 -10560555 -18669483 -16949883 -3584281 8826783 8657254 192707 -4541750
35429 -4541750 -3121432 -2131835 -3103543 -514401 6346382 10110341 6397237 -88791
35421 -88791 -3357481 -3011757 -659565 3495892 6867908 3908960 -5811513 -14179426 -14316331
35412 -14316331 -9540117 -7455481 -9152590 -10375550 -10305329 -11841064 -14074848 -11929819
35404 -11929819 -4816107 572306 -721913 -4623712 -3857893 1601110 4455628 -20235
35396 -20235 -7857077 -11347671 -7721989 -1056815 3250244 3670312 1993127 -315334 -3276783
35387 -3276783 -6436924 -8023776 -7189973 -5694744 -5670223 -6405648 -5363480 -2429132 -930415
35378 -930415 -3372332 -7950773 -10980602 -11459168 -11074548 -10621611 -9314334 -7758128 -8437448
35369 -8437448 -11842685 -14665999 -13836816 -10301831 -6559659 -2521291 2975003 7924909
35361 7924909 8444281 4319445 -392329 -3013535 -5022983 -7847552 -9251924 -6447249
35353 -6447249 -723424 3542412 3477228 -382218 -5671381 -10075544 -12435816 -13227478 -13364514
35344 -13364514 -12227319 -8396367 -2762922 1299427 1885014 443946 -1386933 -4069415
35336 -4069415 -7501783 -9115936 -7473192 -5185663 -4819760 -4096904 553636 6922436
35328 6922436 8328880 2426009 -5249248 -7702383 -3677549 2428376 5353764 2861439
35320 2861439 -2849056 -6612320 -4901124 374782 4092359 3959161 2481372 2919219
35312 2919219 5554452 8415309 9565037 7995133 4111814 53660 -1954867 -1909687
35304 -1909687 -1260018 -63557 2913029 7057033 9244282 7201598 2026817 -2958409
35296 -2958409 -4510501 -1233990 4647980 7908599 5756641 2252210 3434924 8055634
35288 8055634 8246602 964175 -6727518 -7294903 -2864125 -685944 -2083570 -2278360 444615
35279 444615 2334730 1598370 1918857 5974016 10300203 10232679 6605410 3587379 2172781
35270 2172781 234537 -2084751 -1919040 843578 2341481 1202914 2010777 8139064
35262 8139064 13975162 10439591 -1542122 -9385517 -3956091 8366919 13894841 9103457
35254 9103457 3340778 4235049 7562799 5241015 -1846184 -5237767 -1561945 2488511
35246 2488511 -292171 -7517478 -10431145 -5358670 2228617 5417068 3840999 1817186
35238 1817186 1351137 742409 -986599 -2615430 -4135789 -7287453 -10965293 -10452960 -4513786
35229 -4513786 555417 -1329787 -6877174 -7615680 -1924429 3344083 3401430 1196213 706469
35220 706469 806241 -417430 -313828 4086978 9504687 9655303 3979045 -1784462 -3724041
35211 -3724041 -4000131 -5852864 -8174652 -7560382 -3662322 380369 2447830 3801740
35203 3801740 5915156 6889704 3612335 -2849330 -7184991 -6523642 -4127303 -3770687 -3489997
35194 -3489997 434513 5201677 3639518 -4717203 -11135038 -9142728 -3133428 -1366924
35186 -1366924 -4624162 -7088306 -5935210 -4322303 -5302899 -7555961 -8021765 -5642833
35178 -5642833 -1664878 1714585 2664802 1255856 -431453 -889068 -1003014 -1920903 -2504946
35169 -2504946 -956347 2214409 5087163 7158775 8963616 9936171 9266689 8059951
35161 8059951 7792179 7058832 2919533 -4115973 -9039352 -7430340 -390535 6232657
35153 6232657 7205423 2885500 -928562 705251 5645356 7138063 3106083 -761493
35145 -761493 631122 4468772 5094624 2931980 2890569 5945662 8246735 7813855 6340636
35136 6340636 4472357 1049007 -2600382 -3536143 -3223432 -6267483 -11292745 -9963152
35128 -9963152 1054219 13109810 15824711 10015274 4753380 4653222 6170701 5115308
35120 5115308 2012336 -371423 -601658 1050785 2983396 2938200 672209 -718772 1142389
35111 1142389 3480059 1444928 -4803211 -9902481 -10474190 -8652381 -7426599 -6323658
35103 -6323658 -3885355 -1333445 -832642 -2001353 -2974552 -3654046 -5067352 -6283857 -5032723
35094 -5032723 -1460259 1615564 2913429 4396530 7317177 9107609 6769526 1774834
35086 1774834 -1489302 -1639206 -1556582 -3488989 -6047758 -7258453 -7646297 -8165805 -7438250
35077 -7438250 -3973274 207205 1327058 -1026801 -3351708 -3242785 -2640179 -4972037
35069 -4972037 -10377975 -14881159 -14110937 -7750306 -407014 2569774 561204 -1936420
35061 -1936420 -772848 3623656 8165479 10702291 9842814 4106364 -5154450 -11906201
35053 -11906201 -10933346 -4615182 -153075 -393051 -1729793 -1055495 317962 775849 1300426
35044 1300426 1967673 142826 -4685602 -8078164 -6274023 -1760085 361910 -749597
35036 -749597 -1894136 -991392 1266865 3272132 3109872 -666474 -5834673 -6630314 -1065447
35027 -1065447 4347029 2377935 -4087934 -5274489 1641067 8753289 9174672 5727021
35019 5727021 3996279 2705583 -2514565 -9147931 -9374319 -1855746 4846482 3388160
35011 3388160 -2749178 -4824597 -794771 3391021 3367573 1753259 2496621 4273846 2914012
35002 2914012 -1978350 -6519823 -7851286 -6741961 -4995529 -3156987 -1355999 -104455
34994 -104455 581930 1294658 2147598 3010810 4443749 6348332 6382999 2849607 -1065108
34985 -1065108 -14025 5627184 8947530 5646375 -216409 -2737045 -2487869 -3837498
34977 -3837498 -6862214 -7539508 -5086080 -3633962 -5693007 -8191018 -6819933 -1598640
34969 -1598640 3614818 5580305 4450684 2866222 2671885 2411349 -701753 -5546604
34961 -5546604 -6308177 398026 9567521 12752132 8054345 1258410 -2470912 -3400718
34953 -3400718 -3329328 -2018079 229080 630041 -2146666 -4901553 -3975722 -430855 1842561
34944 1842561 1557343 391176 -1012969 -3970758 -8575959 -12407193 -13283623 -11637373
34936 -11637373 -9481345 -8154011 -7450933 -6058221 -2708913 2159584 5869537 5766566
34928 5766566 2401973 -538385 -226577 1930188 1845018 -2141057 -6452077 -5607638 1361648
34919 1361648 8886212 10501212 6062622 1554507 1453645 3517178 2739401 -1313494
34911 -1313494 -3980513 -2069945 1926337 3324518 949250 -2296800 -3284993 -1304924
34903 -1304924 2351058 5563325 6461144 5107232 3970902 4939448 6137125 4184098
34895 4184098 -239456 -2372632 -275263 1708370 -773075 -5150096 -5263014 -35626
34887 -35626 5469132 7065657 5285549 2210158 -1212182 -3933859 -4875364 -5200533 -6726634
34878 -6726634 -7424583 -3291494 3951641 6783875 2581742 -1246090 2349210 9191037
34870 9191037 9533164 1544893 -7289602 -10570320 -8527795 -3976582 1013149 3903852
34862 3903852 2545541 -1581935 -4930942 -6847697 -8847045 -9509044 -5676995 734036
34854 734036 3099621 -861971 -5698128 -6228432 -3989844 -2882413 -3104514 -3008849 -3056043
34845 -3056043 -3941229 -3741686 -706727 3366540 5706305 6278718 6165467 4932409 2740230
34836 2740230 2299946 5066620 7908386 7373299 4900908 3616633 2432764 -1331849
34828 -1331849 -5137536 -3392047 3443167 8102051 6435995 2456929 814496 -442523
34820 -442523 -5087849 -10539528 -10485762 -4644399 -128179 -1807185 -5911366 -5936286 -1544443
34811 -1544443 2259720 2908390 2557469 2735185 1612789 -1591183 -3832480 -3083640 -2416182
34802 -2416182 -5026662 -8071193 -6898094 -3626687 -4867545 -10781943 -13363643 -7822665
34794 -7822665 478783 3964474 2557019 1153837 1594747 2137361 2131077 2342109 2320835
34785 2320835 1483424 1156238 1860050 610663 -4817222 -10610589 -10574974 -4320141 2403075
34776 2403075 5036991 4023112 1845790 283649 547312 2612946 4361092 4183907
34768 4183907 3706585 5002715 6624815 6098221 4532253 4045784 2426310 -3481921 -9913849
34759 -9913849 -9047467 -809374 5474766 3968450 123439 1367688 5749608 5637931
34751 5637931 -802627 -7708456 -9573746 -6408581 -1445940 2334183 3215306 1244757
34743 1244757 -1453948 -2162640 301996 4983019 9348108 10449927 7231740 2009529
34735 2009529 -1975777 -4200955 -5770811 -5630719 -1957064 2719057 3028794 -1064167
34727 -1064167 -2994150 632076 4130368 862600 -6875133 -11145820 -8842614 -4043612
34719 -4043612 -1708464 -3213101 -6666961 -8175269 -4613810 1722746 3900065 -727390
34711 -727390 -5758116 -4362699 1148026 4219732 4728664 6940151 9382659 6266424
34703 6266424 -1203501 -4745806 -2088566 -566902 -4033359 -5656693 9367 5925489
34695 5925489 2213019 -8317156 -13730178 -9737481 -3838834 -2703161 -3687102 -1261029
34687 -1261029 4484175 9298825 10575391 8261165 2924266 -3549099 -7021298 -4469591
34679 -4469591 1710238 5399636 3671297 375467 1385782 7020941 11237089 9046056
34671 9046056 2800611 -1056780 -403692 686874 -1147602 -3534228 -2648604 308605
34663 308605 728420 -2305102 -4406076 -1989472 3051693 6172621 5557759 2983558 752347
34654 752347 -180410 519229 3060767 6443951 8042499 5787170 927048 -2505403 -1774980
34645 -1774980 1618370 3939386 3531316 1835213 590025 12688 36450 1131693 2784119
34636 2784119 3257537 2718569 4688790 11443049 18879661 19653553 12180107 3199321 -593142
34627 -593142 -589661 -2531826 -6563596 -6254736 1270755 9227419 9205021 2234889 -3564018
34618 -3564018 -5054587 -7061778 -12033609 -14042901 -8016349 535454 2131124 -3210979
34610 -3210979 -6802127 -4612809 -1641134 -1899338 -2247647 315813 2387001 414116
34602 414116 -2324256 -1073466 2198603 2507875 826791 2284199 6789616 8566842
34594 8566842 5264693 1028947 -848569 -2501257 -6362830 -10341167 -11217958 -9398774
34586 -9398774 -7275468 -5411964 -3072938 -579914 1290270 2748778 3849743 3393769
34578 3393769 917751 -1587836 -2003694 -1091691 -1129260 -2281862 -2594015 -1522165 -1176558
34569 -1176558 -3010250 -4911780 -3598722 459701 2951855 1704636 375472 3280198
34561 3280198 8121444 8418657 3261467 -897085 -332239 -80710 -5304616 -11727369 -11532342
34552 -11532342 -5576412 -1671515 -1919086 -459075 5102635 8586132 5063729 -1114316
34544 -1114316 -2779686 573522 4204665 4921620 2311769 -3062667 -8500709 -9535154
34536 -9535154 -5603493 -2255694 -3708217 -6537514 -5296786 -1055850 1153786 856114
34528 856114 1973724 5428213 7859540 7546247 6321899 5332641 3665721 1703254 1383407
34519 1383407 2343032 1902403 -118603 -368218 2929221 6994465 8014439 5325614 1292774
34510 1292774 -1021409 -60988 2228793 1358388 -3954140 -8200676 -5341028 2030144
34502 2030144 4860471 -403299 -7203574 -7945023 -2852249 2854941 6277673 7668902
34494 7668902 7076440 4227043 346767 -2913056 -5366427 -7060215 -6749924 -3999514
$$ [...]
##END NTUPLES=NMR SPECTRUM
##END=
