##TITLE=31Pdec_SR166
 DMSO-d6, 128 sc
 20.4.2023
##JCAMPDX= 6.0         $$ Bruker NMR JCAMP-DX V2.0
##DATA TYPE= NMR SPECTRUM
##DATA CLASS= NTUPLES
##ORIGIN= UXNMR, Bruker Analytische Messtechnik GmbH
##OWNER= root
$$ XWIN-NMR		Version 3.5
$$ Thu Apr 20 14:35:46 2023 Russian Standard Time (UT+4h)  she@DPX200
##.OBSERVE FREQUENCY= 81.013821
##.OBSERVE NUCLEUS= ^31P
##.ACQUISITION MODE= SIMULTANEOUS
##.ACQUISITION SCHEME= undefined
##.AVERAGES= 128
##.DIGITISER RES= 16
##SPECTROMETER/DATA SYSTEM= spect
##.PULSE SEQUENCE= zgpg30
##.SOLVENT NAME= DMSO
##.SHIFT REFERENCE= (INTERNAL, DMSO, 0, 248.564)
##AUDIT TRAIL= $$ (NUMBER, WHEN, WHO, WHERE, WHAT)
$$ ##TITLE= Audit trail, XWIN-NMR		Version 3.5
$$ ##JCAMPDX= 5.01
$$ ##ORIGIN= Bruker BioSpin GmbH
$$ ##OWNER= she
$$ F:/spectra/data/she/nmr/P31/1/pdata/1/auditp.txt
$$ ##AUDIT TRAIL=  $$ (NUMBER, WHEN, WHO, WHERE, WHAT)
(   1,<2023-04-20 14:34:49.56 +0400>,<she>,<DPX200>,
      <continue with go, POWCHK disabled, PULCHK disabled
       configuration hash MD5:
       00 E9 B6 7A A2 85 ED C7 34 08 36 98 17 FE 4E 26
       data hash MD5: 32K
       30 99 90 1B FB B0 76 CE FB 25 82 F7 EC 9A D0 DF>)
(   2,<2023-04-20 14:34:51.31 +0400>,<she>,<DPX200>,
      <Start of raw data processing
       efp BC_mod = 2 LB = 1 FT_mod = 6 PKNL = 1 PHC0 = -10970.84 PHC1 = 84.28488 SI = 64K 
       data hash MD5: 64K
       26 4F 64 87 9E 7C 95 CF 29 41 44 E1 81 2B 3E D2>)
(   3,<2023-04-20 14:35:05.67 +0400>,<she>,<DPX200>,
      <pk PHC0 = -87.48187 PHC1 = 142.7999 
       data hash MD5: 64K
       D3 5C CB FD 6F DD 01 99 E1 0A 67 68 80 E9 44 92>)
(   4,<2023-04-20 14:35:28.54 +0400>,<she>,<DPX200>,
      <pk PHC0 = 7.000115 PHC1 = 0 
       data hash MD5: 64K
       98 6B AD 8A 68 D1 7A 82 B2 B8 4B 2D 04 3B 0D 84>)
$$ ##END=
$$ 
$$ hash MD5
$$ 01 5E 1F 7D FC 83 5E 0D 42 8B BB 76 5B 76 FD BA
##$RELAX= 
##$RELAX= 
##$RELAX= 
##$RELAX= 
##$RELAX= 
##$RELAX= 
##$RELAX= 
##$RELAX= 
##$RELAX= 
$$ Bruker specific parameters
$$ --------------------------
##$DU= <F:/spectra>
##$EXPNO= 1
##$NAME= <P31>
##$PROCNO= 1
##$TYPE= <nmr>
##$USER= <she>
##$AMP= (0..31)
100 100 100 100 100 100 100 100 100 100 100 100 100 100 100 100 100 100 
100 100 100 100 100 100 100 100 100 100 100 100 100 100 
##$AQSEQ= 0
##$AQ_mod= 1
##$AUNM= <au_zg>
##$AUTOPOS= <>
##$BF1= 81.014009
##$BF2= 200.13
##$BF3= 200.13
##$BF4= 200.13
##$BF5= 200.13
##$BF6= 200.13
##$BF7= 200.13
##$BF8= 200.13
##$BYTORDA= 1
##$CFDGTYP= 0
##$CFRGTYP= 5
##$CHEMSTR= <none>
##$CNST= (0..31)
1 1 145 1 1 1 1 1 1 1 1 1 1 1 1 1 1 1 1 1 1 1 1 1 1 1 1 1 1 1 1 1 
##$CPDPRG= <waltz16>
##$CPDPRG1= <>
##$CPDPRG2= <waltz16>
##$CPDPRG3= <>
##$CPDPRG4= <mlev>
##$CPDPRG5= <mlev>
##$CPDPRG6= <mlev>
##$CPDPRG7= <mlev>
##$CPDPRG8= <mlev>
##$CPDPRGB= <>
##$CPDPRGT= <>
##$D= (0..31)
0 1 0 0 0 0 0 0 0 0 0 0.03 2e-05 3e-06 0 0 0 0 0 0 0 0 0 0 0 0 0 0 0 0 
0 0 
##$DATE= 1681986707
##$DBL= (0..7)
120 120 120 11 120 120 24 19 
##$DBP= (0..7)
150 150 150 150 150 150 150 150 
##$DBP07= 0
##$DBPNAM0= <>
$$ [...]
##$SUBNAM2= <"">
##$SUBNAM3= <"">
##$SUBNAM4= <"">
##$SUBNAM5= <"">
##$SUBNAM6= <"">
##$SUBNAM7= <"">
##$SUBNAM8= <"">
##$SUBNAM9= <"">
##$SW= 501.771253377433
##$SWIBOX= (0..15)
0 1 3 0 0 0 0 0 0 0 0 0 0 0 0 0 
##$SW_h= 40650.406504065
##$TD= 32768
##$TD0= 1
##$TE= 0
##$TE2= 300
##$TE3= 300
##$TEG= 300
##$TL= (0..7)
0 120 53 12 22 120 120 120 
##$TP= (0..7)
150 150 150 150 150 150 150 150 
##$TP07= 0
##$TPNAME0= <>
##$TPNAME1= <>
##$TPNAME2= <>
##$TPNAME3= <>
##$TPNAME4= <>
##$TPNAME5= <>
##$TPNAME6= <>
##$TPNAME7= <>
##$TPOAL= (0..7)
0.5 0.5 0.5 0.5 0.5 0.5 0.5 0.5 
##$TPOFFS= (0..7)
0 0 0 0 0 0 0 0 
##$TUNHIN= 0
##$TUNHOUT= 0
##$TUNXOUT= 0
##$USERA1= <user>
##$USERA2= <user>
##$USERA3= <user>
##$USERA4= <user>
##$USERA5= <user>
##$V9= 5
##$VALIST= <valist>
##$VCLIST= <CCCCCCCCCCCCCCC>
##$VD= 0
##$VDLIST= <DDDDDDDDDDDDDDD>
##$VPLIST= <PPPPPPPPPPPPPPP>
##$VTLIST= <TTTTTTTTTTTTTTT>
##$WBST= 1024
##$WBSW= 4
##$XGAIN= (0..3)
0 0 0 0 
##$XL= 0
##$YL= 0
##$YMAX_a= 4552
##$YMIN_a= -4912
##$ZGOPTNS= <>
##$ZL1= 120
##$ZL2= 120
##$ZL3= 120
##$ZL4= 120
##$ABSF1= 0
##$ABSF2= 0
##$ABSG= 0
##$ABSL= 0
##$ALPHA= 0
##$AQORDER= 0
##$ASSFAC= 0
##$ASSFACI= 0
##$ASSFACX= 0
##$ASSWID= 0
##$AUNMP= <proc_1d>
##$AZFE= 0.1
##$AZFW= 0.5
##$BCFW= 0
##$BC_mod= 2
##$BYTORDP= 0
##$COROFFS= 0
##$CY= -3
##$DATMOD= 1
##$DC= 0
##$DFILT= <>
##$DTYPP= 0
##$F1P= 0
##$F2P= 0
##$FCOR= 1
##$FTSIZE= 65536
##$FT_mod= 6
##$GAMMA= 0
##$GB= 0
##$INTBC= 1
##$INTSCL= 6.047779e-11
##$ISEN= 30
##$LB= 1
##$LEV0= 0
##$LPBIN= 0
##$MAXI= 10000
##$MC2= 0
##$MEAN= 0
##$ME_mod= 0
##$MI= 50
##$NCOEF= 0
##$NC_proc= -8
##$NLEV= 6
##$NOISF1= 182.463
##$NOISF2= 159.3651
##$NSP= 0
##$NTH_PI= 0
##$NZP= 0
##$OFFSET= 248.5645
##$PC= 4
##$PHC0= -11051.32
##$PHC1= 227.0848
##$PH_mod= 1
##$PKNL= yes
##$PPARMOD= 0
##$PSCAL= 0
##$PSIGN= 0
##$REVERSE= no
##$SF= 81.0140089999694
##$SI= 65536
##$SIGF1= 159.3651
##$SIGF2= -187.1042
##$SINO= 113.3802
##$SIOLD= 16384
##$SREGLST= <1H.CDCl3>
##$SSB= 0
##$STSI= 65536
##$STSR= 0
##$SW_p= 40650.406504065
##$SYMM= 0
##$S_DEV= 0
##$TDeff= 32768
##$TDoff= 0
##$TI= <>
##$TILT= no
##$TM1= 0
##$TM2= 0
##$TOPLEV= 0
##$USERP1= <user>
##$USERP2= <user>
##$USERP3= <user>
##$USERP4= <user>
##$USERP5= <user>
##$WDW= 1
##$XDIM= 65536
##$YMAX_p= 555989644
##$YMIN_p= -55670972
$$ End of Bruker specific parameters
$$ ---------------------------------
##NTUPLES= NMR SPECTRUM
##VAR_NAME=  FREQUENCY,     SPECTRUM/REAL,   SPECTRUM/IMAG
##SYMBOL=    X,             R,               I
##VAR_TYPE=  INDEPENDENT,   DEPENDENT,       DEPENDENT
##VAR_FORM=  AFFN,          ASDF,            ASDF
##VAR_DIM=   65536,         65536,           65536
##UNITS=     HZ,            ARBITRARY UNITS, ARBITRARY UNITS
##FACTOR=    0.620285442955139, 1,           1
##FIRST=     20137.2065510682, 0,            0
##LAST=      -20513.1999529968, 0,           0
##MIN=       -20513.1999529968, -55670972,   0
##MAX=       20137.2065510682, 555989644,    0
$$ Real data points
##PAGE= N=1
##DATA TABLE= (X++(R..R)), XYDATA
$$ [...]
41485a0111890j895281N447976K856031j0023455j3625419r83686R884610O085643
41477a2365471j498074r77506J633621r01518k119416K678403M745167p07642
41469i512436l135608L737847Q399963J825616n874040m164832m95895l483689
41461a2703074m345037N858721J5191258Q113861p671646j2745049n420761O48719
41453a3073008P92992J092250J746679j601594m235357J336817R148303P715114
41445B922196M84064J79572O040736N771693j673239m787809r67596P0510l866481
41436D173646l045115M811747Q293648J346591o559548n834241K39681L765888
41428G192297K669481j649191p124923q547920k338385M768885K948687m515454
$$ y = [-10111890, -12007171, -6559195, -3703164, -13726619, -27352038, -28335724, -18451114, -12365471, -13863545, -14841051, -13207430, -14108948, -16228364, -13549961, -8804794, -9512436, -12648044, -8910197, -510234, 1315382, -4558658, -8723490, -9219385, -12703074, -17048111, -11189390, 4001868, 12115729, 4444083, -8300966, -13721727, -13073008, -12280016, -11187766, -9441087, -11042681, -15278038, -13941221, -4792918, 2922196, 3406260, 3585832, 9626568, 15398261, 13725022, 8937213, 7969617, 8040127, 4173646, 1128531, 5940278, 14233926, 15580517, 9020969, 3186728, 3426409, 7192297, 9861778, 8212587, 1087664, -7460256, -9798641, -5029756, -2081069, -6596523]
41420f596523n592688k99271o25582p193899n043380J0162408K0452232J1680954
41412A6944251m481325q699133j403216L219715J049681k61689K222154L416102
41404A2006540J039213k059535m805301p824219q710554n381107j067528J242831
41396a5559660M642341J0688513J1995436K713257q805183r817080k146033J504129
41388d784280j808303k328580L930481Q053188L946733j183198Q62881N889819
41380A2578741M535222l201278q820693p586831l059477m72470p70825j616772
41372h414383j392292j265320l385830o566753n451545K782326J2021056J2715780
41364A043039M502154k359930n91749M613781L971193k631934p264244n879420
$$ y = [-6596523, -12189211, -12488482, -13114064, -20307963, -25351343, -15188935, 5263297, 16944251, 12462926, 3763793, 2360577, 5580292, 6629973, 6368284, 8590438, 12006540, 13045753, 10986218, 6180917, -1643302, -10353856, -15734963, -16802491, -15559660, -10917319, -228806, 11766630, 14479887, 5674704, -4142376, -6288409, -4784280, -6592583, -8921163, -4990682, 3062506, 7009239, 5826041, 6688922, 12578741, 17113963, 13912685, 5091992, -2494839, -5554316, -6026786, -6797611, -8414383, -9806675, -11071995, -14457825, -21024578, -26476123, -23693797, -11672741, 1043039, 5545193, 3185263, 2593514, 7207295, 11178488, 8546554, 1282310, -4597110]
41356d597110k446874j116968m00257K455830N676470N255198J018715l071518
41348B773486m217040l547934l099390k336250O36644N205729P355976L559929
41340F331150m512344r921201o425695M560726J3768705J2432230R83742j1632975
41332E584338j6827441j2838070l369452O359947J1215306Q047403o56983p393225
41324i878177p082397k257423J554567K973298L992059M845003M106658K120569
41316C74157Q4021k508559n456994n517202j245235L114949M353419O504216J2274957
41307A1977729J3276336R50128j5476083j7031064k134506R966853O969140j337349
41299G161184k698088p58659k800734m154520P28778M076445k052820q643597
$$ y = [-4597110, -7043984, -8160952, -8561209, -6105379, -428909, 4826289, 5845004, 2773486, -1443554, -4991488, -8090878, -10427128, -9790484, -4584755, 2771221, 6331150, 1818806, -8102395, -14528090, -9967364, 3801341, 16233571, 17217313, 5584338, -11243103, -24081173, -27450625, -21090678, -9875372, -1827969, -2484952, -9878177, -16960574, -19217997, -17663430, -14690132, -10698073, -5853070, -1746412, 374157, 458178, -2050381, -7507375, -13024577, -14269812, -11154863, -6801444, -297228, 11977729, 25254065, 26204193, 10728110, -6302954, -8437460, 1529393, 8498533, 7161184, 4463096, 3704437, 903703, -3250817, -2522039, 1554406, -498414, -9142011]
41291i142011l350260P265946Q210142J803766J780046O456424J706021j0144515
41283D585559j0041151M788853J2780951K241430r842290o539919K548273P34225
41275A255931p396597p208298n52977M16333k655251J765100J1416351J1636274
41267H676866K46044q103893n236319k51237k054148n555309k355126N835052
41259h798070J1862764J3144153J0432146L218798o967844j3288864j0015695
41252d12612k61847P028626O769634J792117j795103j285624O57479K30648k122239
41243A0601079k510300K10493K773571L522475N366964R412833J0468561M096309
41235D3941985n363400r361709n468242J285712M663489J087396q552078j6565462
$$ y = [-9142011, -12492271, -5226325, 2983817, 4787583, 6567629, 13024053, 14730074, 4585559, -5455592, -666739, 12114212, 14355642, 4513352, -2026567, 521706, 1255931, -6140666, -13348964, -13901941, -13485608, -16140859, -14375759, -2959408, 8676866, 8922910, 819017, -4417302, -4668539, -6722687, -12277996, -14633122, -8798070, 3064694, 16208847, 26640993, 29859791, 22891947, 9603083, -412612, -674459, 6354167, 13123801, 14915918, 13120815, 11835191, 12492670, 12723318, 10601079, 8090779, 8301272, 11074843, 14597318, 19964282, 29377115, 39845676, 43941985, 38578585, 29216876, 23748634, 25034346, 29697835, 30785231, 22233153, 5667691]
41227E667691j3192153P75823J1720227R848781J615363j994667j657199l715119
41219I068747n772984k039179K712831J02207m860516p75579Q283803O767562
41211A3486892n790485j2022280m447098L809650K726662K76453L819494N287179
41203G146467j962373p963165l058978M138302K222558k132984K768647J0066945
41195A1225419M484882j0378943j5892601o814918L834226P509715Q448727Q191848
41187A0608355J388799q563847q082523M967809J4033006P238290n679512r732955
41179F177422n713266l277081l230660j25147M244672L608376o1760P39159N203418
41170G565133N065637o70290l718589j354896j538137q086603j1431217k808478
$$ y = [5667691, -7524462, -6748639, 4971588, 14820369, 16435732, 14441065, 12783866, 9068747, 3295763, 1256584, 3969415, 4071622, -788894, -1564473, 6719330, 13486892, 7696407, -4325873, -8772971, -4963321, -2236659, -1960206, 1859288, 7146467, 5184094, -2779071, -5838049, -1699747, 522811, -1610173, 1158474, 11225419, 15710301, 5331358, -10561243, -17376161, -13541935, -6032220, 2416507, 10608355, 11997154, 3433307, -4649216, 318593, 14351599, 21589889, 15910377, 6177422, 464156, -2812925, -6043585, -6168732, -1924060, 1684316, 1622556, 2361715, 7565133, 12630770, 11960480, 8241891, 6886995, 5348858, -2737745, -14168962, -16977440]
41162a6977440J0052924J2333776L202445m068737k233164J568732R1333k873586
41154A096283j615882J064552R18659J667652P211442J1006211N326470l590858
41146B3084529l584667K789934J405858r190880j3767004n063625M436559L548938
41138C659642n85695K016607N631637L87079q374777q568194j876556N55417k024471
41129i179311p90412M835600O330124K291461K98303K186079K044387k45903J507568
41120I277896M884276o40194j3847613j8306545o199790Q626005J1065108N824241
41112F83384O299278J1973321J0650116j317516j3329917j4462587m942418N902784
41104A456445P950668j504577j3394822j3884022l72278J3328931J3082459J522594
$$ y = [-16977440, -6924516, 5409260, 8611705, 4542968, 2309804, 3878536, 3969869, 1096283, -519599, 544953, 1463612, 3131264, 10342706, 21348917, 26675387, 23084529, 19499862, 22289796, 23695654, 14504774, 737770, -4325855, 110704, 3659642, 3073947, 5090554, 10722191, 11109270, 2734493, -5833701, -7710257, -7154840, -9179311, -9969723, -5134123, 1196001, 3487462, 3785765, 5971844, 8016231, 7770328, 9277896, 14162172, 13521978, -325635, -18632180, -24831970, -16205965, -5140857, 683384, 6982662, 18955983, 29606099, 28288583, 14958666, 496079, -4446339, 1456445, 9407113, 7902536, -5492286, -19376308, -19748586, -6419655, 6662804, 8185398]
41096H185398p367018o886904k507038P8185K288892N935404O936511J064590
41088G728020p756994j0545759m501433L175621M714741J743840J459285M494160
41080E11481L812415k282857m567521K898654J0404966N451350o543472q461875
41072A223141K088018Q332927P07264q030822l788961N935465M423126p167653
41064C722505j1435590j287995J0276184R454219j163762r559212r889055n314831
41056a5197537p61974J284366L69208j859311j890594K233884P607215Q538982
41048C24239K939478m073680m663845K525197R316971P038824k262978p977542
41040C166664m736428J312195K367393n54795j652426j97789O0971j204253n01481
$$ y = [8185398, 818380, -6068524, -8575562, -8497377, -6208485, -273081, 6663430, 7728020, -28974, -10574733, -15076166, -11900545, -7185804, -5441964, -3982679, 511481, 4323896, 2041039, -2526482, 372172, 10777138, 16228488, 9685016, 1223141, 3311159, 11644086, 12351350, 4320528, 531567, 6467032, 10890158, 3722505, -7713085, -9001080, 1275104, 10729323, 9565561, 6349, -9882706, -15197537, -15959511, -14675145, -14305937, -16165248, -18055842, -15821958, -8214743, 324239, 3263717, -809963, -5473808, -2948611, 6368360, 13407184, 11144206, 3166664, -1569764, -257569, 2109824, 1555029, -97397, -295186, -234215, -1438468, -1939949]
41031a939949K450237L464090M79691l573581n523315n215606l224264J19112
41023a2963585K216542l84406n981986p885858l405841K143504M112835N716020
41015a6432775J0486204J2679476M849802p187958q827603J965853R996597N207185
41007A2736781k514961q63612L951532p89030r319530m660084J0786396J4157901
40999B3485393k878709j8934070j3779827L321050J0752425N342811j083626m327317
40991A898130p847792q164340J10301R480705Q562141J920273J975295N191448
40983A3126161j741276j3852625j1131376P084715J6704649O156766n463669l55070
40975A0528275J0191305P160295n301283j0443880p125812o611874r556516o279476
$$ y = [-1939949, 510288, 3974378, 4454069, 880488, -4642827, -9858433, -13082697, -12963585, -10747043, -11131449, -17113435, -24999293, -28405134, -26261630, -22148795, -16432775, -5946571, 6732905, 11582707, 4394749, -4432854, -2467001, 7529596, 12736781, 10221820, 9358208, 13309740, 12520710, 3201180, -1458904, 9327492, 23485393, 20606684, 1672614, -12107213, -8786163, 1966262, 7309073, 6225447, 1898130, -5949662, -14114002, -14003701, -4522996, 4039145, 5959418, 7934713, 13126161, 11384885, -2467740, -13599116, -6514401, 10190248, 16347014, 10883345, 10528275, 20719580, 27879875, 22578592, 12134712, 5008900, -1602974, -11159490, -17438966]
40967a7438966L808204J0361451Q559784L794040P68741r20069j559675j081711
40959F291799k134744n501562n905868r0606N594230L974197j580852l150045
40951b503451l35226K476218N120579Q321308P163840j575053j0627066j1241794
40943c200645o176584l410851k320338K545522Q820414R499774N125008J679756
40935A2562056R8069j666958j034643L687443N845324M40447m685025q57805N102708
40926A9491616J884396n588869m210639L600928L953332l527393n472477O74605
40918A0805499K724435l425195p150397l327195k27516k171471k253028K114611
40910b910257L640914N63612L52650K867893j517834j0724339q265036Q912692
$$ y = [-17438966, -13630762, -3269311, 5290473, 9084513, 9853254, 8933185, 7373510, 6291799, 4157055, -1344507, -7250375, -7340981, -1746751, 2227446, 646594, -2503451, -2838677, -362459, 4758120, 13079428, 20243268, 18668215, 8041149, -3200645, -9377229, -12788080, -15108418, -12562896, -3742482, 5757292, 10882300, 12562056, 12660125, 10993167, 9958524, 13645967, 19491291, 19931738, 15246713, 14388908, 19491616, 21376012, 15787143, 11576504, 15177432, 19130764, 15603371, 10130894, 10805499, 13529934, 10104739, 2954342, -372853, -600369, -2771840, -5024868, -2910257, 730657, 1294269, 1646919, 4514812, 2996978, -7727361, -15992397, -7079705]
40902g079705K0060875J0580844o025995j0386344m635710j725726k394462l93105
40894a999328J431662j861637l888244K256503Q103389K036069r257933r054088
40886a2233607L780158J3685250J0845647O27140p891688j0378661n608468L565190
40878c609039Q863701N420584m64489n87045K529038J298632l618851n748011
40870D084520m173275k714574k065394j768729m487269r108314o778570N456818
40862b1554787J5126190J1160472J933160J490055N999869K282307o590801n793582
40854D052883L719331N139568m926155r936945k236632L237229n323262j5596909
40846b1870892j0190256O307765J4477939O746729o263848j2004491q068660N5039
$$ y = [-7079705, 12981170, 23562014, 17536019, 7149675, 2513965, 788239, -1606223, -1999328, -567666, -2429303, -6317547, -4061044, 4042345, 6078414, -3179519, -12233607, -8453449, 5231801, 16077448, 16704588, 8812900, -1565761, -7174229, -3609039, 5254662, 10675246, 10210757, 9623712, 12152750, 13451382, 9832531, 4084520, -88755, -2803329, -4868723, -6637452, -11124721, -20233035, -27011605, -21554787, -6428597, 4731875, 6665035, 8155090, 14154959, 16437266, 9846465, 4052883, 7772214, 12911782, 7985627, -1951318, -4187950, -950721, -6273983, -21870892, -32061148, -25753383, -11275444, -4528715, -10792563, -22797054, -30865714, -30810675]
40838c0810675N514392N048344J833728K104476O987694J0845973R142400L654929
40830A4321261j575135m627400m474461n27032M513016N742350J806974l690807
40822A1488766o689807n394236k37954M784941L913007k097562m249851J290613
40814B807917M735284k261845j0556616o999088K483930K099354n334110k012559
40806a5037733J1865617J4283526k112057j4965302o955890P247255O749352k423721
40798a348953j936947O062502N458960l672350o280592J62763K546549l532141
40790b540209p061414j917820M015242M047959J856889J407902J087541J487089
40782B383179O247047J1555182P677509m481631j0932777m690408L366681J302949
$$ y = [-30810675, -25296283, -20247939, -18414211, -16309735, -9322041, 1523932, 10666332, 14321261, 12746126, 8118726, 3644265, 3117233, 7630249, 13372599, 15179573, 11488766, 4798959, -595277, -833231, 3951710, 7864717, 5767155, 1517304, 2807917, 7543201, 5281356, -5275260, -12274348, -9790418, -7691064, -13025174, -15037733, -3172116, 11111410, 8999353, -5965949, -12921839, -5674584, 1074768, -1348953, -3285900, 2776602, 8235562, 4563212, -1717380, -1554617, 991932, -2540209, -9601623, -11519443, -7504201, -3456242, -1599353, -191451, 896090, 2383179, 8630226, 20185408, 27862917, 23381286, 12448509, 7758101, 11124782, 12427731]
40774A2427731o275774o735911J399008P432186L726920n447146r895887m525723
40766g894596N400977R367141L489716m144343l761311K768717N151748k35913
40758A0142136o322184o598978k529992J452665L060331J188900l046585l972980
40750f626687K074023Q109428M136100o330545r115243p63638O069559L096358
40742F49355j520103Q67552M543069J355915l441168k11921P862328R646225L123004
40733B2874256m187777p821589q427353n289970J055109L532202k454934q218147
40725h938203k880428P455240O587010n797333j1265212q6949J3478522J1657103
40717A0209750k673020j2619446j0334781k653407K175062L143928K509509J368215
$$ y = [12427731, 6151957, -583954, 815054, 8247240, 11974160, 6527014, -3368873, -7894596, -2493619, 6873522, 10363238, 6218895, 2457584, 5226301, 10378049, 10142136, 3819952, -2779026, -5309018, -3856353, -796022, 392878, -2653707, -6626687, -4552664, 3556764, 7692864, 1362319, -7752924, -8516562, -2447003, 649355, -870748, -3196, 4539873, 5895788, 2454620, 2242699, 10105027, 19751252, 22874256, 18686479, 10864890, 2437537, -2852433, -1797324, 1734878, -720056, -8938203, -11818631, -4363391, 2223619, -3573714, -14838926, -14925875, -1447353, 10209750, 7536730, -5082716, -15417497, -18070904, -15895842, -12751914, -10242405, -8874190]
40709h874190J020273L380621P384238Q080886K352050n573654p697661k553452
40701b480889J403929l227392j0685942q086453N636721J5578777J0310633k707832
40693E741552q633500n079821n93787J224667L947367P119512N398229p28584
40685H395635m486952m034719l567885k697099L120721R683644N443614q931538
40677B925421j5876011m620661J1474353J2301002k004445j3179207r737819J279618
40669a7437749O669319K578679l872098l873701L512006J0137123Q184871O2154
40661E960604m888449k650008K245715M965295M402235k83981p629595q820392
40653f698576K894358J6565521J2653845p747344j9838010r788319N099254M100539
$$ y = [-8874190, -7853917, -4473296, 2910942, 10991828, 13343878, 7770224, 72563, -2480889, -1076960, -4304352, -14990294, -23076747, -17440026, -1861249, 8449384, 5741552, -2891948, -7971769, -8565556, -7340889, -3393522, 3725990, 9124219, 8395635, 3908683, -126036, -3693921, -6391020, -3270299, 6413345, 11856959, 2925421, -12950590, -17571251, -6096898, 6204104, 4199659, -8979548, -18717367, -17437749, -10768430, -8189751, -12061849, -15935550, -12423544, -2286421, 5898450, 5960604, 1072155, -1577853, 667862, 5633157, 10035392, 9751411, 2121816, -6698576, -3804218, 12761303, 25415148, 17667804, -2170206, -11958525, -6859271, -2758732]
40645b758732n725544m508393P067961J1300254L322018m360861m569655k811751
40637c044703k199142R14277N052860L668008j337683j047789M379543N757611
40629A2142982J776165M86731K732898L92393o405589p020962O85583N344975
40621A0135176J248541l116354j415801J012350J01741O9545J048733m083262
40613E000669j3170464j2372207N46569Q569755K548998k785159N164770J3468983
40605F971914N856544p848272q019312J091670J49428r983722r481081N255121
40597a6007710J4739451Q996654K342619O845213J2286683N149441q702328j4429837
40589A1220186j0115478m832186k389036O35152N002465P329820O281854K824557
$$ y = [-2758732, -8484276, -12992669, -5924708, 5375546, 8697564, 4336703, -232952, -3044703, -5243845, -4329568, 723292, 4391300, 3053617, 2005828, 6385371, 12142982, 13919147, 14405878, 17138776, 17531169, 11125580, 4104618, 4790201, 10135176, 11383717, 8267363, 6851562, 7863912, 7965653, 8035198, 9083931, 5000669, -8169795, -20542002, -19995433, -11425678, -8876680, -11661839, -6497069, 6971914, 12828458, 4980186, -3039126, -1947456, -1798028, -11781750, -21262831, -16007710, -1268259, 7728395, 10071014, 16916227, 29202910, 34352351, 25650023, 11220186, 1104708, -3727478, -6116514, -5481362, -478897, 6850923, 13132777, 15957334]
40581A5957334l118705r887246j1261998l692803N841666O833338l89839m728028
40573d446281r5444N875622L013930o428684j0264221k620890Q415561J1321458
40565D771051M687680l300357n670826k257460L510820P743884O426296j409172
40557A4501916r733673j0254192k938522L279805K322098j835415k374618J348993
40549e683608N374495O795393M326543k007658q123841p678095n56832N147416
40541b406187L618648j074100j971040J194586L835803L111706j374585q149737
40533c214906j1390216m613665Q454426J4304276O975872k786190k728209M662554
40525I663942R357710Q836034N915271l87552r920473j4166949o998779K820776
$$ y = [15957334, 12838629, 2951383, -8310615, -12003418, -6161752, 671586, 281747, -4446281, -4541725, 1333897, 4347827, -2080857, -12345078, -14965968, -6550407, 4771051, 9458731, 6158374, 487548, -1769912, 1740908, 9484792, 15911088, 14501916, 4768243, -5485949, -8424471, -5144666, -2822568, -4657983, -7032601, -5683608, -309113, 6486280, 10812823, 8805165, 681324, -6996771, -7553603, -2406187, 1212461, 138361, -1832679, -638093, 3197710, 6309416, 4934831, -3214906, -14605122, -19218787, -10764361, 3539915, 10515787, 7729597, 5001388, 9663942, 19021652, 27857686, 33772957, 33385405, 23464932, 9297983, 2299204, 5119980]
40517E119980L207356k375034k138046K654781L97821q852163j1788715l455444
40509a7229464N855462P852237N382625J679313m384609q826353l716932P361798
40501f025923J0045101J129374n284861o24002M629220j43623p703252o245567
40493a0223533J046334L435900R75424J605260N600179N886147R58599l349993
40485E934317l567216j754890k81167L74136K99346Q77164L802927O582344M335600
40476A6602561j148065j795464L319303M283407l652545j0304523n782391L478188
40468E000471N062448r9896j186905M308640Q319101N992686N00460m945285r752598
40459A3199122j1020940n391347L498506P236179L161906l306976o462819m932127
$$ y = [5119980, 8327336, 5952302, 3814256, 6469037, 6866858, -1985305, -13774020, -17229464, -11374002, -3521765, 1860860, 3540173, -844436, -9670789, -13387721, -6025923, 4019178, 5148552, -136309, -760311, 3868909, 3725286, -3977966, -10223533, -9177199, -5741299, -4765875, -3160615, 2439564, 8325711, 9284310, 5934317, 2367101, 612211, 331044, 705180, 1004526, 1881690, 5684617, 12266961, 16602561, 15454496, 13659032, 16978335, 21261742, 17609197, 7304674, 1522283, 5000471, 10062919, 9963023, 8776118, 13084758, 21403859, 27396545, 27897005, 22951720, 13199122, 2178182, -3213165, 285341, 7521520, 10683426, 7376450, 913631, -4018496]
40451d018496j18155M077940K083215o341570j2080186o670275N330960J1081656
40443f654911N437974m392422r031949n488666L136554J0365942J0128968L301229
40435F802719j787778m48030J196645l078034p534131l412266M697061M665904
40427A102090k536892k669446Q716030J6793108P685729j1919630k3315859j7708734
40419b3853604k839587Q121383Q580298J869473l148629o67114O353308J0075978
40411D491506O606492j392174q790879j0903405n253242L985615O465059j991346
40403f782374j0388908n391892Q633914J3971151M524191o217677n841760P33854
40395f759501K380856j481417m168900l956103l549016k609947M41123L052660
$$ y = [-4018496, -4136651, -58711, 2024504, -4317066, -16397252, -23067527, -17736567, -6654911, -1216937, -5609359, -14641308, -20129974, -16993420, -6627478, 3501490, 6802719, 5014941, 4566911, 5763556, 2685522, -4848609, -8260875, -3563814, 1102090, -1434802, -4104248, 4611782, 21404890, 29090619, 17170989, -6144870, -23853604, -26693191, -18571808, -9991510, -8122037, -11270666, -11937780, -5584472, 4491506, 11097998, 9705824, 914945, -9988460, -15241702, -11256087, -4791028, -6782374, -17171282, -22563174, -13929260, 41891, 4566082, -1651595, -7493355, -6759501, -4378645, -5860062, -10028962, -13985065, -17534081, -20144028, -19702905, -16650245]
40387a6650245K880031L850268R719660J4731352J0095257j340564o815032j868997
40379A4601730K325067m942006j6972738j6793503J74715J8051618J8249738J019343
40371A5713964j5603040j6810808n418143N501597Q291314N160212J425882r3083
40363a832105L88394L75787k456762n857950l994143L853344R814885P387944
40355G679394L28721m097110n480655o635328n454023L677L674889K74860k964496
40346a2670071L022462J1006910O688207o191099r278150Q62420P552525K706571
40338C699775j308918L126367M308815n005366j0395922K30J2234515Q112578
40330A4772074m836361p238306L21009L029241m5349J373117M483285k080614
$$ y = [-16650245, -13770214, -9919946, -200286, 14531066, 24626323, 23285759, 16470727, 14601730, 16926797, 11984791, -4987947, -21781450, -21606735, -3555117, 14694621, 15713964, 110924, -16699884, -22118027, -16616430, -8325116, -3164904, -1739022, -1832105, -1443711, -1067924, -3524686, -9382636, -13376779, -9523435, 291450, 7679394, 8008115, 3911005, -1569650, -8204978, -13659001, -13655324, -9980435, -9705575, -12670071, -9647609, 1359301, 8047508, 1856409, -7421741, -6559321, 993204, 3699775, 2390857, 5517224, 9826039, 4820673, -5575249, -5575019, 6659496, 14772074, 9935713, 2697407, 3018416, 6047657, 6002308, 7375425, 11858710, 9778096]
40322I778096j2611736r635555N106575J1073638K907724k145832L755473N965286
40314A4193669m164949j2554745p485314N09300n63687k752058M808902J3604041
40306E595159R695021k004385o139234r15509L373923K829783J268729r81537
40298A2721950n162235o378396j057331L644024O51825l392432J072664Q706804
40290A0806873P194412k348519q161853o774340m035932j046915N383003J0977857
40282A1994586Q125510J8489l563278k087211j761764j300560L737616O820995
40274B1984383p21637j0319127o615872M865960M243755q177630j0280694M232399
40266g88463J4107246O156279m203539k264474J304098o244149j3872170o499432
$$ y = [9778096, -2833640, -12469195, -7362620, 3711018, 6618742, 4472910, 8228383, 14193669, 10028720, -2526025, -10011339, -9502039, -10065726, -12817784, -8008882, 5595159, 15290180, 13285795, 7146561, 6231052, 9604975, 12434758, 13703487, 12721950, 7559715, 1181319, 123988, 3768012, 4419837, 1027405, 2100069, 10806873, 18001285, 15652766, 7490913, 716573, -3319359, -4366274, 1016729, 11994586, 20120096, 20138585, 16575307, 14488096, 12726332, 11425772, 15163388, 21984383, 21262746, 10943619, 4327747, 9193707, 13437462, 5259832, -5020862, -788463, 13318783, 19475062, 15271523, 13007049, 14311147, 8066998, -5805172, -12304604]
40258a2304604O817012P956194k78317k452500J756595J148839l721299l357117
40250d435197N49162p46597l785268J127697R026549O718525l161398o070563
40242g77090j046100j6640l135242J429611J2099882J2695638N72394p665328
40234A4157125m362858j479459n542637n472446L986015R179895J399060o508093
40226E356602k513447M067435R05943n372579l485034J311808n21818k661675
40218b912765M430490J1898865N481309q101741j0062437M94017P355605M534438
40210A3117781J017841l20981o240751j3863987r623127P191937J8840626J4031174
40202B4150513K002556n133459q141420j0531873p988019J294946Q117243N595471
$$ y = [-12304604, -5487592, 2468602, 2190285, -262215, 1494380, 2643219, -1078080, -4435197, -3886035, -4632632, -8417900, -7290203, 1736346, 8454871, 5293473, -777090, -1823190, -1839830, -4975072, -3545461, 8554421, 21250059, 21822453, 14157125, 9794267, 8314808, 2772171, -2700275, 1285740, 10465635, 11864695, 5356602, 2843155, 6910590, 7816533, 2443954, -1041080, 270728, -251090, -2912765, 1517725, 13416590, 18897899, 10796158, 733721, 1227738, 8583343, 13117781, 14135622, 13814641, 7573890, -6290097, -15913224, -8721287, 10119339, 24150513, 26153069, 21019610, 12878190, 2346317, -5641702, -4346756, 3770487, 9365958]
40194I365958J134306L981431R366888O691762l035789r652035r322893o672862
40186A856766m355756p72598L141648M021320K731621L138832M249785R70756
40178A4982374o454023j0575454o485911J683861O549512O137410M108359L337814
40170A3283942J950733l516600j1414964j3670036m673000R032450J3801028O022126
40162A0815679k191048M12796Q212973P744896j756089q255496o340578l840801
40154D802332n905364n398371L148238J0998964P914993m17499j018779N062347
40146A9186861N042643l315975p801291k762775J973001m17217j640147N208729
40138A5473829J0732608M583595n175337m340961L594037L853117m133566p028868
$$ y = [9365958, 10500264, 14481695, 23848583, 30540345, 27504556, 17852521, 8529628, 1856766, -2498990, -3271588, -129940, 3891380, 6623001, 9761833, 14011618, 14982374, 8528351, -2047103, -8533014, -6849153, -299641, 5837769, 9946128, 13283942, 15234675, 11718075, 303111, -13366925, -18039925, -9007475, 4793553, 10815679, 8624631, 9037427, 17250400, 24995296, 23239207, 14983711, 8643133, 4802332, -1103032, -6501403, -3353165, 7645799, 15560792, 15143293, 14124514, 19186861, 24229504, 20913529, 13112238, 10349463, 12322464, 11905247, 10265100, 15473829, 26206437, 30790032, 25614695, 21273734, 24867771, 28720888, 24587322, 17558454]
40130A7558454k007211n92726n604697m619337O739732J3837609N936213n799610
40122B5448427n965469K075819M551621j018677o192167o771322m988882j558894
40114E580456L505293O209708L545653j306377n301432r972067j3150463o628823
40106a7518052Q784689J7328851R413194k421084k561637L947715L440826j371292
40098A9043210J220941P621772M697283m639009m854673M637944Q199528Q95481
40090C6822477n576672n730311o621371q310829j315445J1181044J2230585m8501
40082C2630977n946465L584985J1482520M252386n439541k217361N938642L817783
40074D8103926n099613p602649k066867O246128J7268422K6414038J8314372r394664
$$ y = [17558454, 15551243, 14958517, 9353820, 4734483, 11474215, 25311824, 31248037, 25448427, 19482958, 21558777, 26110398, 25091721, 18899554, 12128232, 7139350, 5580456, 9085749, 15295457, 18841110, 17534733, 12233301, 2261234, -10889229, -17518052, -8733363, 8595488, 18008682, 15587598, 13025961, 16973676, 20414502, 19043210, 20264151, 27885923, 32583206, 27944197, 23089524, 27727468, 35926996, 36822477, 31245805, 25515494, 18894123, 10583294, 9267849, 20448893, 32679478, 32630977, 26684512, 30269497, 41752017, 46004403, 40564862, 38347501, 44286143, 48103926, 43004313, 35401664, 33334797, 39580925, 56849347, 83263385, 101577757, 92183093]
40066I2183093l0600544k2510078o56870L716425q884401j1212981L119730R750875
40058C4905249m581580k0067580j5137245L092671J3542737R846670Q05428n908219
40050A6498131p984198m241419L524135R125092R177430P790128J0007830J4798727
40042E8695856J7136016J2930455J244428j3385931k1335966j6773721n625731
40035C2885406J272659J019838j993584n643672r537407q640095O58867J0257266
40027B0279278Q974682L05048k254498K950147M350426j015652k071984M676899
40019C6194346N976608o051755j8069544j4529190p60515O640544L831182P2102
40011A3303778j70457j195471m058486l321862K581997O942722L865843l450269
$$ y = [92183093, 61582549, 39072471, 38415601, 42132026, 33247625, 22034644, 25154374, 34905249, 30323669, 10256089, -4881156, -1788485, 11754252, 21600922, 22406350, 16498131, 8513933, 4272514, 7796649, 16921741, 26099171, 33889299, 43897129, 58695856, 75831872, 88762327, 90006755, 76620824, 55284858, 38511137, 32885406, 34158065, 35177903, 33184319, 27540647, 18003240, 9363145, 10022012, 20279278, 29253960, 29559008, 27304510, 30254657, 34605083, 33589431, 31517447, 36194346, 42170954, 36119199, 18049655, 3520465, 2759950, 9400494, 13231676, 13303778, 13133321, 11937850, 7879364, 4557502, 7139499, 14082221, 17948064, 14497795]
40003A4497795o178784K77267J0445792J2749873J576691j4278769j9303373q940873
39995i154381M892139Q370282J416122m557984j166491Q349127J3645408Q493732
39987C0287954k079405o783142j545412N342106N056186K84178r87934J647229
39979C1221760L851140P270325J4609543J7345868M448716j6489111k4165232
39972C8093009j3022023m03002J165510K6714M449097N050101o553137j7467790
39964A1338479j1111217N466413J1511132L271409m451733l936102k601632m979144
39956D507605m075582M583279J3204054J2172425K648184n656673n300043J514472
39948B3597721M408880l567613j4231342j1721779M304303J4246870O081271n367533
$$ y = [14497795, 8319011, 8596278, 19042070, 31791943, 33368634, 19089865, -213508, -9154381, -4262242, 4108040, 5524162, 966178, -200313, 8148814, 21794222, 30287954, 28208549, 21425407, 19879995, 25222101, 30278287, 30562465, 29574531, 31221760, 35072900, 42343225, 56952768, 74298636, 78747352, 62258241, 38093009, 25070986, 24667984, 25833494, 25860208, 30309305, 35359406, 28806269, 11338479, 227262, 5693675, 17204807, 20476216, 16024483, 12088381, 9486749, 4507605, 432023, 5015302, 18219356, 30391781, 33039965, 27383292, 22083249, 23597721, 28006601, 24438988, 10207646, -1514133, 2790170, 17037040, 23118311, 17750778]
39940A7750778r85322J2193389J2679154o66712q013263l82903J0697533J6483324
39932E9755978K0762040K1597715P079271k0244292l5551402k2937162J447502
39925C1909650J2235305P278876J512965R5387l761402j0355174j0809586k159023
39917B5946998P838284J1176408O091505m801377j4720155j4675138l965241N261739
39909A8153023L075490l409822j135161P644647Q882806l91093p624605m992309
39901B0202976o9162j266425m509809j904257M779506P353778L108385l055444
39893B4639548n594026l046896J954320M683932K571858j406522k530378j287934
39885A9983902j870612m194637l976972j210435q27201l329153l275633K79786
$$ y = [17750778, 16765456, 28958845, 41637999, 40971287, 32958024, 32575121, 43272654, 59755978, 80518018, 102115733, 109195004, 88950712, 53399310, 30462148, 31909650, 44144955, 51423831, 52936796, 53032183, 49270781, 38915607, 28106021, 25946998, 33785282, 44961690, 51053195, 46251818, 31531663, 16856525, 12891284, 18153023, 21228513, 17818691, 16683530, 24328177, 33210983, 32819890, 25195285, 20202976, 20133814, 18867389, 14357580, 12453323, 17232829, 24586607, 27694992, 24639548, 19045522, 15998626, 17952946, 22636878, 25208736, 23802214, 21271836, 19983902, 18113290, 13918653, 9941681, 8731246, 7904045, 4574892, 1299259, 1579045]
39877A579045J420950m80080K888880J3412251J8643189R463035m235163q229454
39869C4462653n678756q538063j4006194q800032N274761J0779157K400880m796699
39861A1097707j156687L107678o59677k261456Q323921J9661815J4674601k260155
39853E0527747j2022534p990728J27488M338890L926335k257651j2348166j4570438
39845I730943j395271J3236466J0165965m618902p975690L273489Q933874K133856
39837C3484730P55195J2389598J6714628L49454j6084689r116821R457758J2695492
39829F0645345K434022L492508K0975240L2371272K2176065k48640j9908947l1940128
39821H9996737l4631208k6124781j3207811p211385p049348j362647R949752J3172450
$$ y = [1579045, 2999995, 2519915, 5408795, 18821046, 37464235, 46927270, 42692107, 34462653, 28783897, 20245834, 6239640, -2560392, 2714369, 13493526, 15894406, 11097707, 9941020, 13048698, 12389021, 10127565, 18451486, 38113301, 52787902, 50527747, 38505213, 30514485, 30641973, 34980863, 38907198, 36649547, 24301381, 9730943, 8335672, 21572138, 31738103, 27119201, 19143511, 22417000, 31350874, 33484730, 34239925, 46629523, 63344151, 63693605, 47608916, 38492095, 47949853, 60645345, 63079367, 66571875, 87547115, 119918387, 142094452, 141845812, 121936865, 89996737, 55365529, 29240748, 16032937, 8821552, 1772204, 409557, 10359309, 23531759]
39813B3531759L737717n438198m649407k47142K34832j9435J517017j224388r249354
39804H193401j1025323m83056R918494P062100k502723l914785K988251O628571
39796A6864930L558006P28502J165173Q51699j082240n61230K876051M982765
39788B9383656M277163K715299l35853o717591j2388344r973119J38909P932642
39780A5032762N462896l872158r825650o734789P63542L040224l069463r411187
39772h613823o547167K842903P411098M143015K396206P583099J1381209N533381
39764B6129921l787431n385414k8311K975338J473599J248704L704925M092213
39756C0423544J453367J97781J292292Q25892j947670l429718l348322n562637
$$ y = [23531759, 27269476, 21831278, 17181871, 16934729, 17169561, 17150126, 18667143, 17442755, 8193401, -2831922, -3314978, 6603516, 13665616, 11162893, 7248108, 10236359, 16864930, 20422936, 21151438, 22316611, 23168310, 22086070, 21524840, 24400891, 29383656, 33660819, 36376118, 36040265, 29322674, 16934330, 6961211, 7100120, 15032762, 20495658, 16623500, 6797850, 63061, 826603, 3866827, 797364, -8613823, -15160990, -12318087, -4906989, -763974, 1632232, 9215331, 20596540, 26129921, 22342490, 16957076, 16928765, 19904103, 21377702, 22626406, 26331331, 30423544, 31876911, 32074692, 33366984, 34192876, 32245206, 28815488, 25467166, 19904529]
39748A9904529r898677j0781056n892313M27408M082410N416969N398063L964266
39740A2621599L268730N853918Q363632M547877l444014n209176K355076Q026807
39732C6384449J780385r269860j0033674M32368O614166j929604j5948556j9171863
39724a1142189r614700Q0754J610299O77688M739857R802943P230333j213983
39716B171002m940134k43030M978431L886634l65282j722535j7633J666250K702186
39707H115889L687942L886534K992904J470600j840753o770100o970875K640355
39699G212496J3062012Q663084q680414j7480920o476980Q217224P472856l370114
39691H619244p050777k574809j562255m315014p72184P738761Q480520k90297
$$ y = [19904529, 10005852, -775204, -6667517, -6240109, -2157699, 3259270, 8657333, 12621599, 15890329, 21744247, 30107879, 34655756, 31211742, 26002566, 28357642, 36384449, 38164834, 28894974, 18861300, 19293668, 25907834, 23978230, 8029674, -11142189, -20756889, -20676135, -19065836, -18388148, -13648291, -3845348, 3384985, 2171002, -2769132, -3012162, 1966269, 5852903, 5487621, 3765086, 3747453, 5413703, 8115889, 11803831, 15690365, 18683269, 20153869, 18313116, 11543016, 4572141, 7212496, 20274508, 28937592, 20257178, 2776258, -3700722, 4516502, 11989358, 8619244, 1568467, -1006342, -2568597, -6883611, -7655795, 82966, 8563486, 8273189]
39683H273189n780896k204404J460626p52831k543200N29856K348092j381975
39675e1543m414698q66350N092206O620883L026863k993759q778977r764080k992802
39666a5122257N667293P220999K997862J715777L856472K530041n47179L298517
39658A1617525J0537765O967156p171581j3769645n743156J721861r89364j119388
39650B051173J0282330J6927162L017402j6823837j7590893j840781P279947K914554
39642F217057p90099L015345N276327J056333l279131m944129p979733r699202
39634a1127232k145391J0264119J2554697K661452m180684L63105N901907K431864
39626A6723837m463677n907055l301738n79720M526930J1786715J2511036K887930
$$ y = [8273189, 2492293, 287889, 1748515, 995684, -1547516, -1017660, 1330432, -51543, -4466241, -5332591, -240385, 6380498, 9407361, 6413602, -2365375, -12129455, -15122257, -9454964, -2233965, 763897, 2479674, 6336146, 8866187, 8319008, 11617525, 22155290, 29122446, 21950865, 8181220, 2438064, 4159925, 3170561, 2051173, 12333503, 29260665, 32278067, 15454230, -2136663, -3977444, 3302503, 6217057, 5426958, 8442303, 13718630, 14774963, 11495832, 6551703, -1428030, -11127232, -13272623, -3008504, 9546193, 12207645, 8026961, 8390066, 14291973, 16723837, 12260160, 6353105, 3051367, 2471647, 6998577, 18785292, 31296328, 34184258]
39618C4184258o589301n923971j004197k546875p565781n434368K665776M870940
39610A2656481k057484p936569n335735R17688L830971L888884L477546K25258
39602I667040o681982r669869j665112J0728077J2997283K751794n871569k416666
39594I838996M646787J962086o449605m654751Q982422J6443412N832854j0822044
39586B5780157j4815384n962278Q50710j947517p662271q028427k335965N244115
39578h876860R192727M919939m992050r291110j011240J0812062J1705322J735886
39570A4194676n491592k608182L874375O084446M024317M67108l521074n688520
39562A1335554l812248j099343j918674k519267L388339J0291147N879992p598920
$$ y = [34184258, 27594957, 21670986, 20666789, 18119914, 10554133, 5119765, 7785541, 12656481, 10598997, 2662428, -2673307, -1755619, 2075352, 5964236, 9441782, 9667040, 2985058, -6684811, -8349923, 2378154, 15375437, 18127231, 12255662, 9838996, 14485783, 16447869, 9998264, 5343513, 14325935, 30769347, 36602201, 25780157, 10964773, 5002495, 5853205, 3905688, -3756583, -11785010, -14120975, -8876860, 315867, 5235806, 243756, -9047354, -10058594, 753468, 12458790, 14194676, 8703084, 6094902, 9969277, 16053723, 20078040, 20545148, 17024074, 11335554, 7523306, 6423963, 4505289, 1986022, 5374361, 15665508, 21545500, 13946580]
39554A3946580j2540261k216270P744599L543533n465269l018492P534684R256389
39546A8785493j531394j0672097p862242P66031M535004K526126J179275L349007
39538A1075203M756804N15120p031250r183073j752914P271446O593076k915409
39530I329003r578116q069340m907810m252424n35791Q304700J2516446N556820
39522H363488k939379j367051N222450M302017l173294n943714j859389J402527
39514D007655J960156L981508M174246m354975j4275330r243188Q774412J6707910
39506A1732394L422524j2517702j0570515K214466N758931j234309l953597Q12374
39498d335434J146907n881028o762972N634176J7772048J3931352j493899j0894749
$$ y = [13946580, 1406319, -809951, 6934648, 10478181, 5012912, 1994420, 9529104, 18785493, 17254099, 6582002, -1280240, -514209, 4020795, 6546921, 7726196, 11075203, 15832007, 16347127, 9315877, 132804, -1620110, 5651336, 12244412, 9329003, -249113, -8318453, -13226263, -17478687, -18014478, -9709778, 2806668, 8363488, 5424109, 4057058, 9279508, 13581525, 10408231, 4464517, 2605128, 4007655, 5967811, 9949319, 14123565, 9768590, -4506740, -13749928, -4975516, 11732394, 15154918, 2637216, -7933299, -5718833, 40098, -1194211, -5147808, -4335434, -3188527, -9069555, -15832527, -10198351, 7573697, 21505049, 20011150, 9116401]
39490I116401o616382K636791N724488R48351n534392o953250j279627O372498
39482D414878P147865j692843j1226331j0134545N60525P629707K129604r474307
39474a0645447j3925402o809454M710263J1924734J2180978P617637J896652o51024
39466F298937K754155R177811J0933398L976935o157475j0137806o113853j680014
39458I052088l527265q563673q500580j358632O137951P936613N583908L397719
39450A0158129J391182k180975m605838j818583L379222L587887j820039m935119
39442C155866j274077L757763M095798J616273M74944k92680k134135j471312
39434G928440L323976N356366j075523r151173q457680j205265K293728J104821
$$ y = [9116401, 2500019, 5136810, 10861298, 11809649, 6275257, -677993, -1957620, 4414878, 11562743, 9869900, -1356431, -11490976, -10930451, -3300744, -1171140, -10645447, -24570849, -31380303, -26670040, -14745306, -2564328, 5053309, 6949961, 6298937, 9053092, 18230903, 29164301, 33141236, 26983761, 16845955, 10732102, 9052088, 5524823, -3038850, -11539430, -12898062, -6760111, 1176502, 6760410, 10158129, 11549311, 9368336, 4762498, 2943915, 6323137, 9911024, 8090985, 3155866, 1881789, 5639552, 9735350, 11351623, 11826567, 11533887, 9399752, 7928440, 11252416, 16608782, 15533259, 6382086, -2075594, -3280859, -987131, 117690]
39426A17690K728734O100742J760355q673525j0126665K184697J2224698O431853
39418A2748579n801681p585205K25057M044981P54167o6599N356136Q867423M145249
39409B2688107m595816j0113457j0164036o204896p78074K500844J780128J09175
39401d778025J076515K766377J676830L75992L769096R051877P915310p38871
39393B1115101q410312q940730n446412l095831j950403k94091P20709k76660
39385f578629j489962m91479K401002M969350M890896M98364o740194j0650317
39377a3190969n942813L986392R583218O477591k45609l909546l224249q5223
39369f551208M052371P121223O556282L178129Q77956L90192j765805n636724
$$ y = [117690, 2846424, 8947166, 10707521, 2033996, -8092669, -5907972, 6316726, 12748579, 6946898, -638307, -413250, 3631731, 4385898, 4319299, 9675435, 18542858, 22688107, 18092291, 7978834, -2185202, -8390098, -9168172, -6667328, -4887200, -4778025, -3701510, -935133, 741697, 1117689, 4886785, 13938662, 21853972, 21115101, 12704789, 3764059, -1682353, -4778184, -6728587, -7022678, -6301969, -6578629, -8068591, -8560070, -6159068, -1189718, 3701178, 4199542, -2540652, -13190969, -19133782, -15147390, -5564172, 913419, 667810, -3241736, -6465985, -6551208, -2498837, 4622386, 11178668, 14356797, 15234753, 15624945, 13859140, 8222416]
39361H222416m944508L471472J1953325R940795k435855j4062749j5541227q123535
39353a1519866l06433J190770k839835n039600J129171J2871944J8619724J0416606
39345B4522481n296425j3369249o824817N638596J0389286L886364n456079q161354
39337E328803l050808L875175O733317M646111J096630k2020J729168K690032
39329B3026408q72072p585203j1336428q059229p07472M273409M164866J701448
39321D605727Q53705L140721O958121Q364296M202819l127945o653226l934068
39313A4410150j521934n044142r123740n428695K628406M427259J94622J005930
39305A547856Q591598R982695j151154j1800552q432328L083094Q412028O099627
$$ y = [8222416, 3277908, 6749380, 18702705, 28643500, 26207645, 12144896, -3396331, -11519866, -11826299, -10635529, -13475364, -18514964, -17385793, -4513849, 14105875, 24522481, 19226056, 5856807, -968010, 4670586, 15059872, 18946236, 13490157, 5328803, 2277995, 6153170, 12886487, 17532598, 18629228, 18607208, 20336376, 23026408, 22154336, 14569133, 3232705, -4826524, -5533996, -1260587, 2904279, 4605727, 5459432, 8600153, 15558274, 23922570, 28125389, 24997444, 18344218, 14410150, 12888216, 7844074, -1279666, -6708361, -4079955, 347304, 541926, 1547856, 10139454, 20122149, 18970995, 7170443, -1261885, 1821209, 10233237, 16332864]
39297A6332864M587135N365433L435293l71649j215048n09347j638841k69517
39289B5716323P041360J0015701k273225j9092199j8871481k209697P435834j88525
39281G574091p719054o95352Q883192M338140p271842p167774N105147J2448471
39273A5495019O390095l954542q199171o525503l697918j296001J144606L081826
39265B438411L260436Q99561k757892l411522J982998Q611078P260241l026576
39257A5256735j2068608j1642014m818080J380352N104959O810870N059023R62584
39249F045821k67960K246744K453346j636573l185912J100725L860150J59030
39241A0775371k850019Q52811L920914j321154p572020m504723K554241J790482
$$ y = [16332864, 20919999, 26285432, 29720725, 29349076, 28134028, 27624681, 25985840, 25716323, 32757683, 42773384, 40500159, 21407960, 2536479, 326782, 7762616, 7574091, -144963, -840315, 8042877, 12381017, 5109175, -2058599, 3046548, 15495019, 21885114, 17930572, 9731401, 3205898, -492020, -1788021, -643415, 2438411, 5698847, 6598408, 3840516, 428994, 2411992, 11023070, 18283311, 15256735, 3188127, -8453887, -13271967, -11891615, -6786656, 24214, 5083237, 6045821, 5777861, 8024605, 10477951, 8841378, 5655466, 6756191, 10616341, 10775371, 7925352, 8778163, 12699077, 11377923, 3805903, -698820, 1855421, 3645903]
39233C645903m175904l759778K265582L214193p18736P66794O975367N359221
39225A3572642n594805j1002071k404816R851330J2959880O641009l213389j2400705
39217H409075j5208841p073287M711505O723045M6440m01254Q267808J0565554
39209A6040045J02638p172563n5985P726226K010657n635558J111374J1307172
39201B5434006L296077j5761603j7450923K190826J4957352M584015r310677m309890
39193C629183J0671852J2435766q19948j0545589o658438K196994M604565q71947
39185A4642438q595880j1998625p163755K873215Q973242O572127K020094K298898
39177I621754L770703j77382n393402k632310N583590P227762O63324j674509
$$ y = [3645903, -530001, -4289779, -2024197, 1189996, 471260, 1238054, 8213421, 13572642, 7977837, -3024234, -5429050, 4422280, 17382160, 24023169, 20809780, 8409075, -6799766, -13873053, -9161548, -2438503, -2392063, -2793317, 5474491, 16040045, 16142683, 8970120, 8914135, 16640361, 18651018, 13015460, 14126834, 25434006, 28730083, 12968480, -4482443, -2291617, 12665735, 17249750, 7939073, 3629183, 14301035, 26736801, 25916853, 15371264, 8712826, 10909820, 15514385, 14642438, 6046558, -5952067, -13115822, -10242607, -1269365, 5302762, 7322856, 9621754, 13392457, 13215075, 7821673, 5189363, 10772953, 18000715, 18664039, 16989530]
39169A6989530O135244J2615875O820841m028806n981105O27753M372779J953499
39161C9505610L23783J316587j517526q704464j0950456m561613J016039j731867
39153A4696093o116671l261864K429086J421276l572399j813242O556628R829387
39145B0168294L936480r99092K351416O736197K846184n396192p376027k099338
39137B0167922J805620K70637j205499K093284N925812L129862n590875j1089596
39129A5507167o239663N220008J2259149Q840263N2550n486761o065181n851417
39121A8236115o262383m587421m80800K923267M934730P493943Q549825L365685
39113C4172961n381998q082868k933059k14469n318544q115674M76724J0892272
$$ y = [16989530, 23124774, 35740649, 42561490, 38532684, 32551579, 33179332, 37552111, 39505610, 39829393, 41145980, 39628454, 30923990, 19973534, 15411921, 16427960, 14696093, 8579422, 5317558, 7746644, 9167920, 5595521, 3782279, 10338907, 20168294, 24104774, 23105682, 25457098, 32193295, 35039479, 29643287, 22267260, 20167922, 21973542, 22244179, 21038680, 23131964, 29057776, 32187638, 26596763, 15507167, 9267504, 14487512, 26746661, 35586924, 35639474, 30152713, 24087532, 18236115, 11973732, 7386311, 6905511, 9828778, 14763508, 22257451, 30807276, 34172961, 28790963, 20708095, 17775036, 17560567, 12242023, 4126349, 4603073, 15495345]
39105A5495345Q068457m155489q363239q09638M344609l15716m376499O53974
39097A0541804O639614L932032j771119k5710O374784P203660K204521m47979
39089C4651607Q63060N00028k133142j809222J409845J831905m44609Q69109N510026
39080D1248607N267767r62751k473989O444866J5515808J3302998M616703K047095
39072H5007104N916917N610858j047477l381699M395029J3093864J2926847Q759382
39064A31280825J1438170J9674954K2479860J8611899K0933148L6782558N4659831
39057C15861245N9300976N2474662M6900764M3718500L1109052O624445j5132073
39050E40857571k4373912l1215057m6739772o0999710n7042862l9755097l0654862
$$ y = [15495345, 23563802, 19408313, 11045074, 10235436, 14580045, 14264329, 9887830, 10541804, 17181418, 21113450, 19342331, 19316621, 25691405, 32895065, 35099586, 34651607, 35514667, 36014695, 33881553, 32072331, 33482176, 35314081, 34869472, 35738581, 41248607, 46516374, 45553623, 43079634, 49524500, 65040308, 78343306, 82960009, 85007104, 90924021, 96534879, 95487402, 92105703, 96500732, 109594596, 122521443, 131280825, 142718995, 162393949, 184873809, 203485708, 224418856, 261201414, 315861245, 375162221, 427636883, 474537647, 518256147, 549365199, 555989644, 540857571, 516483659, 485268602, 438528830, 377529120, 320486258, 280731161, 250076299]
39043B50076299l5324027l6718371k4799361j2589696j3322271j9167924j6311392
39036I1843257p719281n214788q358190p483461j787861J246648Q26258K498652
39028F5851234N112851K306989m106389n891569l037211l155573o410290n364273
39020D5305769q62683k765984j1537319j4282765m864772N895189P111425K349164
39012B6348024k97842o04528k89918L678684J0211947R389992k433158j2485266
39004C3517935q444372K955388O828198K260017l73064J385688N88638l994412
38996C4724016n836138l738171l927079p451992o912330J250355J0274913J2072674
38988C0456248O070472k691651q547368p678301j049432N193032O768605O508361
$$ y = [250076299, 214752272, 178033901, 153234540, 140644844, 127322573, 108154649, 91843257, 84123976, 78909188, 70550998, 63067537, 61279676, 62526324, 63352582, 65851234, 70964085, 73271074, 69164685, 63273116, 60235905, 57080332, 50670042, 45305769, 44443086, 41677102, 30139783, 15857018, 10992246, 16887435, 23998860, 26348024, 26050182, 25445654, 25155736, 28834420, 39046367, 48436359, 46003201, 33517935, 25073563, 28028951, 34857149, 37117166, 36744102, 38129790, 38718428, 34724016, 28887878, 25149707, 21222628, 13770636, 6858306, 8108661, 18383574, 30456248, 36526720, 33835069, 25287701, 17609400, 16559968, 21753000, 28521605, 35029966]
38980C5029966P477130N545047k903188j0461830p384266J553343J928744q039251
38972B2745695j3521202n201125O891623Q460514N18869m379428N2220P538255
38964B3105421Q773019J976908o184423q269288m017552P66383L280512O623743
38956B6054723J1003279R672921N49259n825291n17436Q088594O113258l441839
38948E1697468o204702j128704o40632n864580l049887R908271J4941217K572879
38940F2231330j0201592n890376N781332M645643p257787j0892826k158579K827426
38932C9084571m902164j3107989p864550N827138J1635958L609059p633582r233582
38924A7414859j368711M539908J523409m200793l754264M75180k39594n414806
$$ y = [35029966, 42507096, 48052143, 45148955, 34687125, 27302859, 28856202, 30784946, 22745695, 9224493, 4023368, 10914991, 19375505, 19894374, 15514946, 15567166, 23105421, 31878440, 33855348, 27670925, 19401637, 15384085, 16150468, 19430980, 26054723, 37058002, 46730923, 47280182, 41454891, 40937455, 49026049, 55139307, 51697468, 45492766, 44364062, 43723430, 37858850, 34808963, 44717234, 59658451, 62231330, 52029738, 46139362, 51920694, 56566337, 49308550, 38415724, 36257145, 39084571, 34182407, 21074418, 13209868, 19037006, 30672964, 34282023, 26648441, 17414859, 16046148, 20586056, 22109465, 17908672, 14154408, 14629588, 14389994, 8975188]
38916H975188o259003j624117J52265k662388j674918M547386N165410l608009
38908C011814r011647j981436P086618N277184k604949m352173J83790L904722
38900A513923O199953P762109K848969q001725r747436M688617J6176207N363760
38892B6804377j4224289j4814857J967110R149240j380618r577508l992249K794425
38884c274369K013078K795199Q294001N346752q602449j4048668j224040J0439121
38876A738625L701926p496125k963144Q653607N965279p404872r315565L474644
38868c645625J1453512M752137m561212n094550p00886K084909M122908N606342
38860A4017535K103126n261021p212928O6976Q068137Q080325K300751k208231
$$ y = [8975188, 2716185, 1092068, 1244333, -1418055, -3092973, 1454413, 6619823, 3011814, -5999833, -7981269, -894651, 4382533, 1777584, -2574589, -2390799, 1513923, 7713876, 15475985, 18324954, 10323229, 575793, 5264410, 21440617, 26804377, 12580088, -2234769, -267659, 8881581, 7500963, -2076545, -6068794, -3274369, -1261291, 1533908, 9827909, 15174661, 6572212, -7476456, -8700496, 1738625, 5440551, -2055574, -5018718, 3634889, 9600168, 2195296, -7120269, -3645625, 7807887, 12560024, 7998812, 2904262, 2203376, 4288285, 8411193, 14017535, 16120661, 10859640, 3646712, 3713688, 11781825, 19862150, 22162901, 19954670]
38852A9954670l674302m222841l612502k95780L691305L748517j248539o459936
38844G880592o207598j587484m97405o927793j2480325n354246J1938355K2514761
38836I278857J6182858J902882o269664o913806o861283p035274l624266J416309
38828a923387K464328P27876K198805N892643M106579m549650j1034568p549955
38820i667329K390083Q193155L688214o350388j0206614j841555R976332J0488154
38812F670052j302347r603295l024012J0101043J4704424Q581312j59878o959772
38804A9007527j1134483r718181l153286m87205o063740q265300L346261J6900597
38796D32190J3102574l596238j0420408j606200N109178J80701l916346J476690
$$ y = [19954670, 16280368, 12057527, 8445025, 8149245, 11840550, 15589067, 14340528, 7880592, 1672994, 85510, -411895, -7339688, -19820013, -25174259, -13235904, 9278857, 25461715, 27364597, 21094933, 14181127, 7319844, 284570, -3339696, -1923387, 540941, 1268817, 3467622, 9360265, 13466844, 8917194, -2117374, -9667329, -7277246, 915909, 4604123, -1746265, -11952879, -13794434, -3818102, 6670052, 5367705, -4235590, -7259602, 2841441, 17545865, 26127177, 25967299, 19007527, 7873044, -1845137, -4998423, -5485628, -11549368, -19814668, -16468407, 432190, 13534764, 9938526, -481882, -2088082, 3021096, 3201797, -714549, 762141]
38788G62141M893830k678617r111719j637689R924387Q722639k262296p469673
38780A143003m163733k009093k998423k00123N888348O792736J982781K83768
38772F719264L884787M525026j582106p117184n806190q91415K671475N146669
38764G550326O441028K322795p390696j3587670q319570L235576Q250309K191571
38756F93669o609642q299077k390044M153916N943577L523714O80586L74726K737274
38747H08699M575530J551497n892509r575363j970569J1526789J5759992M943723
38739B1727789q597104j0890818m273569k38136j248075j547244r91325l691928
38731i750410n451725J616844J2149016J1961297J185499m801592j125349m27905
$$ y = [762141, 5655971, 2977354, -6134365, -7772054, 2152333, 10874972, 8612676, 1143003, -3020730, -5029823, -8028246, -8228369, -2340021, 4452715, 6435496, 6719264, 10604051, 15129077, 13546971, 6429787, 623597, -267818, 2403657, 7550326, 13991354, 16314149, 8923453, -4664217, -12983787, -9748211, -1497902, 693669, -5915973, -14215050, -16605094, -12451178, -6507601, -2983887, -2303301, -1928575, 808699, 5384229, 6935726, 1043217, -8532146, -10502715, 1024074, 16784066, 21727789, 13130685, 2239867, -2033702, -2271838, -3519913, -5067157, -6058482, -9750410, -15202135, -13585291, -1436275, 10525022, 11710521, 6908929, 5783580, 5355675]
38723E355675p583814q869204K292396J0142837L103818m665223J622255R373377
38715A0772117Q12569j2462514p227227R481142R890238o903714j2212458L794829
38707d055018J5626150N298795r850480q702182J096549K170722k918508k897608
38699d231580j065153m886921o696053K277516J0668767L926923p241207j808153
38691i055861J4127756J3559492p581736k1566201j0874498O870117Q574055j237365
38683g184241l841598K815221N681480J37334n909573p588987p573194o342730
38675b9806288r54219O139327Q249623N680559N757671R823516J0166164L370959
38667A8427312k885840k194860k40409m940212j1550484q112142N653508J5137718
$$ y = [5355675, -2228139, -11097343, -8804947, 1337890, 4441708, -223515, 1398740, 10772117, 11584686, -877828, -8105055, 1376087, 11266325, 4362611, -7849847, -4055018, 11571132, 16869927, 7019447, -1682735, -586186, 1584536, -1333972, -4231580, -5296733, -10183654, -16879707, -14602191, -3933424, -6501, -7247708, -9055861, 5071895, 18631387, 11049651, -10516550, -21391048, -14520931, -5946876, -7184241, -11025839, -8210618, -2529138, -2391804, -8301377, -15890364, -23463558, -29806288, -30760507, -24621180, -16371557, -10690998, -4933327, 4890189, 15056353, 18427312, 15541472, 13346612, 13106203, 8165991, -3384493, -11496635, -5843127, 9294591]
38659I294591R395926m496025j0555114l264549P272434Q436475l86499p477267
38651H219972k390812J0893816J6899552O847380r275019j4189040m790757N691757
38643A7906849O818366K174458j395142m472255q009806o302952K331524O708730
38635A5759772k058814j3367417j0734279K040702O407770j031768m729906J370142
38627f343798L969559l199751n584000N791041J4654866N507637p860936l955773
38619B978845Q958638N516452j2667790j6935144J864130J7394684R131944p294281
38611H947478q086252K137661L540109m333486n616955J860352L737736m527049
38603b340406r644242k676581P825017J0811581P195053K651886k406644p835809
$$ y = [9294591, 18690517, 14194492, 3639378, 374829, 7647263, 16083738, 15697239, 8219972, 5829160, 16722976, 33622528, 40469908, 31194889, 17005849, 12215092, 17906849, 24725215, 26899673, 25504531, 21032276, 13022470, 6719518, 9051042, 15759772, 13700958, 333541, -10400738, -8360036, -1952266, -2984034, -7713940, -6343798, -2374239, -5573990, -11157990, -5366949, 9287917, 14795554, 6934618, 2978845, 11937483, 17453935, 4786145, -12148999, -10284869, 7109815, 16241759, 8947478, 861226, 2998887, 6538996, 2205510, -3411445, -1551093, 2186643, -2340406, -11984648, -14661229, -6836212, 3975369, 11170422, 13822308, 11415664, 3579855]
38595C579855q059758k08434Q275843Q331326J473746l475974k388956J641383
38587I169031M747491N148346J678425m896989j0337993j1088272q390078m765167
38579a8735206L78094O994911J0187818O396040Q25412Q84457M224153K381914
38571A3537593m328214o148252o2428M414013Q86592k663169L060287J1818371
38563B0514793R133866o490991k0063846j8404550m188566R759227J3989366Q181961
38555A2431260j658409q583243r215189m741156K120408R087209J2422149P709252
38547A9572281l178704r896963m961706N028802O897442j271422p840681m115019
38539B34030M843620Q800252M981348j837308o532471o614438k027654L875469
$$ y = [3579855, -4479903, -4688337, 3587506, 11918832, 13392578, 9916604, 7527648, 9169031, 13916522, 19064868, 20743293, 15846304, 5508311, -5579961, -13970039, -18735206, -18357112, -11362201, -1174383, 5221657, 6047069, 6931526, 11155679, 13537593, 9209379, 3061127, 2998699, 7412712, 8299304, 5636135, 8696422, 20514793, 29648659, 23157668, 3093822, -15310728, -19499294, -9740067, 4249299, 12431260, 10772851, 2189608, -7025581, -11766737, -9646329, -559120, 11863029, 19572281, 16393577, 6496614, 1534908, 6563710, 13461152, 12189730, 4349049, 234030, 5077650, 13877902, 18859250, 17021942, 10489471, 3875033, 1847379, 5722848]
38531E722848N957091L140897K18394J384385M624917M833468J08021o752410
38523A9237611j0672779p694348N91547N990970K175767n466195n343469L335173
38515B154277P676120k63169j0661762r537409J601251R395815P711013K658661
38507A0734797K70704n01713j638598j985873j756362l639072o492321m518061
38499i526499L566204J0132352Q063846O44981k940350J32420L409712M57840
38491A3940506o666862j0091778n881212J186449L591642K69092k873157j316181
38483g841501L002236O133456P216990O472431K775125k484508l696554R31565
38475A2509240L961622q65208o665261k545687P098068O125024p814446j6084876
$$ y = [5722848, 11679939, 14820836, 15039230, 16423615, 21048532, 25882000, 25990021, 19237611, 8564832, 870484, 1462031, 7453001, 9628768, 4162573, -1180896, 2154277, 9830397, 9567228, -1094534, -10631943, -9030692, 365123, 8076136, 10734797, 11005501, 10503788, 8865190, 6879317, 5122955, 1483883, -5008438, -9526499, -5960295, 4172057, 12235903, 12880884, 9940534, 10072954, 13482666, 13940506, 7273644, -2818134, -8699346, -7512897, -3921255, -3652163, -6525320, -7841501, -4839265, 1294191, 8511181, 14983612, 17758737, 15274229, 11577675, 12509240, 16470862, 15605654, 8940393, 6394706, 13492774, 19617798, 11803352, -4281524]
38467d281524n831571R187309Q254090n000962q801310K450588R952085R70910
38459F899615j0949270p724190N078130P915857k234567q956417l019838N252017
38451g738663M865248O84848K117120O150141L317712n577021j0419630o957085
38443a3557330o70520L762267P164032R007173M984307m984222j2803788j0715439
38435a7813520n09066Q531233Q976939J706918n190094m551703J133478J991779
38427e724036n243440j0560379m390270P015713R795172L144212j86538N826935
38419c22631J1995662Q656188j908947j1636411j5722718j2161105k086422O047006
38411a7139378L110384o215933o909233M447907J3999200J2062194N852387L548089
$$ y = [-4281524, -10113095, -925786, 7328304, 2327342, -6473968, -4023380, 5928705, 6899615, -4049655, -11773845, -6695715, 1220142, -1014425, -9970842, -12990680, -7738663, -2873415, -2188567, -71447, 6078694, 9396406, 3819385, -6600245, -13557330, -14227850, -10465583, -3301551, 5705622, 10689929, 5705707, -7098081, -17813520, -18322586, -9791353, -814414, 892504, -4297590, -8849293, -7715815, -5724036, -10967476, -21527855, -25918125, -18902412, -9107240, -5963028, -6149566, -322631, 11673031, 20329219, 18420272, 6783861, -8938857, -21099962, -23186384, -17139378, -14028994, -20244927, -27154160, -22706253, -8707053, 3355141, 9207528, 12755617]
38403A2755617J229247m312579n811919j371113l595121j6560647k0191592P03600
38395c7154507K5669720K3399311j331405j4427698l145377R863219O289219k975934
38387F186548k405610L380572L352224R6998J466042N120270L966474k296082
38379A8867436r713729j5142540j3441627j133470J2132341R645894q030426j9125879
38371b5942000r465916Q802565J6693712J2531478N670384l23506n319686n081809
38363b434778P12713K854059l024451p005199j654668M091224J673144M0701Q291814
38354C544559J3931072J050661j8592964j8474485J716939J4131128M345110r842129
38346h190109q735791K073399O794008M393419L858789N968763M377867j036418
$$ y = [12755617, 13984864, 9672285, 3860366, 2489253, -1105868, -17666515, -37858107, -37154507, -11484787, 11914524, 10583119, -3844579, -6989956, 2873263, 9162482, 6186548, 3780938, 7161510, 10513734, 10610732, 12076774, 17197044, 21163518, 18867436, 9153707, -5988833, -19430460, -20563930, -8431589, 1214305, -6816121, -25942000, -35407916, -26605351, -9911639, 2619839, 8290223, 7966717, 2647031, -2434778, -1722065, 1131994, -1892457, -8897656, -10552324, -6461100, -4787956, -4747255, 3544559, 17475631, 18526292, -66672, -18541157, -16824218, -2693090, 1652020, -8190109, -16925900, -14852501, -8058493, -3665074, 193715, 6162478, 10540345, 9503927]
38338I503927l684856m03123N691237R826647P882985j716600j3285832j5885892
38330b071507o074811N499933O563339j310147o561443m195060k83055l36999
38322h769750j743407p75096n2310l136778o014148j753053P043679Q751123j118873
38313g568613j1396316r210790K437711R329467N792303M08324J629171P034344
38305a544399R812018Q044586L674250j242438l637040j019187K806886M09309
38297A7303985p457866j0409385l371318M981467M665911k081558o331825m778917
38289g479506K58131O593028J0883403P971604j316495p960149o934690m128270
38281b112944m142740q61956R957332J8393730J3483326R04774o108306o699064
$$ y = [9503927, 5819071, 5415948, 11107185, 20933832, 28816817, 27100217, 13814385, -2071507, -8146318, -2646385, 3916954, 2606807, -3954636, -8149696, -8432751, -8769750, -10513157, -11288253, -11340563, -14477341, -20491489, -22244542, -15200863, -6449740, -7568613, -18964929, -28175719, -25738008, -16408541, -10616238, -10207914, -8578743, -1544399, 8267619, 16312205, 19986455, 18744017, 15106977, 14087790, 16894676, 17303985, 9846119, -563266, -3934584, 1046883, 5712794, 3631236, -2700589, -7479506, -7221375, -628347, 10255056, 18226660, 16910165, 8950016, 2015326, -2112944, -6255684, -7117640, 2839692, 21233422, 34716748, 35621522, 29513216, 22814152]
38273B2814152q522379j0246181m888661L153178K191636o685297j0512882n401585
38265a8098019K3150K555219P952018J4105005R282069o863815j7482549j1765522
38257b0292444O61691O921813Q323156J0637704R994008J236705q694884q708241
38249G9508O0859O355663M242984j740383m693374k435617J991535L401507R9198
38240G361880k732148L52696N346756K974228o672658j2539408p985775J295232
38232a2599197P814005J1165845J2108619P584767k009234q667112o726171r87596
38224G683926N98801l038249p535340q966335n119711L087741R377837Q088660
38216D177330L219334K929299N074064L7601j0823149j4094735n711387J949494
$$ y = [22814152, 14291773, 4045592, -843069, 2310109, 4501745, -2183552, -12696434, -18098019, -18074869, -15519650, -7567632, 6537373, 15819442, 8955627, -8526922, -20292444, -19630753, -12708940, -4385784, 6251920, 16245928, 17482633, 8787749, 79508, 140367, 6496030, 10739014, 8998631, 4305257, 1869640, 3861175, 7262682, 7361880, 4629732, 4982428, 10329184, 13303412, 6630754, -5908654, -13894429, -12599197, -4785192, 6380653, 18489272, 26074039, 24064805, 15397693, 8671522, 7683926, 8282727, 5244478, -2290862, -11257197, -16376908, -13289167, -3911330, 4177330, 7396664, 10325963, 15400027, 15437628, 4614479, -9480256, -15191643, -13242149]
38208a3242149R33982j44462N852815R945603K926696p498177r402444n120262
38200a5748398k921115r75769N094501Q541644K274114m733552J74482J0409945
38192B115852Q381171o403682j6041111j0891657m56618M251503L880331K800656
38184a2363555J026547j396341j694264L76514J927174K777373M828468O051606
38176A533522K837025k396480l620058k04373L471366N120694M312394q58783
38168A0195307q754576j0806338k671081O490831O395787J200817M42662J296072
38160C789481m549196j1798866p735337M816864R557821J933173n898007o375354
38152a6259421m321230j529927O587990J4817631R241487p972217j4628920J59184
$$ y = [-13242149, -12308167, -12452629, -6599814, 3345789, 6272485, -1225692, -10628136, -15748398, -18669513, -19645282, -14550781, -6009137, -3735023, -8468575, -8294093, 2115852, 10497023, 4093341, -11947770, -22839427, -23296045, -19044542, -15164211, -12363555, -11337008, -12733349, -14427613, -14051099, -12123925, -9346552, -4518084, 1533522, 4370547, 1974067, -1645991, -1850364, 1621002, 6741696, 11054090, 10195307, 1440731, -9365607, -12036688, -5545857, 849930, 2050747, 2493409, 3789481, -759715, -12558581, -20293918, -15477054, -5919233, -3986060, -9884067, -16259421, -20580651, -22110578, -15522588, -704957, 8536530, 564313, -14064607, -13905423]
38144a3905423J8263378J8352882M096235o575326p046004k850010K216396O696065
38136A9248193O053770j019263p096419o272864k863348k010545p62236L180933
38128H458221M323125L86870q19606L870790L764499p221600j5554634p910288
38120a0702623N115345M348675p226688j0146001J13139R275632J0200609J0457913
38112A1436001J1891216M503742j2369368k1787105j2449119M076907J0071315
38105d626411M518749j197907j516001L02091J556652K327397J167512l239201
38097g07119p263982n356878K102365Q031412O362752j242658o924830n100898
38089a0099836P20721K026111k835251n595513m12766O552831O614057K258310
$$ y = [-13905423, 4357955, 22710837, 26807072, 20231746, 13185742, 10335732, 12552128, 19248193, 25301963, 24282700, 17186281, 10913417, 8050069, 6039524, 5277288, 8458221, 12781346, 13168216, 12348610, 16219400, 19983899, 12762299, -2792335, -10702623, -5587278, -1238603, -8465291, -18611292, -18498153, -9222521, 978088, 11436001, 23327217, 27830959, 15461591, -6325514, -18774633, -14697726, -4626411, -107662, -1305569, -2821570, -2519479, -962827, 1364570, 2532082, -707119, -7971101, -13327979, -11225614, -3194202, 3168550, 1925892, -4998938, -10099836, -9379115, -7353004, -10188255, -15783768, -16196534, -9643703, -3029646, -771336]
38081g71336J923454N025566L919789r36709j087868L563129K480939o922060
38073G194904j1692257k234288J1766387J3996585K919785q731272j0947422m771192
38065b498770K745059M991550P4569o213344n235898K759693P365754L056866
38057G045479k062561K16088L856170j471000j1873092j3907873n557184J253054
38049b2500919L43959K7801P056419J3361615P731762o179074j3326658o594357
38041b0079452N417682J0561975P025751K208756J280539J505835j452482n593786
38033H74818n259129o61458J151692k999214o518271k590700N073161P772631
38025c156470M871609L109587M157159K157656m811899r741419p075348q17261
$$ y = [-771336, 1152118, 6177684, 10097473, 9160764, 8072896, 11636025, 14116964, 7194904, -4497353, -6731641, 5034746, 19031331, 21951116, 13219844, 2272422, -2498770, 246289, 5237839, 5312408, -900936, -6136834, -3377141, 3988613, 7045479, 4982918, 5199006, 9055176, 7584176, -4288916, -18196789, -23753973, -22500919, -22156960, -22129159, -15072740, -1711125, 6020637, -158437, -13485095, -20079452, -14661770, -4099795, 2925956, 5134712, 6415251, 7921086, 6468604, 874818, -4384311, -5045769, -3894077, -6893291, -13411562, -16002262, -10929101, -3156470, 1715139, 4824726, 8981885, 11139541, 6327642, -3413777, -10489125, -11306386]
38017a1306386K592862L187381L560491J807620m127396q902066n292300L733119
38009a4746675O959258N77131n603513j738718P745884R819438R00026p769196
38001c856365n281333L619049M661596n565273j3200178n312034J1657232J9799418
37993F522112J3248551L553492P27705L71683m550939r250658m812705N459707
37985A1268948R186978K766865m747099o275198n129826o063376o820795l329750
37977i143253L143615Q617114J1099102R003854M49829j1333039j7126873j1806295
37969a7095946j454309M631863N041471L927003K164123j510317l588513O88659
37961g195966P076197M865645p532764j7281969j2346432L004839J3288777R696292
$$ y = [-11306386, -8713524, -5526143, -1965652, -158032, -4285428, -13187494, -18479794, -14746675, -7787417, -7210286, -12813799, -14552517, -6806633, 3012805, 3912831, -3856365, -9137698, -5518649, -857053, -6422326, -19622504, -24934538, -13277306, 6522112, 19770663, 23324155, 24051860, 24423543, 19872604, 10621946, 5809241, 11268948, 20455926, 23222791, 18475692, 12200494, 7070668, 1007292, -5813503, -9143253, -5999638, 2617476, 13716578, 22720432, 23170261, 11837222, -5289651, -17095946, -18550255, -13918392, -8876921, -4949918, -2785795, -4296112, -7884625, -7195966, -119769, 4745876, -2786888, -20068857, -32415289, -29410450, -16121673, -6425381]
37953f425381j811584q936898n429140M921020J3483028J4716167R819826L252891
37945B3589929l094674r981207j5278913j2811329k34536J4562367J9997240J3573739
37937C0322616L536360k781440o609726j0945841j2350018o553215J228703J071721
37929c080840o208940q375855k20499P388012M348010k092364N87848Q224994
37921E70366O006585n363928p738055N755917J7557592J1406366l420165p883284
37913A6891394k210434j678111r519936j3053504o382540Q40757J154002M72057
37905a3486315N004964R558247P216708J345416n87870J608467L213987K738858
37897A6612462Q79435l493893r558789j1388415n466434K370013M076471L98351
$$ y = [-6425381, -8236965, -17173863, -22603003, -17681983, -4198955, 10517212, 20337038, 23589929, 20495255, 10514048, -4764865, -17576194, -17810730, -3248363, 16748877, 30322616, 33858976, 31077536, 24467810, 13521969, 1171951, -5381264, -4152561, -3080840, -9289780, -17665635, -17886134, -10498122, -6150112, -8242476, -7654628, 570366, 6576951, 1213023, -6525032, -769115, 16788477, 28194843, 24774678, 16891394, 14680960, 13002849, 3482913, -9570591, -15953131, -15112374, -13958372, -13486315, -8481351, 1076896, 8293604, 9639020, 9051150, 10659617, 13873604, 16612462, 17491897, 13998004, 4439215, -6949200, -12415634, -10045621, -5969150, -5570799]
37889e570799j404174J957942P351847J0615106R084567J801302p337024j0091363
37881F407404l689143L336458J890014m705044o569574k925854j803932n154285
37873a3213956n324254J475628Q067089O918554K84061m727183n031932j405060
37865a2957053M709535R698229Q318225O84165n486438m210114J122245L878291
37857E757085L543914L326874K315110k742391r502343j1097768n651154J050225
37849a3000448L644332L244519L668774N411969N738164K785331k033602m951689
37841D507350l314819P62944J703913k190236m841663l17422O741231N290307
37833H341605o113584j4562700q828581N074475J1322061M996477k421858L85001
$$ y = [-5570799, -6974973, -5017031, 2334816, 12949922, 22034489, 23835791, 16498767, 6407404, 2718261, 6054719, 7944733, 3239689, -3329885, -6255739, -8059671, -13213956, -18538210, -17062582, -8995493, -2076939, -1792878, -6520061, -11551993, -12957053, -8247518, 1450711, 9768936, 10453101, 4966663, 756549, 1878794, 5757085, 9300999, 12627873, 14942983, 12200592, 2698249, -8399519, -14050673, -13000448, -9356116, -6111597, -2442823, 2969146, 8707310, 11492641, 9459039, 4507350, 1192531, 1955475, 3659388, 1469152, -3372511, -3689933, 3051298, 8341605, 2228021, -12334679, -21163260, -16088785, -4766724, 229753, -2192105, -1807104]
37825a807104R199279J0239954j371541j4578227j5147926k477816R647224R373627
37817C077470N08657l681240J138464M706627k169476j2629782j2181846L32529
37809b0898597R750454M945133o071448p383032L445593J2676394Q285046n461247
37801g11704j3314008o296297Q411933J5192018P382751n137748q438972k138134
37793e050161J905634j913858n209242l87257O388565N308461j331253m039846
37785d328957j805154j063388k073936P10082N542884M364765j806715k593134
37777c053553L268172M039655m144514p706216K711133J4525716J1159899k495052
37769A8305240q502587l025117J870353K42492j149995J112560O85656m707778
$$ y = [-1807104, 7392175, 17632129, 16260588, 1682361, -13465565, -15943381, -6296157, 3077470, 3586127, -95113, 1043351, 5749978, 3580502, -9049280, -21231126, -20898597, -11148143, -6203010, -12274458, -19657490, -16211897, -3535503, 4749543, -711704, -14025712, -20322009, -11910076, 3281942, 10664693, 5526945, -2912027, -5050161, -3144527, -5058385, -10267627, -10654884, -4266319, 1042142, -289111, -4328957, -6134111, -7197499, -9271435, -8561353, -3018469, 1346296, -460419, -3053553, 214619, 4254274, 109760, -7596456, -4885323, 9640393, 20800292, 18305240, 9802653, 6777536, 8647889, 8890381, 7740386, 8852946, 9538602, 4830824]
37761D830824o481027J307365J1362302J2529799L287843q495014j3728747p715223
37753c101878N829271J4357639P514837q871764j7312550r903365K720897O692382
37745b074531P92923o912519r818081n228130N655771J4606324J1451527j487573
37737F985711q612658k042331N922628J348432r122952q335708M506447J2610086
37729C259655O488019m585417q716099o217451l150096m95220L157258N315422
37721d943929L358990M43768J402866N200856O600206L958861R31693M90439P57491
37712A8201241j629047n483230n117401J778744Q242898M949896o223902j2037608
37704B681591n410915L433017J001162r215813j1173870N12934J3332130J4858619
$$ y = [4830824, -1650203, -342838, 11019464, 23549263, 26837106, 18342092, 4613345, -3101878, 2727393, 17085032, 24599869, 15728105, -1584445, -11487810, -8766913, -2074531, -1281608, -8194127, -18012208, -23240338, -17584567, -2978243, 8473284, 6985711, -1626947, -3669278, 2253350, 3601782, -5521170, -13856878, -9350431, 3259655, 9747674, 5162257, -3553842, -9771293, -12921389, -13416609, -10259351, -4943929, -1584939, -1141171, 261695, 5462551, 12062757, 16021618, 16953311, 17443750, 18201241, 16572194, 11088964, 5971563, 7750307, 15993205, 20943101, 14719199, 2681591, -2729324, 703693, 1704855, -7510958, -18684828, -18171894, -4839764, 10018855]
37696A0018855P262208n45362n488749q274723o744493j74493M551134K22986
37688H27363q996073j1111822j763180J0030920J2739584M587432o100781r624633
37680i411190l176223P229026J2445395R072685K271682j051061O9257J603590
37672A9053161Q15249j577299m093065n787336n198332j214039M343825P066050
37664A3408214L883808l655282r779323q549501M62028J0165883J2272769O503935
37656B4712531L34142j511122k611771p073416j1446763r946915m059668j67220
37648a1770202M71703K181086N739623O190614J315030m055692m727312j129304
37640e784454L558482P203921P310928J520314o778703q925881k366260L327172
$$ y = [10018855, 17281063, 16735701, 11246952, 2972229, -3772264, -3946757, 604377, 827363, -8168710, -19280532, -21043712, -11012792, 1726792, 6314224, 213443, -9411190, -12587413, -5358387, 7087008, 16159693, 18431375, 17380314, 17449571, 19053161, 19868410, 18291111, 14198046, 8410710, 3212378, 1998339, 6342164, 13408214, 17292022, 13636740, 3857417, -4692084, -4230056, 5935827, 18208596, 24712531, 25046673, 23535551, 20923780, 13850364, 2403601, -7543314, -11602982, -11770202, -11298499, -9117413, -3377790, 2812824, 4127854, 72162, -4655150, -5784454, -2225972, 4977949, 12288877, 13809191, 7030488, -1895393, -4261653, -934481]
37632i34481j237281j0558893j0760153K02209R021665O487308M91322K547213
37624d741091R069106P189203l872618j0199613m363988L011360K70471o611700
37616a0248870m076028O280616R734607K536559j762026M774353R809969j38737
37608A6910443j6583221j9653544o577579N847704O645837L319700N215139P982796
37600C107275L292289n486443q142090l382954O91214M39437J298757O730916
37592a451599J0629918N903752l712161o758742J173040J0916627J0703062N71260
37584B7975157q491485q730211l603390m51430r17309k270870l348527l984714
37576c822779k388401J101908J323823l824314o611075N77772J1536987J3409481
$$ y = [-934481, -2171762, -12730655, -23490808, -23288599, -14266934, -7779626, -7288304, -4741091, 4328015, 11517218, 7644600, -2555013, -6919001, -3907641, -3637170, -10248870, -14324898, -8044282, 1690325, 4226884, 2464858, 7239211, 17049180, 16910443, 327222, -19326322, -25903901, -20056197, -13410360, -10090660, -4875521, 3107275, 6399564, 913121, -7228969, -10611923, -9920709, -9481272, -8182515, -1451599, 9178319, 15082071, 11369910, 4611168, 5784208, 16700835, 27403897, 27975157, 19483672, 10753461, 7150071, 6698641, 5781332, 3510462, 161935, -3822779, -6211180, -5109272, -3785449, -7609763, -14220838, -13643066, -2106079, 11303402]
37568A1303402O022271J175958K169169o95691r909058j2530211j622247Q905916
37560D819509M376635p622731j0171566l636003j028172k983434J752901J2093238
37552b399623J2386425j193854j1434535n624459N975391P832909J710056j087830
37544F164480M84953p49545m848584n125251q24122K275576K360817K571905K632066
37535D942295q67049o079188o912271l059464o57678j844950j867462J432389
37527a4913378L337343R27962j185382J329322M762155L353466q70158r36344
37519d195014L879455O335128K037053l365187j774884N137028O832477j629527
37511A3256529j0954316q515583M258027J2428661O837571m179015o695773J033516
$$ y = [11303402, 17325673, 18501631, 20670800, 19975109, 10066051, -2464160, -4086407, 4819509, 9196144, 1573413, -8598153, -12234156, -13262328, -16245762, -14492861, -2399623, 9986802, 8792948, -2641587, -8266046, -2290655, 5542254, 7252310, 6164480, 6649433, 5899888, 1051304, -4073947, -4898069, -2622493, -261676, 2310229, 4942295, 4075246, -2003942, -8916213, -11975677, -12633355, -14478305, -16345767, -14913378, -11576035, -10648073, -11833455, -10504133, -5741978, -2388512, -3258670, -4195014, -315559, 6019569, 8056622, 4691435, 2916551, 8053579, 14886056, 13256529, 2302213, -6213370, -1955343, 10473318, 17310889, 13131874, 6436101, 7469617]
37503G469617R106996J0030015M585991l631494j0872207j1383950k318913Q385853
37495A1371908Q392680j918538p984459j358751P729774N446291n754017j1869763
37487D055125o995664J897490P070928P002420K562146m043805o680238j330784
37479C537618M746248L93216j1174906j3438695o40537J1599661Q404053k728424
37471F98234n008878J170634J125150p816160j0716347O98103J3781276J3346033
37463G278045K708687m233093l811127l178738m409636j385350O624918J0152712
37455I746418L381749n562677n358291K273512N116214j940837r686424p522250
37447i552586K289202Q494768N856821k08442l653551n192533o688844m999326
$$ y = [7469617, 16576613, 26606628, 31192619, 27561125, 16688918, 5304968, 2986055, 11371908, 19764588, 17846050, 9861591, 8502840, 16232614, 21678905, 15924888, 4055125, -2940539, -1043049, 6027879, 13030299, 15592445, 11548640, 4868402, 3537618, 8283866, 8677082, -2497824, -15936519, -16577056, -4977395, 3426658, 698234, -4310644, -3140010, -2014860, -9831020, -20547367, -19849264, -6067988, 7278045, 9986732, 5753639, 1942512, -1236226, -5645862, -7031212, -406294, 9746418, 13128167, 7565490, 2207199, 4480711, 9596925, 7656088, -2030336, -9552586, -7263384, 1231384, 7088205, 6879763, 3226212, -1966321, -8655165, -13654491]
37439a3654491K011396P773446M058229n595678q633128q12221Q157340R318876
37431B623769N810945M123474K510094l490270j0010228r294843k383593J929575
37423h181077j37845l716277l959601q79783M125584R156040R572364K756079
37415H735484m931050m435182K281052M161248k021188p168373n263080j889745
37407a0530834j876318J40898Q211794J4032398Q414146l393233r386174q269412
37399b656735p143997o215695L53259R926008J1951477M671096j448256j10355
37391I326802K650891Q79645j909344j472344q68246k833693l011555J467015
37383D229171M437670K36379n836071n570835q46180P88101r89172m17294L691950
$$ y = [-13654491, -11643095, -3869649, 188580, -5407098, -14040226, -14852447, -6695107, 2623769, 8434714, 12558188, 15068282, 11578012, 1567784, -7727059, -10110652, -8181077, -8318922, -12035199, -15994800, -16874583, -12748999, -3592959, 5979405, 8735484, 3804434, -630748, 1650304, 5811552, 3790364, -3378009, -8641089, -10530834, -12407152, -12266254, -4054460, 9977938, 18392084, 14998851, 5612677, -2656735, -9800732, -16016427, -15663168, -5737160, 6214317, 10885413, 9437157, 9326802, 11977693, 12857338, 10947994, 9475650, 8607404, 5773711, 2762156, 4229171, 8666841, 8903220, 3067149, -2503686, -3349866, -2561765, -3550937, -3968231, -276281]
37374b76281P678745J0180044J0604126N247166l695870o86575K4770282N3316423
37366A07138060M9358621O280914l9158247m8820015k6225148m625524l238843
37359D0709818j1957755j4091324p073988Q99052K881361j258018m871808n98724
37351D638614Q430287Q193784p025853k1089863j4592142O829304J8678322J1637688
37343A5700141J622946J879725L620164n256704j7470171j7119966l880274Q189860
37335a2714279J0897263P893606L502583k008860o541269o126619j881941Q52290
37327f127226Q40932J620531L877993L984062P60385k260463k339221o57274O35222
37318C34941R22579R00697K467464P006511J1216882Q353743k439147j2315668
$$ y = [-276281, 7402464, 17582508, 28186634, 33433800, 29737930, 29051355, 53821637, 107138060, 156496681, 162777595, 123619348, 74799333, 48574185, 43948661, 40709818, 28752063, 14660739, 7586751, 8485803, 11367164, 10109146, 5237338, 4638614, 13068901, 21262685, 14236832, -6853031, -21445173, -14615869, 4062453, 15700141, 17323087, 19202812, 22822976, 17566272, 96101, -17023865, -20904139, -12714279, -1817016, 6076590, 9579173, 7570313, 1029044, -5097575, -6979516, -6127226, -5286294, -3665763, 212230, 4196292, 4956677, 2696214, 356993, -300281, 334941, 1257520, 2158217, 4625681, 11632192, 22849074, 31202817, 28763670, 16448002]
37310A6448002j3219632p659125k466835J512468O008911P493118K664113k805182
37302G975838k124667k50020o163561j4728155j1151464N436240J7760114J3875874
37294A0630199J610971o037389p591614p684380n649568R86160Q593157J1589673
37286F447209R967293O491632J134348o058903j0979230r748652l930186J920779
37278d755710M572793K579399k535192m725815M46205P648830P823275K474430
37270A3528215J075812L233010k148883j5192293j8766621m052340J2136466R976039
37262b10595m359648q922011J711745J1789665R526343N81667m902499n211229
37254C438l368915n11973K690613M096749K590859p70596m403709o416939n048027
$$ y = [16448002, 3228370, -4430755, -6897590, -5385122, 623789, 8116907, 10781020, 7975838, 5851171, 5601151, -562410, -15290565, -26442029, -21005789, -3245675, 10630199, 12241170, 6203781, -1387833, -9072213, -14721781, -13735621, -5142464, 6447209, 16414502, 22906134, 24040482, 17981579, 7002349, -2746303, -6676489, -4755710, -182917, 2396482, -138710, -4864525, -4418320, 3230510, 11053785, 13528215, 14604027, 17837037, 15688154, 495861, -18270760, -22323100, -10186634, -210595, -4570243, -13492254, -11780509, 9156, 9535499, 10117166, 5214667, 3438, -3365477, -3877450, -1186837, 2909912, 5500771, 4730175, 326466, -6090473, -11138500]
37245a1138500j600119J68379l813J660794N235063N847324L311319L715930O789584
37236A3985961L387633o902771r095383M344459J6859246R963429q505117j6710991
37228G326466j1135818o094708o546688l660253M157937P773938O115430P900713
37220E837017J2330919Q472733k652598o251322O90313L098879n549998j1459340
37212D516603n531474M01353m321836r562387k879125Q090117R257629L536538
37204C507418K805780O202881M108497l200414p178203n891846k830374L512208
37196A035947J4544127K1576631J5916431M747769K044481O822520N449976o075003
37188F6062879j6843856j8169700j2992577p335004l642087l231581n447693m782303
$$ y = [-11138500, -12738619, -12570240, -12574053, -10913259, -5678196, 169128, 3480447, 7196377, 13985961, 17373594, 10470823, 1375440, 5719899, 22579145, 32542574, 24037457, 7326466, -3809352, -9904060, -16450748, -20111001, -15953064, -8179126, -2063696, 5837017, 18167936, 26640669, 23988071, 17736749, 18427062, 21525941, 15975943, 4516603, -1014871, -613518, -4935354, -14497741, -17376866, -9286749, -29120, 3507418, 6313198, 12516079, 16624576, 13424162, 6245959, 354113, -2476261, 1035947, 15580074, 37156705, 53073136, 57820905, 59865386, 66687906, 72137882, 66062879, 49219023, 31049323, 18056746, 10721742, 7079655, 3848074, -1599619, -6381922]
37180f381922J875369P251468L220403m778397n031428J519368L665502k56250
37172A084113m85043N526445Q543300M456924K06527j349490o628414j5238903
37164c884541j4689741m86919J2646477J0949985J096827k655008j77751o20972
37156B178357m316537m591905k280478l446177n529838l66230R620002J2239589
37148C506783M239118l507327k906217O65838k79874l083354j128846M314273
37140A820394N804024J46769q082023j1725746p249427J727768O071067N47413
37132a0939761p522572n336434P450231J5812830R400081k729185n787621p04021
37124c56452N868n886759o958734J798329R392824N598970l637885o291020j680404
$$ y = [-6381922, -4506553, 2744915, 5965318, 1186921, -3844507, -2325139, 1340363, 1084113, 599070, 6125515, 14668815, 19125739, 19332266, 17982776, 11354362, -3884541, -18574282, -19061201, -6414724, 4535261, 5632088, 2977080, 2799329, 2178357, -2138180, -6730085, -9010563, -12456740, -17986578, -18352808, -8732806, 3506783, 7745901, 4238574, 1332357, 1998195, 1718321, -1365033, -2493879, 1820394, 7624418, 7771187, -310836, -12036582, -19286009, -17558241, -11487174, -10939761, -18462333, -23798767, -16348536, -535706, 8864375, 6135190, 347569, -356452, -350584, -6237343, -13196077, -11397748, -2004924, 3594046, -43839, -6334859, -8015263]
37115h015263K182050L014121M912075P394568N201217q78496l537112j238859
37107I034301j014401n377562o316005J198006Q170010L548677p921225j0849165
37099i527364j158884P881695M449892o017150r790944l564053L706037N092985
37091h927786L339171L131962L418216J623750m8798J561210L957240K711073
37083A0766038m70414p24386L97603k567292o666758j955138J0882986J6240397
37075B5903036N207321q976723q992036J051058L128586o111151j1492345m773106
37067e055360L053364Q72371n220071l082106O542661J2292539Q110757j213268
37059A6300887p363697n802763J481214O884288M091950l807327p600143m481975
$$ y = [-8015263, -5833213, -2819092, 2092983, 9487551, 14688768, 13810272, 10273160, 9034301, 8019900, 2642338, -3673667, -2475661, 5694349, 9243026, 1321801, -9527364, -10686248, -2804553, 1645339, -4371811, -14162755, -17726808, -14020771, -8927786, -5588615, -2456653, 961563, 2585313, 2536515, 4097725, 8054965, 10766038, 10295624, 9571238, 9968841, 7401549, 734791, -1220347, 9662639, 25903036, 31110357, 22133634, 13141598, 14192656, 17321242, 11210091, -282254, -5055360, -2001996, -1129625, -6349696, -9431802, -2889141, 9403398, 17514155, 16300887, 8937190, 3134427, 4615641, 11499929, 15591879, 11784552, 4184409, -297566]
37051b97566p75362p18143j173854m71602k503732o785693m847080N674439J2997095
37042A098502P188302l880933n833522J417653O431595N060456L261191L314146
37034A8057390N95161n131654p031766k547813K035559J491625j655422l295620
37026B517460l674211l841048k028310K440917N644292L587487j289804j316670
37018B040113P515549J8363742J8007870J866927j7458964k2637856j1767470
37011d070089J625237P990099R741462Q512276j03652j2421306j3620559m68649
37003b815181Q384409J98857q911504P25575J7348813J4430236n616749j4420085
36995I324371l161521N732437k329389j2951273j1362628n121886l660149L23808
$$ y = [-297566, -1072928, -1791071, -2964925, -3436527, -5940259, -12725952, -17573032, -11898593, 1098502, 8286804, 4405871, -1427651, -9998, 6421597, 11482053, 14743244, 18057390, 18652551, 13520897, 6489131, 3941318, 5976877, 7468502, 5813080, 2517460, -1156751, -4997799, -7026109, -4585192, 1059100, 4646587, 3356783, 2040113, 9555662, 27919404, 45927274, 47794201, 30335237, 7697381, -4070089, -2444852, 5545247, 15286709, 23798985, 23695333, 11274027, -2346532, -2815181, 5569228, 5768085, -3143419, -2417844, 14930969, 29361205, 23744456, 9324371, 6162850, 11895287, 9565898, -3385375, -14748003, -19869889, -23530038, -23206230]
36987b3206230J1139141J3854229q25585j4049814n485218J2048299J1129292
36980D604114o934967j5423205m723032O379495L811196k900830j681901L526970
36972a3342160M941685M824737O816060O683373J743972j571872R01852K202180
36964A3199827l391708q512446m631375J999705j79886p464204n092857P962892
36956f110052J3846881J456266j5160206j4906646R66901J0986938L950423o572733
36948a1542228l849424P402921R605436m14652p295342j145846Q112181O902055
36940G775101k057899n800847o93704M944566N087848K239789p49918n221947
36932E522989j0108004r057097M61208J0508778J1225410L381989l232443k801073
$$ y = [-23206230, -12067089, 1787140, 961555, -13088259, -18573477, -6525178, 4604114, -2330853, -17754058, -22477090, -16097595, -12286399, -15187229, -16869130, -13342160, -8400475, -3575738, 3240322, 9923695, 11667667, 10095795, 10997647, 13199827, 9808119, 1295673, -3335702, -1335997, -1515883, -8980087, -14072944, -6110052, 7736829, 9193095, -5967111, -20873757, -19906856, -8919918, -4969495, -11542228, -15391652, -7988731, 1616705, 1202053, -6093289, -7239135, 873046, 7775101, 5717202, -83645, -777349, 4167217, 9255065, 11494854, 10744936, 5522989, -4585015, -13642112, -13180904, -2672126, 8553284, 11935273, 8702830, 5901757]
36924E901757R18270K559740K538877K943054J294353m978363j0646981p856499
36916g325792P30193L675701j489974l180330N070806J1854554N739742m288040
36908A0786860k553534O081755L120211j1473690j6952854n477030N020231J213171
36900a0234880m343638K686640J2216183P386036n854041q876080p76797L641407
36892d155170P25289O04293M975245L718188m676805q426529j971042N817533
36884c388998O565789J565798o089611j4360237j5959217m691626J0142159J2136835
36876a4079108K702541o31578O099444O767191m617685j0316053J286347J3553650
36868G64749P602329p048314r363846j115387k50647p782587o550089P881548
$$ y = [5901757, 6820027, 9379767, 11918644, 14861698, 16156051, 11177688, 530707, -7325792, -6595599, -2919898, -4409872, -7590202, -2519396, 9335158, 15074900, 10786860, 8233326, 14315081, 17435292, 5961602, -10991252, -16468282, -11448051, -10234880, -14578518, -11891878, 324305, 7710341, 1856300, -7019780, -7796577, -4155170, -3429881, -2825588, 2149657, 5867845, 1191040, -7235489, -9206531, -3388998, 3176791, 4742589, -1347022, -15707259, -31666476, -36358102, -26215943, -14079108, -11376567, -12008145, -5908701, 858490, -3759195, -14075248, -12788901, 764749, 8367078, 1318764, -8045082, -9160469, -9411116, -17193703, -23743792, -15862244]
36860a5862244J8027452J0979628l529264q573230j271621P981608R368561K022822
36852A9143712o302564o501221R06517M573735k182383r957193o685747L024913
36844c980231N222632j98093J51377R172662J2984157L924125n907554l468741
36836A7900334N088341M673470o195056j4808188j2592965m179096J104399j57290
36828i166051l900191l860186J701277P302926N965854j855938q164318o886733
36820a8863360J19951O883253Q866722M581158l127176o900532j639687P882979
36812b196692J2053892R146535N817139M771667J293838n877137j0296845q568144
36804F144253n832599n558691l440969K505494N664016K282481m25358L048109
$$ y = [-15862244, 2165208, 13144836, 9615572, 1042342, -229279, 7752329, 17120890, 19143712, 12841148, 6339927, 7246444, 11820179, 9637796, -319397, -7005144, -3980231, 1242401, 1044308, 1195685, 10368347, 23352504, 27276629, 21369075, 17900334, 22988675, 27662145, 21467089, 6658901, -5934064, -10113160, -9008761, -9166051, -13066242, -16926428, -15225151, -7922225, -1956371, -3812309, -11976627, -18863360, -18743409, -11860156, -2993434, 1587724, -1539452, -8439984, -10079671, -2196692, 9857200, 19003735, 24820874, 29592541, 30886379, 25009242, 14712397, 6144253, 311654, -5247037, -8688006, -6182512, -518496, 1763985, 1338627, 4386736]
36796D386736M921777l341846j4551492j4872220m153343N895240R824916J1213098
36788f77134J0212455L055209o261603q009426k049853J937915J381069M116331
36780C704963J1308263J1880340J191330q091726m172103N160780M249940o709194
36772A8522593j2704283o176827L781536N879355Q39860k922270j960861n86990
36764D672113k492409m620076k158436K752997K823396k680108m637886K467222
36756c873187J0015148O764837l515128p090547r17939M548189L684472K721992
36748A2337837M848723K887281n851873j0782020m256344M630591M024240k413154
36740E425281l827941n76677l12167k084757N95529N120333L652391r77967Q96129
$$ y = [4386736, 9308513, 5966667, -8584825, -23457045, -27610388, -21715148, -11890232, -677134, 9535321, 12590530, 6328927, -1680499, -3730352, -1792437, -411368, 3704963, 15013226, 26893566, 28084896, 19993170, 15821067, 20981847, 25231787, 18522593, 5818310, -358517, 3423019, 9302374, 10142234, 7219964, 5259103, 4672113, 2179704, -2440372, -4598808, -1845811, 977585, -1702523, -6340409, -3873187, 6141961, 12906798, 9391670, 2301123, 1383184, 5931373, 9615845, 12337837, 17186560, 20073841, 14221968, 3439948, -816396, 3814195, 7838435, 5425281, 1597340, 1020663, 708496, -1376261, -780732, 4339601, 7991992, 7014025, 7910154]
36731G910154P118659N622393l786801o945595J049007O784925P23618p148894
36723A1327466m458820L904017N966503K271144J452255L623884K603111K2123
36715B6711683K575840P188752L513632p831851j3410580p240893m87982m098649
36707F919952j1826045r998649K005719J1354262R674438K064618k653993k908855
36699D631447k296075k078448p37456J493244K444663J947094K028579K667261
36691A0100309R50207l968450q194770p880665m321276j316905N64188L346661
36683a0720701O571488P314118N059517J987094j837672q019564j3125545r276098
36675b2047363L819180J3399603Q180669m752920p314078M750119J4656726P300306
$$ y = [7910154, 15028813, 20651206, 16864405, 9918810, 10967817, 17752742, 18476360, 11327466, 6868646, 10772663, 16739166, 19010310, 20462565, 24086449, 26689560, 26711683, 29287523, 36476275, 39989907, 32158056, 18747476, 11506583, 11018601, 6919952, -4906093, -14904742, -12899023, -1544761, 8129677, 10194295, 7540302, 4631447, 2335372, 256924, -480532, 1012712, 3457375, 5404469, 7433048, 10100309, 11050516, 7082066, -1112704, -8993369, -13314645, -14631550, -14067362, -10720701, -4149213, 3164905, 8224422, 10211516, 8373844, 354280, -12771265, -22047363, -18228183, -4828580, 3352089, -1400831, -8714909, -3964790, 10691936, 17992242]
36667A7992242r484468j5646234o164024M088966L056106k840885j615359N090565
36659e523091O037415p06852m583768P85181P986295P479980J213996k208268
36651A0480888j188453j906175o680413r396801n097543J289226Q50965o224747
36643a7873053q955413K44608J3162469J3853427k33891j2610212q458940N427175
36635a5443830J0698283L459544k529978J045146N340790J533921l814691j080287
36627g91102N156087M339206j517101j931900L178505L619701k796420o644379
36619B612597l674710j628341n612624q522908k830898P079241J1555134Q316388
$$ y = [17992242, 8507774, -7138460, -13302484, -9213518, -6157412, -8998297, -10613656, -5523091, 514324, -192528, -4776296, -3991115, 3995180, 11475160, 12689156, 10480888, 9292435, 7386260, 705847, -8690954, -13788497, -12499271, -11648306, -17873053, -26828466, -26583858, -13421389, 432038, 198147, -12412065, -20871005, -15443830, -4745547, -1286003, -3815981, -2770835, 2569955, 4103876, 289185, -791102, 4364985, 8704191, 7187090, 5255190, 8433695, 12053396, 9256976, 2612597, -1062113, -2690454, -8303078, -16825986, -19656884, -12577643, -1022509, 7293879]
$$ [...]
##END NTUPLES=NMR SPECTRUM
##END=
