##TITLE=31Pdec_SR164_k
 DMSO-d6, 128 sc
 9.2.2023
##JCAMPDX= 6.0         $$ Bruker NMR JCAMP-DX V2.0
##DATA TYPE= NMR SPECTRUM
##DATA CLASS= NTUPLES
##ORIGIN= UXNMR, Bruker Analytische Messtechnik GmbH
##OWNER= root
$$ XWIN-NMR		Version 3.5
$$ Thu Feb  9 15:58:42 2023 Russian Standard Time (UT+4h)  she@DPX200
##.OBSERVE FREQUENCY= 81.013821
##.OBSERVE NUCLEUS= ^31P
##.ACQUISITION MODE= SIMULTANEOUS
##.ACQUISITION SCHEME= undefined
##.AVERAGES= 128
##.DIGITISER RES= 16
##SPECTROMETER/DATA SYSTEM= spect
##.PULSE SEQUENCE= zgpg30
##.SOLVENT NAME= CDCl3
##.SHIFT REFERENCE= (INTERNAL, CDCl3, 0, 248.564)
##AUDIT TRAIL= $$ (NUMBER, WHEN, WHO, WHERE, WHAT)
$$ ##TITLE= Audit trail, XWIN-NMR		Version 3.5
$$ ##JCAMPDX= 5.01
$$ ##ORIGIN= Bruker BioSpin GmbH
$$ ##OWNER= she
$$ F:/spectra/data/she/nmr/P31/1/pdata/1/auditp.txt
$$ ##AUDIT TRAIL=  $$ (NUMBER, WHEN, WHO, WHERE, WHAT)
(   1,<2023-02-09 15:57:34.03 +0400>,<she>,<DPX200>,
      <continue with go, POWCHK disabled, PULCHK disabled
       configuration hash MD5:
       00 E9 B6 7A A2 85 ED C7 34 08 36 98 17 FE 4E 26
       data hash MD5: 32K
       8E D7 C0 4B 0F BD 1A EA 98 08 6D 4D BA 04 74 AC>)
(   2,<2023-02-09 15:57:37.62 +0400>,<she>,<DPX200>,
      <Start of raw data processing
       efp BC_mod = 2 LB = 1 FT_mod = 6 PKNL = 1 PHC0 = -11137.05 PHC1 = 478.4113 SI = 64K 
       data hash MD5: 64K
       A2 EF 67 BB B0 CE B5 EB 2E 15 09 E1 52 C6 EA 2A>)
(   3,<2023-02-09 15:58:06.70 +0400>,<she>,<DPX200>,
      <pk PHC0 = 992.1898 PHC1 = -2521 
       data hash MD5: 64K
       9C 3A A9 03 60 4F C5 65 A3 40 2F AB 23 7D 51 4E>)
(   4,<2023-02-09 15:58:10.90 +0400>,<she>,<DPX200>,
      <abs ABSG = 5 
       data hash MD5: 64K
       33 9C 06 30 9E DC 82 9E BB BD 74 A1 4E 98 D6 9D>)
$$ ##END=
$$ 
$$ hash MD5
$$ 1D 2E CA EC AD 8F 83 A7 7E C3 66 96 80 D7 8C AB
##$RELAX= 
##$RELAX= 
##$RELAX= 
##$RELAX= 
##$RELAX= 
##$RELAX= 
##$RELAX= 
##$RELAX= 
##$RELAX= 
$$ Bruker specific parameters
$$ --------------------------
##$DU= <F:/spectra>
##$EXPNO= 1
##$NAME= <P31>
##$PROCNO= 1
##$TYPE= <nmr>
##$USER= <she>
##$AMP= (0..31)
100 100 100 100 100 100 100 100 100 100 100 100 100 100 100 100 100 100 
100 100 100 100 100 100 100 100 100 100 100 100 100 100 
##$AQSEQ= 0
##$AQ_mod= 1
##$AUNM= <au_zg>
##$AUTOPOS= <>
##$BF1= 81.014009
##$BF2= 200.13
##$BF3= 200.13
##$BF4= 200.13
##$BF5= 200.13
##$BF6= 200.13
##$BF7= 200.13
##$BF8= 200.13
##$BYTORDA= 1
##$CFDGTYP= 0
##$CFRGTYP= 5
##$CHEMSTR= <none>
##$CNST= (0..31)
1 1 145 1 1 1 1 1 1 1 1 1 1 1 1 1 1 1 1 1 1 1 1 1 1 1 1 1 1 1 1 1 
##$CPDPRG= <waltz16>
##$CPDPRG1= <>
##$CPDPRG2= <waltz16>
##$CPDPRG3= <>
##$CPDPRG4= <mlev>
##$CPDPRG5= <mlev>
##$CPDPRG6= <mlev>
##$CPDPRG7= <mlev>
##$CPDPRG8= <mlev>
##$CPDPRGB= <>
##$CPDPRGT= <>
##$D= (0..31)
0 1 0 0 0 0 0 0 0 0 0 0.03 2e-05 3e-06 0 0 0 0 0 0 0 0 0 0 0 0 0 0 0 0 
0 0 
##$DATE= 1675943669
##$DBL= (0..7)
120 120 120 11 120 120 24 19 
##$DBP= (0..7)
150 150 150 150 150 150 150 150 
##$DBP07= 0
##$DBPNAM0= <>
##$DBPNAM1= <>
$$ [...]
##$SUBNAM3= <"">
##$SUBNAM4= <"">
##$SUBNAM5= <"">
##$SUBNAM6= <"">
##$SUBNAM7= <"">
##$SUBNAM8= <"">
##$SUBNAM9= <"">
##$SW= 501.771253377433
##$SWIBOX= (0..15)
0 1 3 0 0 0 0 0 0 0 0 0 0 0 0 0 
##$SW_h= 40650.406504065
##$TD= 32768
##$TD0= 1
##$TE= 0
##$TE2= 300
##$TE3= 300
##$TEG= 300
##$TL= (0..7)
0 120 53 12 22 120 120 120 
##$TP= (0..7)
150 150 150 150 150 150 150 150 
##$TP07= 0
##$TPNAME0= <>
##$TPNAME1= <>
##$TPNAME2= <>
##$TPNAME3= <>
##$TPNAME4= <>
##$TPNAME5= <>
##$TPNAME6= <>
##$TPNAME7= <>
##$TPOAL= (0..7)
0.5 0.5 0.5 0.5 0.5 0.5 0.5 0.5 
##$TPOFFS= (0..7)
0 0 0 0 0 0 0 0 
##$TUNHIN= 0
##$TUNHOUT= 0
##$TUNXOUT= 0
##$USERA1= <user>
##$USERA2= <user>
##$USERA3= <user>
##$USERA4= <user>
##$USERA5= <user>
##$V9= 5
##$VALIST= <valist>
##$VCLIST= <CCCCCCCCCCCCCCC>
##$VD= 0
##$VDLIST= <DDDDDDDDDDDDDDD>
##$VPLIST= <PPPPPPPPPPPPPPP>
##$VTLIST= <TTTTTTTTTTTTTTT>
##$WBST= 1024
##$WBSW= 4
##$XGAIN= (0..3)
0 0 0 0 
##$XL= 0
##$YL= 0
##$YMAX_a= 10133
##$YMIN_a= -4289
##$ZGOPTNS= <>
##$ZL1= 120
##$ZL2= 120
##$ZL3= 120
##$ZL4= 120
##$ABSF1= 248.5645
##$ABSF2= -253.2056
##$ABSG= 5
##$ABSL= 3
##$ALPHA= 0
##$AQORDER= 0
##$ASSFAC= 0
##$ASSFACI= 0
##$ASSFACX= 0
##$ASSWID= 0
##$AUNMP= <proc_1d>
##$AZFE= 0.1
##$AZFW= 0.5
##$BCFW= 0
##$BC_mod= 2
##$BYTORDP= 0
##$COROFFS= 0
##$CY= -3
##$DATMOD= 1
##$DC= 0
##$DFILT= <>
##$DTYPP= 0
##$F1P= 0
##$F2P= 0
##$FCOR= 1
##$FTSIZE= 65536
##$FT_mod= 6
##$GAMMA= 0
##$GB= 0
##$INTBC= 1
##$INTSCL= 6.047779e-11
##$ISEN= 30
##$LB= 1
##$LEV0= 0
##$LPBIN= 0
##$MAXI= 10000
##$MC2= 0
##$MEAN= 0
##$ME_mod= 0
##$MI= 50
##$NCOEF= 0
##$NC_proc= -8
##$NLEV= 6
##$NOISF1= 182.463
##$NOISF2= 159.3651
##$NSP= 0
##$NTH_PI= 0
##$NZP= 0
##$OFFSET= 248.5645
##$PC= 4
##$PHC0= -10144.86
##$PHC1= -2042.589
##$PH_mod= 1
##$PKNL= yes
##$PPARMOD= 0
##$PSCAL= 0
##$PSIGN= 0
##$REVERSE= no
##$SF= 81.0140089999694
##$SI= 65536
##$SIGF1= 159.3651
##$SIGF2= -187.1042
##$SINO= 113.3802
##$SIOLD= 16384
##$SREGLST= <1H.CDCl3>
##$SSB= 0
##$STSI= 65536
##$STSR= 0
##$SW_p= 40650.406504065
##$SYMM= 0
##$S_DEV= 0
##$TDeff= 32768
##$TDoff= 0
##$TI= <>
##$TILT= no
##$TM1= 0
##$TM2= 0
##$TOPLEV= 0
##$USERP1= <user>
##$USERP2= <user>
##$USERP3= <user>
##$USERP4= <user>
##$USERP5= <user>
##$WDW= 1
##$XDIM= 65536
##$YMAX_p= 238870731
##$YMIN_p= -277464707
$$ End of Bruker specific parameters
$$ ---------------------------------
##NTUPLES= NMR SPECTRUM
##VAR_NAME=  FREQUENCY,     SPECTRUM/REAL,   SPECTRUM/IMAG
##SYMBOL=    X,             R,               I
##VAR_TYPE=  INDEPENDENT,   DEPENDENT,       DEPENDENT
##VAR_FORM=  AFFN,          ASDF,            ASDF
##VAR_DIM=   65536,         65536,           65536
##UNITS=     HZ,            ARBITRARY UNITS, ARBITRARY UNITS
##FACTOR=    0.620285442955139, 1,           1
##FIRST=     20137.2065510682, 0,            0
##LAST=      -20513.1999529968, 0,           0
##MIN=       -20513.1999529968, -277464707,  0
##MAX=       20137.2065510682, 238870731,    0
$$ Real data points
##PAGE= N=1
##DATA TABLE= (X++(R..R)), XYDATA
$$ [...]
44244 -12665357 -8513285 -9313273 -6917491 708240 5162075 3032359 1046684 2687642
44236 2687642 2953260 418909 2064755 10747117 18375211 17120368 8885518 -608061
44228 -608061 -8716870 -13087514 -10698233 -4139526 -1295818 -4884830 -9096295 -9032603 -5928996
44219 -5928996 -1245508 5634084 11694770 11605951 7017501 4823599 4368709 -2070067 -13401712
44210 -13401712 -17681419 -10794929 -3404783 -2566229 -730129 7692840 13046667 6347052
44202 6347052 -3540803 -3346581 3211497 3029074 -4045891 -6445342 -801134 4379796
44194 4379796 3695208 561632 -1514207 -2108422 846075 8274694 13409457 8537893
44186 8537893 -2567350 -9325730 -10234041 -12675463 -17279396 -15231817 -3773730 7076045
44178 7076045 7864245 1013735 -5464957 -8153948 -8075335 -6635648 -5588833 -6414286 -7357046
44169 -7357046 -5327995 -1677061 -1170144 -4684216 -8045122 -8211617 -5427227 -285103
44161 -285103 5050643 4557132 -4360455 -12672303 -9061211 2578969 6679034 -1300133
44153 -1300133 -8921064 -7957711 -7073603 -14080121 -18566455 -6697431 14280154 22354649
44145 22354649 9908541 -7309667 -12040130 -4958942 1446209 -487069 -8456077 -16188592
44137 -16188592 -19346502 -17699258 -14483932 -12776752 -12341585 -12027048 -13879881 -20358733
44129 -20358733 -27714480 -27894018 -18941572 -8557495 -4567197 -6167310 -7786860 -7333715
44121 -7333715 -6204899 -4467915 -1257893 1907502 2990275 3003923 3062347 171036 -7522962
44112 -7522962 -12778784 -5421383 11724426 21827481 13927933 -2901922 -11317101 -6303806
44104 -6303806 2816994 6885161 5525292 3078832 3137800 6884327 11482517 11045449 4111890
44095 4111890 -1948870 146655 6824220 9065379 6267393 5641350 8672048 8408674
44087 8408674 1655597 -5874438 -9201579 -9783240 -8588349 -2752692 6766877 12995370
44079 12995370 13012648 11923337 12509498 10323844 4447306 2910479 9874255 16853900
44071 16853900 15314248 9068463 4826652 -95980 -8957209 -13360037 -4506346 9201115
44063 9201115 11300539 798357 -8540469 -10322934 -10941125 -12911810 -9856312 -1911742
44055 -1911742 -326112 -9607310 -18082108 -14777287 -5310637 -1766119 -4875792 -6062619
44047 -6062619 -1911103 2744189 3641838 1403204 -2149340 -6316217 -9742501 -9525947
44039 -9525947 -3074535 8943948 20615429 23896045 17479392 10534235 11933558 17393880
44031 17393880 15008130 3252811 -5855306 -3851835 3019344 4110581 -1775610 -7946967
44023 -7946967 -9230826 -5356207 -235500 -770026 -9665379 -17049448 -8851327 11831540
44015 11831540 23074970 12210907 -5486717 -8302052 1337887 3952144 -5395823 -12173117
44007 -12173117 -9061134 -7539117 -16197112 -24573384 -19943546 -7751638 -2032957 -4110759
43999 -4110759 -5196047 -4740731 -10185320 -19226935 -18577861 -5050097 5949033 1547121
43991 1547121 -9451614 -9716686 1218371 7885079 2824143 -4056011 -2701016 2295951
43983 2295951 657177 -7949527 -15208290 -16454011 -14273659 -12510734 -13194324 -17413297
43975 -17413297 -22807611 -21672321 -8705229 9124298 17309127 10417947 -1334878 -4429378
43967 -4429378 3490125 13800556 17313515 11432745 300104 -8501038 -9156941 -2722254
43959 -2722254 3471144 3115275 -3114042 -9625870 -12256718 -11384609 -10326750 -11964179
43951 -11964179 -15788874 -17557732 -13447415 -5289441 188096 -1679007 -8995020 -16345430
43943 -16345430 -19870597 -18392555 -12933374 -7671008 -8213827 -14691614 -18272848 -9691115
43935 -9691115 8385134 22182894 21778093 11236370 1280018 -3987724 -8122711 -12759866
43927 -12759866 -14192123 -10896439 -8251348 -11505299 -17645077 -19132135 -14268968 -9451493
43919 -9451493 -11091524 -18455513 -24996288 -25052012 -19361930 -14590219 -15729119 -18821336
43911 -18821336 -15564385 -6711988 -3932200 -12890874 -21624988 -15368601 1844205 12284921
43903 12284921 8947589 1629686 -1255539 -1857643 -480923 9949607 28435137 38498288
43895 38498288 28043264 7015598 -6363129 -8655243 -8290344 -7357598 -1193858 7902258
43887 7902258 11533992 9262978 8861711 11725373 9746392 -1039889 -13570406 -19329571
43879 -19329571 -17127441 -10495982 -3322195 692497 763985 1766291 7848579 13891098
43871 13891098 11145785 1445681 -2983768 4197603 15219654 19082083 14116288 6641233
43863 6641233 2395730 2395960 3808242 2960253 -517438 -3056586 -2948826 -4117949 -10026052
43854 -10026052 -16831257 -17922620 -12827390 -6713315 -4221158 -8363911 -20202517 -33365441
43846 -33365441 -35364519 -22751153 -8486537 -4684637 -5644780 -227711 7151719 4421002
43838 4421002 -5264610 -7961313 -3652528 -5864189 -16004950 -19197605 -9528998 794584
43830 794584 3179490 3707565 5367101 -328637 -13695220 -18389060 -5981309 7866755
43822 7866755 6436774 -3698907 -6677739 -2161308 388961 633618 3098009 3144634
43814 3144634 -5414587 -15553987 -16136224 -9916477 -7164825 -7297161 -2819739 3442030
43806 3442030 1737945 -6886106 -11957520 -10819327 -9878157 -10408926 -7812766 -4069047
43798 -4069047 -6365783 -13189530 -15533027 -12397029 -11578740 -14196397 -12245829 -3833433
43790 -3833433 2333986 1263052 -1194726 479813 3463373 3721368 2109237 -16594
43782 -16594 -2901674 -3415471 3622019 16210469 24639688 22324043 10783450 -5652924
43774 -5652924 -21566187 -28055219 -20121614 -7333433 -4888519 -11738913 -10763174 4961674
43766 4961674 20051563 18821705 6854707 -252025 7990 -2089948 -10393916 -18519939
43758 -18519939 -21784817 -22535148 -22866640 -20589285 -14628721 -8494028 -5711971 -5255556
43750 -5255556 -3630936 206851 3464187 2799011 -1441474 -5208138 -5850088 -5651375 -8066186
43741 -8066186 -12299346 -15221009 -16830618 -18751842 -18611593 -12479247 -3014468 1919468
43733 1919468 220443 -1879588 -307720 1207842 -758270 -3165788 -3085567 -3148485 -4664219
43724 -4664219 -2627287 4679302 7691727 -2662770 -19342872 -26469692 -20362054 -11701929
43716 -11701929 -6767319 205308 11769087 17496430 9056057 -4007773 -5761193 3441699
43708 3441699 8493593 2693779 -3872637 -2527383 -348773 -7904278 -20455894 -21979550
43700 -21979550 -5729550 17399636 30856491 27206910 12009535 -1479777 -2306836
43693 -2306836 8173610 17073919 15195908 8587524 8467924 13467630 12269432 2554255
43685 2554255 -5218041 -5048644 -3663732 -6435203 -7331864 -1111058 5094922 2935396
43677 2935396 -2512380 -863490 6483681 9238796 4657704 -405407 -1968926 -2639771
43669 -2639771 -3758102 -4080840 -6067322 -13297871 -20858221 -18419872 -5366474 6006179
43661 6006179 5696688 -2859776 -9713333 -9389208 -1673449 11659622 25990249 34363848
43653 34363848 33539513 27113778 20173861 13753217 6531517 -1259819 -8044260 -12649603
43645 -12649603 -14090923 -11620728 -6220775 -349631 4314203 7230672 7345615 3322303
43637 3322303 -4422017 -13473471 -20960092 -24588289 -23758768 -20668286 -18126174 -15739256
43629 -15739256 -11828555 -9306151 -13392050 -21780302 -25212823 -21641248 -20171334 -24340491
43621 -24340491 -22383473 -5282875 14962472 19885880 10920121 4750500 6387709 5386762
43613 5386762 -1503524 -3387600 4818381 12775678 11563450 5026436 -2371951 -13561238
43605 -13561238 -25892242 -25359185 -6272465 15066300 19670045 9877828 1380860 -429784
43597 -429784 -2029539 -5633224 -6372312 -3347946 -661978 1956820 8730910 18276408
43589 18276408 23860545 23052904 19227709 14848904 11342533 13395772 23802984 35311556
43581 35311556 37600005 31909021 28436323 29178272 25127872 12905887 2147270 849017
43573 849017 3633122 1865847 -2902060 -4121390 -2536810 -3798724 -7477726 -7937481
43565 -7937481 -4948815 -4766430 -9909622 -15190309 -15628997 -12101121 -7088847 -1033969
43557 -1033969 3939218 2858567 -4441368 -9627270 -6539556 -1692207 -5572597 -15415180
43549 -15415180 -17288208 -7032345 2143648 -1103983 -9479362 -9252355 -1836322 -362415
43541 -362415 -7983334 -13619781 -10577073 -6281085 -8766347 -14553037 -16625466 -15275444
43533 -15275444 -13207193 -7719408 3074446 12348260 12917087 9154355 10152113 14171437
43525 14171437 11635917 2695781 -898665 5995715 13625065 12522950 6761391 4608125
43517 4608125 4416373 -407254 -7625097 -7990516 722376 10666546 15084615 14822292 13026411
43508 13026411 10688609 9073153 9900327 11013028 7950536 1652398 -2108776 -2926231
43500 -2926231 -7017137 -14643415 -16158994 -7727777 -1320061 -8065284 -19161213 -17211184
43492 -17211184 -2092093 10074026 12295785 13831632 19311822 18629278 5893543 -6714671
43484 -6714671 -5939950 2610905 4016246 -4577617 -14506884 -21176880 -26529699 -30396938
43476 -30396938 -31491660 -33725332 -39843881 -41600694 -28530879 -5151620 12497733 16992695
43468 16992695 14755757 11804259 7178160 2031269 2123802 6972999 7685578 782510
43460 782510 -5352245 -3109972 3803443 7836039 7863919 6617764 5019598 4635233 9097485
43451 9097485 17043590 19251369 8980765 -8848616 -23525391 -29504805 -27710992 -21077692
43443 -21077692 -13666205 -9852666 -9452642 -7053262 9910 7068232 9287860 8767588
43435 8767588 9820250 11538604 10594393 8068773 7497750 7980984 4972286 -2179303 -7840064
43426 -7840064 -6409202 793811 5717368 1045909 -11434084 -20902233 -18526796 -7681245
43418 -7681245 158713 -990044 -6124315 -6858015 -179685 10026893 15976653 11501927
43410 11501927 -823629 -10009632 -9513215 -6447293 -10297638 -16564993 -13122854 -684466
43402 -684466 7131648 4970673 1963975 3425282 2126638 -5506350 -9887011 -4790316
43394 -4790316 210502 -4460267 -12021758 -11792602 -7583294 -9199790 -14096762 -12975607
43386 -12975607 -7369313 -5945405 -7871757 -5757919 -2086141 -6249744 -16039229 -18408640
43378 -18408640 -10303294 -3497462 -5443951 -9617203 -9807943 -10600693 -16328722 -20593583
43370 -20593583 -15599865 -4463835 3882139 6791275 7798968 8309976 6155993 973434
43362 973434 -3863109 -4796660 -1624471 2275729 3286687 2145126 3638702 9614305
43354 9614305 15143629 15436479 13164251 13347578 14387013 11688426 7608114 8566231 13106283
43345 13106283 12718669 5476906 -887804 -1589322 -779789 -1722167 -656280 4451044 7475837
43336 7475837 2599308 -7292711 -15913078 -20747792 -19836600 -9010274 10100302 25039087
43328 25039087 23882590 8709275 -8231780 -17958916 -18595615 -10899311 1937494 13004891
43320 13004891 17807710 19650328 22749789 23800337 18198850 10592205 8951071 10608944
43312 10608944 6134852 -3137797 -4747337 4488128 10630354 1983068 -14384636 -24013163
43304 -24013163 -24159406 -21716842 -19295517 -15054445 -12039791 -15374075 -21366265 -20667698
43296 -20667698 -12704415 -6685170 -7028385 -7940954 -4836111 -1032850 702905 3553835
43288 3553835 8458237 9801261 5819261 4537191 11063423 16757487 11276160 -360378
43280 -360378 -4099589 3114925 11118659 12939319 11951951 11703851 9279248 2270689 -5437724
43271 -5437724 -8346102 -4583626 4445872 13733870 14475479 2623704 -11502624 -11704977
43263 -11704977 3244658 16862584 17222091 11655577 12109629 15621666 10909394 -1008889
43255 -1008889 -6105775 2165701 12625634 11117309 -1461432 -11801007 -11454059 -5101650
43247 -5101650 -1436115 -1819860 -2156529 -2235376 -5856360 -11585531 -11883236 -5447440 -2419123
43238 -2419123 -10040149 -19743005 -18261996 -6863164 1942735 3899720 5993761 10304515
43230 10304515 9289696 653511 -6347588 -5463047 -3071508 -6365133 -11891553 -13527398
43222 -13527398 -12968047 -13754423 -12331094 -4196759 6432571 11557955 10117196 6963617
43214 6963617 5024868 4491461 5859184 8296804 8737471 6715255 5244855 3524090
43206 3524090 -4151627 -17359468 -25182048 -19507449 -6214608 3191131 4585574 91023
43198 91023 -8091677 -15477698 -14859808 -6448391 -1300635 -6338762 -13407957 -11986719 -4723660
43189 -4723660 -323573 981563 3495023 5087133 2586284 1524125 7494466 13764217
43181 13764217 10990963 3543753 1741693 3470226 -203590 -5619188 -1119305 10711785
43173 10711785 14470885 6797466 1229331 4585551 6472480 -1081021 -9578216 -8659851
43165 -8659851 -2113668 263541 -2622764 -5384517 -6202929 -7345047 -10344553 -15188338
43157 -15188338 -20052240 -20290755 -13564168 -6136696 -6098739 -10185628 -7239615 3927327
43149 3927327 11194575 6921164 -1530986 -3786490 274052 4361171 5080501 2674326
43141 2674326 -1027207 -2091837 1998369 6999836 7157132 5482290 9205436 15106157
43133 15106157 11410771 -3901747 -19273782 -26866128 -30423495 -31988740 -25268016 -8921215
43125 -8921215 6807099 14252677 16697683 15655093 4330039 -16346430 -29449914 -22864837
43117 -22864837 -6870126 1957769 3037769 3752110 836744 -11672342 -23615777 -18125920
43109 -18125920 2396389 17600151 16371796 6890518 -636148 -5053958 -5663256 1687631
43101 1687631 14202735 20466997 15529725 7313875 2246777 -4765843 -17975507 -27817753
43093 -27817753 -21769845 -3867948 8035872 4899673 -2967389 -1684670 6868155 8817433
43085 8817433 -965709 -10904595 -9024149 225588 3504027 -1275759 -3226315 3248519
43077 3248519 10287726 10347631 6820338 4299592 -1107667 -12022341 -19243955 -13471939
43069 -13471939 -1945197 47866 -8490418 -13963279 -9782025 -4398723 -4859486 -5221679
43061 -5221679 2061467 12629785 16051866 9645367 -389702 -8058654 -11784973 -11671394
43053 -11671394 -8077301 -3157007 -608019 -2765350 -8308926 -12722334 -11790045 -6016404
43045 -6016404 -752195 -316171 -3463140 -6753228 -9735525 -12818222 -12622744 -5715957
43037 -5715957 3649483 6363302 473804 -5768289 -5510398 -2432399 -4321435 -11603748
43029 -11603748 -17103141 -15508731 -9245758 -5242812 -7907699 -14916434 -19183960 -16037789
43021 -16037789 -8355712 -2522684 -26929 2768390 6375328 6014005 740776 -1797350
43013 -1797350 3746565 9378766 2757611 -13753054 -22824038 -14036963 2046796 7278093
43005 7278093 -2357041 -15173443 -20074401 -16418991 -8988565 -1753984 1196904 -4278448
42997 -4278448 -16474031 -25758874 -23256467 -10633291 1479135 4078242 -2609062 -10742651
42989 -10742651 -12710583 -8211420 -3664284 -3586082 -4743876 -2635702 -982810 -6895783
42981 -6895783 -16741912 -17133833 -4033958 9241931 10479716 5998589 9212454 18722387
42973 18722387 21047550 12238738 3222622 3046265 8889520 15012193 20505800 24296974
42965 24296974 22271013 14438636 7119876 3402694 -1147729 -8730993 -13114599 -9241851
42957 -9241851 -2233904 274485 -508298 1620243 6418405 7595383 3338697 -518796
42949 -518796 1379785 7272315 10963222 8499665 1305459 -6088978 -10851633 -13813137
42941 -13813137 -15913803 -14786907 -8484454 -1439116 -1229020 -8201883 -13374182 -9350180
42933 -9350180 264125 5212653 271130 -9331790 -13035201 -5242023 8273385 15498578
42925 15498578 11398555 3001485 -1565826 -4010683 -9844237 -16820532 -18976280 -18760259
42917 -18760259 -23575004 -31409639 -32351988 -25135417 -19228156 -18091416 -14060987 -4538941
42909 -4538941 619463 -4617335 -11315115 -9988817 -5312647 -6180617 -10650505 -12131553
42901 -12131553 -12574030 -17134244 -21338960 -15973774 -1883309 10591295 15035063 13290532
42893 13290532 8823834 3846877 978288 762653 -428876 -4861915 -9656727 -13100318
42885 -13100318 -18211822 -23874211 -20743337 -5454926 8550727 6242125 -8002756 -16563283
42877 -16563283 -12008538 -2377266 4189602 7703122 9964889 10849631 10900417 9243664
42869 9243664 1586315 -10606956 -14069530 172330 18654900 19351347 2522325 -9742945
42861 -9742945 -6771612 -3291602 -13061970 -25980191 -24228864 -9223652 2193426 2166263
42853 2166263 -1177612 831426 6305325 8413567 4122866 -5304233 -17426456 -28788113
42845 -28788113 -34175145 -29513505 -17016794 -5544490 -2474566 -5312819 -5497917 -905978
42837 -905978 1839403 -298766 -897527 3552467 4708761 -4109645 -13486259 -10638362
42829 -10638362 -1125753 -1466865 -12013262 -15307223 -4228974 5845207 -8144 -16143019
42821 -16143019 -28186710 -32371728 -32928155 -30891755 -26527627 -24324877 -24772437 -19002891
42813 -19002891 -3032783 10056804 5670469 -9503015 -14812140 -3995527 8141526
42806 8141526 8355767 255341 -7265155 -14025818 -22605877 -27243064 -19435937 -1698962
42798 -1698962 13115613 16554426 12490884 9163729 8506419 6636986 2112415 -808278
42790 -808278 1944820 7726734 9177670 2808636 -6459772 -10926432 -9460565 -8807237
42782 -8807237 -14439886 -22206032 -22413075 -12309295 -441535 4019508 2806982 4652533
42774 4652533 11928907 17671411 16264163 10383808 5111593 1677587 702401 5075803
42766 5075803 13790940 18266208 12124093 1201150 -3699026 -1753878 -1927028 -8669843
42758 -8669843 -15923865 -16891618 -13242166 -11682818 -15239965 -20320061 -20815183 -14730996
42750 -14730996 -7331859 -5553927 -8497530 -8321396 -2868080 -36338 -4257615 -7361769
42742 -7361769 -2388345 1901170 -5673772 -16833950 -13229805 3590477 11508683 1249483
42734 1249483 -9387679 -4320357 5754354 2061920 -11969041 -17545439 -10153680 -3421496
42726 -3421496 -5263738 -7600942 -2454868 6143370 11534744 14459465 17343902 17335994 12286789
42717 12286789 7313487 7644552 8922773 2482566 -11373853 -22671826 -24457515 -19612774
42709 -19612774 -13743311 -8120278 -3230252 -2857467 -8108862 -11818513 -7308584 -472189
42701 -472189 -3172928 -14338640 -19004303 -9980704 1152282 2163075 -1675990 960072
42693 960072 6544822 2514458 -10188258 -16986413 -12715558 -9167367 -15318770 -23604637
42685 -23604637 -22772429 -13746464 -4922504 321453 3963033 7210557 10307109 13545854
42677 13545854 14093875 7510738 -3843539 -10842315 -10075890 -8394392 -10267454 -9986879
42669 -9986879 -3590067 853471 -5064200 -15249744 -17004784 -8843874 201279 4972989
42661 4972989 7030815 6342708 1383299 -4349841 -6615869 -9308457 -17695466 -24761751
42653 -24761751 -18297060 -2459456 3023636 -9702168 -23924270 -21402043 -6415777
42646 -6415777 3796466 3507153 753201 579959 -478109 -4094575 -6088691 -4735162
42638 -4735162 -4229666 -7004917 -9560590 -8839696 -6796492 -5674387 -4204321 -1732850
42630 -1732850 -966162 -2904718 -4087425 -3322841 -5919752 -14807041 -21674972 -15568357
42622 -15568357 1014851 13409399 13262558 7512093 5965326 7759674 5997500 500534
42614 500534 -1419731 4521862 13928757 19052826 16768020 10953067 8086925 9730793
42606 9730793 9779052 2442483 -7174744 -6588833 7171665 20670202 19887079 8162739
42598 8162739 883710 4676338 9834333 4141967 -11719884 -24793838 -23345187 -9107851
42590 -9107851 3154679 161871 -14962594 -26045355 -23420832 -14061054 -9129511 -9416970
42582 -9416970 -9683805 -9893852 -12605091 -14546174 -11016543 -4792390 -909735 2862814
42574 2862814 9421146 11586367 2117713 -9472338 -7223043 4965491 6182447 -9189172
42566 -9189172 -21287854 -14552367 895 3765856 -2739771 -6052227 -2120747 1945626
42558 1945626 1927876 -622091 -5371862 -12245628 -16677357 -14788568 -10196441 -8357636
42550 -8357636 -8320573 -7009193 -6292390 -7935026 -7010249 896288 10710312 14873254 14579470
42541 14579470 14841673 13272253 4710020 -6129934 -8215840 32291 8372686 8602606
42533 8602606 2612376 -3760217 -7505052 -8160429 -6365042 -3213431 2003279 10789843
42525 10789843 19037680 17522473 4839838 -6576391 -5714753 1643703 2595419 -3562348
42517 -3562348 -7508658 -6905103 -7696658 -10703630 -10663417 -7862132 -7200860 -6254193 905300
42508 905300 7591256 -572668 -20680779 -30161728 -17446791 951779 4966267 -1577957
42500 -1577957 -1997687 5831539 9497655 3374038 -5872664 -12536079 -16574031 -15970158
42492 -15970158 -7809357 1847882 1609786 -8513387 -14872879 -9132429 313802 1862956
42484 1862956 -2949281 -4795874 -2228058 -2415738 -8567208 -15346955 -16956735 -12821200
42476 -12821200 -4890242 3671278 6133150 -3165385 -18223380 -23438372 -12394427 2338999
42468 2338999 6029747 1516456 757147 2178163 -6888747 -24644081 -30270497 -13122659
42460 -13122659 9010720 13454811 2771352 -3681119 274407 3631004 131122 -3941015
42452 -3941015 -4485031 -5716609 -8610158 -8090853 -5854323 -11206925 -23084511 -25919056
42444 -25919056 -12263992 3981257 8126211 6065283 10832583 17961104 12329761 -5151851
42436 -5151851 -16552459 -13499013 -8003508 -12028147 -20163697 -20191085 -10822302 -602537
42428 -602537 4390975 4456610 2218816 491617 995433 1293769 -3240029 -11483304 -15875145
42419 -15875145 -13132412 -9115352 -8094385 -4899174 4184386 9901946 1271449 -15411521
42411 -15411521 -22057185 -13113865 -1544572 1478029 -489271 -1477779 -4994065 -14255504
42403 -14255504 -21120421 -16824917 -7189842 -5088487 -12013594 -18824024 -21555413 -23860900
42395 -23860900 -25211813 -20271265 -11412082 -8763161 -14193990 -17492075 -13538481 -11038860
42387 -11038860 -16506497 -21088715 -14571810 -4043869 -4995058 -17564503 -24989045 -16295450
42379 -16295450 296514 9512589 6578611 -1132488 -4620642 -1492648 3684835 4617822
42371 4617822 -344796 -6724859 -9533511 -8959623 -8668316 -10413106 -13192336 -16138829
42363 -16138829 -18936657 -20256216 -18653941 -14534508 -9634502 -6174229 -7504793 -15655685
42355 -15655685 -25501991 -26221811 -13892880 925993 4560565 -3184380 -10673006 -11231343
42347 -11231343 -10310696 -14859440 -22913047 -27191876 -24385157 -17532842 -11989157 -11242134
42339 -11242134 -14529694 -17111096 -14684166 -8202548 -2663561 -1408632 -3743671 -7312775
42331 -7312775 -9919238 -9964083 -8652286 -10858918 -19447140 -29234814 -31846955 -27078505
42323 -27078505 -23620505 -26420112 -29253611 -24385315 -15211484 -12490887 -18621195 -22475531
42315 -22475531 -13762285 1049131 3718998 -12981576 -32958517 -33610403 -13223497 6499694
42307 6499694 7295978 -4659769 -10439565 -3730904 5296350 7769557 5940921 4153865
42299 4153865 855687 -5441002 -10054682 -8265941 -2566320 1987235 5620618 10840854
42291 10840854 14523249 10273785 -1413876 -11569774 -12997452 -7858346 -3472575 -4414450
42283 -4414450 -10663795 -19571269 -26250615 -25106946 -15634603 -5398606 -2663287 -6507081
42275 -6507081 -8990765 -7023442 -6063528 -10548059 -17339519 -22092145 -25195470 -26002823
42267 -26002823 -18515157 -1605756 12267894 10176341 -2282148 -7697070 -2084280 202417
42259 202417 -10696411 -26041013 -32798650 -29814811 -22504163 -12838000 -3619794 -2348413
42251 -2348413 -9891057 -13725629 -4222785 9237395 10863773 1630448 -3604369 1236595
42243 1236595 7631565 8752903 8410838 11422969 15558357 16567046 14074193 10087418
42235 10087418 6598391 4903191 3343034 -1777459 -8731939 -9513808 -3227628 -2483808
42227 -2483808 -15149288 -27075007 -18883658 4068019 16882067 10278226 1323989 4817878
42219 4817878 12954720 12583071 6371908 4039712 4475753 809090 -4033293 -595199
42211 -595199 11174707 20191422 17923257 6375437 -6979174 -16409608 -20125551 -19130650
42203 -19130650 -14535140 -6058090 4786603 11768338 9796788 3115932 599692 2677316
42195 2677316 1287086 -5983569 -11373926 -9583363 -5222737 -3269442 -1597218 1486041
42187 1486041 1563765 -3308964 -6992506 -5727555 -5976756 -13142560 -19910053 -16121889 -5050281
42178 -5050281 835479 -2307138 -5665643 -941276 9698988 16779045 11931455 -5489941
42170 -5489941 -26338964 -38175754 -36661093 -27762540 -17864740 -8183299 -1163435 -3029408
42162 -3029408 -13535377 -21032646 -15840667 -2875328 6192198 7471774 4341144 -1077156
42154 -1077156 -7422220 -10785955 -10564044 -13235864 -21870750 -28189864 -24800696 -18640792
42146 -18640792 -20345172 -25912162 -22803465 -10906776 -2872025 -4391534 -8006235 -7476060
42138 -7476060 -5584702 -5644604 -6576925 -8506340 -12764655 -14808371 -7973161 3924729
42130 3924729 8862625 3800784 -1694211 -1814116 -2492463 -8670104 -15451006 -18029903
42122 -18029903 -19630886 -22625272 -21792636 -14220551 -6630224 -4177072 -559580 10633477
42114 10633477 21847327 20300981 6606406 -6126096 -9380931 -5642976 538304 7704507
42106 7704507 13119075 12242685 5204862 -2382516 -7159845 -11359706 -16558996 -19165202
42098 -19165202 -15300752 -7104570 -1109543 -1469238 -6384576 -10534594 -10282596 -6985893
42090 -6985893 -5395536 -8586398 -14912181 -20113910 -21344606 -18691013 -14144884 -10005252
42082 -10005252 -7477453 -6534483 -7702096 -12454733 -19353032 -21792733 -15023191 -5489416
42074 -5489416 -6401802 -20910629 -35619243 -35760904 -22284854 -8200148 -1893791 -1358952
42066 -1358952 -2770066 -6047457 -10449615 -11921196 -8736927 -5616884 -8549731 -17521555
42058 -17521555 -26372940 -28099306 -19825115 -5932588 2750783 -2330342 -16362625 -23086581
42050 -23086581 -12787898 4602412 10427160 -369177 -15038120 -21165373 -20188191 -19122581
42042 -19122581 -17600864 -11654198 -5069188 -5833221 -11853712 -11181637 322334 10980365
42034 10980365 8728289 -2863970 -11273986 -11984830 -10068657 -8560905 -5165868 235730
42026 235730 4245612 7185646 12815890 18602449 15581401 2775196 -6816355 -2358137
42018 -2358137 8897303 11415730 3725648 -153416 7497408 15723759 10287273 -5692414
42010 -5692414 -15125007 -8906816 3537777 7114657 -1887260 -15147826 -23832585 -25093057
42002 -25093057 -19666269 -10253985 -3219629 -5205404 -14424167 -20165714 -15496858 -6642649
41994 -6642649 -4465846 -9844632 -14210710 -12807663 -9515866 -8041979 -6508092 -3943390
41986 -3943390 -5001129 -12703241 -21097160 -21369296 -13440335 -6289599 -6937290 -12702880
41978 -12702880 -14879119 -8241407 3241720 9765072 5744534 -3772746 -9074350 -7460567
41970 -7460567 -4639258 -4512084 -4312752 -2759605 -5749572 -17383655 -30144746 -31974343
41962 -31974343 -21376229 -8787628 -3884898 -7258073 -13302601 -15194375 -8150906 5547820
41954 5547820 15349127 13032711 4006299 509335 4059781 4213106 -3778492 -10949190
41946 -10949190 -8914866 -2025279 1975660 4588452 10324893 14540807 8982515 -3601217
41938 -3601217 -11525007 -10385825 -7395467 -8841076 -12660227 -15737799 -19635212 -24653922
41930 -24653922 -25457983 -18673760 -10404501 -10094571 -18828641 -28550120 -32155116 -30315620
41922 -30315620 -27729696 -25677289 -20766361 -10998910 -805927 2785097 -1091009 -5888872
41914 -5888872 -6652277 -5961203 -7701520 -9611192 -7564213 -3442633 -1594328 -191568
41906 -191568 5361221 11711554 9919616 -579908 -9816320 -11269411 -8771847 -6428934
41898 -6428934 -1515456 7456573 14629500 15145918 11784343 7111930 -2267679 -15730882
41890 -15730882 -21792434 -12167222 3695997 9816283 4967620 1039815 3628337 7033647
41882 7033647 7263136 7101436 7201349 3881610 -1843131 -3431443 266722 2670439 500740
41873 500740 -2169672 -3133039 -5062104 -6215194 600537 14391124 22052350 15370997
41865 15370997 2550856 -5221615 -9399950 -16217021 -21684443 -17759897 -8809734 -7593369
41857 -7593369 -15369266 -19485701 -13527419 -7592617 -12150589 -21153759 -20663260 -9539201
41849 -9539201 -1292459 -4945532 -12726482 -11548644 -1617055 3669860 -4093164 -17414275
41841 -17414275 -23578591 -20583545 -16162478 -14215627 -10666902 -3386383 1943108 -131665
41833 -131665 -6432747 -9586383 -7568329 -4494117 -3873673 -4740693 -3745324 775257 5883221
41824 5883221 5258144 -3539316 -13024320 -12356362 -1827737 5294202 -596256 -12755550
41816 -12755550 -18021437 -14598717 -11766830 -14198799 -15963399 -11560239 -4740830 -2048953
41808 -2048953 -3214451 -3668069 -3578902 -7821390 -16631077 -22295032 -18892703 -11838842 -12072672
41799 -12072672 -21143659 -28210313 -24492030 -15222788 -11867702 -15996236 -18000458 -11222589
41791 -11222589 -537636 4686005 939124 -8120599 -16529697 -20129796 -18967075 -17040934
41783 -17040934 -17322822 -17284378 -12665580 -4566887 2007093 5614016 8287950 8742085 3436848
41774 3436848 -4795702 -7736430 -3890843 -1263239 -4445334 -7266728 -3183048 4888679
41766 4888679 10889266 14327231 16184796 13488618 5886158 1129398 4819874 9729284
41758 9729284 5136408 -6748973 -13686415 -10555285 -3697089 899518 3682034 4990933
41750 4990933 2082879 -4229224 -7632566 -5087087 -2014756 -4706175 -11625318 -16287914
41742 -16287914 -16081058 -14115713 -13216465 -11818068 -7092983 192437 6692355 11428182
41734 11428182 15402009 15411287 4937439 -13562399 -23926149 -13894179 6214932 14660759
41726 14660759 6776915 -1960053 -2378595 -3801175 -13399985 -20852301 -15723222 -5932298
41718 -5932298 -4054843 -6525537 -2927065 2919146 -708329 -11555921 -16156411 -11925137
41710 -11925137 -9214594 -12175318 -14277585 -13575627 -16152076 -21728729 -20714702 -9578208
41702 -9578208 3370223 10857544 13838385 13716505 9381843 4106181 3342107 4056410
41694 4056410 -980558 -7485871 -3613731 8258939 11400132 1700862 -3656696 6414621
41686 6414621 18364174 15328094 1786350 -7844391 -12526022 -19608704 -25608173 -20033293
41678 -20033293 -4710097 6013293 3413878 -8463689 -21652721 -29872792 -27826899
41671 -27826899 -15475096 -1924734 3534634 2607354 2985850 5978105 7748773 8916674
41663 8916674 12818970 16941298 16297291 13302972 13847938 14934838 7402996 -8494266
41655 -8494266 -20667572 -20436084 -11787920 -3749471 -1247911 -4965221 -12613614 -18374798
41647 -18374798 -17558442 -13106425 -11538559 -12704689 -10921429 -5964137 -3933233 -6208458
41639 -6208458 -7256278 -5885401 -8504434 -16627799 -20959617 -14880202 -5787547 -4623182
41631 -4623182 -10050602 -12239705 -8725029 -6951302 -11748887 -18565813 -20688633 -17310691
41623 -17310691 -12381156 -9438901 -9503882 -11622796 -14174077 -16694533 -19949570 -22834844
41615 -22834844 -21097451 -12372436 -1407330 3717625 734472 -5034315 -8392447 -9649068
41607 -9649068 -10811188 -10719768 -7596607 -3838773 -3740702 -6846708 -7757103 -3919914 -358251
41598 -358251 -3655751 -12555202 -18206203 -14964634 -8050925 -7061449 -12745666 -15036704
41590 -15036704 -6590077 5844538 8686990 -1669969 -15370616 -22225694 -21279271 -15604839
41582 -15604839 -6099924 4016985 6352596 -1785137 -8715634 -1700079 13339328 17616028
41574 17616028 5616766 -7252449 -7022323 923400 3301517 -1785602 -6176607 -5243603
41566 -5243603 -1026692 3475269 5463485 2091379 -4618903 -7947290 -7283695 -10934327
41558 -10934327 -20726456 -23927090 -12212961 949785 -2233188 -16190228 -20587022 -12625823
41550 -12625823 -9321662 -16871672 -20271183 -9927237 1932575 2138595 -3211565 -2186721
41542 -2186721 3103261 3641875 -350726 -3667069 -7445054 -13561246 -16065585 -11074686
41534 -11074686 -7394755 -13714270 -22262001 -19731393 -8390434 -652516 2323374 8864656
41526 8864656 16162319 11066864 -6218105 -17872886 -14078389 -6742581 -9256702 -16829788
41518 -16829788 -17865094 -13243050 -11249500 -11474893 -7854930 -3273690 -6835643 -17169028
41510 -17169028 -21760957 -15711142 -9457001 -12192948 -17536765 -14552675 -6106941 -4514108
41502 -4514108 -11079751 -12731572 -2330331 8927816 7245502 -3610002 -8471490 -3000398
41494 -3000398 2014696 -1644299 -9158432 -13218647 -15254343 -20431267 -28493273 -35644182
41486 -35644182 -40543327 -43184281 -42148840 -37556123 -32439813 -27297329 -18721236 -7948636
41478 -7948636 -4008855 -11347212 -20192804 -18156548 -7579341 -1847268 -6339393 -12481976
41470 -12481976 -10874785 -1964497 7692708 12773830 10929332 3113565 -5326606 -7926560
41462 -7926560 -3465112 3123398 6040478 2510297 -6758360 -17066947 -21243981 -16183545
41454 -16183545 -7050267 -1334462 -600157 -2096462 -5267590 -10363200 -12996341 -8026293
41446 -8026293 1282751 5560838 2093061 -1429074 1875114 8827526 11087041 5058885
41438 5058885 -5967228 -16606306 -23489466 -25587758 -22070355 -11327043 5179723 18353413
41430 18353413 16971289 1645148 -12524897 -13325531 -6182349 -3856768 -6830580 -5191336
41422 -5191336 2559020 5848230 -965663 -9904831 -12506579 -12149000 -16861237 -26171983
41414 -26171983 -31296877 -25166581 -8804561 9289597 18639071 15620905 7673974 4658274
41406 4658274 6995528 8387813 8260008 11607017 16166701 11874811 -2504517 -13440213
41398 -13440213 -10409299 -312338 4062975 1735773 -243605 -1878238 -9602085 -22669060
41390 -22669060 -31036625 -28393651 -20031273 -15651173 -18876644 -25303285 -27998846 -24046872
41382 -24046872 -16849980 -11640994 -9133023 -6387988 -3406578 -3584697 -6903974 -9237106
41374 -9237106 -10265490 -14254914 -19705454 -17579659 -5866476 3625146 1915571 -2485629
41366 -2485629 2696429 12292086 10993387 -1743128 -10305626 -7044776 -2121633 -5189568
41358 -5189568 -11571565 -13763860 -14352676 -17811748 -19066605 -11883456 -2643948 -3379067
41350 -3379067 -13129165 -17831280 -10153205 373560 1182784 -6597190 -11502643 -8124174
41342 -8124174 -2995397 -3528047 -7000230 -5073511 3012527 7774713 1969025 -8991236
41334 -8991236 -13735907 -9523058 -4225946 -4063353 -5926132 -4598648 -2151879 -5006493
41326 -5006493 -14128323 -23241959 -26558476 -24530894 -21608753 -21380965 -24590128 -28937824
41318 -28937824 -29424171 -21895811 -9432454 -3405693 -13182350 -33378121 -45878866 -38603723
41310 -38603723 -19544408 -6921003 -7139261 -10024078 -6746784 -2900870 -7590786 -17223824
41302 -17223824 -20413901 -15683607 -13062327 -17503400 -21343008 -17107907 -9101343 -6328587
41294 -6328587 -10082676 -14973152 -17927508 -19464000 -18451778 -12074987 -968995 9735042
41286 9735042 14661191 11611938 2565188 -6511521 -9409406 -6100195 -2987066 -4372590
41278 -4372590 -7384377 -8545204 -10379215 -15940800 -21206274 -20382449 -16005306 -15491465
41270 -15491465 -18916350 -18986078 -13633000 -9907026 -12878605 -18161859 -18979593 -14805751
41262 -14805751 -9706964 -7094660 -8810229 -14431451 -19007981 -16712859 -9370185 -5961188
41254 -5961188 -10768518 -17541792 -18704783 -14814611 -11278787 -11158652 -14947606 -21817456
41246 -21817456 -27181890 -25053345 -16936553 -11670847 -11969278 -9330345 1379159 11369855
41238 11369855 11039146 5235981 3936976 4711516 -1739738 -13191876 -18198928 -15113512
41230 -15113512 -13758776 -17606519 -19053751 -14910271 -12295939 -14806389 -16186222 -13404345
41222 -13404345 -13355499 -19454241 -23229673 -17826544 -9908475 -8976942 -13280458 -15481608
41214 -15481608 -14814530 -14437951 -13678127 -12383508 -16402888 -28307394 -38029897 -33643637
41206 -33643637 -17709716 -2726188 5994654 12088356 15867538 12570317 2904258 -5349539
41198 -5349539 -7570769 -5629150 -1029102 5937404 9806558 3113485 -11396474 -20994328
41190 -20994328 -19089467 -13109954 -12573434 -17379362 -22915529 -28998415 -36300496 -39073340
41182 -39073340 -30083486 -11829760 3592843 6882089 436512 -5537628 -3528309 5023382
41174 5023382 12641652 14479452 13382676 14885144 18134188 15754598 4332349 -8755686
41166 -8755686 -12919141 -7131141 -594611 -188135 -1992287 1237124 7557958 7381075
41158 7381075 -2014157 -10913489 -10876117 -7866299 -13317723 -25466642 -30432123 -22418311
41150 -22418311 -11553000 -7677579 -7204867 -3357887 -96716 -5436273 -16767094 -23900071
41142 -23900071 -23865195 -22455792 -22460511 -20356584 -15201781 -11869040 -13196395 -15360898 -13081178
41133 -13081178 -5205928 4735776 9407119 1329137 -18121293 -35316203 -37247752 -26671018
41125 -26671018 -17277649 -15628657 -16661739 -15868815 -15176370 -15371577 -13004692 -7787033
41117 -7787033 -4056918 -2213890 1899551 6180522 1679216 -12054389 -21924580 -19308979
41109 -19308979 -13619708 -18264373 -30711387 -37658099 -34929434 -30351595 -29005562 -27327024
41101 -27327024 -22893592 -19923636 -21233819 -21805476 -15311469 -3494189 5076379 4508969
41093 4508969 -2491455 -8044590 -7193606 -1922936 2568552 3598049 1379716 -3731049
41085 -3731049 -10157855 -12951362 -8789358 -2909573 -3961573 -11114933 -14844295 -12907643
41077 -12907643 -14872773 -24694036 -29999611 -19748066 -3955842 -1458792 -12671307 -20223002
41069 -20223002 -15553674 -8291467 -6488076 -4496509 1849636 3301002 -7248366 -18645277
41061 -18645277 -15971861 -4354056 -2340908 -14119583 -24105415 -20393962 -8976751 -602594
41053 -602594 3086994 3757878 -1224656 -11411956 -17781462 -15002753 -11604452 -16755111
41045 -16755111 -23658288 -19554479 -7720854 -3851777 -11281915 -16079861 -9968237 -2511476
41037 -2511476 -3751916 -8631974 -8260965 -5049548 -5073321 -4667459 2083607 8854680 4315813
41028 4315813 -9006756 -16649683 -12710431 -6135415 -5272179 -7899609 -10218200 -15319423
41020 -15319423 -26228256 -36938268 -37002988 -23014871 -2490568 12114801 12976032 3629420
41012 3629420 -3769637 -1203205 5992126 6631440 -1379369 -9655861 -12074218 -11585922
41004 -11585922 -13080499 -16292891 -18453776 -18508279 -16026543 -10774358 -5937970 -6916662
40996 -6916662 -13574672 -17799033 -12732460 -1665104 6306641 8047982 9609451 16676297
40988 16676297 24841083 23415255 9802179 -4533454 -7553666 -2975677 -4570460 -14784445
40980 -14784445 -20762476 -15385886 -9143695 -12114472 -16283856 -9453413 2484815 4102780
40972 4102780 -3878937 -5604643 4291991 13685166 13508257 9003031 6643955 4876691
40964 4876691 2907413 4703296 8300028 4292633 -8195643 -16135461 -10423268 1847094
40956 1847094 9677037 11695702 10631034 5930956 -171651 -730215 3006849 -1661189
40948 -1661189 -19120763 -33847259 -30746853 -17087896 -10528771 -13564972 -14812099 -9915693
40940 -9915693 -5611960 -5431572 -5702228 -5901885 -10907348 -21238850 -30132595 -32079249
40932 -32079249 -28331762 -24096886 -24546754 -30683380 -34704177 -24985611 -2146542 16110514
40924 16110514 14481516 -1666058 -16604891 -25599110 -33480536 -37885301 -30233857 -12924050
40916 -12924050 -476568 -695255 -6718801 -10668832 -13633606 -17867323 -19550502 -15266938
40908 -15266938 -8077119 -1908658 3742560 8877534 8774691 63202 -13015524 -22865909
40900 -22865909 -26110445 -23873816 -18116156 -11465221 -7987673 -9808975 -13623874 -13753842
40892 -13753842 -9002810 -4242042 -4061472 -6437045 -5335558 380619 4543751 2630755
40884 2630755 -1119563 -665053 1602332 -543516 -4903129 -3715745 1428895 -87293
40876 -87293 -9838027 -15655900 -10835574 -5057001 -7469651 -11269026 -6696131 1589712
40868 1589712 4191653 4855282 12092514 19202796 11458215 -8164502 -18819749 -10507390
40860 -10507390 2703865 3809194 -5799867 -13816696 -15969022 -17933737 -22891897 -25682820
40852 -25682820 -20088657 -8073839 856811 474172 -4087714 -3717194 69855 -3540813
40844 -3540813 -16183889 -23915902 -16605141 -3938814 -1576858 -9099059 -13892871 -11163729
40836 -11163729 -6931389 -4716602 -2206241 474511 482752 -1181896 -2413015 -6125604
40828 -6125604 -13960081 -18839679 -15203840 -11059841 -16558577 -26152725 -27205816 -20949012
40820 -20949012 -17687218 -16108839 -7427989 3019202 1006111 -9808582 -10351787 1433046
40812 1433046 5425186 -6696243 -17365710 -13811474 -8552367 -13978832 -18417879 -7283815
40804 -7283815 8998829 9929474 -3825435 -14795231 -16069426 -14668960 -13114635 -6608793
40796 -6608793 3075352 6831858 1942058 -4782318 -6935539 -2861055 6758937 16662882
40788 16662882 16437519 1857915 -16620438 -25315727 -23073793 -17663545 -12813966 -8721394
40780 -8721394 -8915585 -14713187 -17964866 -11591691 -2712231 -2375934 -6824705 -3995127
40772 -3995127 4271769 3763669 -7404904 -12917758 -2621464 11688818 13059516 1237055
40764 1237055 -11071790 -15940459 -15031004 -11407654 -5593485 777207 3503513 -240678
40756 -240678 -8356395 -14958396 -15435303 -11078974 -7550948 -7476773 -6979598 -2332106 2926220
40747 2926220 2395710 -3423019 -7523854 -6313432 -3531683 -3390168 -5047919 -6008324 -6636258
40738 -6636258 -7994355 -7827062 -2739784 5416672 8359910 -533932 -16923806 -27711600
40730 -27711600 -25410472 -17589596 -17038593 -24374187 -27874806 -21150162 -11986374 -9498231
40722 -9498231 -10857592 -7979134 -1220503 2380389 971139 -1034664 -2324071 -6269452
40714 -6269452 -12206487 -12891751 -3923951 9190177 16705455 14626126 6635901 -1903324
40706 -1903324 -9171262 -16090042 -21969250 -22910746 -15854346 -3286738 8147273 13424095
40698 13424095 11770216 5040206 -3086022 -7581357 -6552864 -4857132 -8083888 -13334870
40690 -13334870 -12453166 -4877714 344079 -2432709 -7955061 -9078755 -6365825 -4392744
40682 -4392744 -4414391 -4985102 -4766745 -1479848 6236828 13228427 11110214 410338 -8320165
40673 -8320165 -9217832 -8098736 -10145431 -10791480 -5880122 -1014697 -1881460 -4022958 -1900498
40664 -1900498 143219 -3522210 -8192022 -7355971 -5436019 -9265241 -13655325 -9855330
40656 -9855330 -3015908 -5359348 -15053676 -18280476 -11582913 -6006786 -7738509 -10229410
40648 -10229410 -8832555 -8810967 -13886795 -19395209 -22016385 -24787474 -27122251 -21348715
40640 -21348715 -6204549 6033021 3892586 -8901866 -20100692 -23660738 -21652343
40633 -21652343 -17460226 -13887495 -14065975 -18388730 -22767402 -23457538 -21223282 -18734093
40625 -18734093 -16872091 -14918445 -11505871 -5741362 -794088 -3509359 -14336560 -21713213
40617 -21713213 -16485052 -8545878 -14832291 -30972812 -32669773 -11142688 10483896 7999773
40609 7999773 -10903471 -19808541 -9784036 4686319 10351690 8030357 1723292 -8485711
40601 -8485711 -19083253 -21707667 -14532626 -5997557 -2912736 -2912536 -2396314 -3226529 -6223529
40592 -6223529 -6180725 -702187 2374760 -4801288 -16329876 -18409155 -7786619 4642890
40584 4642890 9635206 10328189 13665325 18478231 18197611 11168330 2083424 -4660102
40576 -4660102 -7683178 -6442469 -1831531 1987556 1801480 862257 4510920 10578272
40568 10578272 10909092 3671588 -2815948 -1461513 4429856 6938888 3303010 -3671786
40560 -3671786 -10054613 -12148500 -8570624 -4739172 -9725219 -24137104 -36641800 -37340890
40552 -37340890 -28712972 -18187619 -7452525 3049611 6489107 -2241816 -15103396
40545 -15103396 -19139397 -13958792 -10151442 -12133556 -14510863 -15204328 -19161115 -26208406
40537 -26208406 -27445919 -19365421 -11681045 -13927523 -21276822 -21155210 -9919821 3373992
40529 3373992 8026417 2427605 -5340283 -5967590 849490 5307791 -460005 -11068955
40521 -11068955 -14148492 -7097820 -479891 -3433735 -12533941 -17936305 -15056233 -7103282
40513 -7103282 -429741 88496 -5146953 -9550876 -7139690 -1121012 -760416 -8394830
40505 -8394830 -15409695 -14123172 -8598828 -9200432 -18974355 -29322333 -29043202 -16365263
40497 -16365263 -1614317 3475436 -496932 -1352689 7721844 17373475 13988093 -2080827
40489 -2080827 -17784293 -23683467 -20718146 -13457052 -6258098 -4859998 -11683506 -19344562
40481 -19344562 -18154279 -10009205 -5133210 -5581419 -3804435 1323092 316777 -10748862
40473 -10748862 -21832176 -23026624 -17655322 -15079746 -18110448 -22642613 -22853984 -13403753
40465 -13403753 5535437 22661283 24349249 12310828 2452047 3107275 6305340 4723336
40457 4723336 3113696 5424812 4647514 -3931938 -11575313 -10210851 -7195301 -13068653
40449 -13068653 -23459711 -26609263 -21628149 -15935403 -10883814 -3563673 2186077 182617
40441 182617 -6232795 -8908674 -7717104 -7210630 -5579925 101950 2832530 -5078460
40433 -5078460 -15588405 -14356845 -4785103 -4821889 -18647586 -29662186 -26426537 -18658097
40425 -18658097 -19106681 -23527774 -19691903 -7229899 2249420 498412 -9178891 -16429086
40417 -16429086 -12990220 -689555 8638937 6242138 -1376630 -1596940 3912436 551105
40409 551105 -14583287 -24048558 -14570095 2466843 7543927 760795 -2058035 3997481
40401 3997481 6803761 -1534605 -12310051 -14381326 -9280300 -4949924 -3153811 -1932049
40393 -1932049 -4302237 -13657566 -22810549 -19024875 -2174711 11737334 10239146 19795
40385 19795 -3918706 1237078 5524977 2812378 -2596546 -6320056 -10632305 -17218332
40377 -17218332 -21520605 -19828149 -16242237 -16949742 -21493010 -24636398 -23776949 -20167025
40369 -20167025 -15392650 -10492406 -6766171 -5061066 -6033788 -11134475 -19099310 -22138594
40361 -22138594 -13332871 640198 3381394 -10458829 -27191186 -32250895 -27048743 -20702066
40353 -20702066 -14925240 -7434056 -2218282 -4106757 -8319970 -7246849 -3549075 -5014627
40345 -5014627 -10049064 -10218645 -4410957 1408637 5892918 11271299 12904457 3595678
40337 3595678 -12176205 -21666923 -21533994 -18906284 -15479348 -6293512 4199907 2369146
40329 2369146 -12865177 -24646522 -21948750 -13679645 -10219607 -6067204 6497393 18924809
40321 18924809 16970079 2367834 -10268218 -13717118 -13000442 -13423258 -15240433 -18132097
40313 -18132097 -20936751 -18632530 -8581942 2077699 3924472 -1771632 -6080138 -6262204
40305 -6262204 -7213019 -10411169 -11546084 -9709525 -9567201 -12671329 -14746247 -13250601
40297 -13250601 -9891708 -4419489 5218303 14321103 12991144 1015444 -8203447 -5627295
40289 -5627295 -252002 -5555108 -18675787 -24672608 -18595938 -11049825 -11075512 -15019157
40281 -15019157 -16199495 -15886022 -18723124 -24359574 -29597356 -32986939 -31920489 -21999763
40273 -21999763 -6271466 1968733 -4895415 -15838463 -15354275 -5788012 -1949534 -6512144
40265 -6512144 -7516419 -1466515 -668023 -10982738 -18930343 -11668985 3536072 12061138
40257 12061138 13074982 14632252 16836316 14514581 10171198 9736488 10009518 4281063
40249 4281063 -3297467 -3020695 3398883 5188756 203564 -3540605 -3114642 -3631118 -5845250
40240 -5845250 -4318580 978883 3825071 3388312 4341276 4986513 -1315745 -11757162
40232 -11757162 -15025713 -8795763 -2827039 -2570770 -3664581 -4853620 -10996320 -19648808
40224 -19648808 -20460212 -12832224 -8604596 -11931284 -12972793 -7834422 -6849121 -14268110
40216 -14268110 -17870817 -10264815 -3218022 -7272707 -13576525 -11619572 -9462214 -17758350
40208 -17758350 -26702196 -19711099 -1197395 9692347 7144478 1656358 -250827 -1046705
40200 -1046705 -435936 3873545 6048870 -845480 -10129368 -9938460 -3696209 -5034331
40192 -5034331 -14091930 -17192807 -10487444 -5462389 -8160070 -10526770 -7280247 -5222231
40184 -5222231 -9121048 -12205236 -8209093 -1702129 361122 -2157128 -7388459 -16143604
40176 -16143604 -26153448 -30038067 -24774924 -16691688 -12919964 -13933048 -17133516 -21061906
40168 -21061906 -23529688 -21922987 -17233830 -12345005 -6864290 -263929 2384362 -2772530
40160 -2772530 -8400323 -4754327 3166739 1224207 -11076793 -19058338 -16446760 -13799310
40152 -13799310 -18220402 -21552029 -17268187 -13452534 -17539115 -21436176 -15269801 -5799112
40144 -5799112 -6882453 -17998945 -25409616 -21330338 -11531101 -6110579 -10167398 -20606276
40136 -20606276 -26744503 -19052556 -2478399 5485922 -4111117 -19785988 -25092265 -17830743
40128 -17830743 -6692017 2010978 5062600 -1079311 -13128824 -17977221 -8805933 2389867
40120 2389867 641137 -10077649 -14374985 -9237191 -4839650 -4937012 -2797843 3518604
40112 3518604 7148697 5529254 4172226 5238975 4686156 2712420 4626990 9038444
40104 9038444 7923302 1596103 684674 8937516 16961480 18430985 19346615 23895372
40096 23895372 24071452 13379308 -29848 -5186629 -4255902 -4678384 -3205265 8091337
40088 8091337 24179480 29879904 20214101 6306994 -145056 1418478 5677091 9480546
40080 9480546 11880218 12633647 12906988 12843109 8707758 -1611645 -11253542 -10614777 -1453018
40071 -1453018 4117974 870402 -2696925 885643 5830764 3232957 -3722055 -4589292
40063 -4589292 1770896 5545108 922307 -5830721 -5643232 2085601 10646439 14565997
40055 14565997 14025837 12895949 14416126 17736024 18180091 12425283 3426702 -1859195
40047 -1859195 7662 5471213 8226692 5539993 543876 -703859 4435378 10808905
40039 10808905 10216140 2585977 -1966881 3146715 10043989 6984366 -3686963 -9068116
40031 -9068116 -6123193 -5406292 -11652951 -14936241 -8663015 -3045292 -8700785 -17473745
40023 -17473745 -14868590 -4648911 -3605538 -14267100 -20809588 -14247310 -4796489 -3283737
40015 -3283737 -5139564 -1777542 4264419 6490952 7716938 14130143 21638674 19984598
40007 19984598 8172220 -4243454 -10189518 -10417689 -6244787 3866645 18474474 31375049
39999 31375049 39024591 44514191 50869695 54740262 51033997 41511714 34145536 33436197
39991 33436197 34537416 29285269 16944851 5917561 3837917 9030223 14431025 16929719
39983 16929719 17824495 15942757 7813795 -3845588 -9212034 -3360377 6131113 8906167
39975 8906167 5296523 4078339 9020055 14124834 12631803 5662469 -183940 -1070605
39967 -1070605 795434 1727650 2123421 5012250 9507076 10514617 7797081 9496661
39959 9496661 19719150 27691542 20296583 2855609 -6710172 -5136050 -8053411 -21056501
39951 -21056501 -25400862 -6332611 20077011 27835253 18267347 14093299 21778086 24341924
39943 24341924 12870299 1158826 1569272 7106737 8602430 11818804 22981266 31363781
39935 31363781 23362877 5352367 -3793192 2078043 13349478 23021605 32842111 41509703
39927 41509703 41126180 28929111 12679889 1337364 -2288766 1259217 10169571 19890866
39919 19890866 27864546 40130954 63582873 90553274 102752954 94534714 80550531
39912 80550531 73977312 69337342 57272182 45237103 47724940 61467331 67860293 60493493
39904 60493493 54328441 63478946 84398469 108147364 135536517 167977689 192813196
39897 192813196 193094589 169645916 141135553 122395874 112728771 105077084 95252634 80093503
39889 80093503 57893692 35707629 26912286 35099020 47454627 50274260 44667527 40697928
39881 40697928 42489979 46685114 50113970 50774340 45827640 37046190 33679467 40530957
39873 40530957 47619827 42605407 29479119 21848615 20804278 15943892 8203382 11754786
39865 11754786 27365005 34339444 21635292 9143683 19714831 43280340 51138345
39858 51138345 38501814 28334399 33692469 40693648 34749163 22122465 14897972 12129665
39850 12129665 8811493 9340910 17716615 25533928 24507277 21654600 26743901 33125213
39842 33125213 28479880 17983952 16702405 22270187 17404369 1067557 -5843900 7036420
39834 7036420 22672153 23850489 18883666 24767889 39139664 46738034 44082207 39962614
39826 39962614 37618375 33655454 31536533 40494486 61971470 89627317 120427548 153519912
39818 153519912 182044772 200165359 214347532 231441143 238870731 216459445 168661954
39811 168661954 124745080 102735737 92312340 78739700 63367808 51658356 40829704
39804 40829704 31428021 32974299 44398398 46593021 30848507 17797873 28054492
39797 28054492 48729758 52816963 40690950 35295422 41753367 40749486 24074161 9965952
39789 9965952 14504761 28669665 34803891 30418064 24859738 23803315 26723384 31595316
39781 31595316 34699839 31839005 23975845 16000116 9355173 3866392 5182490 17872570
39773 17872570 31167187 27033404 5987173 -10509399 -8910166 565672 4216984 4965165
39765 4965165 11266349 20059524 24212920 26091009 30271942 32073995 26869384 22316788
39757 22316788 26910383 33617484 30274115 20608012 18680770 25990185 30782181 28804876
39749 28804876 27946838 31084381 30733052 24574000 21106805 23804818 23221433 12828576
39741 12828576 1227422 -502043 6153101 14805722 28006140 50100234 70854936
39734 70854936 70940599 45670124 12616264 -7882296 -11564922 -6182933 2243719 11296324
39726 11296324 16068519 11605537 1362344 -4819677 -2846868 2054747 5532875 10177302
39718 10177302 17505583 21754686 18613841 13958228 15266600 19006922 16422869 8524460
39710 8524460 4181044 5183683 5514656 4942896 9233552 15040312 10479532 -3651197
39702 -3651197 -9423797 1861142 14181724 11204463 2557584 7655049 22968515 27011619
39694 27011619 14374389 2628791 3074387 5580180 338018 -3405277 6527969 22442828
39686 22442828 25441066 12036132 -1388756 -870219 8563477 11940133 3846539 -6114449
39678 -6114449 -6215749 2972494 9948925 7405809 1298469 1431427 6828581 7088752 -2345142
39669 -2345142 -13272010 -15240205 -7598166 2185572 8425764 11640414 14792620 18268630
39661 18268630 19010534 14236514 6062887 908412 2435118 6650647 7047320 3470322
39653 3470322 2052431 6495663 13225265 16020915 12721527 6768244 4154142 8533856
39645 8533856 17036209 21611452 17228370 8066131 2848834 4918022 9799269 11418643
39637 11418643 7346394 -1033203 -9664372 -13508378 -10640987 -4755944 -1260450 -1822763
39629 -1822763 -4807836 -8614947 -11346087 -9890858 -3429430 4561374 11596766 19910914
39621 19910914 30085127 35488780 30336433 20018444 15304134 18507564 23526560 26987712
39613 26987712 29587698 28231640 18505454 5627921 1370995 7624828 13774806 13371503
39605 13371503 12292346 15986238 19725824 17951917 13795427 12328045 12548414 12707591
39597 12707591 15525084 21291641 23930968 21227630 20568631 26198271 29396152 21562896
39589 21562896 9359097 4983293 7616789 7560512 4237920 5744929 12305871 14577949
39581 14577949 9552435 5335511 7531556 12159283 15114554 17921457 20265991 17215242
39573 17215242 9064570 4672262 8929265 15118282 16439214 17508469 25953520 38042953
39565 38042953 42101812 34156974 22335898 15997851 16273196 17393285 13034977 1438157
39557 1438157 -12610191 -21564417 -23016772 -21598757 -20924931 -18195704 -11347205 -6320065
39549 -6320065 -9056228 -13495023 -8209346 4833196 9947950 657612 -8074481 438655
39541 438655 20329737 30424597 22551708 10063762 6904768 10134072 9198414 3652542
39533 3652542 2319447 8441726 14801466 14538824 10477992 10482161 16280664 20207965 13809545
39524 13809545 -1195790 -12640085 -10565740 1239578 9973485 9355398 4992108 3394047
39516 3394047 2825657 -682896 -4704455 -4624687 -2105552 -1784443 -2493586 168429 4307386
39507 4307386 3404117 -2681541 -6689928 -4723446 -130604 4394776 10136957 15651859
39499 15651859 15427292 8999407 3674617 3947757 5519638 4191568 2833905 4018493
39491 4018493 3910357 778211 1665172 10933221 18559506 11663245 -5655272 -16232166
39483 -16232166 -13027329 -6541924 -6949515 -9632505 -3744278 12159158 28673820 35593028
39475 35593028 29748541 16474905 6130950 5914422 12888537 17880183 16886480 14267126
39467 14267126 14008091 14174598 12934400 13697792 18979491 23851322 21859988 14701413
39459 14701413 9729750 9477179 10026054 9118580 8893742 9459188 6999849 2068155 3508176
39450 3508176 17296204 34285515 36769177 18504594 -7242419 -21909625 -19633874
39443 -19633874 -8392828 2121789 8103589 9257178 6087471 1732381 1319495 5525015
39435 5525015 7851872 2884974 -4503391 -3975256 5434893 11378685 3522413 -11129805
39427 -11129805 -15094016 -2008097 16005793 24745512 23701934 19451146 11012804 -6244949
39419 -6244949 -24710833 -27445739 -11652088 3500119 1546911 -8457443 -5503710 13613318
39411 13613318 31753087 35652042 28353345 17028209 2966743 -11560808 -18968474
39404 -18968474 -16789358 -13973382 -19127595 -28782676 -33961177 -32238981 -26298017 -16449393
39396 -16449393 -3039561 7802134 9577534 4687764 999109 824666 281858 -1885093
39388 -1885093 -2415591 -495145 308444 -1712430 -3839516 -4082143 -4188565 -5831275 -7509125
39379 -7509125 -6836334 -3234191 2448719 8554271 12660190 13592955 13314551 13969663 13269380
39370 13269380 6472867 -5998175 -16166102 -16159281 -7175758 1156023 866287 -5565419
39362 -5565419 -7829841 13088 11772045 16357545 11583749 6246356 8096286 15125732
39354 15125732 21139845 24857583 29283525 35373951 40486312 41184600 35102243 23045210
39346 23045210 11621458 9421481 16807388 23720362 22173205 16685457 16652342 22154388
39338 22154388 24484421 18872442 9571002 2435356 -1560526 -4584686 -8007890 -10954115
39330 -10954115 -10557347 -4960499 1928975 2254715 -5335261 -11008330 -5143972 8656951
39322 8656951 18093011 17136680 10081271 3108850 -826122 -236920 3994857 6210869
39314 6210869 1550399 -6050077 -8130081 -3892935 -1208598 -5129377 -12231372 -17008975
39306 -17008975 -17266970 -12563665 -4202980 2090034 48593 -9303261 -19441262 -27610895
39298 -27610895 -34787225 -36741243 -25646192 -4062376 12330018 12322546 2963387 -535179
39290 -535179 6100180 13422405 11936870 3361168 -1380843 6469931 23138189 33879024
39282 33879024 28116130 11993074 1004772 1303662 5070998 4100752 -475919 -3702016
39274 -3702016 -3475780 1548931 12808963 26190405 32211455 26202485 12818764 -1987680
39266 -1987680 -15922775 -24433802 -19825904 -2731009 14056212 20844759 22768222 28358198
39258 28358198 34351823 32489493 25325238 22560126 24248224 20384275 7935891 -3042027
39250 -3042027 -3713816 1812660 3854995 510409 -1508237 2977394 10380110 11701577
39242 11701577 2791624 -9202651 -12074278 -2585049 8787863 9691226 -418269 -11297312
39234 -11297312 -13364394 -4683417 9837479 21566368 23394946 16821340 11526626 13587651
39226 13587651 17388810 14565974 7249952 4905614 10006233 15130639 14373209 9795046
39218 9795046 4945635 -809052 -8097771 -13035779 -11309906 -4394758 1513589 2235912
39210 2235912 114771 1743319 10290270 19845658 20465594 10776460 1491013 2410381
39202 2410381 10022040 13913273 11928914 10850950 13707562 15924444 15275305 16277291
39194 16277291 20658366 21274018 11790993 -2244368 -8265576 -747855 13700059 23627900
39186 23627900 22035644 10503073 -2526060 -8777480 -7899797 -6824339 -9899387 -12796190
39178 -12796190 -9299690 -891230 5546410 7994629 11286686 18234160 24505230 25002960
39170 25002960 20741791 15484345 9276331 823022 -5947334 -4922668 1894665 4539145
39162 4539145 -885331 -4966177 1965106 14574560 19061899 12917277 8290293 14056403
39154 14056403 23593664 24920594 16086211 4706550 -2899373 -5874532 -5247773 -2395003
39146 -2395003 25189 422268 1171778 5625850 12662783 17016670 14752967 6875185
39138 6875185 -1455569 -4515824 -1070773 3540329 3618975 1722308 5800268 16334548
39130 16334548 23429484 20767588 15310894 16585508 22361187 23406438 18393785 14758468
39122 14758468 16444484 19536125 19936545 17862878 14405737 10401296 9256075 14590171
39114 14590171 24038857 30582550 30837361 28006734 27028262 30470226 37259104 41260622
39106 41260622 34679954 18700146 6396876 7325000 13864905 12934443 6628749 7659462
39098 7659462 16790094 21382177 17943791 18541532 28813239 36460091 31579561 23686276
39090 23686276 25546067 32188165 31231375 25031646 25506449 31966567 31508937 20635972
39082 20635972 10616239 9404496 12284239 14186615 18451838 27232901 33664625 31372447
39074 31372447 24688791 22063243 24366184 26495503 26806753 28202434 31806330 35543585
39066 35543585 38657869 43105878 50063335 58079067 65013994 69743246 72058538 72739800
39058 72739800 73585789 75699764 77703326 76969345 72743259 67154598 63302084 63254904 67588029
39049 67588029 75298437 83567671 89001136 90864981 93079307 101334496 117233957 136215188
39041 136215188 152143047 162705280 168883460 170978387 168613175 164366663 163228746 166525897
39033 166525897 169178143 165349883 155220403 144466349 138567756 138723435 141103989 138856371
39025 138856371 128002854 113597366 106513991 110715406 117283701 115905311 108885578 106849445
39017 106849445 112653907 118814238 121909060 129184017 145267133 160980535 164550924 158745195
39009 158745195 156090816 159143399 157609748 146997007 137725436 138836045 142837975 137413680
39001 137413680 125325967 119362070 120331446 115098316 98464128 81993273 74532902 68074014
38993 68074014 54331557 43453800 49553067 64057341 62780884 39817391 16224231
38986 16224231 10316165 16221405 20435704 23802114 33101677 42261604 39329582 27196909
38978 27196909 20857973 24857627 28232341 23371989 16133194 13336148 12696253 11280508
38970 11280508 13310880 21651643 29665603 29941619 25091410 21989913 20916993 19008343
38962 19008343 19233795 25269618 30573695 24879454 12014604 8921544 22553541 38131272
38954 38131272 37631787 22542097 9646617 8839968 14496166 17358107 15820166 13499282
38946 13499282 12519741 12731443 13360009 12437230 7990823 2691878 4100298 16355296
38938 16355296 33268503 43418414 41640832 32647407 23988518 18923268 16592151 15657826
38930 15657826 15579340 15903865 16215273 16331898 15776343 13948478 11698401 11720506 15964393
38921 15964393 22876915 28249649 28776416 24192124 16608501 9350224 6273595 9408346
38913 9408346 15096992 14589769 2968385 -12014306 -15247607 -2288154 11887647 8762703
38905 8762703 -10247901 -23986017 -17214528 1453755 12059937 7117235 -4585369
38898 -4585369 -13356889 -17647266 -18248580 -13725780 -5467884 -74357 -1524356 -5322733
38890 -5322733 -4871436 -236645 3575952 4080421 2551752 -163542 -4483816 -9215566
38882 -9215566 -11259586 -8487262 -1567823 5989074 8837650 3842971 -4679218 -7080533
38874 -7080533 744750 11310499 14383661 9410261 4286619 3623179 4081479 1226435
38866 1226435 -4494312 -9807921 -12575951 -12665411 -11969103 -13470142 -16899049 -16523231 -8349465
38857 -8349465 1473969 2523714 -4896055 -8703159 -2002927 7101003 8151494 3333883
38849 3333883 1758019 4218369 3779430 -568945 -1325776 4991840 11408367 10212486
38841 10212486 3244998 -1225261 1850946 10146335 16162702 12537069 -628639 -12836580
38833 -12836580 -12891243 -2989328 3166028 -1298487 -7750615 -6619794 -2341709 -4859496
38825 -4859496 -12211626 -13267105 -5701222 891871 1012352 658157 4550881 6732311
38817 6732311 1469580 -4390924 515665 15775872 29895139 35383031 34940123 33040417
38809 33040417 29393489 22811532 15504635 10353497 7306824 4525490 614354 -5130876
38801 -5130876 -11954834 -16698153 -16701192 -13971465 -13126838 -15050988 -16468683 -15825751 -14546548
38792 -14546548 -11922931 -5392249 1616325 -390396 -13494705 -24877908 -20815021 -4843201
38784 -4843201 6353221 3696192 -5956472 -11914679 -11214212 -6520428 -1473655 -1820327
38776 -1820327 -12582319 -28039780 -32004512 -16603190 4059105 8405214 -6869082
38769 -6869082 -24833337 -30845827 -26532662 -19865688 -12572750 -3615569 2973759 2240405
38761 2240405 -3519222 -7838722 -9080397 -10396873 -12850731 -14841417 -17083188 -21664249
38753 -21664249 -26368878 -26365557 -22316148 -20332491 -21758898 -19436299 -8619546 3028808
38745 3028808 2680576 -11276411 -25317338 -25180344 -11753522 116459 -1224379 -11050785
38737 -11050785 -15383042 -9949767 -5505082 -11014057 -18489264 -13200751 4332137 17617076
38729 17617076 16469227 8884708 6037719 5975862 1081376 -5928313 -5396435 2527204
38721 2527204 6156602 -1178068 -11959638 -15231857 -9811749 -2994585 -1301182 -6487367
38713 -6487367 -16330993 -24515814 -22780648 -9040315 6998821 11419471 1074758 -12141666
38705 -12141666 -14305566 -4801874 4105382 2166363 -7804057 -14649557 -11458535 -948201
38697 -948201 9412265 13957406 11338471 4486958 -1241023 -2969353 -4129692 -10472977
38689 -10472977 -21432464 -28764793 -25643794 -14602078 -4290609 138667 1510414 5730329
38681 5730329 13012988 15047960 4020383 -14520426 -23441235 -13928046 1480640 4153104
38673 4153104 -6159890 -13256549 -8896891 -1169800 3007856 7692270 13942260 11871450
38665 11871450 -2290340 -14446673 -11784861 -3107082 -4388166 -12247664 -9604097 6541961
38657 6541961 21011638 23578966 19862937 17553297 16338674 14507160 13235685 11470534
38649 11470534 7070413 4065826 7749770 12736382 8894857 -676102 -2711028 3365229
38641 3365229 2464332 -11257250 -23275858 -20727298 -10542164 -5444726 -5006770 -2281116
38633 -2281116 1399431 424423 -4020133 -7257080 -8777385 -8266392 -1849740 9422902
38625 9422902 15842396 12306691 6359795 4446165 897704 -8558594 -13577851 -3826155
38617 -3826155 11822892 16159787 7684289 -854121 -2585301 -511300 3595264 8695131
38609 8695131 6845386 -7450814 -22414292 -20168579 -2482913 10602389 8549833 950419
38601 950419 -1348442 226068 1274390 2746456 4562411 2841474 -1969755 -4812693
38593 -4812693 -6217020 -10715633 -13472119 -3788612 13613566 17309355 -2131147 -26240867
38585 -26240867 -31864885 -18588894 -2534517 6015209 6541758 -701279 -13400359 -22131165
38577 -22131165 -19416843 -11302422 -9952054 -17473820 -25992990 -30495503 -32189394 -31487333
38569 -31487333 -27066749 -21187198 -18083637 -17356418 -15107473 -10491423 -5620839 -1150860
38561 -1150860 2289660 1234944 -5382879 -11216543 -10542760 -8757148 -15655867 -29211469
38553 -29211469 -36084515 -29897084 -19548036 -15481485 -15903574 -12952919 -6974568 -6429914
38545 -6429914 -14462849 -22517500 -20302756 -8611472 1893805 3857220 536669 -1718606
38537 -1718606 -3164092 -7642864 -13528251 -15460243 -13827466 -13478112 -12555352 -3564244
38529 -3564244 10966604 16027225 5191289 -6842788 -4412634 4925235 1151201 -17767215
38521 -17767215 -32388967 -29119921 -16024691 -7569842 -6605799 -7921325 -9429931 -11824447
38513 -11824447 -13683161 -13900570 -14548343 -16366944 -16029790 -12115951 -8519147 -7365588
38505 -7365588 -4401653 2687986 7041737 1625957 -8182762 -9948076 -1326521 6367457
38497 6367457 3337765 -6508025 -11758983 -7782514 -1197851 -1481903 -10392487 -19823109
38489 -19823109 -19839661 -8939608 4258149 9700083 4808071 -5626722 -15524232 -21124152
38481 -21124152 -20766011 -14850617 -6341052 548632 2546683 -1552540 -9796456 -16469169
38473 -16469169 -16032608 -9909734 -5863392 -7483448 -8310101 -1538883 7900969 8391631
38465 8391631 -2216548 -13300286 -15578372 -11272424 -7297642 -4966618 -1374432 3480914
38457 3480914 6399052 5634610 1904221 -3368336 -7663016 -7600966 -3102410 726762 -624432
38448 -624432 -5200462 -7748286 -6584807 -3599179 187327 4189382 5028598 -404824
38440 -404824 -8365476 -9955502 -1165577 12070737 19954450 17355493 6247682 -6881168
38432 -6881168 -15314544 -17017952 -16509832 -19778661 -27124793 -33252394 -33953214 -29721634
38424 -29721634 -23218768 -16795502 -12749400 -12574788 -15190042 -18130231 -20031058 -19798848
38416 -19798848 -15509463 -7811655 -1825427 -748060 -552557 2654823 3756708 -3583021
38408 -3583021 -13006723 -11737995 -985282 3804494 -3351989 -9197812 -2110985 10474726
38400 10474726 15270040 12317803 9555180 8040476 5406700 5840019 12735858 17905754
38392 17905754 12434213 2801733 1068537 3843604 -1843433 -14536990 -19053079 -11549401
38384 -11549401 -4796706 -5121818 -3196059 5585136 9906587 2042438 -7098825 -4932994
38376 -4932994 3440952 6103219 3897047 4604055 5570520 -2062167 -15632430 -22175985
38368 -22175985 -16996192 -9151845 -7411528 -10250387 -11587439 -9335694 -6345074 -7131468
38360 -7131468 -13825176 -22523710 -25770773 -21473262 -15438132 -11792281 -6888801 2030897
38352 2030897 9002600 7908124 2833302 873975 156204 -4567779 -9390161 -6790347
38344 -6790347 -566588 -1514993 -9064578 -11481286 -5750622 -2609991 -7563581 -10969868
38336 -10969868 -4196238 6557237 11561849 12436553 15416285 18104522 14646928 8385720
38328 8385720 7134949 9101646 5811199 -1996373 -4055525 1792676 3790202 -6055068
38320 -6055068 -18139965 -17922777 -6611766 747375 -3995343 -13050282 -16153214 -14356050
38312 -14356050 -14847236 -17835860 -16598798 -9019594 -1320882 1218464 870550 1699374
38304 1699374 2710168 1472121 348898 2901618 6156284 2984015 -7792410 -19263681
38296 -19263681 -25162271 -25603830 -22932788 -17335298 -9528410 -3422950 -2056708 -3326748
38288 -3326748 -3208683 -1377616 -461981 -1286219 -2247625 -2595257 -3147209 -4093356 -5017263
38279 -5017263 -6877305 -10766469 -14572728 -14792461 -12955585 -15659872 -24585027 -30630951
38271 -30630951 -24698541 -12686613 -10818845 -23362710 -34006393 -26759565 -8765015
38264 -8765015 -1378520 -11243678 -22919724 -22129574 -13656549 -9590766 -10355037 -7763202
38256 -7763202 -667819 3715934 1973988 -1470240 -2057584 618584 5494993 10047946
38248 10047946 8785683 -851119 -12181870 -16824727 -17198402 -21800520 -28536292 -25058919
38240 -25058919 -8834370 5556355 5892936 -1364183 -2801769 2771635 7255342 8458819
38232 8458819 10284649 11645037 7842047 2169574 3982275 13344977 18578321 13037192
38224 13037192 4713188 3283504 5572997 1819119 -8592845 -16282741 -15038879 -8277768
38216 -8277768 -2204244 770035 34582 -5666077 -14535773 -19517286 -15213009 -5786328
38208 -5786328 -763404 -2561976 -3543908 2091233 8700548 6793715 -2961932 -10450522
38200 -10450522 -10476852 -8960066 -12446887 -18335885 -20357239 -18653168 -18229550 -20336585
38192 -20336585 -21534456 -19846338 -16401542 -12160650 -8231599 -7929976 -12448019 -15809331
38184 -15809331 -11635216 -4651891 -6405559 -17475425 -23672863 -15098803 -285018 6064698
38176 6064698 2081443 -3855353 -8774849 -16157436 -23746655 -23445124 -15335303 -10119499
38168 -10119499 -12838054 -14044991 -4018600 11965915 20681438 17903144 9869303 1470526
38160 1470526 -7744029 -16631990 -20248269 -16588860 -9815719 -5048230 -4281392 -7969966
38152 -7969966 -15343497 -21662830 -20381484 -10784252 298440 6720361 9436977 12510895
38144 12510895 16532424 19164487 19359377 17888293 15798015 14734349 16226611 18239611
38136 18239611 15722114 7940435 1799767 3075359 7100245 4276377 -6447973 -16377623
38128 -16377623 -19605314 -19462710 -20068710 -18877084 -13264572 -8844128 -12650273 -19928588
38120 -19928588 -17291133 -1782473 11272957 6065267 -12537253 -23845963 -16682912
38113 -16682912 -1581558 4981045 928546 -3213599 -1481362 1272307 -133522 -3326211
38105 -3326211 -4458539 -5585992 -10452952 -16747722 -18549026 -15104614 -12014235 -13768852
38097 -13768852 -19153875 -24012067 -24641670 -18397185 -5625272 7375013 11567091 4405282
38089 4405282 -6679964 -12535095 -11416414 -7062664 -1055531 7292486 14545493 13596861
38081 13596861 3219631 -7921378 -11151756 -8482660 -8529333 -13833443 -18304628 -17330499
38073 -17330499 -14066269 -13023276 -12559472 -8156314 -41294 7182519 10895992 11976252
38065 11976252 10768669 6234444 -312045 -4841903 -5846894 -6851814 -11124928 -15689368
38057 -15689368 -13775292 -3582739 7785172 11274960 6204941 776246 1130891 3505430
38049 3505430 1105864 -4480954 -5777093 -2345154 -2217295 -8326330 -13317124 -13016251
38041 -13016251 -14960950 -24669441 -32448169 -26455603 -12873910 -8422055 -15569075 -20778826
38033 -20778826 -17559318 -14862424 -18591187 -20432677 -12834899 -2258289 1797951 927557
38025 927557 1897547 5280507 8726865 13371081 18229092 16503167 6874556 16801
38017 16801 3164109 6683909 -1083514 -13170275 -13693244 -3269860 2483572 -1637541
38009 -1637541 -4379806 42071 1178512 -9143367 -21067775 -19544916 -4574798 10683119
38001 10683119 16954098 16021977 13609892 11813477 8906042 3639856 -1270774 -1256825
37993 -1256825 2973502 3495467 -5116761 -16861139 -21205259 -16545364 -9521019 -3488720
37985 -3488720 2701692 5970808 1277520 -5879396 -2409609 11784214 18547058 5179219
37977 5179219 -16678927 -26155141 -19564238 -10302488 -7455276 -7214496 -4609974 -1918775
37969 -1918775 -2288987 -3266827 -1145403 2928424 4935077 3494908 727373 -1032780
37961 -1032780 -1558823 -2161837 -3706387 -5691994 -7775854 -11445945 -18127910 -25531155
37953 -25531155 -28602280 -25338374 -19479601 -16287258 -17751337 -22568407 -27603214 -28039244
37945 -28039244 -20162329 -7142172 1193190 -1522606 -10122530 -13801592 -8601383 193006
37937 193006 6960804 11329734 13593295 10420372 13568 -11372137 -14331089 -8298524
37929 -8298524 -3136710 -6037892 -11666699 -10311837 -2472899 1584233 -4006417 -14032909
37921 -14032909 -20361796 -19785718 -12583937 -1694525 3707430 -6300201 -26683148 -36320682
37913 -36320682 -22404133 791186 8954931 -1277534 -11511529 -9472315 -2799732
37906 -2799732 -2404106 -5710248 -3820455 3396087 7588386 3390622 -6149509 -13951008
37898 -13951008 -15724699 -13325929 -11726974 -11986284 -10247194 -6244282 -6863265 -14596050
37890 -14596050 -18778215 -9331688 5057293 6540133 -5349746 -12721304 -7471486 -3518827
37882 -3518827 -13270306 -27111113 -28751990 -20213215 -16785753 -22437497 -24731429 -14451480
37874 -14451480 923801 7117642 248672 -10062415 -12755102 -7123122 -1012410 1015315
37866 1015315 2549271 6416707 7848302 3005234 -1849223 770768 6384792 5731062
37858 5731062 1050827 1323891 4127806 -1087196 -11911501 -13616172 -3656174 3434804
37850 3434804 793149 -833448 4261542 4559436 -6428562 -14874546 -8520044 2834017
37842 2834017 4723798 483472 -577928 -2072554 -8339373 -8018720 7633433 22198241
37834 22198241 14906013 -4919152 -10796988 -846134 1459639 -12838324 -25687146 -23312435
37826 -23312435 -14248827 -8973298 -4739978 -221360 -4446911 -19069281 -28588285 -20986387
37818 -20986387 -5218895 2962897 1267703 -3203857 -7564768 -12035444 -13819721 -12054605
37810 -12054605 -12228065 -17463066 -21690959 -18783373 -12376108 -9736118 -11493337 -13914037
37802 -13914037 -16207287 -19290485 -21327542 -19858607 -15464869 -9993661 -4339743 214979
37794 214979 2522646 4378169 8056267 11025299 9024318 3990258 1759768 2250361
37786 2250361 97331 -5224971 -9197352 -12129398 -18622232 -26230562 -26258604 -18262386
37778 -18262386 -12021998 -11746373 -10444519 -4506336 -1257262 -5357136 -9335522 -5786659
37770 -5786659 961363 3573048 3054909 3153602 1995734 -1959049 -3373544 1492764 6398362
37761 6398362 4023706 -2609223 -5949192 -5291736 -3714637 645029 10206575 18432557
37753 18432557 14924639 -393108 -15760512 -20662534 -15245873 -6607217 122079 5565591
37745 5565591 11839507 15749505 10330448 -3704588 -14037717 -12359274 -8366908 -15643052
37737 -15643052 -27433141 -23667154 -2679015 13445323 10822204 2034865 2878650 8788625
37729 8788625 7786560 1595302 -1694840 -3646994 -8197892 -9047394 -873010 6017171
37721 6017171 -594011 -13933337 -18254674 -13275233 -10918434 -13170046 -12104008 -8641872
37713 -8641872 -11819241 -19838144 -20210176 -10153190 -252294 3683667 6152462 7638245
37705 7638245 1825755 -9077934 -12663389 -5587744 361284 -2307462 -5571284 -1464026
37697 -1464026 4668512 5496304 4451019 7037932 9295018 5781742 1401078 3979766
37689 3979766 10064859 8959517 -1258417 -10886275 -11479568 -4494126 3909006 11406925
37681 11406925 19947582 29074671 31966839 21907305 3494940 -8265735 -5111649 3293164
37673 3293164 3024232 -3900181 -4187567 4242853 8578716 2003881 -5884984 -5525126 -1722237
37664 -1722237 -2764538 -5372933 -1377781 7308047 11499031 8884751 5354438 3837832
37656 3837832 733949 -6276967 -13878687 -17953027 -18265215 -17354658 -17520220 -18941782 -19135090
37647 -19135090 -15473395 -9354282 -4993397 -2405486 4058708 16379286 25993510 22126805
37639 22126805 5853831 -9318239 -11650867 -2961511 4290416 -157502 -14556453 -27108517
37631 -27108517 -27983008 -19352253 -11983600 -12317126 -16262525 -16515194 -11790469 -6155403
37623 -6155403 -2567248 -730538 420542 1386898 2497702 3505414 3582183 2949066 2855805
37614 2855805 2600978 -1075772 -9258483 -17300256 -18871518 -12941402 -4487033 1487357
37606 1487357 4708796 8016427 12111657 13123059 6659092 -5195260 -12927186 -8576571
37598 -8576571 4513891 13854268 10589735 -1933454 -12971647 -15502286 -11487984 -7921265
37590 -7921265 -9164497 -12715201 -12135216 -4401012 6420509 13572152 14302769 10986801
37582 10986801 7738760 8180061 14138635 22867537 27092966 21906334 10808274 1208803
37574 1208803 -4746200 -10250906 -15872736 -17473703 -12991661 -6200587 -2052081 -2167315
37566 -2167315 -6000877 -12356922 -18289252 -20105255 -16957122 -10798057 -2733080 7045446
37558 7045446 15941345 20070219 19036534 15263745 8762235 -1981069 -13597480 -18737453
37550 -18737453 -15146382 -8070486 -1883409 4352820 10559615 11937974 6124487 -1474404
37542 -1474404 -4379497 -2727781 -8620 3254062 7569311 10188937 8092656 2454179
37534 2454179 -4245841 -12199890 -20687920 -24337701 -19172611 -9937088 -4986623 -5367690
37526 -5367690 -5549081 -4382701 -7837990 -18554764 -28723689 -28045671 -16410650 -4654454
37518 -4654454 -2702264 -9413363 -15308899 -14061577 -8794975 -6093202 -6553696 -4917096
37510 -4917096 1469904 9047083 13663868 15085237 13855714 8458622 -515790 -6957431
37502 -6957431 -5085555 2645533 7854751 6060808 582552 -3241452 -3942920 -2842030
37494 -2842030 -147088 5038910 11406228 14748446 12278226 6748424 3889238 5340271
37486 5340271 6836192 4821278 1689002 1575023 3959234 5642520 6632056 8825613
37478 8825613 10480950 7933029 2149726 -2408676 -5021757 -8246404 -10357275 -5919058
37470 -5919058 4762944 14326311 18457674 19690421 19065077 13192102 3720194 97642
37462 97642 6077043 11719628 7124452 -2748933 -6210331 -2058208 1809314 3063304
37454 3063304 6649436 12835539 14640293 8912283 957498 -4427953 -8785054 -13668039
37446 -13668039 -15430118 -10925150 -3603606 866914 2038946 3202721 4237672 1034588
37438 1034588 -6847820 -12000845 -6862874 5057153 10951919 4755621 -3368421 6557
37430 6557 12251960 17844082 10939433 3456423 6114289 12326969 9714115 -529004
37422 -529004 -6753427 -4631078 -831109 -1177281 -5155975 -11107035 -17502098 -19613517
37414 -19613517 -14060358 -6482619 -5401867 -8456874 -5302379 4351472 7585386 -1796184
37406 -1796184 -11238897 -6199746 8521006 14743986 5141179 -8507169 -12111647 -6287502
37398 -6287502 -2412899 -6071143 -10473046 -7162705 1526378 5620052 1663870 -3053721
37390 -3053721 -2548950 -1114712 -4542973 -8867852 -6997520 -2582235 -6118442 -18101485
37382 -18101485 -27589263 -29023395 -28667936 -30317247 -26555306 -12044240 3982466 8475869
37374 8475869 1813592 -5231736 -7273109 -7374655 -7382881 -5401347 -2364310 -1989178 -3410778
37365 -3410778 -1974755 1422108 123312 -6301830 -7974353 1751245 14497642 16211729
37357 16211729 6170983 -1096044 5118856 16561968 15739560 -512338 -14399527 -8870273
37349 -8870273 8745674 14177537 -1962269 -20510496 -18739269 -313211 11356203
37342 11356203 5267565 -5905529 -7559875 -1723205 2295620 3753910 7072749 10683384
37334 10683384 10186454 7760644 8008699 7936098 1720325 -6823113 -7845761 -943371 4448371
37325 4448371 4843676 6587074 10989778 8388646 -6360698 -23100441 -29299108 -25449245
37317 -25449245 -19551652 -14266856 -8678517 -5562743 -6358338 -4521439 5230737 15705148
37309 15705148 16562603 10789588 9406910 12667565 10523842 1406244 -3925115 179475
37301 179475 6126719 6513806 3749866 1069788 -4875578 -15500164 -23393853 -21488772
37293 -21488772 -12791071 -5049106 -1306070 -301105 -383549 1008566 5909547 10790777
37285 10790777 9412184 2733130 -2104161 -4374763 -10707483 -20321611 -22156246 -13064350
37277 -13064350 -5983777 -10737290 -18341300 -15603821 -5200566 1425237 2907935 6171049
37269 6171049 11628462 13303753 10188498 6443846 3409832 213517 -2328568 -6053305
37261 -6053305 -16042035 -28169093 -26708058 -6836130 11707464 9931347 -1581148 634857
37253 634857 15171594 18583191 3122113 -13199338 -16462247 -13544551 -13650606 -14259681
37245 -14259681 -12707741 -12730577 -11656804 714703 21715110 31908797 21849384 6647382
37237 6647382 3137648 7976664 10022337 9376799 10598005 10065625 4149995 -1153904
37229 -1153904 -1696209 -4853836 -14624698 -19503097 -10769116 -1008186 -5962033 -17434131
37221 -17434131 -14878700 1952467 13199060 9464845 1584540 -1262269 -3973422 -11677098
37213 -11677098 -19602720 -22711956 -22765201 -20594073 -12639786 -295587 7373960 5311487
37205 5311487 -1598071 -7894573 -13878318 -18863662 -17700737 -9510590 -1749946 267587
37197 267587 816516 4791997 7918961 3173463 -7337898 -14062770 -11813807 -4764646
37189 -4764646 -662284 -3525208 -11017815 -16573341 -15164407 -8394137 -2435146 -448072
37181 -448072 431366 3990746 9964901 15231044 17062537 14290524 8300300 3666997
37173 3666997 4321010 8077016 8750811 4890654 1874727 3153422 4481433 1185063
37165 1185063 -2863297 162103 9760192 16032477 12672957 5836102 6099108 14578352
37157 14578352 22179836 22072208 17206520 13256328 9510193 2241253 -6048666 -8261512
37149 -8261512 -3758525 -452904 -3221971 -6727414 -4325276 1128209 1554326 -4293718
37141 -4293718 -9527292 -9030638 -5115908 -2847100 -4126552 -7611474 -11289307 -13291014
37133 -13291014 -11428542 -3560810 10165519 24271556 29083787 19480445 3023527 -5784276
37125 -5784276 -1538475 6689494 8635444 5414948 3922616 4566919 2458849 -2093268
37117 -2093268 -2573387 4146872 13399979 18661027 17479742 11519732 4808305 1761281
37109 1761281 3210952 4789409 2470108 -1534963 -2032982 1449815 4273865 3005121
37101 3005121 -1367236 -5226248 -4381365 3152091 12823484 15168703 6340837 -6054454
37093 -6054454 -12461359 -12933672 -13380988 -14705680 -13773446 -11972038 -13355371 -15657590 -12671444
37084 -12671444 -5351092 -1074673 -1181054 1160312 8821699 15842204 17609471 16990489
37076 16990489 16295536 11563967 601307 -9714677 -10560571 -2095983 7332879 10468631
37068 10468631 6823877 1480065 -223597 1185111 -684083 -8619129 -15181422 -12009625
37060 -12009625 -3206209 -445151 -5852672 -10259955 -8750193 -5997398 -3954837 2729031
37052 2729031 14075918 20207545 16443075 11398770 12059641 12306443 5937952 -220059
37044 -220059 1830276 6365600 4700384 2301705 9382564 20501132 20806809 10001910
37036 10001910 3008460 6416122 10173328 5213564 -4946446 -13783360 -19979998 -22019880
37028 -22019880 -16795151 -8210593 -5541402 -8385285 -5260688 6944700 14976582 9323558
37020 9323558 281160 2109453 10536353 10057895 -1877530 -12424393 -13381260 -10336013
37012 -10336013 -10260468 -11298788 -9114353 -5368858 -4663426 -7415683 -9887062 -9296431 -6765168
37003 -6765168 -6196375 -10341159 -16721174 -18821850 -13643809 -6273192 -3734999 -6063866
36995 -6063866 -7505290 -5346769 -2985491 -4268186 -8554323 -11672637 -9358379 -887243
36987 -887243 8170181 9493717 2305970 -3193436 1391642 9703557 9047152 245816
36979 245816 -1846722 9907042 23339119 23279589 11392586 1978980 3376874 11607108
36971 11607108 19153291 21712725 17005914 4403932 -12133031 -24711441 -26961482 -17936505
36963 -17936505 -1874300 13908368 22620462 22416556 16945518 10775346 6075314 3743993
36955 3743993 3651175 2690667 -2398680 -8783264 -10422057 -9169357 -14155299 -25595825
36947 -25595825 -29892748 -19598570 -7923257 -10472414 -21011528 -21907366 -13064549 -10429632
36939 -10429632 -16483754 -14375190 2660736 16871847 12687750 859020 484898 9361262
36931 9361262 10052692 -1319950 -10202969 -6260477 3916939 8691087 4982138 -2746467
36923 -2746467 -9170630 -11152989 -9205152 -7001293 -6255500 -3955806 1399106 4662778
36915 4662778 1348847 -3513630 -1779450 4675240 5767757 -2124659 -11142064 -12452673
36907 -12452673 -5494747 3707098 7641067 914827 -14758951 -28588388 -29759960 -19439560
36899 -19439560 -8566674 -3694234 -1303796 3032078 7016518 6625538 3661108 3656936
36891 3656936 7927673 11013358 6808386 -3324076 -10181953 -6982601 969659 1916106
36883 1916106 -6525618 -14119832 -13149229 -8489463 -7501935 -8731646 -8484276 -10097126 -16120231
36874 -16120231 -18493694 -9136248 4826995 9706252 5271687 2394372 3933855 3147450
36866 3147450 -614102 -941315 655830 -4749170 -16289261 -22857394 -21968108 -21774372
36858 -21774372 -21752435 -11822197 3326037 1689152 -22347212 -42852793 -37413541 -19072403
36850 -19072403 -13322563 -18698193 -14529824 1847922 11989899 7843363 2042192 4091896
36842 4091896 7047765 3730194 -802804 -528449 869388 -1757050 -5828767 -6599098
36834 -6599098 -4338561 -1123299 2738433 5410414 3430174 -1939691 -5014395 -5165782
36826 -5165782 -8869843 -19021811 -29338481 -33384802 -32394402 -29392092 -22006115 -7610759
36818 -7610759 8577025 17434202 16775843 13287777 13632984 16949142 17031683 10705417 3082984
36809 3082984 3196530 13369911 24832548 26600967 17347415 5299767 -1999491 -3431118
36801 -3431118 -899773 4156192 9770757 13340461 14053980 12640307 8754550 2156216
36793 2156216 -4090709 -6403535 -6721702 -10318169 -16756854 -19031558 -13722072 -5877032
36785 -5877032 -537141 4380889 11612108 16539391 13209042 5235787 2014785 4355574
36777 4355574 2970045 -5840574 -11786070 -5023849 6821051 6274062 -10219697 -26345069
36769 -26345069 -26963167 -16401861 -9526578 -11149217 -12835121 -6937610 4664574 14806510
36761 14806510 16910498 7912549 -7193649 -15112311 -7404502 6569817 9810696 1246397
36753 1246397 -2549100 8014514 21914589 24604967 16827271 7814282 432388 -6072825
36745 -6072825 -7207608 502937 10195730 13393253 13296425 17795979 23827138 21757628
36737 21757628 12656001 7565479 9963972 11929959 9008210 6695153 9383132 13667384
36729 13667384 16147380 18389651 20448582 18107219 10653958 3975819 2040249 1832514
36721 1832514 111678 -1181269 102634 1443078 -552478 -5279857 -9328253 -9599150
36713 -9599150 -5194402 259113 -55313 -7349961 -12526320 -7385738 2332681 4279408
36705 4279408 -2355200 -6931820 -4653245 -1578873 -1734529 -2145263 -2845156 -8202589 -14433501
36696 -14433501 -10169116 4089323 11153766 935574 -13443577 -14416746 -4421109 796748
36688 796748 -4531435 -12194439 -14075970 -8988648 603512 9099560 9159175 1303796 -2953872
36679 -2953872 3583079 11729025 9771862 2670383 3713724 11727493 12728049 3524764
36671 3524764 -2734596 2098544 9038949 7766932 2727035 4555729 13166099 18593150
36663 18593150 15175171 7685861 4447056 8960612 18105623 26029470 29509879 29499306
36655 29499306 26966922 19771744 7204188 -4469303 -6874042 -455145 4622011 238753
36647 238753 -10667196 -18274935 -16203221 -6938518 479659 -1758015 -12121027 -20314756
36639 -20314756 -19078026 -13341730 -12591858 -16085143 -13447497 -1041232 10194158 7600654
36631 7600654 -7476995 -21273609 -21954335 -9231436 7375014 16575707 13845432 4996218
36623 4996218 32175 2001186 4249724 143205 -7953982 -12280463 -9329788 -2117855
36615 -2117855 5366817 11865554 17462564 22039188 25484667 26909217 23655895 14046923
36607 14046923 1776620 -5540701 -4217961 1200887 3892878 3378305 4768198 9833312
36599 9833312 13240398 9818670 2144665 -2787863 -2480045 -209975 1662816 4488120
36591 4488120 8460122 10068958 7312378 3535867 2172179 446262 -6724585 -17295560
36583 -17295560 -21548526 -12907413 3364424 14731871 14041112 5751153 -905449 -3011083
36575 -3011083 -5383496 -11122326 -15447790 -12631717 -5688002 -3112071 -6871405 -10105265
36567 -10105265 -7636965 -2460791 314105 -9126 -2034023 -5167182 -6680801 -2033942
36559 -2033942 7141881 11349908 5545501 -2296355 -2230672 2749830 1835234 -6380854 -11778440
36550 -11778440 -7867247 54267 4032189 3440088 2867589 5513223 11484554 18528683
36542 18528683 22345894 19719798 12830551 7305852 5324032 4000776 710303 -3864265
36534 -3864265 -7870029 -9118557 -4164952 7966943 20751660 24947376 20038731 15144780
36526 15144780 16355982 19039619 15984854 7676703 -98434 -4660426 -7222494 -7791386
36518 -7791386 -4521914 2059953 7640737 7789653 2393285 -3021440 -789991 11713925
36510 11713925 27975813 37672868 36387725 28078926 19242884 14376789 15618145 20769851
36502 20769851 21660630 11412772 -5107389 -14993911 -13571260 -9393851 -10082919 -12349953
36494 -12349953 -11775960 -12914038 -20092536 -25560433 -18927228 -4419802 3949532 3055435
36486 3055435 3520544 10529550 14714225 7340844 -5902786 -13491533 -12981974 -10081475
36478 -10081475 -8422071 -7599115 -7526541 -7814991 -5351354 1423666 7920660 8699108 5343925
36469 5343925 3323889 2813286 -928479 -8721267 -15410649 -17001595 -14086226 -7703087
36461 -7703087 2065116 11947562 16077104 13389795 9274411 7142206 3722986 -3569575
36453 -3569575 -9832642 -8552075 -838984 6328969 8405473 5127711 -2554492 -11103862
36445 -11103862 -12462701 -1553715 14061162 19848591 12187510 3992180 8269529 21079751
36437 21079751 26609333 17053141 1828733 -3828973 4034415 14598351 15108196 5194222
36429 5194222 -3551074 -2263835 4200745 4110788 -5239063 -13543963 -10522539 1118706
36421 1118706 8661610 3779945 -8372663 -14724616 -8313253 4262879 11035943 9372943
36413 9372943 7706046 11177240 12912994 5969390 -2686241 -1253349 6872072 5795178
36405 5795178 -8459125 -19922430 -15010747 -938046 6950763 6467367 6309802 9572887
36397 9572887 11683862 11177444 11131378 11271453 8565951 4931061 5200439 7919529 7018329
36388 7018329 2164653 -1813780 -5441043 -13686892 -23160994 -22144603 -8160987 5285367
36380 5285367 6696578 2130396 3496646 8559685 4805232 -9171203 -18510164 -11250985
36372 -11250985 6244117 18264006 18603402 14225710 12544310 11865242 6383883 -3741801
36364 -3741801 -11656535 -12420432 -8580961 -5727067 -5082400 -3268396 1395003 5405079
36356 5405079 4313691 -811208 -3240001 2146219 12439472 19513010 19213078 14998460
36348 14998460 11541958 8870443 6084690 6372679 12137194 18309078 18593395 16682971
36340 16682971 21449180 30750874 31552789 19613166 7470832 6432528 11150252 10559724
36332 10559724 4751896 774145 -402146 -1317645 1067228 9700799 17722299 16913002
36324 16913002 11660076 11477475 13558041 7858184 -2479926 -2750946 9480044 18499953
36316 18499953 13424614 2793438 -564058 3020339 5794313 5948016 6661332 8579277
36308 8579277 10338492 11595030 10888661 5884091 -1013489 -3740334 -2182533 -3411209
36300 -3411209 -10313398 -16936322 -18464812 -17292088 -15432643 -10260044 -2684960 88967
36292 88967 -3574443 -4107857 5429031 17519982 20077835 11787989 243177 -9081871
36284 -9081871 -14368735 -13358286 -5658337 4030999 10547261 12903195 11418716 6292893
36276 6292893 2281511 6787670 18387926 25361476 21044129 11992175 5070648 -3239656
36268 -3239656 -16233692 -25715537 -22435808 -10565799 -1058502 3271528 5844149 5714100
36260 5714100 -18084 -7605437 -10357906 -7148627 324367 12333869 24845548 26820847
36252 26820847 14695323 1493716 -872139 -236049 -10456102 -26528595 -31213738 -22423162
36244 -22423162 -15244386 -17146707 -19126914 -13885247 -6528015 -2706585 145605 4405543
36236 4405543 6108214 2167780 -4537431 -10095518 -12387238 -9019140 -753888 4546854
36228 4546854 1356523 -2602940 2742921 10277478 2795913 -19325839 -34332166 -28076814
36220 -28076814 -11888138 -3963821 -5548125 -5166025 2257368 10444721 12206423 8364191
36212 8364191 6816879 13274600 21555334 17897326 469553 -12753688 -6309603 9501924
36204 9501924 12526267 615844 -8695822 -7725757 -6691711 -10576190 -9787557 -217449
36196 -217449 7067285 4708977 501597 1465863 2728612 713427 1162218 5207941 4076402
36187 4076402 -2763432 -1467715 12946781 24495325 20388956 10773298 9914017 13518675
36179 13518675 10780963 4411766 1647797 -1458393 -9495947 -14149373 -8917894 -4788286
36171 -4788286 -12387308 -20980992 -15987522 -5566096 -6446030 -13180887 -7257262 9633838
36163 9633838 18105974 14005387 12473711 18523225 18785400 6693982 -6304594 -10179354
36155 -10179354 -7910815 -2988842 6613977 17164365 18825020 11591114 6586252 8366092
36147 8366092 11102473 13692366 21040574 28299581 23435676 9655288 5088293 13840521
36139 13840521 17656742 5181491 -10019975 -11890359 -4776754 -1236385 -2096100 -1764920
36131 -1764920 -601128 454076 6220717 17049532 23272250 19964146 15379697 14745172
36123 14745172 9320656 -6159480 -18814262 -15374085 -3247602 1796417 -813961 -1289900
36115 -1289900 872755 -647635 -3349016 -125185 5053190 2378108 -5532934 -6737900
36107 -6737900 -109388 3260436 -654281 -2782967 3277566 12098213 16649969 17497341
36099 17497341 17912339 17568034 14389543 7501398 -2598204 -12341386 -15069748 -8254998
36091 -8254998 1412488 6091693 6998688 9947465 14396557 15101564 11836179 9118901
36083 9118901 8693797 10252609 16309802 27152733 33997535 27662024 12609230 2344138
36075 2344138 1730261 3428499 1016717 -3918334 -7267263 -6247861 861001 10375410
36067 10375410 11865643 1406736 -7961305 -2013293 11900536 13540796 -359286 -12639935
36059 -12639935 -13139826 -10286510 -10703747 -7043420 4790364 14110751 12948726 9704087
36051 9704087 12364487 12487842 1246638 -11001422 -8936399 2895398 7759948 2962739
36043 2962739 -234630 1007685 -1669041 -8518528 -8691701 -135664 4283397 -3354341
36035 -3354341 -13776977 -14825909 -6435008 4928956 15496788 20816583 14357860 -1097273
36027 -1097273 -9758676 -1106152 14653986 19613108 11231915 1852628 -500391 859227
36019 859227 1621827 2282352 2847619 1610268 766262 4498979 9945207 9085243 1890907
36010 1890907 -1898204 2150727 5872780 1825966 -5205345 -7452468 -6708196 -8336155
36002 -8336155 -9470765 -4135394 4422235 7986770 6894861 7293546 7096319 -1316857
35994 -1316857 -13883501 -15656544 -3412795 6868934 2928454 -5937886 -4168925 7442670
35986 7442670 16719674 19807203 22083282 23913602 19777889 10955111 6455259 9408575
35978 9408575 12535777 9764653 4353988 2796603 6754737 12809171 15377891 10075088
35970 10075088 -404193 -5156448 3208549 16975965 21511746 14247776 6497883 6455726
35962 6455726 10415274 12032775 9661445 1985879 -12489825 -27247543 -29868174 -18416166
35954 -18416166 -6242695 -4184313 -7361742 -6429076 -1771993 2144061 6447674 11040614
35946 11040614 7569459 -7435339 -20260762 -16591681 -5011189 -6272331 -21408520
35939 -21408520 -29937504 -21824211 -11139327 -10637034 -11734917 -2736618 8371578 6777703
35931 6777703 -3059948 -3397062 8294949 15674690 9992355 2966399 7105741 17538741
35923 17538741 22679471 21636826 19503167 13954858 832252 -11172948 -7072904 11938606
35915 11938606 26606620 24887319 16734490 16312000 20679447 17461337 6062652 -2273566
35907 -2273566 -2417163 -348609 -747510 -2193750 -6124788 -17339511 -30784077 -30437785
35899 -30437785 -10229973 13212256 19257166 8694735 -347834 1790826 6245427 1522307
35891 1522307 -10799148 -19853499 -18736333 -10373729 -3432601 -4368081 -11581644 -17202572
35883 -17202572 -16094873 -11109776 -6855939 -2033182 6500094 15014575 16043612 9586184
35875 9586184 3210214 256991 -3624296 -9791480 -11374638 -3927202 6169619 10735593
35867 10735593 10960788 11269874 7519858 -6850323 -24201126 -25804345 -6796867 12568010
35859 12568010 9822159 -11746741 -28450735 -26579852 -15671316 -10327387 -11177760 -10778886
35851 -10778886 -8810068 -10297890 -13350494 -10706038 -3124645 -29646 -4478605 -7855150
35843 -7855150 -4044908 763242 -532205 -2919102 2831390 14313088 19763145 14245489
35835 14245489 4578563 -1139018 -728274 4991806 13864013 20067692 17949394 10239275
35827 10239275 5813710 7515438 8920913 5133019 -464976 -3043928 -2574105 459093
35819 459093 7940701 17286539 18845030 7729112 -6592765 -10506468 -3098846 4711215
35811 4711215 5797655 3757469 4503488 8096255 10582767 9240969 4701741 796390
35803 796390 1764589 6572591 8054521 2053903 -5240324 -5197242 471260 3028711 1682068
35794 1682068 4991862 15580703 24267404 24334007 21324725 20830308 15926574 -1469613
35786 -1469613 -22583803 -29205380 -18430599 -6846400 -7252386 -13003958 -11268855 -1953960
35778 -1953960 5162105 5684548 3337867 384621 -5446590 -14119011 -20454954 -19989726
35770 -19989726 -13262123 -3447531 6110306 11327414 8952279 812360 -6572515 -8452509
35762 -8452509 -5912255 -2967487 -2354859 -4596057 -7749006 -7264398 -195153 8819759
35754 8819759 10416046 2548827 -4557433 -256959 12639024 21422616 19506297 12849030
35746 12849030 9964958 11318450 11229396 6312200 -1252233 -6725787 -6584214 -906511
35738 -906511 5913813 8321990 5369883 1758235 1150717 609646 -4870656 -13580660 -17505616
35729 -17505616 -12495991 -4121840 -1095608 -5558379 -12470342 -16456149 -15981871 -11865785
35721 -11865785 -5182864 2902491 11315098 19189121 24544117 24346066 18512044 12201384
35713 12201384 10234624 10640484 8956378 7694758 13430946 22873453 21671937 3853853
35705 3853853 -15081822 -14517366 5109694 22522855 21731936 8929575 1557148 8172481
35697 8172481 22533131 32339087 30397727 20066986 11265361 9182352 8540660 3046469
35689 3046469 -2917320 -329610 8340114 10292726 2036882 -3673034 3445214 15697680
35681 15697680 19443308 14776855 12383706 15429707 16238558 10218273 2753923 57835
35673 57835 757541 -19184 -2957685 -4279308 -992825 5492863 10368163 10018362 6082957
35664 6082957 3761184 5678664 9631187 12759397 14444398 14091525 10451310 5029677
35656 5029677 1648867 566656 -1945064 -6168860 -7441547 -4909330 -4329587 -7994769
35648 -7994769 -10059855 -7458614 -6457498 -10773028 -12630639 -5894474 853245 -2695015
35640 -2695015 -10006051 -7484531 2420975 5118328 -1400943 -4029663 2069427 5739447
35632 5739447 118974 -6274206 -6245905 -6784681 -15341202 -25107370 -24888648 -15362223 -5852592
35623 -5852592 -1476404 -1711640 -5583598 -10554121 -11811558 -9560201 -11252315 -19797029
35615 -19797029 -25785166 -19520093 -5867058 1390426 -2871059 -10569011 -11848479 -5240148
35607 -5240148 2886118 5398328 1461590 -2983954 -3976375 -6068971 -13414780 -17568890
35599 -17568890 -6601696 13269238 20582534 8310978 -4890053 -1792694 10200880
35592 10200880 14996060 12656661 12552841 13453947 8972310 4492937 8934128 15034552
35584 15034552 8388626 -6396095 -9735523 1935627 10198421 3991799 -5098379 -4806755
35576 -4806755 -1530156 -6300868 -15216297 -16705938 -9278524 -628441 4569497 6444746
35568 6444746 4783310 524183 -1469816 2359899 9672938 16792848 22559275 24389576
35560 24389576 18371592 8340542 6156298 15620511 24180775 19499548 7060211 935813
$$ [...]
##END NTUPLES=NMR SPECTRUM
##END=
