##TITLE=31Pdec_SR163_rm1h
 , 24 sc
 18.1.2023
##JCAMPDX= 6.0         $$ Bruker NMR JCAMP-DX V2.0
##DATA TYPE= NMR SPECTRUM
##DATA CLASS= NTUPLES
##ORIGIN= UXNMR, Bruker Analytische Messtechnik GmbH
##OWNER= root
$$ XWIN-NMR		Version 3.5
$$ Wed Jan 18 16:04:24 2023 Russian Standard Time (UT+4h)  she@DPX200
##.OBSERVE FREQUENCY= 81.013821
##.OBSERVE NUCLEUS= ^31P
##.ACQUISITION MODE= SIMULTANEOUS
##.ACQUISITION SCHEME= undefined
##.AVERAGES= 24
##.DIGITISER RES= 16
##SPECTROMETER/DATA SYSTEM= spect
##.PULSE SEQUENCE= zgpg30
##.SOLVENT NAME= CDCl3
##.SHIFT REFERENCE= (INTERNAL, CDCl3, 0, 248.564)
##AUDIT TRAIL= $$ (NUMBER, WHEN, WHO, WHERE, WHAT)
$$ ##TITLE= Audit trail, XWIN-NMR		Version 3.5
$$ ##JCAMPDX= 5.01
$$ ##ORIGIN= Bruker BioSpin GmbH
$$ ##OWNER= she
$$ F:/spectra/data/she/nmr/P31/1/pdata/1/auditp.txt
$$ ##AUDIT TRAIL=  $$ (NUMBER, WHEN, WHO, WHERE, WHAT)
(   1,<2023-01-18 16:03:13.76 +0400>,<she>,<DPX200>,
      <created by zg, POWCHK disabled, PULCHK disabled
       configuration hash MD5:
       00 E9 B6 7A A2 85 ED C7 34 08 36 98 17 FE 4E 26
       data hash MD5: 32K
       E5 CB B0 E1 B1 DC D0 C9 BF 1C 3F 95 F5 A2 B9 41>)
(   2,<2023-01-18 16:03:16.12 +0400>,<she>,<DPX200>,
      <Start of raw data processing
       efp BC_mod = 2 LB = 1 FT_mod = 6 PKNL = 1 PHC0 = -10996.49 PHC1 = 137.0578 SI = 64K 
       data hash MD5: 64K
       82 01 24 21 4C 15 C2 0A 14 E1 AD 23 6F D4 D1 8D>)
(   3,<2023-01-18 16:03:47.42 +0400>,<she>,<DPX200>,
      <pk PHC0 = 18.77026 PHC1 = -70.00001 
       data hash MD5: 64K
       09 4A 27 62 78 40 10 B2 F6 26 52 10 D9 5C F0 2A>)
(   4,<2023-01-18 16:03:50.42 +0400>,<she>,<DPX200>,
      <abs ABSG = 5 
       data hash MD5: 64K
       D5 C9 19 21 D8 21 B0 E9 D5 27 B1 BA 09 66 24 F6>)
$$ ##END=
$$ 
$$ hash MD5
$$ 7B DD 88 B8 78 40 39 7E 50 C3 F8 A6 07 49 90 27
##$RELAX= 
##$RELAX= 
##$RELAX= 
##$RELAX= 
##$RELAX= 
##$RELAX= 
##$RELAX= 
##$RELAX= 
##$RELAX= 
$$ Bruker specific parameters
$$ --------------------------
##$DU= <F:/spectra>
##$EXPNO= 1
##$NAME= <P31>
##$PROCNO= 1
##$TYPE= <nmr>
##$USER= <she>
##$AMP= (0..31)
100 100 100 100 100 100 100 100 100 100 100 100 100 100 100 100 100 100 
100 100 100 100 100 100 100 100 100 100 100 100 100 100 
##$AQSEQ= 0
##$AQ_mod= 1
##$AUNM= <au_zg>
##$AUTOPOS= <>
##$BF1= 81.014009
##$BF2= 200.13
##$BF3= 200.13
##$BF4= 200.13
##$BF5= 200.13
##$BF6= 200.13
##$BF7= 200.13
##$BF8= 200.13
##$BYTORDA= 1
##$CFDGTYP= 0
##$CFRGTYP= 5
##$CHEMSTR= <none>
##$CNST= (0..31)
1 1 145 1 1 1 1 1 1 1 1 1 1 1 1 1 1 1 1 1 1 1 1 1 1 1 1 1 1 1 1 1 
##$CPDPRG= <waltz16>
##$CPDPRG1= <>
##$CPDPRG2= <waltz16>
##$CPDPRG3= <>
##$CPDPRG4= <mlev>
##$CPDPRG5= <mlev>
##$CPDPRG6= <mlev>
##$CPDPRG7= <mlev>
##$CPDPRG8= <mlev>
##$CPDPRGB= <>
##$CPDPRGT= <>
##$D= (0..31)
0 1 0 0 0 0 0 0 0 0 0 0.03 2e-05 3e-06 0 0 0 0 0 0 0 0 0 0 0 0 0 0 0 0 
0 0 
##$DATE= 1674043393
##$DBL= (0..7)
120 120 120 11 120 120 24 19 
##$DBP= (0..7)
150 150 150 150 150 150 150 150 
##$DBP07= 0
##$DBPNAM0= <>
##$DBPNAM1= <>
$$ [...]
##$SUBNAM3= <"">
##$SUBNAM4= <"">
##$SUBNAM5= <"">
##$SUBNAM6= <"">
##$SUBNAM7= <"">
##$SUBNAM8= <"">
##$SUBNAM9= <"">
##$SW= 501.771253377433
##$SWIBOX= (0..15)
0 1 3 0 0 0 0 0 0 0 0 0 0 0 0 0 
##$SW_h= 40650.406504065
##$TD= 32768
##$TD0= 1
##$TE= 0
##$TE2= 300
##$TE3= 300
##$TEG= 300
##$TL= (0..7)
0 120 53 12 22 120 120 120 
##$TP= (0..7)
150 150 150 150 150 150 150 150 
##$TP07= 0
##$TPNAME0= <>
##$TPNAME1= <>
##$TPNAME2= <>
##$TPNAME3= <>
##$TPNAME4= <>
##$TPNAME5= <>
##$TPNAME6= <>
##$TPNAME7= <>
##$TPOAL= (0..7)
0.5 0.5 0.5 0.5 0.5 0.5 0.5 0.5 
##$TPOFFS= (0..7)
0 0 0 0 0 0 0 0 
##$TUNHIN= 0
##$TUNHOUT= 0
##$TUNXOUT= 0
##$USERA1= <user>
##$USERA2= <user>
##$USERA3= <user>
##$USERA4= <user>
##$USERA5= <user>
##$V9= 5
##$VALIST= <valist>
##$VCLIST= <CCCCCCCCCCCCCCC>
##$VD= 0
##$VDLIST= <DDDDDDDDDDDDDDD>
##$VPLIST= <PPPPPPPPPPPPPPP>
##$VTLIST= <TTTTTTTTTTTTTTT>
##$WBST= 1024
##$WBSW= 4
##$XGAIN= (0..3)
0 0 0 0 
##$XL= 0
##$YL= 0
##$YMAX_a= 7851
##$YMIN_a= -8494
##$ZGOPTNS= <>
##$ZL1= 120
##$ZL2= 120
##$ZL3= 120
##$ZL4= 120
##$ABSF1= 248.5645
##$ABSF2= -253.2056
##$ABSG= 5
##$ABSL= 3
##$ALPHA= 0
##$AQORDER= 0
##$ASSFAC= 0
##$ASSFACI= 0
##$ASSFACX= 0
##$ASSWID= 0
##$AUNMP= <proc_1d>
##$AZFE= 0.1
##$AZFW= 0.5
##$BCFW= 0
##$BC_mod= 2
##$BYTORDP= 0
##$COROFFS= 0
##$CY= -3
##$DATMOD= 1
##$DC= 0
##$DFILT= <>
##$DTYPP= 0
##$F1P= 0
##$F2P= 0
##$FCOR= 1
##$FTSIZE= 65536
##$FT_mod= 6
##$GAMMA= 0
##$GB= 0
##$INTBC= 1
##$INTSCL= 6.047779e-11
##$ISEN= 30
##$LB= 1
##$LEV0= 0
##$LPBIN= 0
##$MAXI= 10000
##$MC2= 0
##$MEAN= 0
##$ME_mod= 0
##$MI= 50
##$NCOEF= 0
##$NC_proc= -8
##$NLEV= 6
##$NOISF1= 182.463
##$NOISF2= 159.3651
##$NSP= 0
##$NTH_PI= 0
##$NZP= 0
##$OFFSET= 248.5645
##$PC= 4
##$PHC0= -10977.72
##$PHC1= 67.05779
##$PH_mod= 1
##$PKNL= yes
##$PPARMOD= 0
##$PSCAL= 0
##$PSIGN= 0
##$REVERSE= no
##$SF= 81.0140089999694
##$SI= 65536
##$SIGF1= 159.3651
##$SIGF2= -187.1042
##$SINO= 113.3802
##$SIOLD= 16384
##$SREGLST= <1H.CDCl3>
##$SSB= 0
##$STSI= 65536
##$STSR= 0
##$SW_p= 40650.406504065
##$SYMM= 0
##$S_DEV= 0
##$TDeff= 32768
##$TDoff= 0
##$TI= <>
##$TILT= no
##$TM1= 0
##$TM2= 0
##$TOPLEV= 0
##$USERP1= <user>
##$USERP2= <user>
##$USERP3= <user>
##$USERP4= <user>
##$USERP5= <user>
##$WDW= 1
##$XDIM= 65536
##$YMAX_p= 331188640
##$YMIN_p= -24589829
$$ End of Bruker specific parameters
$$ ---------------------------------
##NTUPLES= NMR SPECTRUM
##VAR_NAME=  FREQUENCY,     SPECTRUM/REAL,   SPECTRUM/IMAG
##SYMBOL=    X,             R,               I
##VAR_TYPE=  INDEPENDENT,   DEPENDENT,       DEPENDENT
##VAR_FORM=  AFFN,          ASDF,            ASDF
##VAR_DIM=   65536,         65536,           65536
##UNITS=     HZ,            ARBITRARY UNITS, ARBITRARY UNITS
##FACTOR=    0.620285442955139, 1,           1
##FIRST=     20137.2065510682, 0,            0
##LAST=      -20513.1999529968, 0,           0
##MIN=       -20513.1999529968, -24589829,   0
##MAX=       20137.2065510682, 331188640,    0
$$ Real data points
##PAGE= N=1
##DATA TABLE= (X++(R..R)), XYDATA
$$ [...]
47445 -10789125 -9797590 -4823042 -2238845 -2754601 -1348604 2854603 4416729 1487878
47437 1487878 130389 4520797 9516935 8574356 3761749 1461991 1889904 -135912
47429 -135912 -5771704 -10025911 -9073084 -4745511 -1148236 -290449 -1390647 -1931067 332460
47420 332460 4314614 5725195 2662385 -665059 912308 6178528 9258894 7730221
47412 7730221 4649904 2608266 324642 -3580866 -7134679 -7393574 -4161983 78567
47404 78567 2469737 1477070 -1952505 -4576404 -4002286 -1746014 -1126733 -2310104 -2253707
47395 -2253707 111914 1940011 997365 -844835 -672427 1191343 2230091 1487296 142925
47386 142925 -560510 -127887 1507758 3421347 3638824 1248841 -2076822 -3993843 -4101226
47377 -4101226 -3369146 -2061611 57935 2335730 3893726 4955088 5628135 4310511
47369 4310511 -104886 -4915719 -5690468 -2219455 678468 -381894 -2940357 -2828406
47361 -2828406 -163193 1921378 2904375 5254555 9138479 10650695 7103242 1386344
47353 1386344 -1482875 -719840 12409 -1664107 -3620748 -2646973 845323 3316931 2672060
47344 2672060 650317 289241 2110580 3711957 2792544 -225727 -2669240 -2191752 1146040
47335 1146040 4839493 5984100 4103944 2038025 2979745 6341799 8077749 6055641
47327 6055641 3282489 3725748 6432989 6971987 4180669 1669822 1909400 2780179 1941871
47318 1941871 841417 1123902 173488 -5267682 -12663961 -15637111 -12091011 -6162307
47310 -6162307 -1944010 397363 1474353 242742 -3120446 -5507042 -4648876 -1975636
47302 -1975636 415203 2803099 5432503 6062258 3275859 -59162 -312948 1622080
47294 1622080 2311680 1550366 1817997 2797125 1393430 -2248304 -3637290 -787722 1899354
47285 1899354 -436441 -6114819 -9133819 -6827362 -2261963 311773 -287815 -2488927
47277 -2488927 -4413668 -5400321 -6117552 -7395656 -8463856 -6988997 -1983145 3846562
47269 3846562 6199678 3736136 -750045 -3858878 -4777761 -4296414 -2316639 1680642
47261 1680642 6079961 7283833 3585954 -2247903 -5687373 -5223915 -3023388 -1143026
47253 -1143026 770509 3233259 4479932 2399849 -1966829 -5220979 -5963508 -6163226
47245 -6163226 -7438373 -8164130 -6153992 -2783851 -1645525 -3052270 -2792022 2020672
47237 2020672 8067904 9675126 6525867 3858007 4472590 4736971 1205452 -2388904
47229 -2388904 375234 8557312 13770104 10867225 3893031 -419122 -654899 521261
47221 521261 1584318 2216470 1133971 -1708460 -2741095 742030 5042533 4072847 -1404984
47212 -1404984 -3927068 186408 5565461 5594893 1434149 -552495 1847184 3985810
47204 3985810 990850 -5724958 -9826398 -7051212 156474 5393391 5320695 2762629
47196 2762629 2375080 5003676 7975385 9343481 9138449 7288594 3482880 -818349
47188 -818349 -3097801 -2958670 -2211274 -1685458 -621144 642796 459545 -1077165 -1914678
47179 -1914678 -1534107 -1435634 -1358651 1200245 6144982 9334522 8436887 6745144 7960213
47170 7960213 9969899 7602637 -9215 -8292725 -12699829 -12559793 -10036700 -7589749
47162 -7589749 -6268592 -5068113 -2504242 405549 349371 -3777965 -8422596 -9311543 -6405085
47153 -6405085 -3051581 -1475808 -1002727 93453 2494322 5080496 5793597 4332611
47145 4332611 3669263 6533276 10664590 11059112 7151318 3304185 1242827 -2458133
47137 -2458133 -8940289 -13009893 -10661103 -5480576 -2576191 -910917 2436070 4816028
47129 4816028 2085477 -2925432 -3768970 -516431 1038356 -588718 -967668 1721397
47121 1721397 3896383 3314567 2056023 1540193 555560 -651856 -197130 644411 -1360040
47112 -1360040 -4431080 -2776931 3817928 8416243 7285720 4752663 4668835 4317612 1070981
47103 1070981 -1800145 -1327591 -742688 -3081642 -4203792 919879 8938657 12160206
47095 12160206 9027500 3930813 -940743 -6408517 -10376938 -8591195 -1953231 3041078
47087 3041078 2572446 -509344 -2098508 -1879142 -1483756 -1375006 -1444219 -2007221 -2609247
47078 -2609247 -1928822 -67914 957975 123907 -919376 -344294 957073 554081 -1815155
47069 -1815155 -3219661 -1003197 3530794 6558796 6959073 7611631 10016894 10653660 6185579
47060 6185579 -240961 -3073323 -3173229 -5967579 -10949607 -10937308 -3971158 2073730 1025555
47051 1025555 -2825616 -3214895 -2153366 -4074661 -5632672 -985140 6180444 6215937 -1783752
47042 -1783752 -8545349 -8593455 -6515700 -7107348 -7852681 -5307098 -2115545 -2544346 -5588982
47033 -5588982 -7228784 -6364566 -4534144 -2227423 897680 3837919 5247466 5477783
47025 5477783 5606535 5676630 5389278 5052350 4494995 2645185 -436196 -2551320 -1701032
47016 -1701032 1645722 5326946 7256687 6075590 1895488 -2796324 -4664364 -3032825
47008 -3032825 -800506 -1178047 -4296616 -7206120 -6547387 -1787113 3205959 3019623 -3094236
46999 -3094236 -9161289 -8997544 -3531363 1237799 2255652 1527431 901297 -564336 -3076245
46990 -3076245 -4014990 -1307663 3681409 7984011 9693224 8256265 4571104 1323152
46982 1323152 706864 1370090 183425 -2781570 -4048307 -1865187 1645612 4041848
46974 4041848 5044623 4791599 2951906 583338 -202332 648722 1226875 1271248 2340867
46965 2340867 4096344 4416458 3834743 5403985 9059612 10878191 9568844 8724999 10333677
46956 10333677 11097546 8327632 4768418 3827085 4244971 3616719 3343938 5516632 8083903
46947 8083903 7907997 6123386 5810874 6368515 4709841 521762 -3781851 -6946286 -8972775
46938 -8972775 -8959117 -6703803 -4910675 -5818703 -6972192 -4316711 1596599 6276376 7081775
46929 7081775 4823170 1060639 -2314036 -2396699 1322600 4031875 824965 -5879554
46921 -5879554 -8987254 -6307026 -2306786 -313426 1329403 4074892 5616367 4069792
46913 4069792 1454428 96264 -1150112 -4105398 -7211257 -7423566 -4814851 -2541898
46905 -2541898 -2515406 -2989952 -940335 3766835 7264610 5703841 447693 -2718464 -802763
46896 -802763 2322516 1505535 -2323000 -4074074 -2228947 -120116 14956 -549857 -1106843
46887 -1106843 -3251045 -6884062 -8607246 -6500504 -3356240 -2677646 -3932169 -4211681
46879 -4211681 -2645031 -686869 760273 2243068 4011574 4690139 2145613 -3792522
46871 -3792522 -9189828 -8519029 -1467889 4660480 3038999 -3357512 -5271526 133990
46863 133990 5703915 4921686 461492 -1154478 1210098 3772667 4303151 3503799 1800644
46854 1800644 -995247 -3701085 -4795763 -4779144 -4902561 -4608599 -2784988 -344635 1071386
46845 1071386 1675281 2105880 934343 -3110087 -7585416 -8673507 -6480658 -4332511
46837 -4332511 -3124944 -551350 3431647 4660355 441286 -5827989 -8343293 -5575170
46829 -5575170 -1077074 1352735 1238027 316997 -531613 -2400093 -6400254 -11039585 -12597093
46820 -12597093 -8937334 -2307500 2692307 3441936 710831 -3259331 -6415368 -7293484
46812 -7293484 -5826480 -3818912 -3068436 -3160856 -2654298 -1916791 -2614062 -4586899 -5751522
46803 -5751522 -5365956 -4784974 -4314001 -2089580 2543234 7040625 8987639 9516722 11267342
46794 11267342 14269148 15985151 14655906 10786449 5934105 1688408 -552319 -262266
46786 -262266 1821558 4655402 7536357 9261176 8186907 4547170 1394748 1444496 3901117
46777 3901117 6095232 7187794 8242824 9612921 10648684 11393212 12078568 11339247 7600376
46768 7600376 2163859 -1842351 -3746929 -5623852 -7861096 -7875125 -4729237 -1814774
46760 -1814774 -2407627 -4867061 -5194690 -2923729 -1264038 -1720695 -1652372 1668287 6389459
46751 6389459 7360066 2177324 -5217987 -8298060 -5360197 -1495423 -2055444 -6130753
46743 -6130753 -9020778 -9435047 -10034565 -11133676 -8988429 -2181527 4705928 6788092
46735 6788092 4899859 2811669 1462609 -376976 -2146914 -2276963 -1455098 -1490493 -2072889
46726 -2072889 -1796480 -925864 15639 2470646 6887264 9531407 6851013 1549612 -749129
46717 -749129 23274 -1337872 -6753325 -12104728 -13611517 -11784819 -8166461 -3256622
46709 -3256622 1039481 1839668 -219649 -1315515 -406536 -120215 -762974 766523 4286828
46700 4286828 4784721 518478 -3291558 -2623355 -873663 -2521828 -5882922 -7321898
46692 -7321898 -7965292 -10439660 -12784156 -11592858 -8196227 -6011278 -4504574 -1438530
46684 -1438530 1572614 1646152 308352 564566 760115 -2066439 -5022934 -3121819 1251295
46675 1251295 957818 -3870504 -5045282 791258 6584550 5284541 -1102318 -6698889
46667 -6698889 -9919946 -11803530 -11015642 -5874268 1288795 6125242 7036323 5106183
46659 5106183 1447086 -2473932 -3959363 -1855441 935959 582941 -2574185 -4308839
46651 -4308839 -1760350 3240836 6348063 5418262 2632267 1587206 2502760 1977914 -1591162
46642 -1591162 -4728405 -3508234 445450 2024572 -414773 -3750941 -4947713 -3493368
46634 -3493368 286813 5241378 8110254 6513238 3007631 1790467 1873176 -1113824
46626 -1113824 -6404942 -7809997 -3314532 1328693 1023549 -2391704 -5016897 -6342289
46618 -6342289 -6543735 -3956196 661028 2419328 -709358 -3924148 -3185425 -1812239
46610 -1812239 -4000322 -6537346 -3924451 1672259 3159277 -623742 -4100535 -4268631
46602 -4268631 -3733571 -4081318 -2885466 941221 4092579 3412034 -100939 -3316414 -4164213
46593 -4164213 -2310025 358753 -14161 -5015224 -10118532 -9129024 -2650796 2273237
46585 2273237 1582311 -1518633 -3033579 -3840274 -6127614 -8618228 -9284191 -9763337 -12729632
46576 -12729632 -16484815 -16303221 -10844628 -3930952 365050 1870931 3021490 5482832
46568 5482832 8981811 12069995 12928378 10200443 4284175 -2141511 -5761723 -5366868
46560 -5366868 -2676762 -102472 1745363 3576131 5217328 5602302 4862491 4323352 3898210
46551 3898210 1942751 -1015196 -1204348 3055598 7127973 4935210 -2767954 -8844961
46543 -8844961 -8644984 -4749332 -2036635 -1691659 -2050406 -2300252 -2419407 -1289734 1986347
46534 1986347 5465956 5675579 1706297 -3749837 -7482842 -8345539 -6917906 -4562980
46526 -4562980 -3260912 -4474998 -7086759 -7876831 -5362429 -2019834 -1196259 -2824572
46518 -2824572 -4146226 -3998677 -3895329 -4815759 -5621326 -5441949 -4989547 -4150986 -1002351
46509 -1002351 4562143 8625638 7675392 3582691 985223 999181 1035855 -69891 -743045
46500 -743045 -266403 313572 1119657 3204319 4828956 2511068 -2806518 -5279772 -2305253
46491 -2305253 1199967 106405 -3044292 -1942046 4010052 8866602 8114500 3524949
46483 3524949 -154931 -399013 1724631 3382936 2700862 608481 -316759 634261 1258834
46474 1258834 -147467 -2152669 -2602894 -1993606 -2345394 -3976348 -5523218 -6249715 -6362344
46465 -6362344 -5824165 -4739673 -4293647 -5515002 -7380088 -7491599 -4591135 110849 3659252
46456 3659252 3539925 357356 -2016055 -831318 1645146 1560410 160232 2493242 8747361
46447 8747361 12192164 8251895 866185 -3537458 -4075844 -3429198 -1869248 1715173
46439 1715173 5576817 6839027 5715354 4032035 1718789 -1247187 -1973268 1608007
46431 1608007 6222467 7100184 4341125 962319 -2761069 -7484999 -9778817 -5716880
46423 -5716880 1449156 3911527 -237179 -5129851 -6004840 -4101853 -2001932 157647
46415 157647 2387163 3645298 4254156 5319710 5261762 1595691 -3470288 -4555384 -1168114
46406 -1168114 1202628 -424299 -2336253 -643528 2955689 4704710 4033817 2528719
46398 2528719 949429 -300188 -388959 479783 1074276 1272210 1556283 610345 -2834632
46389 -2834632 -6009299 -4639100 305596 3495617 3385675 3749644 5948389 5952935 1510246
46380 1510246 -3493922 -4859329 -3209629 -572137 2867069 5563276 3878371 -1383421
46372 -1383421 -2986222 3300976 11635487 13496145 8388169 2079937 -2297061 -5454529
46364 -5454529 -6569579 -3085399 4011006 9321104 8527705 2569580 -3775656 -6219012
46356 -6219012 -4450809 -1900511 -1076208 -27194 3832050 7758273 6601055 1400581
46348 1400581 -1309399 219781 618349 -2298675 -2923216 1991454 6338780 4324802
46340 4324802 688318 3576950 11921184 17712273 17433734 13803471 8984841 3377142
46332 3377142 -1009900 -2773836 -4632325 -8449374 -9722172 -4293743 2411109 1548665
46324 1548665 -5482560 -8782426 -4937330 -893085 -1892378 -4706796 -5345437 -5220302 -6095010
46315 -6095010 -5857825 -3191719 -716727 -33084 1004134 2844726 1645348 -3988851
46307 -3988851 -8741056 -7533644 -2533068 1315361 3904509 7911605 11928541 11418604
46299 11418604 5774663 -348786 -3087596 -3250467 -3573163 -4901844 -6178665 -6355027
46291 -6355027 -5023153 -2114307 1618191 3889184 2259456 -2461290 -5354511 -2600936
46283 -2600936 2575775 2791363 -3466156 -8945802 -7706685 -3756993 -4678822 -10022404
46275 -10022404 -12685014 -10237170 -7462623 -7240986 -6301911 -2452010 432947 -1427839
46267 -1427839 -5270809 -5793618 -2421000 1365367 3578991 4831800 5401179 4684043 3107605
46258 3107605 2075608 2104799 2521662 2680769 2422290 1731792 637330 -904211 -3048432
46249 -3048432 -5310151 -6211549 -4915979 -2744777 -1641706 -1802447 -2456373 -3865001 -6190463
46240 -6190463 -7517875 -6068076 -3608530 -3196928 -3958932 -2010911 3183369 7302389
46232 7302389 6870240 2996844 -1464059 -5053823 -6882035 -5941112 -2738545 824021
46224 824021 3908459 6514656 6854816 2688922 -4065133 -7971265 -6599650 -2960554
46216 -2960554 -398434 1211715 2965195 4547728 5948362 7897795 9173338 7314081
46208 7314081 3370333 1566939 2564168 1951329 -2166338 -5276512 -3540325 216986
46200 216986 1876488 2815233 6030821 9085847 7054587 753014 -3551388 -2131981
46192 -2131981 2798120 7174673 8842443 7671761 5187075 3817047 4147771 3810136
46184 3810136 1137157 -1815244 -2395521 -1499243 -1586742 -2406088 -1980535 -399288 513335
46175 513335 21031 -1683061 -4598333 -7136220 -5758339 1035 4589328 2742948
46167 2742948 -3282555 -7121381 -6797012 -4953943 -2837470 -76661 966012 -2470706
46159 -2470706 -6965558 -5725599 861909 4303623 -161510 -7209976 -10020819 -9134312
46151 -9134312 -8442291 -7647702 -4327319 97396 2401719 3535120 6780951 10691600
46143 10691600 9502123 1618468 -6753045 -8573983 -3819924 1694680 3466747 1986171
46135 1986171 41209 -1140913 -1943960 -1906409 465428 4799613 7866117 7517310 6218110
46126 6218110 7638230 10323002 8775063 1825156 -4271944 -3842694 419023 1429471
46118 1429471 -2742770 -7493269 -8446997 -5090752 1605053 9945110 15345917 13035059
46110 13035059 5248036 763640 3834040 8026343 5570636 -1242452 -4177756 -1814833
46102 -1814833 -576116 -3447646 -5607137 -3226101 518655 1674730 1585756 2433188 2278969
46093 2278969 -219849 -1196132 1979158 3939323 -1350466 -9533495 -10843150 -4861490
46085 -4861490 -956254 -3246660 -4726601 278578 6380553 5473819 -1367469 -6535299
46077 -6535299 -6334358 -2985291 969697 4799677 7618975 8625723 8425770 7401333
46069 7401333 4656328 1046196 264074 3492309 5949591 2931647 -3193374 -6397690
46061 -6397690 -5066790 -1883364 2083064 7294648 10989393 9145066 3821688 2337204
46053 2337204 6993849 10870788 7121293 -1416460 -5881528 -2598600 3208957 4490999
46045 4490999 35033 -5844823 -9204342 -9882280 -9189833 -6808572 -2380706 1053127
46037 1053127 -883353 -7335389 -11295819 -7812811 -554381 2863783 260230 -3673106
46029 -3673106 -4074762 -586722 4311095 8405234 10573507 10636579 9204831 6950047 4224339
46020 4224339 1689693 47141 -1417180 -4136145 -7319758 -8161288 -6175382 -4441049
46012 -4441049 -4846679 -5273349 -3607048 -1097679 720590 2490715 3425754 237 -7348065
46003 -7348065 -11042757 -5926354 1992610 3307280 -1459583 -4036324 -1587285 854927
45995 854927 214027 -1132151 -2072573 -4516381 -7047853 -4823798 2062389 7308188 7475478
45986 7475478 5241987 2008006 -4386924 -11752114 -12291565 -4126238 3767458 3734486 -576513
45977 -576513 -2375393 -2565943 -4760563 -5790466 -621173 7055766 8624335 3334979
45969 3334979 -1135533 -362537 2280959 3087374 2994218 3700948 4515640 4874818 5705305
45960 5705305 6861739 6697834 5078869 3689079 2819714 824812 -2790354 -6272816
45952 -6272816 -7708223 -6219603 -2031393 2326669 2631098 -1847531 -5422216 -2377688
45944 -2377688 4927807 8830922 6342242 1477924 -1803725 -3348042 -3015813 833791
45936 833791 6905706 10065018 7885031 4339857 4100752 6412000 7623733 7001782 6625453
45927 6625453 7250743 7430918 6075618 3771425 2018118 2228575 4437327 6257013 4839268
45918 4839268 891454 -1260994 984562 5127357 7238862 6972858 6577513 6537165 5144908
45909 5144908 1964755 -870261 -1275806 359531 1740580 939374 -1757022 -3895979
45901 -3895979 -3530526 -2204121 -3675634 -8596538 -12406730 -10688825 -5117526 -1204343
45893 -1204343 -952902 -1214344 472520 2197773 1572506 243681 1611476 5534720 8127706
45884 8127706 6447591 1384146 -3693857 -5361451 -1911238 4875136 9869033 9064995
45876 9064995 4369373 1639756 3457140 6430968 6571145 4343127 2517211 1776181
45868 1776181 1238575 1262906 2475700 3300899 1776186 -835909 -1381372 598760 2552314
45859 2552314 2847107 1986590 193334 -2834283 -5616832 -5769060 -3628399 -1707793 -200940
45850 -200940 3163454 8080484 10750424 9546935 7531885 7389600 7951945 8079378 9570372
45841 9570372 12862693 13980965 10092646 4828296 3402888 5057095 5205763 2954821
45833 2954821 1273551 1124981 743150 21212 389949 500515 -2815824 -8805111 -12761170
45824 -12761170 -12475557 -10231674 -7641534 -3421462 2111260 5143554 3586368 380259
45816 380259 -1057009 -1243968 -1686079 -916866 2659553 6142062 4560046 -2445351 -9446060
45807 -9446060 -11015009 -6797017 -772496 2894344 2869391 551893 -2105852 -4094711
45799 -4094711 -4680545 -2767861 1439760 5142609 5605315 3635107 1982765 889303
45791 889303 -1536606 -4707023 -5392655 -3069664 -1368248 -2535775 -4363114 -4722269 -5089819
45782 -5089819 -6684261 -7219627 -5447198 -5136362 -9367217 -13730567 -11431367 -3910019
45774 -3910019 49083 -3875913 -10527253 -13275467 -11480322 -7799848 -3306650 1212175
45766 1212175 3197919 1846124 1043766 4563859 9974858 11341523 7024246 969784
45758 969784 -3237220 -5628914 -6921642 -6373312 -4037520 -1866746 -495037 2374373
45750 2374373 7675196 11116904 7224208 -3067048 -12015546 -13109369 -7331517 -562442
45742 -562442 3035052 3338377 1778595 -568355 -2359398 -1958554 544079 2473965 1329699
45733 1329699 -1792974 -2817791 841034 7133474 11233533 10213801 5464970 845187
45725 845187 -830359 535961 3187603 5191086 5403882 3599725 279911 -3445017
45717 -3445017 -5952083 -5743384 -2898124 37689 -179683 -3880918 -7486625 -7502068 -4978896
45708 -4978896 -4174447 -6847475 -10193788 -11223798 -10691901 -10734197 -10702155 -8498025 -5226982
45699 -5226982 -4917675 -8862569 -13175293 -13470724 -9742504 -4967289 -1077724 1314875
45691 1314875 1024243 -2496370 -6455120 -6541844 -2228303 2198168 2789965 -101749 -4000973
45682 -4000973 -7866327 -11494439 -13385310 -11916773 -7894275 -3828823 -1272452 -544020
45674 -544020 -1923796 -4814098 -6772802 -6216751 -5353233 -7199895 -10174140 -9552580 -4593794
45665 -4593794 22722 943260 -11027 -513270 -1666763 -4330500 -5732812 -3698609 -900203
45656 -900203 -736030 -2000208 -2085965 -2438947 -5525242 -8934104 -8508841 -5487013 -4076712
45647 -4076712 -3321122 1342008 8787287 12278431 9754860 6303202 4611310 1067657
45639 1067657 -5426757 -8790252 -4914151 1211194 3135596 1973051 1964789 2451480 931648
45630 931648 -482890 1001131 2003894 -2279093 -8805049 -9794270 -3978213 2267135
45622 2267135 4420631 3848402 2630177 879572 -313141 840976 2815531 2132904
45614 2132904 -799807 -2090013 -706409 602653 701636 1000404 960830 -1449960 -4292223
45605 -4292223 -2808652 2700980 6165598 4611190 1880278 1378923 947947 -2114288
45597 -2114288 -6026516 -7671121 -6546107 -3133303 2293235 7076226 7333951 4209316
45589 4209316 3778270 7848019 10380314 6750460 996309 -852446 349926 78208
45581 78208 -1954010 -2851112 -2278305 -1636954 -255561 2354572 3153892 -146168 -4024323
45572 -4024323 -3930629 -1657429 -1911559 -3736064 -2192494 2593957 5216063 3797250 2149485
45563 2149485 2277712 1330600 -2205030 -5336573 -6102887 -6909833 -9301851 -10130114 -6583549
45554 -6583549 -1327407 1192407 777042 125596 -268950 -1933091 -4395160 -5209489 -3916439
45545 -3916439 -2916035 -3878430 -5574454 -6017588 -4967381 -3324104 -1506584 29777
45537 29777 -484024 -4584993 -10092677 -11356614 -5356082 3233717 5962788 200121 -7694268
45528 -7694268 -10012378 -6197936 -1814888 -955785 -2369619 -2533724 -281948 2053829
45520 2053829 1363233 -2271830 -4592330 -1689361 4560417 8217861 7028418 5032424
45512 5032424 5883691 7537257 6643544 4527965 4348259 4897288 2290282 -3459271 -8186353
45503 -8186353 -9101069 -6478069 -1051697 5645762 9418130 7189122 2379553 1258531
45495 1258531 3981418 4853557 1805127 -722868 237835 1741442 1074276 349150 1453673
45486 1453673 1794680 -743369 -3281432 -2924227 -2062903 -3731711 -5384389 -2973265 1494478
45477 1494478 2494225 -451271 -2531316 -1377424 347924 302607 -315668 332426 2363274
45468 2363274 5341867 8688983 10697082 10067025 8257123 7403234 6696962 4386955 2368775
45459 2368775 4143359 8510881 10399804 8355205 5841854 4237418 601050 -5503489
45451 -5503489 -9273172 -8317336 -7179083 -9513617 -11212702 -7437778 -1929564 -1776968
45443 -1776968 -5864551 -6803875 -3098686 -738371 -2201691 -2620601 609380 2544391
45435 2544391 -641669 -4531922 -3546260 159009 971359 -969018 -1172689 1405755 4284491
45426 4284491 7149085 11215862 14112349 11963808 6410627 3251355 3696133 3256283
45418 3256283 274498 -1157418 1004324 2628795 676216 -1239985 813556 4095377
45410 4095377 3974324 1925282 2736756 6212799 7795510 6205592 4538394 4043885 2494762
45401 2494762 -590714 -2338283 -1657340 -1479169 -3746502 -5886324 -4746572 -1175638
45393 -1175638 1767282 2840872 2477744 681154 -2196270 -3907691 -2377895 1044393
45385 1044393 2683086 1009203 -1718374 -2634838 -1716644 -1294393 -2728710 -4351898 -3134856
45376 -3134856 1426485 5601192 4750827 -1276238 -7235384 -7950089 -3852126 262308
45368 262308 1402805 1284493 2686890 5147821 6122760 5150404 4324429 4730151 4969503
45359 4969503 3965655 2797088 2322590 1288999 -1103365 -2910620 -2604277 -2637976 -5918747
45350 -5918747 -9753324 -8203537 -1041898 4574900 3484280 -654268 -1063985 2862975
45342 2862975 5872392 4574785 966482 -1276731 -918966 714867 1805787 1878242 2291048
45333 2291048 4400630 7004649 7224015 4561074 1896249 1269961 1129016 -437637 -2163728
45324 -2163728 -1735258 461173 2232305 2737003 2527576 1887855 1171955 1331354 2349260
45315 2349260 2823601 2446832 2537864 2939848 1881947 540684 2979265 8612345 10268537
45306 10268537 4614945 -920448 1555866 7735629 7282583 -193736 -5002660 -2568110
45298 -2568110 1019492 171816 -2469443 -2690302 -1544297 -1430110 -1176654 935896 3724987
45289 3724987 5798450 7645259 8858819 7768930 5675474 6242869 8628959 7128862
45281 7128862 499068 -4556111 -2999677 1453127 3364376 3697383 5267813 5635586
45273 5635586 1761647 -2054634 1297103 10838748 17903393 17000094 10846381 4955456
45265 4955456 2106258 2090903 2734138 1090966 -3226638 -6674335 -6560751 -5310474 -6241558
45256 -6241558 -7341388 -4358347 1188863 2880230 -1424113 -6462550 -6891804 -3483467
45248 -3483467 -401955 229209 -833920 -2015325 -2003007 -265724 2326602 4193276 4548174
45239 4548174 3492057 1317993 -1044781 -1935952 -989294 -225224 -1335214 -3059712 -3230284
45230 -3230284 -2022203 -849991 484260 2675285 4163758 2772514 -489103 -2415560
45222 -2415560 -2247251 -2469504 -4880769 -8274954 -10126467 -8715869 -4123301 863218
45214 863218 1799369 -2811424 -8645411 -10078275 -7081042 -4675485 -5801727 -7985195
45206 -7985195 -7613278 -4605713 -1600484 -438051 -739919 -1037812 -458397 638147 1697668
45197 1697668 3147330 5286293 6485946 4967841 2399250 2302057 4228292 3877274 601220
45188 601220 -471891 3101519 6143870 4218083 1522984 3874139 8441695 8662157
45180 8662157 6048857 7567987 12594724 12653501 5158657 -2218459 -3601541 -2575502
45172 -2575502 -3880161 -5325482 -3269863 116559 888322 25748 580307 1636772 287252
45163 287252 -2964664 -5332354 -6228033 -6694741 -6212918 -3656046 27259 2983307 4804970
45154 4804970 5435571 3753045 -336014 -4355850 -6074497 -5965696 -5144750 -3382963 -1049345
45145 -1049345 -107009 -970175 -1370873 -589153 -1281588 -4283241 -5440351 -1483178 4307154
45136 4307154 6702924 5932254 5674276 6080498 4285088 596485 -1360927 -642470 -278472
45127 -278472 -1959872 -3492407 -2548000 232230 2869566 4395387 4937876 5304374 6618134
45118 6618134 8887528 10445201 10223613 9339657 8671277 6748470 2623041 -1106523 -1472399
45109 -1472399 171543 230735 -1618212 -2816851 -2713407 -2738492 -2535684 -477560 2123156
45100 2123156 1948104 -837393 -2502654 -1690969 -896614 -1311955 -1123566 -175430 -1100395
45091 -1100395 -3814438 -4287485 -1730183 -1498257 -6486654 -10635647 -6950301 1534166
45083 1534166 5572810 2649027 -944535 -758082 170765 -1817337 -4652343 -4642459 -2646169
45074 -2646169 -2071824 -3433176 -4802423 -5907159 -7912016 -9987248 -9770923 -7233203
45066 -7233203 -4904248 -3919890 -2812695 -838090 633114 1271177 3055335 6109468
45058 6109468 6334087 870579 -6036787 -7243001 -2369097 1493932 -295703 -4079209
45050 -4079209 -4468294 -2359679 -1968949 -2790534 -341173 5531902 8875497 6030796 1337089
45041 1337089 1302419 5976237 9645139 8461749 3822854 -1150206 -4899135 -6775159
45033 -6775159 -6270999 -4264318 -2802191 -2269653 -712660 2611723 5248460 5354747 5436214
45024 5436214 8880302 13865658 14911134 10791751 6560641 5998701 6182725 2671448
45016 2671448 -3312238 -7168561 -8096984 -8895227 -9586211 -6958495 -1228287 2469643 1776482
45007 1776482 1482789 6333643 13112514 14802280 10492179 5727222 3614991 1338749
44999 1338749 -3112976 -6148149 -4158266 -292549 -696476 -5264637 -7197147 -2522315
44991 -2522315 4392419 7076477 5054568 2301546 452734 -1653778 -3055457 -1105695
44983 -1105695 2491194 1925918 -3925502 -8235067 -5611091 -116049 1154428 -1409412
44975 -1409412 -2095271 295467 2012810 2259509 3743211 5534051 3480618 -1239744
44967 -1239744 -2371731 477357 36103 -5731979 -8228131 -1961267 4866821 2139198
44959 2139198 -6547704 -10109595 -7084819 -5508850 -8262153 -9972354 -8363789 -7791620
44951 -7791620 -9734136 -9606210 -5872788 -3415518 -4353323 -3935510 225922 2945244 696068
44942 696068 -1524181 1032828 3865485 552661 -6022856 -7919340 -4222930 -960107
44934 -960107 -1094994 -2221108 -2990733 -4453447 -5206714 -2094337 3613764 6705401 5460131
44925 5460131 3194284 1860486 -176906 -2954713 -3327644 -514821 1862162 1354707
44917 1354707 -344498 -1750019 -3777686 -5463231 -3188800 2494175 4854724 344695
44909 344695 -4996788 -4066200 581070 1237782 -2572591 -3831322 558602 5460367 5849281
44900 5849281 3215274 1192507 -203455 -2677944 -5331238 -5593903 -2912541 735198
44892 735198 3051309 2993663 1221053 -429714 -977842 -1627404 -3495826 -4804077 -2969704
44883 -2969704 1038922 3716732 4132195 4170244 3668888 194207 -5151543 -6944725 -3085220
44874 -3085220 1400096 1401301 -1705160 -4077893 -5528532 -7037374 -6373070 -2063803 1395772
44865 1395772 -1180408 -7141678 -9241738 -6020863 -2222923 110299 3244711 6239023
44857 6239023 4240429 -2349650 -5749959 -1694552 4131644 5029434 2707206 2486194
44849 2486194 4343000 5059746 5366013 8052469 11415000 11418364 9115869 9254215 11775083
44840 11775083 11256584 5737015 29409 -1747081 -1598360 -2781346 -4114670 -3067647
44832 -3067647 -1275536 -2394444 -5878440 -7241233 -4640272 -1563199 -1669747 -3716515
44824 -3716515 -3962315 -2193431 -2318002 -6504531 -11330074 -11685389 -7102238 -1896149 284087
44815 284087 -520439 -2782939 -5580953 -7514675 -6358142 -1630555 4269456 8813278
44807 8813278 11310152 11166365 7213646 979822 -2344172 383077 5550624 7345143
44799 7345143 5391971 3931897 4593601 4668889 2620211 678591 739929 1549410 1638465
44790 1638465 1739097 2383456 2157902 640173 335575 2862279 5431013 4530092 1716456
44781 1716456 1803627 5350406 6925624 2497554 -4375883 -6460078 -1595490 5213384
44773 5213384 8145560 6316810 2674234 -62759 -506759 2174236 7138205 10762363
44765 10762363 9759571 5668996 3539984 5512233 8370948 8540772 6721096 5630950
44757 5630950 5488339 4393475 1903557 -363978 -1210798 -962417 -423213 -320674 -1462910
44748 -1462910 -4009611 -6672218 -7585339 -5911724 -2421632 772329 1215544 -1462312
44740 -1462312 -3965054 -2502735 1759851 3149198 -1199811 -7127339 -8484996 -4071514
44732 -4071514 2360350 6558141 6190436 1623375 -3093623 -2683398 3038659 7934956
44724 7934956 7535993 4958530 5011535 6033252 3233439 -2239103 -4085216 -103983 5266333
44715 5266333 7834726 7759284 6331714 3810013 1441759 1146082 2176992 2026420 1013015
44706 1013015 1681955 3419514 2622556 -939391 -2981252 -1323399 1097302 1429761 480993
44697 480993 -695713 -3148193 -6741271 -8752151 -8034004 -6750258 -6078200 -4359324 -1537229
44688 -1537229 -955048 -4187155 -8269167 -10576029 -12125420 -13448295 -12038464 -7369281
44680 -7369281 -3789459 -4308308 -5656959 -3880913 -846304 -284430 -940525 794880 3993947
44671 3993947 4489740 1532227 -1704539 -3102105 -3000061 -2048453 -1336322 -2628850 -4679905
44662 -4679905 -2153158 6831327 14811746 12862410 2747214 -5349268 -6372840 -4568318
44654 -4568318 -3888066 -2166773 2315777 5279425 2334568 -3748849 -6547650 -4512139
44646 -4512139 -1852301 -2092755 -4322051 -5768428 -5501933 -4923692 -5739847 -7817647 -8816090
44637 -8816090 -6422055 -1342870 2613951 2182734 -1877258 -5492433 -5519599 -2944397 -1479811
44628 -1479811 -3094071 -5887538 -7006466 -6299149 -5354191 -4154354 -1638157 881208
44620 881208 665787 -1400824 -812569 3664929 7024494 4782878 -709601 -4212784 -4881995
44611 -4881995 -5439199 -6313947 -5420867 -2881778 -1434449 -1972532 -2349395 -1112236 584893
44602 584893 1440591 1975682 3235880 4962784 5532390 3328524 -1103421 -4155297 -2497255
44593 -2497255 1958758 3339518 -428807 -4441665 -3638318 729640 4343268 5729471
44585 5729471 5199140 1809934 -3742761 -6644643 -3899854 271616 875853 696774 5002821
44576 5002821 10349132 7991832 -1647176 -7374856 -2395494 6910367 10677010 7350134
44568 7350134 2203765 -185439 1795009 7269429 12095896 11642296 7062640 4632568
44560 4632568 6647074 8119405 5389358 2316633 3541558 6513086 5559334 383749
44552 383749 -4745580 -7719027 -9511089 -10156146 -8433433 -4824888 -1412256 493510
44544 493510 536635 -1101022 -2323775 32079 5427443 8530738 5881160 786619 -1713195
44535 -1713195 -1697587 -2147260 -2770884 -1085612 2074777 3276654 2062037 1246948 1854415
44526 1854415 1856655 67439 -2315230 -4163686 -5187977 -4415519 -1331655 1420555 49406
44517 49406 -5018602 -8858112 -7951136 -3753494 265399 2409040 2580129 883007 -1929217
44508 -1929217 -4127796 -4583126 -3986778 -3862905 -5008110 -7059386 -8720414 -8322472 -5129883
44499 -5129883 -343931 3802854 5942128 6105030 4820538 2578730 113548 -1520561
44491 -1520561 -1506138 -54791 1260938 658676 -1600902 -3031587 -2401053 -2202133 -5163410
44482 -5163410 -9187412 -9309873 -4780975 -334114 459851 -801635 -1335901 -1088571 -680256
44473 -680256 523283 1772687 274711 -3986988 -6708758 -5678857 -4455267 -5838648
44465 -5838648 -6369935 -2569402 1607033 192813 -4791212 -5808988 -685823 5686385
44457 5686385 9404814 10663086 9592072 5891478 2434125 2399195 2788572 -1987505 -9704552
44448 -9704552 -11523040 -5085254 1830836 3337673 2716007 3813493 3700936 -208733
44440 -208733 -3195409 -757013 2730759 795547 -4238087 -5419916 -2757426 -1832944
44432 -1832944 -3063579 -1643071 2332724 3067668 -307508 -1224047 3171539 6402459
44424 6402459 2881465 -2930016 -3606574 -182446 357443 -3570704 -6194093 -3577351
44416 -3577351 1011395 2384080 -7078 -2908703 -4145045 -4426871 -5243534 -6507962
44408 -6507962 -6448675 -3695311 481882 2702501 1022648 -2671419 -4793005 -3908789 -1363638
44399 -1363638 962485 1788093 159157 -3591611 -6855289 -7199021 -5864376 -6093575 -7692841
44390 -7692841 -6722488 -1916330 2214539 1223171 -3343911 -6849367 -7513999 -5779397 -669803
44381 -669803 7895135 14798612 13905277 6682890 956138 341020 792509 -960714 -2168578
44372 -2168578 -419687 970457 -1259315 -4075784 -3118253 19665 1138564 713623
44364 713623 1765368 3244568 2098972 -144109 219155 1596222 -506802 -4393583
44356 -4393583 -3694608 1521795 3826396 747686 -667536 4377502 10060565 9064771
44348 9064771 3583536 531185 735675 96499 -1950776 -2474539 -1626460 -2331468 -4240853
44339 -4240853 -4099023 -1778990 -317009 -70048 1601167 4565631 5431849 3693608 2871425
44330 2871425 4003003 3472233 -181961 -2509271 33207 3750161 2961743 -1220831
44322 -1220831 -2663066 376254 2866391 719639 -3632613 -5580454 -5064047 -5707472
44314 -5707472 -8596621 -10439228 -8535017 -4843630 -3157814 -3717423 -3224480 -85432
44306 -85432 2960370 2619873 -314876 -1804461 714750 5709684 9127667 7778283 2059161
44297 2059161 -3707898 -4753790 -951414 2641550 1697941 -2358230 -5290406 -6457244
44289 -6457244 -8879866 -13181175 -15319052 -11927963 -5195876 -231261 862758 230247
44281 230247 518555 1916735 2854865 2223429 516383 -647096 -20607 1954097 3393750
44272 3393750 2749220 335376 -1844018 -1782397 528779 2500932 1224001 -2842375 -5503996
44263 -5503996 -3672068 391491 1985922 587830 276292 2877941 4444399 1143574
44255 1143574 -4223703 -5506393 -1736686 1831086 1406080 -666869 -499635 1461275
44247 1461275 1942674 223910 -1106661 -129300 2219481 3813184 3196833 68223 -3960840
44238 -3960840 -5339384 -1970918 3026531 3824544 -799236 -5456878 -5075821 -1005711
44230 -1005711 2134910 2939287 3110628 2973587 1369172 -850252 -1502108 -1067596 -1798790
44221 -1798790 -2749896 -430921 4661668 7213800 4824132 1668588 1512867 1947978 -161655
44212 -161655 -1923555 1049215 6322946 7562190 4571883 3567786 6849110 8695285
44204 8695285 4002461 -4000091 -7934793 -4884420 2052229 8188642 10450964 8206230
44196 8206230 3805373 1333157 2621311 4997338 4321974 -460013 -6775744 -11395200
44188 -11395200 -12812073 -11443623 -8553233 -4903944 -542091 3632921 5206236 3119875
44180 3119875 460680 1415782 5239226 6465901 2209293 -3790623 -6101342 -3959904
44172 -3959904 -723734 771400 121344 -1538593 -2186407 -145156 3544674 5547602
44164 5547602 4595573 3391090 4268859 5354840 3760834 522610 -991365 -252126 259541
44155 259541 -744424 -2297635 -3893674 -5985598 -7704210 -7100259 -4194920 -1397782
44147 -1397782 -434761 -805521 -1288100 -888907 1477376 5707621 8778683 6985456 710769
44138 710769 -5074714 -5833466 -1572412 4015847 6734774 4520181 -771180 -4245262
44130 -4245262 -3029761 -333046 -1697756 -7260467 -11152142 -9252021 -3986876 -118287
44122 -118287 729839 -613031 -3686383 -7729741 -10550590 -10861110 -10139587 -10002567 -9581603
44113 -9581603 -7712636 -5654385 -4992953 -4741160 -3416255 -2223783 -2911559 -4041358 -3176380
44104 -3176380 -1640831 -2791451 -5913654 -6506576 -3374686 -831383 -1959753 -3821221
44096 -3821221 -2390001 914703 1503717 -1249999 -3162695 -1427386 1689859 2358715
44088 2358715 164879 -1885818 -1272670 1426835 3573088 3290780 1127291 -763973
44080 -763973 -876132 220987 627887 -744652 -2767315 -3004410 -415740 2971767 3951954
44071 3951954 2014765 185789 1017308 2911555 2296664 -1098243 -3503242 -1987956
44063 -1987956 2124068 5581847 6861055 6145982 3627851 -99670 -3192527 -4308787
44055 -4308787 -4504310 -5358729 -5947227 -4164146 -819770 427244 -2055614 -5544812 -6768289
44046 -6768289 -5979919 -5535321 -5942386 -5402405 -2701009 1074040 3569635 3091004 140056
44037 140056 -2136545 -164531 5918347 11198236 10816956 5352253 -378262 -3293669
44029 -3293669 -4483508 -5755257 -6680686 -6356171 -5715890 -5892234 -5638972 -2925731 1192342
44020 1192342 2803544 152015 -3370677 -2977912 1505095 5405297 5193137 2493527
44012 2493527 695874 -254376 -2520901 -4905927 -3275397 2438779 6215726 3829724
44004 3829724 -1128623 -3110710 -2880341 -4322215 -5775361 -2162045 4660281 5970046
43996 5970046 -1176153 -8861115 -9693097 -6641658 -6436113 -8963850 -9674922 -8177643 -7286408
43987 -7286408 -6353441 -2862421 862918 -269582 -5642673 -9038568 -7482616 -3967327
43979 -3967327 -955917 2621741 6662922 8095594 5895742 3099680 1931172 1263028
43971 1263028 389130 791608 2605036 3771541 4053292 5197560 6093547 3496274 -778287
43962 -778287 73207 7618862 14522643 15019083 12669042 12707969 12979995 9172792 4015275
43953 4015275 3453959 6743810 7888650 5118232 1943171 -14886 -2477772 -5249773
43945 -5249773 -5749748 -3945544 -2384309 -1366681 777544 2920038 2114142 -607003
43937 -607003 -911332 1903605 4015750 3780383 3913956 5826310 7024644 5811295 3718327
43928 3718327 1518510 -2300303 -6830129 -7329645 -1783436 4866606 6580822 3669036
43920 3669036 1099119 1267781 1661704 -924409 -6101125 -10025076 -9202622 -4219912 836103
43911 836103 3244907 4381296 6084457 6704505 3983563 -60403 -1371785 114481
43903 114481 1083227 591773 372810 48967 -2363944 -5011171 -3170266 3125602 7897135
43894 7897135 7248749 3566546 288757 -2162418 -3453632 -1903544 1533881 2872404
43886 2872404 1140552 296 1214671 1896348 679772 710644 3282754 4426117 1694723
43877 1694723 -1355600 -1659393 -1853309 -4287732 -5648261 -3164598 -814756 -2996829
43869 -2996829 -6574612 -5780328 -1189405 2515289 4023639 4390880 2440755 -2153288
43861 -2153288 -4928704 -2713916 104970 -1318434 -3099009 910935 7292359 7703239
43853 7703239 2735037 316619 1664362 408296 -4023922 -4259327 1296460 4085591
43845 4085591 -876621 -7089724 -7804421 -6124494 -7571458 -10333629 -9920333 -7364209
43837 -7364209 -5903779 -4547257 -1499155 423517 -1710259 -4772700 -4211217 -1627676
43829 -1627676 -1521177 -3330508 -3206667 -1598945 -2378847 -5340112 -5895603 -2402041 1602505
43820 1602505 3024648 2406917 847685 -1780134 -4220960 -3388468 1323750 5869146
43812 5869146 5810174 1349248 -3378346 -4969628 -3320157 -139811 3374371 6522233
43804 6522233 7703808 5143743 -127630 -3918175 -3449076 -847968 325369 424744 2061445
43795 2061445 4353087 3641166 51078 -1734536 556835 3853217 5364672 6183001
43787 6183001 7132465 6316386 3866848 3802448 7060473 7910018 2666628 -2783660 -1054440
43778 -1054440 4600279 4371784 -3023439 -7650758 -2205342 8330196 13942986 11604098
43770 11604098 6380934 3502586 3002739 1685844 -1773142 -4644781 -3547370 338341
43762 338341 1888041 -797671 -2937682 50812 5026410 5350906 1121600 -673131
43754 -673131 3428796 8489220 8654135 4692830 1081436 -734763 -2447801 -4409885
43746 -4409885 -4784616 -2761118 -48636 1190316 688937 119571 1084710 2997963 3512091
43737 3512091 1845725 583576 2190515 4649639 3698909 -587530 -3237987 -1679348
43729 -1679348 287289 -1433090 -4466082 -3463201 1518083 5053496 4578935 3515954
43721 3515954 4662908 5306720 2461604 -740578 778246 5145771 5048814 -1091320 -5640414
43712 -5640414 -2588098 3400567 3857761 -1260657 -4605874 -2866919 -111596 533978
43704 533978 1549972 5084991 8218696 7508460 3760692 -909808 -6349169 -11080957
43696 -11080957 -10335998 -2426874 6217419 7898244 3551013 758855 3438535 8508860
43688 8508860 11699340 11585370 8323811 3255752 -155767 662465 3356006 3624869 1856900
43679 1856900 2118462 4603139 4550920 1286 -4474972 -4213313 -692743 1241448 -587640
43670 -587640 -4652826 -8183735 -8745409 -5598189 -1064146 1457793 1705914 2256777 3415005
43661 3415005 2026469 -2905639 -7037198 -5960509 -1115002 2488196 2605562 1070613
43653 1070613 142557 238012 664760 531882 -761267 -2645638 -3583596 -3104906 -2686732
43644 -2686732 -3567278 -4706045 -4170827 -1941264 -258960 -1228178 -4255296 -5792571 -2459913
43635 -2459913 4682041 10154312 9947298 6019012 2734355 727948 -2014771 -4549219
43627 -4549219 -3798443 -1009047 -1473475 -6055061 -8614828 -5033976 140174 373859 -3278347
43618 -3278347 -4268152 -100617 4909044 5638534 1365172 -4486765 -7131493 -3850590
43610 -3850590 2871433 6583738 3522656 -2912599 -6210167 -3935765 946830 4262292
43602 4262292 4120003 1876821 1340794 4953301 9307362 7671530 -859276 -8750881
43594 -8750881 -9890028 -7591020 -7870931 -9276542 -6623467 -1750604 -1529658 -5674974
43586 -5674974 -5894329 811262 6742211 5488002 1761281 3297658 8577788 9812624
43578 9812624 5056712 148817 -585219 750184 716301 -616637 -1761908 -2952318 -4724784
43569 -4724784 -5704631 -4293062 -1486511 59537 -523911 -1437392 -905614 694702 2075561
43560 2075561 3104038 4132229 4069996 1525379 -1790170 -1554848 3471394 8463280 7981335
43551 7981335 3050874 -353217 711126 3072401 2614682 -653205 -3662860 -3891539
43543 -3891539 -961366 3138674 4778551 2083858 -1806655 -1787677 2116378 4304779
43535 4304779 1891144 -592734 2105770 8066153 11290227 10245185 8347828 7210662
43527 7210662 4882188 1139444 -707869 858236 2656758 1790852 181853 1002179
43519 1002179 3079379 2561866 -1014422 -3938611 -3545895 -1146178 828593 1883069
43511 1883069 2463352 2187644 991188 620647 2772307 6225881 7861366 6618402 4648291
43502 4648291 4129017 4752686 5281395 5764499 6416217 5546004 1125363 -5610459 -10372595
43493 -10372595 -10375807 -7143632 -4118278 -3041168 -3568347 -4775587 -5514083 -4529023 -2066747
43484 -2066747 -612498 -2187516 -5419764 -7205280 -6831388 -6073837 -5232806 -2114206 3785429
43475 3785429 8851743 9510579 7014593 5288644 5079623 3464566 -879867 -5141246
43467 -5141246 -6084194 -3717615 -14721 3544563 5442209 3690092 -1234594 -4751254
43459 -4751254 -2951152 1651285 2772164 -995744 -3965360 -1265882 4410439 6699264
43451 6699264 3909695 32304 -1698451 -2577792 -4874343 -7287323 -6288225 -1307759
43443 -1307759 3510785 3723367 -23216 -2487128 -128408 4555617 6456671 4498474
43435 4498474 2343886 2628301 3566038 2444564 -349122 -2834830 -4551830 -5487489 -3951792
43426 -3951792 888255 5380898 4321187 -2116106 -7838565 -8268852 -5337037 -3569251
43418 -3569251 -3915454 -3883045 -2217852 -700166 -1274391 -3212462 -3936255 -2152627 509041
43409 509041 1419760 293208 -480012 727445 2477959 2585033 1145948 -567363 -2502076
43400 -2502076 -4360968 -3457339 1869558 7509708 7294088 1935390 -1213639 890747
43392 890747 2179673 -2632689 -8786321 -8012218 -769759 4841131 4704984 2300899 951416
43383 951416 -381784 -1930610 -487068 4426777 7009195 2646069 -4471148 -6342366
43375 -6342366 -1923782 2241292 1732966 -380987 787920 4846449 7306768 5683843
43367 5683843 1556528 -2672037 -6307795 -9056180 -9353235 -5919680 -343176 3832957
43359 3832957 4961424 4689310 4954931 5496003 5715364 6925045 9952785 11833309 8728606
43350 8728606 2272669 -1058629 1618839 5616537 5718611 3678132 4564752 8012428
43342 8012428 8481054 3983124 -787523 -1622986 -487489 -1025819 -1965343 560142 5650508
43333 5650508 7388427 2694799 -4170212 -6806159 -4045030 54545 2143076 2948878
43325 2948878 4877704 8422569 11748045 12666471 10371564 6085162 2498841 1643914
43317 1643914 2724070 3130217 2382523 3526799 8762224 14823609 15671150 10108917 3905832
43308 3905832 2943887 6525417 9453257 8879837 6386448 4311768 3177633 2949995 4074755
43299 4074755 6211515 7804335 7861794 6698148 4399960 566243 -3465713 -4416266 -990958
43290 -990958 3659216 5579351 4784821 3956352 3573367 1692987 -1547647 -2846960 -404483
43281 -404483 3299429 5242256 5836307 6708558 6670799 3412542 -1625020 -3825994 -1446761
43272 -1446761 2062578 3101835 2579450 3468410 5766490 6691718 5103455 3048256 2701276
43263 2701276 3792325 4636870 4315140 3331765 3124435 4965586 8121352 9343534 6193271
43254 6193271 1081645 -600904 2464635 5162970 3062521 -582840 1020429 7951802
43246 7951802 12264504 8325519 467609 -2698373 840818 4984112 4076388 -593783
43238 -593783 -3672962 -2562140 372328 1387499 -347072 -2217932 -1471294 1318604
43230 1318604 2663718 323640 -3876583 -6407899 -6379610 -5840224 -6191419 -6612387 -6480725
43221 -6480725 -6879415 -8224959 -8448643 -5763157 -1918429 -158893 -668989 -893947 -282066
43212 -282066 -1376270 -4976636 -7272543 -4384686 1962042 6130640 5212514 1323675
43204 1323675 -2529060 -5988115 -9758204 -12655811 -12030233 -6535665 2253118 10344631
43196 10344631 13373267 9786053 2957875 -1242083 -326734 2305337 1958188 -1350256
43188 -1350256 -3202239 -535937 4775032 8209759 7167521 3171276 476931 2222912
43180 2222912 6931380 9386354 6331391 569182 -2471451 -1512481 -93799 -732656
43172 -732656 -1993796 -2414222 -3493449 -6004675 -6404076 -1142494 6755344 9960849 6118996
43163 6118996 908187 331846 3369798 4970511 3864754 3476786 5494088 6509975
43155 6509975 2914406 -3304899 -6461533 -4178340 209503 2674971 3331176 4598304
43147 4598304 6517870 6679895 4355672 2039077 2328571 5232200 9135736 12560704
43139 12560704 14247485 13420632 10989271 8776752 6750168 3203706 -1253480 -2870977
43131 -2870977 -197077 2559340 1148793 -1964259 -1085903 3481129 5016577 10528
43123 10528 -6667701 -8431623 -4932196 -480189 2475463 4829651 7530253 10161875
43115 10161875 12172033 12973732 11374404 7206553 3109079 2394884 5140262 8295194
43107 8295194 9687918 10073924 11045696 12759549 14333846 15050698 14420972 12114444 8566823
43098 8566823 5001766 2345801 576316 -671855 -1428757 -1464237 -461413 1961403 5723260
43089 5723260 9580760 11569965 10487095 6739345 1913853 -2008548 -3383536 -1919710
43081 -1919710 821086 2734712 3193039 3033049 2556598 839376 -2339087 -5111915 -5379972
43072 -5379972 -3532453 -2050599 -2496766 -3967532 -4571109 -3369260 -610343 2858999
43064 2858999 5753353 6744530 5624272 3803483 3060059 4012078 6095294 8302262 9234572
43055 9234572 7292403 2255662 -3510890 -6842036 -6969914 -5763955 -4621183 -2592811
43047 -2592811 1698320 7519836 12383113 14106697 11848122 6301417 138508 -2740002
43039 -2740002 -345241 4803520 7514082 4966791 -483548 -3727700 -1874753 3193984
43031 3193984 7074355 7510413 6340784 6478237 8092966 9342454 9924811 11063096 11867852
43022 11867852 9282413 3311357 -960021 573353 5337595 7760366 6913127 6698221
43014 6698221 9222421 11864863 11320758 7616082 3503454 1858238 3581579 6270350
43006 6270350 5836455 1683306 -1198015 1547212 6895562 8211990 4710958 1953258
42998 1953258 2999302 4860228 4942349 5224196 7565705 9957047 10434403 10230555 9946183
42989 9946183 7086265 1046755 -3641484 -3110671 546319 3734938 6945748 11115330
42981 11115330 12717411 8814504 3867526 4473322 9152578 10487381 6491889 2632972
42973 2632972 2577656 4239486 5926146 9004034 12329662 11300463 6064300 4184416
42965 4184416 10203824 17734728 17638534 10290020 3583791 1257322 -91226 -2866494
42957 -2866494 -3929548 -162369 6082785 10161422 11174615 11825302 13477784 14363771
42949 14363771 13074187 11462328 12227061 14449772 13861801 8331981 1303326 -1909423
42941 -1909423 -241415 2608500 3247298 2055761 1523647 3062039 5947161 8000692
42933 8000692 7120354 3622048 1091165 3034206 8307162 11728342 9862213 4557485
42925 4557485 250987 -382369 2568043 7433582 11728473 13263259 12021348 10065332
42917 10065332 8755699 7377559 5473223 4785127 6937929 10148439 10518575 6862472
42909 6862472 2668922 2373881 6234813 9753062 8471524 2914660 -2033205 -2676490
42901 -2676490 -169659 2107945 3353190 5598367 9791268 13907429 15513220 14659842
42893 14659842 13371205 12967684 12523760 10099257 5811255 3234554 5963765 12385401
42885 12385401 16487117 15432342 13375915 14911107 17707634 16175751 10506758 6571419
42877 6571419 7390793 10365242 13255599 16819054 20025775 19007890 13962221 11472068
42869 11472068 15520977 20727253 19718016 13840209 10770971 13440031 17168409 17412847
42861 17412847 15174533 13910770 14995233 17448016 19533470 19819605 18555221 18091671
42853 18091671 20108749 22895694 23662288 23031547 24413340 28819495 33063455 33745117
42845 33745117 30742210 26142640 22014621 20187357 22026292 26711944 31006793 32443138
42837 32443138 32291207 34033022 38914102 44139652 46105672 44839049 44108827 46868128
42829 46868128 51837889 55770626 58067038 61132904 66523371 73197760 80050945 87746990
42821 87746990 96994485 107194203 118208216 131590483 148536460 168286564 190083616
42814 190083616 215002544 243942522 274846070 303136405 323600904 331188640 322754408
42807 322754408 300403351 271282321 241625859 212292319 181980458 152644437 128664265
42800 128664265 111894198 100543832 92377751 86528919 82664475 80579144 80248774 80768582
42792 80768582 80282073 78456399 77379846 78273034 79623954 81040243 86201440 98218082
42784 98218082 114198361 128871803 142161287 158361220 178766859 200534226 222766756
42777 222766756 247635984 273590440 292689352 297854600 289321039 271338087 246179863
42770 246179863 215193093 183184027 156830876 138284091 123288122 106751781 88671585
42763 88671585 73481362 64341034 59559916 55136081 49406927 43383341 37426788 30863473
42755 30863473 25295107 24186560 26989524 27707433 22953479 17845429 18919914 24002315
42747 24002315 25285368 20910723 16519439 15282010 13720016 9463458 6517652 9006608
42739 9006608 14408249 17067639 15296780 11662583 8887177 8432217 10791576 14318192
42731 14318192 15517084 12837129 8765630 6691827 7476619 10179499 13761328 16698054
42723 16698054 17255483 15502597 13032765 10249085 6813977 4983583 8236193 15233139
42715 15233139 19462899 17038320 11091814 6591460 5024363 6247139 10590950 15931400
42707 15931400 17425227 14035107 11056411 12313045 14455742 13456023 11772042 13279938
42699 13279938 15628533 14654056 12909373 15958197 22228760 24531980 20975450 16862562
42691 16862562 15745184 15848536 15957174 17527040 19259028 16371643 8017617 -63724
42683 -63724 -2998336 -2198065 -1050920 87136 1916161 3392396 3720447 3757582 3275785
42674 3275785 383315 -4255732 -6436427 -4110891 -502756 1047625 1780611 3980008
42666 3980008 5953580 4383660 -84593 -2991507 -1255633 3676090 7352807 6342348
42658 6342348 1757601 -1537520 -971332 -39867 -2593430 -5323032 -2064914 4994645
42650 4994645 6444572 -148941 -5685390 -3414551 959761 -254208 -3495750 -320377
42642 -320377 7870521 11745195 8605188 5034855 4986581 4590074 801977 -2772922 -1911360
42633 -1911360 2489511 7790443 13537774 18933985 20935362 18332267 14584753 13909787
42625 13909787 16993047 22005137 26750328 28540947 25610915 20396483 17990759 19728736
42617 19728736 21737826 21044607 18847428 16179861 11483396 5329276 2502181 5447081
42609 5447081 9935195 11349903 10946141 11160027 9399879 3095214 -2588082 -60312
42601 -60312 8902638 14449587 12111936 7841536 8202496 12251495 15816709 17935104 19249130
42592 19249130 18544271 15241298 12497732 13872089 18436523 22010007 21911967 18551495
42584 18551495 14128731 11669810 13278432 17202338 18628309 15580751 11953640 12282839
42576 12282839 15732695 18282799 18907573 19898511 22277450 24900517 27869122 32977276
42568 32977276 40068552 46051314 48580570 48409651 47345412 46061288 44661213 43340466
42560 43340466 41787941 39865796 39189030 41401858 44151487 42058852 33802916 25509341
42552 25509341 24106268 29117419 34343915 36480086 38103324 42064972 47072543 50591187
42544 50591187 52841039 55068527 55954174 53189586 47865116 43812237 42237293 40338332
42536 40338332 36640974 34615035 38213545 45694155 51151478 51482940 48684594 45427555
42528 45427555 41863670 37670923 33935303 31219147 28446485 25687006 25371323 28145821
42520 28145821 30112429 27800674 24002608 24299291 28688955 31545621 30201616 28459163
42512 28459163 29781289 31805468 31036653 29332205 31125414 35956315 38391181 35342271
42504 35342271 29713118 25863927 24260259 22105861 17648848 12336781 9069461 8984954
42496 8984954 10162346 9922969 8361290 8193640 10402499 11973578 9817346 5233691
42488 5233691 1776257 -28185 -2257239 -4366766 -2756109 3186326 8471198 8420491
42480 8420491 4537850 1929205 2937356 5874964 8241516 8423784 5705498 1534621
42472 1534621 -416243 1502824 3715235 1829999 -2804779 -5141524 -4475461 -5224435
42464 -5224435 -8825107 -10580176 -7381904 -3331521 -3161835 -4242517 -1071943 4792457
42456 4792457 6133187 1063375 -4001739 -3806643 -781494 625032 932791 2798731
42448 2798731 5057496 4713076 2861350 3435907 6438337 7100360 2680020 -3620903 -6999576
42439 -6999576 -6431282 -4011462 -1358497 1040389 2392035 2028257 1005968 1396111 3678061
42430 3678061 5991755 6258471 4178505 839302 -2798992 -6270860 -8763283 -8829015 -5584670
42421 -5584670 -165490 4528512 6069922 4683046 3046805 3672968 6362130 8416318
42413 8416318 7609687 4782226 2913521 3496118 4610180 3241580 -1054458 -5649082
42405 -5649082 -7602872 -6036258 -2194857 1580747 3087712 1819083 -541600 -2240196
42397 -2240196 -3810330 -6722811 -9873700 -9798144 -5178204 1025174 5222570 7106193
42389 7106193 8386660 9367644 8833280 6362446 2924893 -288294 -2416874 -3089836 -2944934
42380 -2944934 -2854141 -1998057 1261866 5563682 6525956 2827122 -643592 853063 4901863
42371 4901863 5660085 2728290 998013 2361425 3421552 2219770 1488684 3078926
42363 3078926 4323608 3173880 2644421 6041356 10773731 11307161 6712493 1491102
42355 1491102 -269993 1516011 4470814 6080914 4926055 1863498 -459546 -981484
42347 -981484 -1926669 -5076936 -8002804 -7140282 -3554876 -1855140 -3390041 -4415512 -2167386
42338 -2167386 700836 -4554 -3976516 -6843873 -5614959 -1408318 2964004 6135784
42330 6135784 8377282 9985873 10630995 10167594 9344143 9233650 10089769 11181531 11839294
42321 11839294 12261298 13023848 14046415 14332366 12751734 9217441 5334977 3586239
42313 3586239 5186538 8736326 11568658 12326706 11527501 9919192 7593039 4877737
42305 4877737 2677147 1209329 -506908 -3039387 -5144106 -4826188 -1539617 2995856
42297 2995856 5925564 5488026 2919821 1759258 3961479 7025670 6810332 3212448
42289 3212448 732193 2597215 6504357 7587277 3990304 -1853645 -6053196 -6068758
42281 -6068758 -2130390 2699039 4983059 4573957 4608243 6946437 9327729 8338153 3490960
42272 3490960 -2980239 -8405990 -10234001 -6859400 -454849 3253859 1261952 -2305929
42264 -2305929 -1527589 2977339 5188712 2557310 -909416 -1135038 855571 2129712
42256 2129712 2524053 3335476 3895503 2694844 717691 637560 2830043 4616477 3991315
42247 3991315 2234747 1766358 2646323 2759390 1110346 -798042 -1429670 -1440164 -2032367
42238 -2032367 -2350538 -673851 2418017 4604310 5414380 6435094 7727753 7447101 5918501
42229 5918501 6116742 8058189 6874157 -57737 -7626504 -9159859 -5475359 -2687446
42221 -2687446 -2803273 -2301384 381071 1927459 -755 -2781401 -2674057 705927 5103613
42212 5103613 7892251 6994072 2817786 -291745 1718126 6492688 7737781 4443195
42204 4443195 2276731 4102954 5305197 2258044 -370909 3389656 10542032 12567440
42196 12567440 7213612 400415 -2958163 -3729973 -3561091 -1216329 3533886 6884396
42188 6884396 5309741 440766 -3246911 -4042766 -3864228 -4599882 -5940561 -6578410 -5738922
42179 -5738922 -3336463 104761 3268271 4640940 3922854 2548467 2286026 3353263
42171 3353263 4409157 4512709 4361382 5006762 6087683 6501991 6376723 6753567 7316291
42162 7316291 6405348 4044443 3026610 5411714 9200981 10375390 7802655 4548847
42154 4548847 4285696 7396023 10666864 10306708 5586915 -75016 -2227559 69618
42146 69618 3749248 6079752 7656670 9774205 10930386 8820720 4905231 3565932
42138 3565932 6146945 8798299 7693036 4042769 1942436 2963660 5272481 7012708
42130 7012708 7831398 7408075 5510838 4203127 7020449 14065289 20166953 20501858 16619238
42121 16619238 14025581 14739002 15695706 14482230 12823415 13193075 15373283 18199882
42113 18199882 21577024 24446611 23908862 19583384 16158461 17701932 21583286 22493328
42105 22493328 20717622 20929760 23477625 23238556 18326783 13725550 13239128 13089613 8020569
42096 8020569 233151 -2897929 1383333 8050681 10739815 8161892 3849936 1849026
42088 1849026 3300004 6277074 8681428 10842704 13832344 15698240 12721164 5611508
42080 5611508 836282 3048320 9048549 12522657 12252025 11647438 12137860 11987218 11146084
42071 11146084 12251572 15781607 18297362 17274477 14733068 14313715 16944341 20799827
42063 20799827 23516627 23153984 19079230 13615101 11097835 13310617 16862299 16898487
42055 16898487 12878088 9182425 10242774 16196154 23198141 27095238 26792765 24593810
42047 24593810 23227166 22519014 19839423 14412917 9989370 11384675 18380703 24994528
42039 24994528 25901925 22306965 19902693 21869276 26020710 28782402 29396946 29016475
42031 29016475 27872390 25579378 23101475 22154609 23066161 24965409 27517481 30641845
42023 30641845 33158500 33871627 33698868 34759384 37782562 42333591 48608536 56364270
42015 56364270 63086383 66657893 69320175 75266741 84670525 94266305 103557753 115329793
42007 115329793 129617824 143046819 155580078 171627531 191857064 210206956 222479232
42000 222479232 231309312 237961885 236195895 221292187 199587943 180902124 165689117
41993 165689117 148319202 129543390 115616847 106575785 95874595 82333998 72640102
41986 72640102 69876542 68536376 63928101 58263947 53745956 47601097 38894246 33231448
41978 33231448 34723435 38640042 37928475 32726152 27902745 25149550 23263637 22889978
41970 22889978 24848530 26039996 22938200 17797115 16028221 18322677 20426680 20254183
41962 20254183 20241021 22154889 23849460 22566620 18788036 15713259 16341590 21060203
41954 21060203 26824049 29332875 27326186 23790628 21880367 21402165 20734022 19849046
41946 19849046 19186232 17721543 14862236 12447702 12209384 12983491 13027514 13126528 14532574
41937 14532574 15825408 15035242 13190478 12686930 13881479 16126559 19733085 23608482
41929 23608482 23977605 19768336 16211772 17807251 20710044 18727992 14417892 15885698
41921 15885698 23170548 26897827 22146066 15044583 12239844 11685068 8790692 5081104
41913 5081104 4622172 6551506 7272468 6787837 7305975 8303794 8374026 9585002 14252336
41904 14252336 18908651 17493012 10465321 5386128 7380313 13199953 16233195 14281290
41896 14281290 10646924 9364212 10852464 11965603 10229885 7720265 8893095 14007810
41888 14007810 17679401 16022133 12213532 11739955 14703094 16861032 16334979 14840862
41880 14840862 13694231 13223579 14888209 18786983 20053708 13949929 4650998 2159758
41872 2159758 8974121 16731753 18887923 19508311 24462058 30325457 29556456 22968035
41864 22968035 18863806 20829178 24003200 24319706 24518494 28071725 32363170 32258961
41856 32258961 27948076 25189557 28142057 34675255 39471343 40354972 40310498 43284187
41848 43284187 49397899 55764276 61005608 66050849 70622360 73419559 77550391 90337618
41840 90337618 112893599 134268437 143105906 142811918 146896177 159688232 170998492 172053813
41832 172053813 166985565 162992400 157634503 144590476 126714272 113547713 107713034
41825 107713034 102568355 93264232 82331126 73463605 66960527 63003543 62774647 63840163
41817 63840163 60513597 51960493 44560667 42785636 42925427 40011262 35992969 35570564
41809 35570564 37602206 36869790 32494988 28814541 28609145 30409598 32129403 32815862
41801 32815862 31014755 25913974 20330345 18244272 18836299 17192207 11834202 7370401
41793 7370401 8118662 12777143 17146069 18702708 16631508 10933013 4231923 1472735
41785 1472735 4538031 9136524 10027690 7669530 6639979 8863225 11866286 13237169
41777 13237169 13388641 13395495 12866872 11138421 8799904 6856015 5401026 4024355 2824513
41768 2824513 2158381 1617047 -10692 -3330335 -6993402 -8361528 -6063003 -1577462
41760 -1577462 2310704 4192840 4423021 3655692 2518450 2234953 3663801 5769699 6807255
41751 6807255 6777775 6705518 6060751 3804797 1708212 2910215 6712551 8869885 8100356
41742 8100356 7861114 10017518 11799888 11774454 13457700 18832505 23349112 22754098 20393564
41733 20393564 21426562 23808651 22401142 18637990 17465575 17011014 11239219 2344053
41725 2344053 -204388 5333076 9355844 5825719 890178 1495193 4544916 4247027
41717 4247027 2514637 4031298 6883978 6432950 4129051 4388493 6048366 4772062
41709 4772062 1443538 742746 3313168 6126743 8490313 10942283 10741290 6038370
41701 6038370 2297475 6227653 14908421 19777094 20254729 23420428 30048884 32089970
41693 32089970 26685822 22033476 24427459 28662231 27470873 22854353 21059260 22231022
41685 22231022 22230806 20464889 19209038 18196380 15671773 12340965 9497433 6071072 2048166
41676 2048166 1412872 6486307 12427228 12986630 9213948 6753951 6788022 5930275 3676318
41667 3676318 3334833 5552740 6818204 5287671 3339856 3434888 5428807 8496063 11765705
41658 11765705 12574694 8189498 321470 -5585127 -6651407 -5093628 -3725319 -2365876
41650 -2365876 -203505 1251813 -163600 -4049587 -7404550 -7228044 -2923653 2905645
41642 2905645 6125684 4692634 575871 -2575419 -2837815 -385503 3692428 7266489
41634 7266489 7791800 5496855 4368970 7287546 11664661 12916407 10879585 9332893
41626 9332893 10131179 11513695 11771830 10947990 8994789 5807005 3332442 4277203 8067796
41617 8067796 10921154 10507116 8116197 5921478 4523470 3580528 2791762 1936309 1268861
41608 1268861 1316396 1228447 -745608 -3408476 -2265007 3803589 8724137 6678894 625433
41599 625433 -2158005 -730737 -111124 -1736776 -1867830 432123 1280985 -778896 -2449349
41590 -2449349 -2210569 -2482433 -3486948 -1902910 2070816 3383562 656804 -1105629
41582 -1105629 541625 1467837 -284863 -61795 3846736 4818513 -793764 -5139324 -686041
41573 -686041 6564377 6454100 1720879 3335166 11934621 16981932 14086528 10570582
41565 10570582 11968170 14644495 15179398 16240094 18403796 16214440 8637466 4533362
41557 4533362 10017689 17612053 16626319 8843244 4596740 6950907 9503132 8302580
41549 8302580 6315233 5513596 3432060 -23436 9394 5459507 11057882 12258720 12178596
41540 12178596 15499225 19702733 18769806 13362479 10542276 13351037 16782337 15717884
41532 15717884 11704760 9029810 8080893 6363836 3681184 2420447 3609492 5703700
41524 5703700 6847410 6110322 3298306 -174493 -1256524 1151855 3429939 1254893
41516 1254893 -4044724 -6744695 -4558148 -1419970 -1384108 -3421759 -4251256 -3182121 -1484115
41507 -1484115 753749 4097495 7211814 7445850 3843225 -1822796 -6696301 -8844569
41499 -8844569 -8466295 -7577612 -7402018 -6128814 -1360132 5054568 7809785 5194457 2174839
41490 2174839 3873952 8478115 9877914 5847103 206541 -2659184 -2440197 -1728298
41482 -1728298 -2359577 -3691128 -3616583 -1004317 2769864 5319816 6233568 7181130 8813607
41473 8813607 9393292 7203868 2626843 -2672253 -6693356 -7144996 -3466693 651465
41465 651465 368775 -3469653 -4639320 -664943 2857589 397457 -5238976 -7306775
41457 -7306775 -4541645 -1025514 1090731 3190128 5526182 6231314 5132524 4327971
41449 4327971 4579357 4517234 3555984 2568034 1703011 286167 -1273071 -1799399 -1079783
41440 -1079783 526446 2761281 3888998 1009145 -5237987 -9210410 -7232804 -3130923
41432 -3130923 -2505690 -4609577 -5231340 -4657672 -6238504 -9180915 -9838021 -8712642 -8821983
41423 -8821983 -8302426 -2870410 4808979 7259574 4382326 3941303 7910508 8473495 1666960
41414 1666960 -4753294 -3175142 2373370 3645342 350342 -2447617 -3431483 -3968029
41406 -3968029 -2685544 1258744 3499535 718652 -1965748 2072444 9518054 11242085
41398 11242085 6235360 2545670 4408250 6924788 4947356 -96089 -4351802 -6355576
41390 -6355576 -5600852 -1819858 2156012 1904060 -1968047 -3422211 437839 4899521
41382 4899521 4445356 -60107 -3970210 -5052582 -3868775 -1011974 2495636 4096447
41374 4096447 2225313 -1267812 -3513387 -4040042 -3842449 -2853064 -774193 1036302 1132337
41365 1132337 525210 1256609 3050258 3688106 2469660 1200241 1591128 3286584 4648128
41356 4648128 4220459 1411188 -2943792 -6512327 -7250296 -5708967 -4525710 -5045639 -5379249
41347 -5379249 -2725965 2938490 8645293 11821964 12575287 11994866 9613738 4473149
41339 4473149 -1576834 -4004202 -270057 6985317 12803949 14949718 14652263 13413320
41331 13413320 11361397 8728383 6809286 6674003 8162609 10545857 12931614 13822016
41323 13822016 12003466 8617592 6663090 7271197 8001164 6364611 3585560 2600773
41315 2600773 3197491 2035036 -2169045 -6205568 -6443166 -3300934 -6125 1467759
41307 1467759 1243714 -290323 -2606154 -4033581 -3340123 -2081288 -2521656 -3205287 -198021
41298 -198021 6192248 9903625 7025902 1991969 2057132 7651606 12531564 12580751 9897864
41289 9897864 7795368 6097976 3203936 -282594 -2260406 -1837132 264916 2874473
41281 2874473 4918475 5752503 5551823 4719117 3230858 1684112 1950882 4605543 6665525
41272 6665525 5004848 1599019 1686497 6423932 11319328 12920148 12923682 13853903 14686861
41263 14686861 13514373 11288094 9858744 8799465 6992510 5135999 4105395 3093220
41255 3093220 1788116 1808053 3427453 3961692 2526547 2907397 7413489 11224460 8576561
41246 8576561 2301848 509917 4516792 7220708 4547316 1471170 3464541 7772958
41238 7772958 8035509 3887647 651582 1131913 2777122 3131626 3786891 7085366 11614291
41229 11614291 13645938 12251069 10566566 11453629 13641608 13433319 9163701 2532965
41221 2532965 -3549883 -6626327 -5173665 -163225 4199182 4413344 2475899 3229805
41213 3229805 6635893 7286384 3036404 -1156839 -1002358 749522 72807 -1205823 -12595
41204 -12595 538808 -3998596 -9770308 -8580315 -976518 3425876 80828 -4383559 -3172509
41195 -3172509 1206783 3020616 2488500 3168308 4707480 4276064 2520419 2472208 3919859
41186 3919859 3699006 1015168 -1506210 -1943804 -1058660 -104078 805040 1936782 3297836
41177 3297836 4789590 6081009 6910241 7986572 10106514 11828287 10442120 6524139
41169 6524139 4637258 7162405 10097140 8247368 2671005 -784631 657388 4096929
41161 4096929 6001619 6141886 5645731 4251177 1367771 -1790546 -3032990 -1870688
41153 -1870688 -281702 -434155 -1957538 -2273729 -220331 1661456 209560 -3529407
41145 -3529407 -5217339 -3346073 -1359630 -2227637 -3908182 -2690499 1257789 4601032
41137 4601032 5507142 4727908 3193578 1395797 377680 648282 692583 -1006407 -3206136
41128 -3206136 -3728855 -3254191 -4324361 -6937713 -8207171 -6558937 -3498352 -923322
41120 -923322 693488 1156482 324835 -330142 1514351 5855352 10046596 12168821 12464524
41111 12464524 11095961 7447870 2823010 973108 3955674 9346364 13223201 14208912
41103 14208912 13130458 10711135 7592877 5023903 3385340 1270674 -1901782 -3513523
41095 -3513523 -388881 6658815 13036722 14995919 12392564 7237499 1568963 -2947953
41087 -2947953 -5094559 -4738907 -2807464 -339066 2041845 3988630 5472972 6757003
41079 6757003 7780105 7994138 7303594 6445492 5879048 5386084 5474641 7465591 10771822
41070 10771822 12132706 9993157 7738908 9109276 11918316 11069680 7304575 7000465
41062 7000465 11842097 15031292 11477303 5989328 5531667 7877304 5720710 -392230
41054 -392230 -2411487 1531194 3262103 -1902449 -6131330 -295552 11496611 16847684
41046 16847684 11995113 5543885 5281237 8853711 9954497 7746951 6000893 6433394
41038 6433394 7303653 7288820 7213362 7851078 8296820 7324609 5553087 5520003 9026819 14213246
41028 14213246 16464523 13532807 8619710 6266316 6242738 4712055 1051822 -746258
41020 -746258 1414036 4245781 4742741 5352495 9375880 14146469 14216056 10263137 8990246
41011 8990246 13095545 16598173 13065896 4738467 -469388 936268 4968527 6606565
41003 6606565 5410922 3877409 3444659 4143359 6118133 9003817 10779812 9718703
40995 9718703 7236748 6485335 7962385 9032602 8527386 8942408 12094331 15138320 14181762
40986 14181762 10529890 9517837 13073769 17040087 16934937 13275552 9529410 7456539
40978 7456539 6732075 7150714 8534856 9563589 9126508 8179097 8084924 7781061 5173788
40969 5173788 1376640 876516 6290298 14633705 20225656 20482187 17647498 15252174
40961 15252174 14196667 12769269 9714141 6197800 4507619 5600632 8573670 11879411
40953 11879411 14047389 13784554 10966541 7547786 5892187 5944528 5682750 4632695 4806543
40944 4806543 7320691 10336226 11792300 12078696 12212018 11553199 9811822 9307556 11913998
40935 11913998 15058419 14618804 11397407 10611512 14318317 18341397 18395164 15752309 14256968
40926 14256968 14405727 13665357 11253336 9341108 9706716 11740399 14110447 16491806
40918 16491806 18948860 20745944 20534736 17675345 13618611 11869686 15144300 21676284
40910 21676284 25973578 25012260 22247281 22916857 26475854 27362171 23336912 18720815
40902 18720815 17531682 17591184 15165025 12401796 14856425 22436303 28271661 27798785
40894 27798785 24329652 23235981 24554138 24918747 24023020 24637797 27139383 28335574
40886 28335574 26450713 24155084 25291953 30400403 36461265 39881114 39269085 36377901
40878 36377901 34526642 35152017 36174239 34886123 31722694 29408664 29084928 29665499
40870 29665499 30726425 33264195 37233049 40931502 43510420 45810759 48244226 50330410
40862 50330410 52775126 57070798 62237208 65155142 65361641 66182837 69535095 73271369
40854 73271369 75942945 80259005 88335508 96864197 101314329 102528457 104719127 108936555
40846 108936555 113419901 118974251 128354592 140268099 149264625 152694673 153400224 154286488
40838 154286488 154505141 152829558 150790303 149694277 147445116 141371655 132615813 125234107
40830 125234107 121707286 120778354 118947149 113399782 104711597 97121190 94414754 94985852
40822 94985852 93031649 85507988 75737306 68936640 66300787 65056394 62467414 57948917
40814 57948917 52635327 48573460 47195800 47159439 44997719 39488589 34112076 33292996
40806 33292996 36999650 40829483 40950088 37387953 32813870 29759611 29297344 31198604
40798 31198604 34384568 37067969 37020459 33060095 27205823 24126260 26474687 31356215
40790 31356215 33728652 32934862 32876526 35482102 37700575 36618749 34221219 34353236 37315288
40781 37315288 40445458 42416960 43851184 44597024 43540161 41268878 40670020 44242480
40773 44242480 51647551 59578254 63512750 61060072 55038320 51920755 55381637 62389056
40765 62389056 67458681 69517731 72164267 77935890 85137839 90645434 93718283 96287982
40757 96287982 100621241 107168136 114229141 119819028 123891285 127800240 131588492 133730457
40749 133730457 134084790 134486716 135068386 133003172 127306517 121926930 120560641 120718746
40741 120718746 117113840 109325648 101500189 95331080 88404837 79858645 72892133 70183801
40733 70183801 70444365 70930963 70307461 67883052 63138117 57477814 53881810 53424907 54036781
40724 54036781 53247606 50167835 45020531 39460949 36798928 38275997 39597972 35661936
40716 35661936 28573979 25530329 28210244 30676034 29518503 28889203 31806464 33558785
40708 33558785 29531380 23859667 23349622 26882555 28034301 25256852 22242910 20410057
40700 20410057 18539826 18511748 23467606 30269690 31499484 26226249 21793982 22943392
40692 22943392 25672961 24669718 21006223 18870458 19214646 20348221 21502922 22643559
40684 22643559 23230685 23305625 23383529 22227026 18093978 13071702 11797758 14438481 15854525
40675 15854525 13789181 12388900 14474641 16105892 13527242 10362502 11892688 16033327
40667 16033327 16580136 12934762 10100208 10539636 12289954 14179404 16610364 17415351
40659 17415351 13294446 6199318 2539979 4622168 7923731 8317838 6971707 6200030
40651 6200030 5499451 4470804 5169167 8053214 9323937 6323050 2814367 4513789
40643 4513789 10916453 15857928 15834970 13936944 14802151 18688160 22139669 22770387 21441166
40634 21441166 20086907 19106280 17803162 16513100 16560006 17841293 18342026 17310452 17269059
40625 17269059 20844455 26689248 30814472 31216130 28912417 25397759 22123554 21844005
40617 21844005 26501645 33105551 35435602 31395901 25709009 23809405 26029416 29595025
40609 29595025 33173804 36605921 38502180 37457537 34588648 32238132 30979733 30116950
40601 30116950 30133867 32085727 35035940 36615575 36298940 36133469 37810449 40548610 42423580
40592 42423580 42710929 42303813 42338678 42837097 42665230 40845213 37801828 34959329 33191758
40583 33191758 32197927 31362511 30697012 30956600 32980443 36179965 37452890 33478625 25576378
40574 25576378 20225933 22004517 27501550 29648656 26915282 23916718 23396109 22899997
40566 22899997 20560706 18999129 20781772 23904172 24725198 22480648 18537127 14107079
40558 14107079 10927705 11170168 14395046 17487047 19353635 22063719 25618577 26391551
40550 26391551 23426038 20954640 21043279 19562116 14332194 10997073 13985730 17570630
40542 17570630 14773305 10300447 13757563 22892233 25948491 20520243 17191392 21680460
40534 21680460 25885154 22413621 16960118 17978783 22633337 22644164 18244169 16389621
40526 16389621 18533750 19691609 18136284 17283241 18027893 17093625 14053178 13095915 15964616
40517 15964616 19069036 19924215 21122100 24874905 28163219 27202792 23589086 21921148
40509 21921148 23208395 24599601 24804365 25900159 29277223 32927653 34140921 32802260
40501 32802260 30520333 28211856 26539287 27455165 32480121 39444007 43702207 43568470
40493 43568470 42241712 43061587 45276448 46547605 47285507 49342787 51849003 51964215
40485 51964215 49386810 46770139 45566899 44556931 42821008 41167424 39977564 38308215
40477 38308215 35723488 32639649 28778219 23982983 20257646 19476413 19300148 15811138
40469 15811138 10512263 9343056 13316165 16015316 13286500 9590884 10347554 13255130
40461 13255130 13109700 11186419 12819524 17792400 20198912 17475808 13340215 11263650
40453 11263650 10531886 9806262 9711414 10444829 10914170 11512793 13847640 16526068 15425500
40444 15425500 10043083 5651300 6598149 10690200 12924831 11966432 9928019 8125170
40436 8125170 6536838 6029655 7581700 9707573 9662660 7395523 5922612 7382332 10676755
40427 10676755 13495342 14850239 14797816 13177467 9864561 5539529 1323881 -1799908
40419 -1799908 -2745014 -701391 3049787 4875117 2499567 -1318292 -1272669 3831501 9407236
40410 9407236 11176838 10235256 10054832 11218820 12351492 13987211 17121179 19192033
40402 19192033 16640892 11414160 9532641 12195679 13867803 11264003 8462948 9557978
40394 9557978 11775951 11201911 10886760 16436657 25884467 31008380 28378275 22948447
40386 22948447 20254418 20740911 22891853 26353581 29582004 29104688 24453908 20653813
40378 20653813 22491890 28302010 32211543 31034889 26307008 20591000 14788049 9492758
40370 9492758 6682495 8149753 12423914 14951634 12886077 9149880 9502627 15099333
40362 15099333 20489075 20399980 15987445 12222405 11548310 12994152 15328078 17467867
40354 17467867 17387945 14471494 11737758 11945737 12949298 11299763 8821088 9885884
40346 9885884 13004512 12053272 6761733 4791968 10571792 18438893 20905011 18347113
40338 18347113 15718799 14139715 11376172 7702313 5631120 5326445 5040093 5000452 6641485
40329 6641485 9035191 10269803 11506260 15330560 20398404 22012458 18409044 12731954
40321 12731954 8306964 5669935 5011649 7523690 12333415 15327587 13724163 9841307
40313 9841307 7806665 7949244 7212552 4623101 3477879 7046138 13770072 18395424
40305 18395424 17625776 13457797 10569341 11271395 13816198 15181913 14323440 12387987
40297 12387987 10663001 9181830 7309848 5191948 4130408 5191130 7628381 9381090
40289 9381090 9237677 7782005 6252768 5717953 7351363 11378873 15066042 14452422 9746827
40280 9746827 6221955 7391864 10384245 11451558 12594215 17371037 22796501 22567316
40272 22567316 17708956 16309297 21367715 26383184 25798297 22740506 22185417 22798949
40264 22798949 21142368 18977346 20082974 23155968 23944846 22201076 21018315 21016951 20279008
40255 20279008 18641120 17393563 16103001 14071284 13255550 15248401 17218550 15719434
40247 15719434 12698203 12385968 13855737 12574793 8262573 4990013 3978708 2666499
40239 2666499 898323 1438391 3717868 3806278 1899482 3040111 8293205 11932492 10420165
40230 10420165 7792848 8219714 9097793 6455163 2410845 1759847 4465753 6720840
40222 6720840 7101861 7071740 7236597 7226107 7774035 9370897 10344314 9360230 8083832
40213 8083832 8463598 9473728 9547609 9806924 11451208 12465327 10898464 9095341 10216904
40204 10216904 12553404 12219292 9986405 10064769 12875972 14655488 14272814 14741904 16996528
40195 16996528 17779212 15763773 14660995 17163733 19993768 18780414 14916320 13477970
40187 13477970 15925884 18663762 18374501 15660089 13139201 12344215 13258641 15270870
40179 15270870 17371139 17944834 15557615 10688440 6460682 6467840 11072462 16666157 19528788
40170 19528788 19431714 18184431 16153993 12759951 9449555 8744132 10176133 10689459 9911520
40161 9911520 11182176 15361602 17432957 12874784 4863532 812692 2872817 6168702
40153 6168702 6350934 4590625 3989511 4888877 5939227 6965438 8099488 8065400 6256656
40144 6256656 5324437 8579217 14960329 19288435 18012439 12682177 7358674 4689662
40136 4689662 5126596 7671956 10030815 9894503 7723607 6815385 9045651 12085701 12726722
40127 12726722 11366516 10673201 11111076 11029530 10609440 12019247 15153920 16813579 15606095
40118 15606095 14629651 17090475 21385446 22913773 19668192 14284437 11301954 13372182
40110 13372182 19093480 23919742 24572771 22794535 22616786 23907007 22258523 16456389
40102 16456389 11659518 12255854 15498125 16236046 14617171 14232983 15274981 15141389 14153205
40093 14153205 14710375 15589489 13205032 8451560 6040752 6545827 5752719 3240412 4364155
40084 4364155 10717579 15591036 13543876 8580749 7235478 8502683 7219627 3861315
40076 3861315 3684523 7686987 11166504 11173061 9790214 9553905 10224697 10645515 10013476
40067 10013476 7221847 2531637 -445704 1659737 6691669 9327995 8454250 7816029
40059 7816029 9416237 11105764 11275649 11011221 10481815 8050537 4509565 3384694 5057598
40050 5057598 5395357 2734121 1416061 5006261 10296487 12084162 10433777 9036515
40042 9036515 9291610 10239826 11849557 14046137 14621554 12532734 11448591 15303888 21527162
40033 21527162 23470195 19114124 12916568 9091160 7351305 5795274 4099559 2789760
40025 2789760 2233367 3075697 5399351 7548810 8237677 9123807 12189637 15444912 15289839
40016 15289839 12807321 12936084 16638121 18738712 15546801 10500753 9463762 13269183
40008 13269183 17490453 17569027 12293772 4156008 -2162151 -3431941 -1108587 824479
40000 824479 1357934 2885897 5903637 7347582 5613519 3153541 2018704 810259
39992 810259 -1384374 -2050018 474609 3395109 3815421 3412317 4816733 6441207 5374490
39983 5374490 2807382 1839443 2002517 782733 -1150241 -1082105 778824 2078174 2532990
39974 2532990 2781366 1121974 -3127147 -5213315 -682201 5906367 5759728 -948986
39966 -948986 -5034919 -2360548 993490 183814 -805632 2363621 6381544 6700564 5144703
39957 5144703 4631421 2486593 -3538433 -7923676 -4617229 2164368 3334336 -1207782
39949 -1207782 -3193132 557974 4360466 3791717 1061105 -1223381 -3688303 -5358554
39941 -5358554 -2770304 2979838 5290021 1825849 -1431378 -218363 706416 -3713692
39933 -3713692 -8731218 -6340484 1585588 5135493 349904 -6325762 -8308937 -6771893
39925 -6771893 -5932855 -5897835 -3926636 153811 3359515 3511234 1724043 1049563 3234575
39916 3234575 6550419 7226340 3904648 -204170 -1159575 746225 2156258 1888534 1805613
39907 1805613 2500064 1775581 -1336142 -4226531 -4375878 -2963253 -2650901 -3728176 -4815070
39898 -4815070 -5776486 -7151108 -7564791 -4688493 994996 5680797 6211782 3078986 -1031409
39889 -1031409 -4275003 -6445003 -7770834 -8079142 -7164092 -5494117 -4124157 -3529238 -2715960
39880 -2715960 -438136 2472482 3384347 1452141 -534946 273830 2443485 2042697 -1511143
39871 -1511143 -4336404 -3506927 -760394 680902 398087 -340776 -1736483 -4339427 -6064156
39862 -6064156 -3957468 1104309 4792672 4928693 3578744 2683517 1095518 -1998020
39854 -1998020 -3914762 -2015848 1649240 2864792 1270724 138228 662837 584137 -973622
39845 -973622 -1342983 1341747 4995731 6881950 7156928 6814170 5054871 1819249 269495
39836 269495 2694122 5806247 4746952 623870 -1218862 -131454 -1060070 -5070450
39828 -5070450 -5786498 606275 7610446 6894575 610903 -2188093 511964 1693255
39820 1693255 -2199460 -5294030 -2295907 2823473 3861000 2810015 6089794 13172184
39812 13172184 16550704 12753991 6629429 3462034 2754212 2127928 2265484 4565312
39804 4565312 7607767 9487188 10898165 12627388 12537083 8668092 3365398 624615
39796 624615 869225 1938752 3570755 6598160 8928012 7376375 3349133 1572642
39788 1572642 2605920 1985256 -1701899 -3574255 -296446 3991472 3936997 1106309 725840
39779 725840 3266025 4990068 5205501 6976187 10804110 13181324 12374011 10848119 10430789
39770 10430789 9264520 5607766 1257239 -980039 -577668 1693701 5418203 9406480
39762 9406480 11360171 10500938 8442867 6170866 2888059 -619236 -928110 3005051
39754 3005051 6830231 6219457 2845478 1187937 1467195 276878 -2769616 -3753702 -126058
39745 -126058 6208080 12104307 16057839 17118143 14354367 8949883 4303253 2515448
39737 2515448 2601439 3104645 4309553 6570219 8440218 8282278 6678932 5708640 6170772
39728 6170772 6447094 4317487 27204 -2765678 -646254 4438744 6330461 2895645
39720 2895645 8033 3428496 9487363 9829758 4189876 983870 4066549 6745500
39712 6745500 2764290 -3616292 -4309206 769499 5052792 5201951 3106839 278086
39704 278086 -3020547 -4106974 -9407 6558257 9241956 6644759 3417555 2222189
39696 2222189 594752 -2713025 -4379812 -2266774 849249 2631334 5246744 9917481
39688 9917481 12037116 7301515 -310613 -2704115 1526952 6074086 6346194 4460812
39680 4460812 3919586 4296993 3555403 2035398 1283312 1163838 859770 1289444 3822109
39671 3822109 7212943 8396297 6586751 4451397 4308656 4845531 3135172 -1081642
39663 -1081642 -5044682 -6661698 -6489992 -5601888 -3716240 -888777 863385 -83205 -2119174
39654 -2119174 -2409813 -1073076 -696371 -1986028 -2797953 -1712138 365021 2742256 6052831
39645 6052831 9784874 11678286 11045673 9975712 9773627 9134245 7517425 6951767 8087229
39636 8087229 7995580 5215056 3626919 7017977 12521112 14418754 12371148 10314721
39628 10314721 8655701 4070193 -2852318 -6386603 -3817974 794471 3186452 4080639
39620 4080639 5272680 5554590 3833011 1847431 250058 -3612460 -9928632 -12952664
39612 -12952664 -8605684 -1694528 677427 -288456 1528306 5324984 3922931 -3378223
39604 -3378223 -7730515 -3839602 1896309 1656490 -1872635 -768675 5258817 9099748
39596 9099748 7552489 4830800 4456069 4339280 1881788 -1350524 -2829270 -3014632 -3231630
39587 -3231630 -2622478 -101856 2960787 4752154 5824170 7311114 8112469 6654231
39579 6654231 4047558 2619947 2443995 2255254 2701778 5193624 8065280 7681897 3662018
39570 3662018 -464391 -2233672 -2304936 -1078152 2283925 5901798 5122508 -377715 -3737872
39561 -3737872 381925 7650237 10017212 7315371 6372252 9444570 10922380 7145772
39553 7145772 2618390 2619946 4940164 4083306 223706 -1714872 -293460 760714 -716865
39544 -716865 -1828093 447857 4237809 5063763 1466961 -3470240 -5469710 -3003509
39536 -3003509 1382608 3193268 253796 -4819646 -7254205 -5234209 -1218482 1688229
39528 1688229 2753890 2608849 1643178 964582 2857285 7757546 11988963 11473309 7348217
39519 7348217 4736602 5522590 5896581 2781922 -848000 -538154 2278783 2367310 -557623
39510 -557623 -713670 4593605 9883018 9123265 4565961 3143195 6356415 9216173 8543619
39501 8543619 6666954 5918320 4781875 2031810 387101 2461313 5899309 6252400
39493 6252400 3039465 -324222 -1447557 -770389 635341 2041510 2287494 823679
39485 823679 -602321 246996 2756241 4266762 3961599 3320498 2755298 786817 -2727587
39476 -2727587 -5341236 -5342614 -4171607 -3967182 -4314085 -3079478 415965 4415211 6599990
39467 6599990 6332462 5273552 5719543 7831215 9096721 7503727 4276992 1837067
39459 1837067 211867 -1940494 -3644220 -2508253 667546 2117918 866370 315134
39451 315134 2489012 4701007 4362832 3187508 3312851 2905052 -121923 -3052416 -2082644
39442 -2082644 1117352 2121854 1538861 3690424 7704205 6974731 -522128 -7791986
39434 -7791986 -8296381 -4651211 -3270818 -4455270 -3555293 256231 2554482 1005030
39426 1005030 -1135084 -364101 2144146 3188030 2383318 1683275 1469048 -65588 -3485011
39417 -3485011 -6248211 -5657714 -2774772 -1554891 -3707840 -6193069 -5317382 -1940592
39409 -1940592 -79975 -844076 -946592 2004326 5876191 7433591 6765004 5973159 5574338
39400 5574338 4851617 4096379 3653613 2117883 -1486578 -4826063 -4754585 -1842964 874489
39391 874489 2743213 5100156 6619537 3976662 -2054065 -6043297 -5298225 -3329850
39383 -3329850 -3396744 -2906626 2045394 9914360 15735091 17662341 17360195 15613126 11887254
39374 11887254 7336467 4096976 1892113 -997485 -3720975 -3625036 -956472 1242727
39366 1242727 2372699 5120799 9725933 11630976 7613278 1260026 -996254 2135035
39358 2135035 5671132 4833398 512291 -2211137 -145649 4108494 5159448 1973690
39350 1973690 6565 4035704 10816312 12921525 9164838 6039097 7876674 11161189
39342 11161189 11345649 9983782 10488482 11028769 7664880 2136065 79307 2227408
39334 2227408 3651441 2292032 2103441 5645298 8961440 7312901 2135746 -1587592
39326 -1587592 -2292095 -2311856 -3027396 -3294460 -2182921 -258077 1672776 2672290 1080112
39317 1080112 -3348437 -6916181 -4928342 2012445 7738413 8044599 5558375 4802071
39309 4802071 5289886 3463290 -140489 -791620 2790346 5679719 4067387 1144797
39301 1144797 1809352 4666534 4513989 1303161 686072 4976073 9120321 8138532 4200025
39292 4200025 2795544 4804353 6209155 4205721 124095 -3350209 -5266330 -6442398
39284 -6442398 -7684522 -8164207 -5889378 -1057560 1943918 -927234 -7020726 -9687870
39276 -9687870 -8030419 -7943638 -10925720 -9204880 1983125 13684043 13792418 4599073
39268 4599073 -417459 3849743 8466181 5806375 173814 -1250533 564525 719542
39260 719542 -453144 934347 5053423 8317017 8463261 5872693 2147257 218714
39252 218714 2769540 7772803 9237206 5328693 1609085 2849403 6314789 7434348
39244 7434348 7237642 8674276 10023946 8510117 6840280 8960984 12039308 10256197
39236 10256197 4649367 1235054 547502 -2287982 -6909221 -6257846 1912631 10111374
39228 10111374 11299105 7391630 3722965 1057469 -2120130 -4178102 -2611975 1027023
39220 1027023 2889221 1689685 -1257956 -4676492 -7174324 -6802295 -3684499 -1044548
39212 -1044548 -961375 -1244342 791911 3731753 4437489 3244521 3301308 5552257 7451767
39203 7451767 6596860 3471525 507929 -278732 1082569 2549640 2247906 674700 -450085
39194 -450085 -1034866 -1940925 -1849642 1451326 5939775 5918092 -56366 -5780170 -5153278
39185 -5153278 -87559 2953953 1681789 -718432 -1117318 706940 3614880 5954319
39177 5954319 5645516 2458204 -579074 -620175 1371068 2958038 4318373 6698728 8562037
39168 8562037 7287019 3655357 707121 -997366 -2903308 -4102073 -2174359 1676597
39160 1676597 3280886 2223617 3285909 9348261 16639002 19262504 15736056 9282733
39152 9282733 4014180 2243057 3388200 4404178 3172583 1637681 2938451 5718046
39144 5718046 5410452 1784975 233613 3490708 7034829 6156067 3149862 2825805 4363927
39135 4363927 3393389 305395 334804 5203030 10029522 10085450 6603274 3869453 3489339
39126 3489339 3835694 3458352 2842582 3065386 3758604 2841169 -1017838 -5427008 -5605034
39117 -5605034 -355309 5195942 5704408 2922477 2959914 7001943 9749083 7803152 4237065
39108 4237065 2519958 1157350 -1627933 -2535814 1621971 6351268 4116084 -4170774
39100 -4170774 -9362224 -6966301 -3106547 -4587849 -8929156 -9188226 -4575027 -402505
39092 -402505 410217 -123715 -545290 -2361153 -5734889 -7262027 -4342456 1063847 5035125
39083 5035125 5893693 4218981 884435 -2826210 -4778895 -4010906 -2466448 -2768513 -4537302
39074 -4537302 -4547811 -734619 5018342 8507120 7341035 3315340 535082 1056602 2918540
39065 2918540 2987750 806138 -1634312 -3004001 -3557710 -3530719 -3032359 -3353271 -5618611
39056 -5618611 -7948418 -7133671 -3896593 -2900838 -5811793 -7938419 -4649434 1747743
39048 1747743 5057821 3194232 -469452 -2517843 -2692737 -2109672 -1370582 -598358 627416
39039 627416 2922196 5203876 4762549 1345342 -1065694 280882 2022080 -363961
39031 -363961 -4707924 -4977558 -1136734 453697 -2624647 -4880100 -1893071 2989967
39023 2989967 4988674 5481997 7884176 10005893 6943191 -341691 -5369791 -4655326
39015 -4655326 -918304 2037522 2981618 1591635 -2184261 -6017584 -6481459 -3880888
39007 -3880888 -2405843 -4176718 -6563934 -6913323 -6282433 -6271941 -5628404 -3053756 -610484
38998 -610484 -858354 -2657425 -3360008 -3498266 -5434820 -8463712 -9343670 -7320716 -4715496
38989 -4715496 -2686055 -509549 895776 -417624 -2333551 487047 8227653 13405144
38981 13405144 10516013 4007950 2023420 5546831 8974129 8876533 6386275 2551354
38973 2551354 -2381143 -5601436 -4054545 -599538 -1616088 -7190217 -9840028 -5133460
38965 -5133460 2390035 6753786 8140661 9110267 8705700 5460444 2148018 2106789 3701338
38956 3701338 3263989 906938 -1097896 -2778507 -4458359 -3454658 1523627 5481925
38948 5481925 3128920 -2345858 -3456133 168422 2282404 1275796 2203414 6304357
38940 6304357 7324121 1946866 -3504215 -1804834 5137233 10002967 9746684 6877527
38932 6877527 4243349 2851750 2578819 1705635 -1908077 -6649296 -7433935 -3074649 479102
38923 479102 -1850027 -6707002 -7540031 -4246432 -1929654 -2129760 -1517440 1233447 3208301
38914 3208301 2577859 1062917 -212888 -2792485 -6840255 -8852317 -6113507 -959485
38906 -959485 1986935 1286946 -808853 -2220381 -3101615 -4162923 -4852883 -4164158 -2477823
38897 -2477823 -1385613 -1439100 -1179801 596862 2541229 2461136 800990 11661 418511
38888 418511 -281355 -2489093 -3001053 77692 3723070 4278373 2885258 2902040 3640898
38879 3640898 1214367 -4610871 -8786511 -7370470 -2290697 1710428 2283055 43129
38871 43129 -3749012 -7812569 -10281458 -9676427 -6498143 -2762945 84156 2101930 3708267
38862 3708267 4336144 2855756 -640458 -4102833 -5224622 -3618710 -570605 2948876
38854 2948876 6643047 9324922 8882995 4676633 -1347304 -6655455 -9941576 -10509503
38846 -10509503 -7953761 -3754509 -1233275 -2057265 -4231084 -5285779 -5759819 -7228005
38838 -7228005 -8474818 -6827947 -2811399 -286679 -1416947 -4001137 -4798832 -3576463
38830 -3576463 -2470866 -2448816 -2029931 232134 2950582 2945918 -284231 -2583255 103395
38821 103395 5545442 7167740 3017936 -963905 893617 5923413 7145573 3187045
38813 3187045 -617099 -505456 1101670 356199 -2500635 -4446240 -4044409 -2287796 -254969
38804 -254969 2269719 5879612 9875818 11818314 9596391 4527014 1031380 1711224
38796 1711224 3999248 3806339 1336510 361653 2195022 3742772 2117446 -1796930
38788 -1796930 -5449459 -7664054 -8203969 -6654606 -3578327 -1114712 -666569 -1234052 -1522010
38779 -1522010 -2291677 -4770670 -7888359 -9368918 -9049274 -8689213 -8350406 -5611920 203104
38770 203104 5091265 4285445 -1368867 -5597153 -4014622 903029 3596797 2235560
38762 2235560 -623101 -2904713 -5232623 -8000540 -9342959 -7648341 -4247438 -1905880
38754 -1905880 -1562507 -1735474 -625110 1765650 3217718 1377340 -2754990 -4471781
38746 -4471781 -725597 5011082 6511275 3175687 612862 2187230 4594104 3856623
38738 3856623 1207275 -339389 -1498399 -4486034 -7739040 -7375850 -2984701 1591869
38730 1591869 2850678 655557 -2471993 -3301072 -556242 2897850 2707725 -785827
38722 -785827 -2358260 63711 1486935 -2457945 -8129543 -9089027 -5313958 -1744563
38714 -1744563 -404451 131121 -382663 -3098500 -5446810 -3594414 964377 3137268
38706 3137268 2181340 2138419 4533435 6467453 6168781 4918538 3307629 938581 -396586
38697 -396586 1038930 2080940 -1380906 -6098914 -4846780 1593999 4602023 1625588
38689 1625588 495694 5915873 10688172 6699298 -2416613 -6801888 -3571126 2446193
38681 2446193 7356964 10724310 11892061 10292183 8503946 9874309 13469701 15217512
38673 15217512 13491895 10419356 8280243 7183704 5775888 2701895 -1613062 -3966985
38665 -3966985 -1289762 4801031 9132381 9287619 7445724 5513426 2905769 191573
38657 191573 -179646 1466250 1885471 1220051 3361444 7684385 7634914 1444363 -3320544
38648 -3320544 -1437093 1195533 -2277552 -7538631 -6241185 -2473 3020734 2031632
38640 2031632 3039979 5942101 3652065 -4672249 -10131640 -7251924 -1962560 -1878811
38632 -1878811 -5492460 -6265952 -2593832 1582085 3177159 2504572 872939 -1052407
38624 -1052407 -2928883 -4459990 -5108713 -3925572 -887405 1859865 2031885 385066
38616 385066 -187626 1299778 2779493 1953035 -1477372 -5915575 -8456564 -6376407 -319424
38607 -319424 4906373 5098629 1362056 -2108362 -3437135 -3531108 -2837444 -1255157 -284678
38598 -284678 -1576698 -3785771 -4147747 -2662347 -1501934 -923947 771949 3578863 5397407
38589 5397407 5148957 3407125 447613 -3441318 -6417185 -6821068 -5711894 -4933122 -3935615
38580 -3935615 -1529236 884343 1388233 1203836 2472732 4201393 4567038 5178867 8104242
38571 8104242 10542977 8098733 2039617 -2422204 -3762079 -3894852 -1873984 4494414
38563 4494414 11101944 10046265 1186282 -6521308 -7318937 -4812043 -3371353 -1366692
38555 -1366692 2865026 5558751 3581524 428988 599497 2422654 1882001 -203980
38547 -203980 -290978 1459009 2032321 828500 -509506 -1953819 -4622699 -7433728 -7645816
38538 -7645816 -4268475 1118181 5880326 7387805 4634030 295138 -1122640 1413029
38530 1413029 4453011 5214731 4393454 2931207 342449 -2111555 -1482856 1169241 273369
38521 273369 -5791544 -10924305 -10081007 -6611453 -5710450 -5592829 -1781658 3765662 5437152
38512 5437152 3612668 3843508 7177159 8626150 5773412 2323420 1661257 2410832 2181097
38503 2181097 1107292 -128758 -1853845 -3350428 -2768853 -509443 590140 -427436
38495 -427436 -1612918 -2515417 -5542616 -10857578 -13867799 -11028472 -5244508 -1921887
38487 -1921887 -1746781 -1267566 671553 1490104 -37168 -1529568 -1444574 -2248240 -6348623
38478 -6348623 -11216015 -12059449 -8374121 -4340296 -2879995 -2826080 -2416661 -1787278 -679663
38469 -679663 2421479 6616725 7778364 4352936 408382 -573680 -1080940 -4224176 -7032298
38460 -7032298 -5312898 -1990067 -3012571 -6889703 -6715908 -1997751 478531 -1727671
38452 -1727671 -3477507 -2494876 -3650387 -9102290 -12932321 -10537331 -5688834 -3231543
38444 -3231543 -2260533 -1717821 -4641570 -10487056 -11454706 -4329405 1718208 -1813367 -9060996
38435 -9060996 -9458291 -4600513 -3451118 -5693956 -3395155 3226721 5554241 1960251
38427 1960251 144798 2484436 1745747 -5237957 -11236721 -10651490 -7729477 -7484193 -7383773
38418 -7383773 -3875274 502024 2387934 3487474 5817730 6992215 5200105 3220526
38410 3220526 2893177 1441307 -2129915 -3268346 263259 3048785 565541 -2888255
38402 -2888255 -1642962 1379633 -27213 -4276614 -4616030 -419197 2061637 -789421
38394 -789421 -6322279 -10741963 -12132286 -9382270 -3550804 719690 226455 -1718427
38386 -1718427 -189581 3431335 4194121 2154253 1453483 2289919 1330210 -371626 1941387
38377 1941387 7114523 7376745 56979 -7260920 -7279382 -2689491 -777922 -3180036 -6028587
38368 -6028587 -6904217 -6664672 -6244763 -5704151 -5404798 -5282911 -4069729 -1338690 1135103
38359 1135103 1805049 1356547 793468 -170337 -1235323 -881342 348146 -913745 -5595878
38350 -5595878 -9309049 -8141484 -4389084 -2440514 -1711179 1197615 5212084 5685939
38342 5685939 2268624 -35632 1355922 3118325 2066342 -214890 -1346732 -2493462
38334 -2493462 -5441435 -8623921 -9537557 -8738806 -8249172 -8097605 -7592683 -7952945 -10093338
38325 -10093338 -11457697 -9009432 -4370011 -1913211 -2207870 -1664571 917166 1836091
38317 1836091 -1819695 -7423834 -9999814 -7886359 -3331065 669040 2294967 1184001
38309 1184001 -1437740 -3662039 -4766213 -5171274 -4493577 -1869649 1138053 791578 -3884159
38300 -3884159 -8729033 -9219833 -5857311 -2648589 -1927661 -3179034 -5638738 -9117296
38292 -9117296 -12510772 -13771157 -11643191 -6562967 -571401 3070199 2137795 -1255126
38284 -1255126 -1883554 1999473 5783158 4975774 1814788 1328884 3003207 1679891 -4024417
38275 -4024417 -9803753 -12630694 -14200409 -15886399 -15365145 -10973046 -5404350 -2024669
38267 -2024669 -580879 607109 1024109 -431341 -2498369 -3207941 -2749962 -2149724 -934091
38258 -934091 1275434 2670457 1611741 -400722 -884574 -134461 -48862 -546582 -166155
38249 -166155 814418 895372 148105 -432199 -1368597 -3266081 -3972952 -1117274 2984213
38240 2984213 3324710 -541890 -3683742 -3215392 -1936843 -2650019 -3475875 -2084276 -647245
38231 -647245 -2205113 -4791196 -4064292 -431719 1301407 -919532 -4154071 -5707289
38223 -5707289 -6111274 -5758210 -3068350 1702138 4769559 4048920 2760322 4061991 5012005
38214 5012005 879500 -6240770 -9073571 -5604006 -1920990 -2734116 -4640746 -2536447
$$ [...]
##END NTUPLES=NMR SPECTRUM
##END=
