##TITLE=31Pdec_SR163_oilEtAc
 , 24 sc
 20.1.2023
##JCAMPDX= 6.0         $$ Bruker NMR JCAMP-DX V2.0
##DATA TYPE= NMR SPECTRUM
##DATA CLASS= NTUPLES
##ORIGIN= UXNMR, Bruker Analytische Messtechnik GmbH
##OWNER= root
$$ XWIN-NMR		Version 3.5
$$ Fri Jan 20 16:30:43 2023 Russian Standard Time (UT+4h)  she@DPX200
##.OBSERVE FREQUENCY= 81.013821
##.OBSERVE NUCLEUS= ^31P
##.ACQUISITION MODE= SIMULTANEOUS
##.ACQUISITION SCHEME= undefined
##.AVERAGES= 24
##.DIGITISER RES= 16
##SPECTROMETER/DATA SYSTEM= spect
##.PULSE SEQUENCE= zgpg30
##.SOLVENT NAME= DMSO
##.SHIFT REFERENCE= (INTERNAL, DMSO, 0, 248.564)
##AUDIT TRAIL= $$ (NUMBER, WHEN, WHO, WHERE, WHAT)
$$ ##TITLE= Audit trail, XWIN-NMR		Version 3.5
$$ ##JCAMPDX= 5.01
$$ ##ORIGIN= Bruker BioSpin GmbH
$$ ##OWNER= she
$$ F:/spectra/data/she/nmr/P31/1/pdata/1/auditp.txt
$$ ##AUDIT TRAIL=  $$ (NUMBER, WHEN, WHO, WHERE, WHAT)
(   1,<2023-01-20 16:29:41.32 +0400>,<she>,<DPX200>,
      <created by zg, POWCHK disabled, PULCHK disabled
       configuration hash MD5:
       00 E9 B6 7A A2 85 ED C7 34 08 36 98 17 FE 4E 26
       data hash MD5: 32K
       B4 43 79 9E FF 1D 74 1D EB 3E 1B 97 F5 E0 78 54>)
(   2,<2023-01-20 16:29:43.70 +0400>,<she>,<DPX200>,
      <Start of raw data processing
       efp BC_mod = 2 LB = 1 FT_mod = 6 PKNL = 1 PHC0 = -11022.9 PHC1 = 195.6578 SI = 64K 
       data hash MD5: 64K
       6C B9 44 F4 DB 11 6E 7B 39 3F 4E 24 ED 73 58 EB>)
(   3,<2023-01-20 16:29:58.96 +0400>,<she>,<DPX200>,
      <pk PHC0 = 1.904628 PHC1 = 0 
       data hash MD5: 64K
       70 9B EF 04 D8 E3 93 B9 51 95 CE D1 3D FC DA 1C>)
(   4,<2023-01-20 16:30:04.39 +0400>,<she>,<DPX200>,
      <abs ABSG = 5 
       data hash MD5: 64K
       F4 42 FA 42 99 CD 47 BF FD 38 66 54 ED 69 84 D4>)
$$ ##END=
$$ 
$$ hash MD5
$$ ED 38 2D A4 E9 64 75 FE D6 92 03 B4 11 16 2A A7
##$RELAX= 
##$RELAX= 
##$RELAX= 
##$RELAX= 
##$RELAX= 
##$RELAX= 
##$RELAX= 
##$RELAX= 
##$RELAX= 
$$ Bruker specific parameters
$$ --------------------------
##$DU= <F:/spectra>
##$EXPNO= 1
##$NAME= <P31>
##$PROCNO= 1
##$TYPE= <nmr>
##$USER= <she>
##$AMP= (0..31)
100 100 100 100 100 100 100 100 100 100 100 100 100 100 100 100 100 100 
100 100 100 100 100 100 100 100 100 100 100 100 100 100 
##$AQSEQ= 0
##$AQ_mod= 1
##$AUNM= <au_zg>
##$AUTOPOS= <>
##$BF1= 81.014009
##$BF2= 200.13
##$BF3= 200.13
##$BF4= 200.13
##$BF5= 200.13
##$BF6= 200.13
##$BF7= 200.13
##$BF8= 200.13
##$BYTORDA= 1
##$CFDGTYP= 0
##$CFRGTYP= 5
##$CHEMSTR= <none>
##$CNST= (0..31)
1 1 145 1 1 1 1 1 1 1 1 1 1 1 1 1 1 1 1 1 1 1 1 1 1 1 1 1 1 1 1 1 
##$CPDPRG= <waltz16>
##$CPDPRG1= <>
##$CPDPRG2= <waltz16>
##$CPDPRG3= <>
##$CPDPRG4= <mlev>
##$CPDPRG5= <mlev>
##$CPDPRG6= <mlev>
##$CPDPRG7= <mlev>
##$CPDPRG8= <mlev>
##$CPDPRGB= <>
##$CPDPRGT= <>
##$D= (0..31)
0 1 0 0 0 0 0 0 0 0 0 0.03 2e-05 3e-06 0 0 0 0 0 0 0 0 0 0 0 0 0 0 0 0 
0 0 
##$DATE= 1674217780
##$DBL= (0..7)
120 120 120 11 120 120 24 19 
##$DBP= (0..7)
150 150 150 150 150 150 150 150 
##$DBP07= 0
##$DBPNAM0= <>
##$DBPNAM1= <>
##$DBPNAM2= <>
$$ [...]
##$SUBNAM3= <"">
##$SUBNAM4= <"">
##$SUBNAM5= <"">
##$SUBNAM6= <"">
##$SUBNAM7= <"">
##$SUBNAM8= <"">
##$SUBNAM9= <"">
##$SW= 501.771253377433
##$SWIBOX= (0..15)
0 1 3 0 0 0 0 0 0 0 0 0 0 0 0 0 
##$SW_h= 40650.406504065
##$TD= 32768
##$TD0= 1
##$TE= 0
##$TE2= 300
##$TE3= 300
##$TEG= 300
##$TL= (0..7)
0 120 53 12 22 120 120 120 
##$TP= (0..7)
150 150 150 150 150 150 150 150 
##$TP07= 0
##$TPNAME0= <>
##$TPNAME1= <>
##$TPNAME2= <>
##$TPNAME3= <>
##$TPNAME4= <>
##$TPNAME5= <>
##$TPNAME6= <>
##$TPNAME7= <>
##$TPOAL= (0..7)
0.5 0.5 0.5 0.5 0.5 0.5 0.5 0.5 
##$TPOFFS= (0..7)
0 0 0 0 0 0 0 0 
##$TUNHIN= 0
##$TUNHOUT= 0
##$TUNXOUT= 0
##$USERA1= <user>
##$USERA2= <user>
##$USERA3= <user>
##$USERA4= <user>
##$USERA5= <user>
##$V9= 5
##$VALIST= <valist>
##$VCLIST= <CCCCCCCCCCCCCCC>
##$VD= 0
##$VDLIST= <DDDDDDDDDDDDDDD>
##$VPLIST= <PPPPPPPPPPPPPPP>
##$VTLIST= <TTTTTTTTTTTTTTT>
##$WBST= 1024
##$WBSW= 4
##$XGAIN= (0..3)
0 0 0 0 
##$XL= 0
##$YL= 0
##$YMAX_a= 9723
##$YMIN_a= -11340
##$ZGOPTNS= <>
##$ZL1= 120
##$ZL2= 120
##$ZL3= 120
##$ZL4= 120
##$ABSF1= 248.5645
##$ABSF2= -253.2056
##$ABSG= 5
##$ABSL= 3
##$ALPHA= 0
##$AQORDER= 0
##$ASSFAC= 0
##$ASSFACI= 0
##$ASSFACX= 0
##$ASSWID= 0
##$AUNMP= <proc_1d>
##$AZFE= 0.1
##$AZFW= 0.5
##$BCFW= 0
##$BC_mod= 2
##$BYTORDP= 0
##$COROFFS= 0
##$CY= -3
##$DATMOD= 1
##$DC= 0
##$DFILT= <>
##$DTYPP= 0
##$F1P= 0
##$F2P= 0
##$FCOR= 1
##$FTSIZE= 65536
##$FT_mod= 6
##$GAMMA= 0
##$GB= 0
##$INTBC= 1
##$INTSCL= 6.047779e-11
##$ISEN= 30
##$LB= 1
##$LEV0= 0
##$LPBIN= 0
##$MAXI= 10000
##$MC2= 0
##$MEAN= 0
##$ME_mod= 0
##$MI= 50
##$NCOEF= 0
##$NC_proc= -8
##$NLEV= 6
##$NOISF1= 182.463
##$NOISF2= 159.3651
##$NSP= 0
##$NTH_PI= 0
##$NZP= 0
##$OFFSET= 248.5645
##$PC= 4
##$PHC0= -11021
##$PHC1= 195.6578
##$PH_mod= 1
##$PKNL= yes
##$PPARMOD= 0
##$PSCAL= 0
##$PSIGN= 0
##$REVERSE= no
##$SF= 81.0140089999694
##$SI= 65536
##$SIGF1= 159.3651
##$SIGF2= -187.1042
##$SINO= 113.3802
##$SIOLD= 16384
##$SREGLST= <1H.CDCl3>
##$SSB= 0
##$STSI= 65536
##$STSR= 0
##$SW_p= 40650.406504065
##$SYMM= 0
##$S_DEV= 0
##$TDeff= 32768
##$TDoff= 0
##$TI= <>
##$TILT= no
##$TM1= 0
##$TM2= 0
##$TOPLEV= 0
##$USERP1= <user>
##$USERP2= <user>
##$USERP3= <user>
##$USERP4= <user>
##$USERP5= <user>
##$WDW= 1
##$XDIM= 65536
##$YMAX_p= 368549792
##$YMIN_p= -28289091
$$ End of Bruker specific parameters
$$ ---------------------------------
##NTUPLES= NMR SPECTRUM
##VAR_NAME=  FREQUENCY,     SPECTRUM/REAL,   SPECTRUM/IMAG
##SYMBOL=    X,             R,               I
##VAR_TYPE=  INDEPENDENT,   DEPENDENT,       DEPENDENT
##VAR_FORM=  AFFN,          ASDF,            ASDF
##VAR_DIM=   65536,         65536,           65536
##UNITS=     HZ,            ARBITRARY UNITS, ARBITRARY UNITS
##FACTOR=    0.620285442955139, 1,           1
##FIRST=     20137.2065510682, 0,            0
##LAST=      -20513.1999529968, 0,           0
##MIN=       -20513.1999529968, -28289091,   0
##MAX=       20137.2065510682, 368549792,    0
$$ Real data points
##PAGE= N=1
##DATA TABLE= (X++(R..R)), XYDATA
$$ [...]
42553b32049j514029m79181J612797K139181L25106j338235P320L580310N074618
42544I175838J841149l087942m322609j066578K113079J803347l51559j513447
42536D591278j782802k197110k041738j109528j331926k711524j296229M152838
42528c726741P203819J958771o415272p297976P5379N533151L247321q19553o0095
42519c01196K586605J294640k356418k821964j24322J187780K54595M05249K364461
42510B489430K883601M13341k550769l483582k655220j393598l34770K26653L83985
42501d020929R26511J936362K004305P02923K59050K184637L907462K109425j807979
42492H201767l422231j852548n64585j473183k351633j219308M08652O21707N39344
$$ plain form
42553 -232049 -1746078 -2225259 -612462 1526719 1851825 513590 520910 4101220 9175838
42544 9175838 11016987 7929045 3606436 2539858 4652937 6456284 6104725 4591278
42536 4591278 2808476 611366 -1430372 -2539900 -3871826 -6583350 -7879579 -3726741
42528 -3726741 3477078 5435849 -979423 -8277399 -8202020 -2668869 578452 -241101 -301196
42519 -301196 2285409 3580049 1223631 -1598333 -1722655 -534875 -280280 124969 2489430
42510 2489430 5373031 5786372 3235603 -247979 -2903199 -4296797 -4631567 -4404914 -4020929
42501 -4020929 -3094418 -1158056 846249 1549172 1808222 3992859 7900321 10009746 8201767
42492 8201767 4779536 2926988 2362403 889220 -1462413 -2681721 -2273069 -1651362 -1112018
42483a112018K067258M060243L535804K14203k581203k183526j27785l0594k513005
42474A329377m153784k224129J412021L051578K318140J581974J115417r50257
42466C480337l389080j612433M873517R252140N729733k145990o190774m325863
42458E671587j427770p48852k84665J829988L597687K778872M27740j287960j984722
42449H571905k034421j210599r9382m50014k208710k441744N26307L806081L466089
42440G925512Q2072k220902j760057j093042k197025k924139l30347M387163O976401
42431H845636N473187J861458j503685m230126n884593m818794j144787J639949
42423B38245R19787r84119l01615K185121K603436N15480o69056J46527J02992
$$ plain form
42483 -1112018 955240 5015483 8551287 8765490 6184287 4000761 3872976 3842382 1329377
42474 1329377 -2824407 -5048536 -3636515 -584937 1733203 3315177 4430594 3480337
42466 3480337 91257 -1521176 3352341 12604481 18334214 16188224 9997450 5671587
42458 5671587 4243817 3494965 3210300 5040288 8637975 11416847 11844587 10556627 8571905
42449 8571905 6537484 5326885 5227503 4777489 2568779 127035 653342 4459423 7925512
42440 7925512 8007584 5786682 4026625 2933583 736558 -2187581 -2517928 1869235 8845636
42431 8845636 14318823 16180281 14676596 10446470 4561877 -256917 -1401704 238245
42423 238245 1158032 173913 -127702 2057419 4660855 5176335 4507279 4653806 4756798
42414D756798k008484l326000k048924m65099l59892J67181K148599K430148q41799
42405D52528l257485q267N864623O861461J496946m104358m861436j892126J417232
42396A969118L578687L807242R74567l751521o129464l423265J671111L752667
42388B449142P58001l979143n341641j414406M789057Q106313N844719j24324
42380A1087718n449766o859857m023965O23063L450883K426606q28440k697343
42372b271101j611606P70885K422284L019092K809451J719018M40212K38256P56527
42363H293018J68100j719041k930272k603104j965634j279689P30166L151693
42355A845237K542918j518958m310290k243699J869234K854765n2949l203346
$$ plain form
42414 4756798 2748314 -577686 -2626610 -3091709 -3451601 -3284420 -1135821 1294327 452528
42405 452528 -2804957 -2813224 3051399 9912860 11409806 7305448 2444012 551886 1969118
42396 1969118 5547805 9355047 10329614 6578093 448629 -2974636 -1303525 2449142
42388 2449142 3207143 -772000 -6113641 -7528047 -2738990 5367323 11212042 11087718
42380 11087718 5637952 -1221905 -5245870 -4622807 -1171924 1254682 426242 -2271101
42372 -2271101 -3882707 -3111822 -689538 2329554 5139005 6858023 7298235 7536491 8293018
42363 8293018 8461118 6742077 3811805 1208701 -756933 -2036622 -1306456 1845237
42355 1845237 4388155 2869197 -1441093 -3684792 -1815558 1039207 986258 -2217088
42347b217088l232472J40177L914395L667685j267526m636031l78931P087952
42339C078161P154333r96290o009286j834146K793708o61780o199490m117520
42331f792310K257273L162118l85780K36306M559999L961173j894114l830603
42323A274062O42731L477216Q70576r99575J263125K136632j143938k396476J625000
42314F749353L779388j315257o872766m472196K216288L444596j855964n947579
42306d274137l826916K210490P266260P595754K170344m949019o773539j947402
42298b528165K509377R28877l117984l375122m22177J308369J701029L267735
42290B71939M489547K088376j949250k630165l37267k82409l512152m769133q23223
$$ plain form
42347 -2217088 -5449560 -5309383 -1394988 2272697 1005171 -3630860 -4009791 3078161
42339 3078161 10232494 9236204 3226918 1392772 4186480 3524700 -2674790 -6792310
42331 -6792310 -4535037 -1372919 -1758699 -1522393 3037606 6998779 5104665 1274062
42323 1274062 1916793 5394009 6264585 5265010 6528135 8664767 7520829 5124353 6749353
42314 6749353 10528741 9213484 2340718 -2131478 84810 3529406 1673442 -4274137
42306 -4274137 -8101053 -5890563 1375697 8971451 11141795 6192776 -580763 -2528165
42298 -2528165 -18788 910089 -2207895 -5583017 -6005194 -4696825 -2995796 271939
42290 271939 4761486 6849862 4900612 2270447 1933180 1650771 -1861381 -6630514 -7453737
42281g453737M111388L845958j795044o811370n852391R5198N033187M852565
42273c974246J770566L88109R79205M02708j209147j60361L558483M753264J281567
42264G790148j910655o45567J876449Q71859k186981k710193m60438J209136Q82697
42255D716455o18412k846843m685577l691549k54848J226121p15464j107644K980183
42246d997578N686090J197294n138761l574892M580485Q082276K374671m322103
42238C887482l851734J062424K900710K25956k484673k424875j181400r18332
42230b784442j172797j48757K044841K872784J081578l14194K163229N941862
42222I684104M509637k495595o992131l691384K021794K491334j206546l124157
$$ plain form
42281 -7453737 -3342349 503609 -1291435 -8102805 -13955196 -13859998 -8826811 -3974246
42273 -3974246 -2203680 -1815571 -836366 -433658 -1642805 -1803166 1755317 6508581 7790148
42264 7790148 5879493 5233926 7110375 7982234 5795253 3085060 2624622 3833758 4716455
42255 4716455 4098043 1251200 -3434377 -7125926 -7380774 -6154653 -6870117 -7977761 -4997578
42246 -4997578 688512 1885806 -3252955 -6827847 -2247362 5834914 8209585 3887482
42238 3887482 35748 1098172 3998882 4224838 1740165 -684710 -1866110 -2784442
42230 -2784442 -3957239 -4105996 -2061155 811629 1893207 1579013 3742242 9684104
42222 9684104 14193741 11698146 4706015 1014631 3036425 5527759 4321213 1197056
42214A197056k664259l113628l435865k87174L765387L025683j131485j769901
42206d414186J849947L101099l15227k628010m43684J640645l62412l021552j721221
42197f314601K224703M839441M863291K512085k083136o084954m901936P43735
42189d201372L957891J265146k400139j975522K56297R3686j145809n8955K489206
42180a719571L854469M387570M557668J721401m462989p871568l962898J966520
42172a529398K219213j050982K6396M873641M862140j721003n727390j560645
42164C91972L781987J776204m683998o480672j800933K919324L345738J607193
42156H56815N77539j99252j494845j748797L77687L435618M950718M030641J187644
$$ plain form
42214 1197056 -1467203 -4580831 -8016696 -8303870 -4538483 -1512800 -2644285 -4414186
42206 -4414186 -2564239 536860 221633 -2406377 -2850061 -1209416 -1571828 -4593380 -6314601
42197 -6314601 -4089898 749543 5612834 8124919 6041783 -43171 -4945107 -4201372
42189 -4201372 -243481 1021665 -1378474 -3353996 -3097699 -3004013 -4149822 -4208777 -1719571
42180 -1719571 2134898 6522468 11080136 12801537 8338548 466980 -3495918 -1529398
42172 -1529398 689815 -361167 -334771 4538870 9401010 7680007 1952617 391972
42164 391972 4173959 5950163 1266165 -5214507 -7015440 -4096116 -750378 856815
42156 856815 1434354 1235102 -259743 -2008540 -1630853 1804765 6755483 10786124 11973768
42147A1973768k507641m963997l891945Q0293K803099J358960j818173k161373
42139H72991N60602K204918O20674j622321j933708j372189j381566m68493K311356
42130b07736L626385N55302k994412o92808N698532P110906L80234o112395m272920
42121C091088J964950L057770j798206m521636j268829K362072J115117j862589
42113B139737r36787K794952L561937k6271l216570k299977O79146J703254L76712
42104D776133l92176Q97994K107506N22811k896675m003680q97856K748059K141489
42095E003605j622793k644086R73166L796766J364210k459468j508825K289671
42087E192246J529862m353989p186414k514534L335750K971886j299888k255667
$$ plain form
42147 11973768 9466127 4502130 610185 690478 3493577 4852537 3034364 872991
42139 872991 1433593 3638511 4259185 2636864 703156 -669033 -2050599 -2519092 -207736
42130 -207736 3418649 3973951 979539 286731 5985263 13096169 13476403 7364008 3091088
42121 3091088 5056038 8113808 6315602 1793966 525137 2887209 4002326 2139737
42113 2139737 1202950 3997902 7559839 7533568 4316998 2017021 2696167 4399421 4776133
42104 4776133 4383957 5281951 7389457 7912268 5015593 1011913 114057 2862116 5003605
42095 5003605 3380812 736726 1709892 5506658 6870868 4411400 2902575 5192246
42087 5192246 6722108 2368119 -4818295 -7332829 -3997079 -1025193 -2325081 -4580748
42079d580748J063609L628736L234941K206763J521437j67005j852189q66818
42071D188726J230044k83295m934953n867625M02092Q230733J0027975N034927
42063A8028624k007809o952573p774331l822342K450777N631686K961974j939625
42055F576381l752794j803798Q16140K017344J600250m02753l092294m146414
42047b187938k686470r04092m07965N31760L114613M280393J010055l801065m542261
42038e592970q99295K007659J250453o01435m34690J028467J292828q7996j353969
42029c390948r40313Q51020K134743J512623K1852j06249J097564J169137p52686
42020A596743k396406k214816j628809j393784O41232M922649O840370K512385
$$ plain form
42079 -4580748 -3517139 111597 3346538 5553301 7074738 6907733 5055544 4188726
42071 4188726 5418770 5135475 200522 -5667103 -5265011 2965722 12993697 18028624
42063 18028624 16020815 9068242 1293911 -2528431 -77654 5554032 8516006 6576381
42055 6576381 2823587 1019789 1835929 3853273 5453523 5050770 1958476 -2187938
42047 -2187938 -4874408 -5778500 -6186465 -5654705 -2540092 1740301 2750356 -1050709 -5592970
42038 -5592970 -6492265 -4484606 -3234153 -3835588 -4270278 -3241811 -1948983 -2036979 -3390948
42029 -3390948 -4331261 -3480241 -1345498 167125 188977 82728 1180292 2349429 1596743
42020 1596743 -799663 -3014479 -4643288 -6037072 -5395840 -473191 6367179 8879564
42012H879564m469822o967172l590256N85145J694906Q02522J10403j51994l07003
42003c413707Q8030J300525K953177M241471L488349o17971n633585o225386j239347
41994e058444L529930L346940J373961K438469M122134J230480l835145l822817
41986C325508J280933L851847R49341j785536o62875J38622k979179n998481l794734
41977e674554J683816M763406L708701Q62768j556797k264966o11296J584599
41969B495677J123844j268303p99985L516342N683921J361459m916193o147629
41961A049133k609425M30579J446418K557131K873580o53756n933897o514056
41953g354293j284543K967868J546881j342674r5541K757444Q22402m766404n660469
$$ plain form
42012 8879564 4409742 -2557430 -6147686 -5562541 -3867635 -3065113 -2954710 -3106704 -3413707
42003 -3413707 -3325677 -2025152 928025 5169496 8657845 8039874 2406289 -3819097 -5058444
41994 -5058444 -1528514 1818426 3192387 5630856 9752990 10983470 7148325 3325508
41986 3325508 4606441 8458288 9407629 7622093 6959218 7097840 4118661 -1879820 -5674554
41977 -5674554 -3990738 772668 4481369 5344137 3787340 1522374 911078 2495677
41969 2495677 3619521 2351218 1551233 5067575 10751496 12112955 7196762 1049133
41961 1049133 -1560292 -1129713 316705 2873836 5747416 5093660 -840237 -7354293
41953 -7354293 -8638836 -5670968 -4124087 -5466761 -5562302 -2804858 -1982456 -6748860 -12409329
41944a2409329J146254P856228O483035j88361l371345o40045K605573K470041
41936C952051P37303n04081j915098k999851j271007K196011K282455j895748
41928E82035m162105q04858L102597K150665n68260K34492K239344J98110l616254
41919f44234k730258K166416M303030K011584o4693k74867j454877l091729j199094
41910i78722K976637L136486j411840l915153j217013J796353J379439J46562
41902A912749O1167j323273l915688k853214K235003L968395j281769o279575
41894g476205l636483L104925N894844L899741J762273R02862l77283j603843
41886B470831j249141m19687m28011K21334K139524K302786n78908k409439k45538
$$ plain form
41944 -12409329 -11263075 -3406847 3076188 2887827 -483518 -1123563 1482010 3952051
41936 3952051 4689354 4185273 2270175 -729676 -2000683 195328 2477783 582035
41928 582035 -3580070 -4384928 -1282331 868334 300074 534566 2773910 2972020 -644234
41919 -644234 -3374492 -1208076 3094954 5106538 5041845 4766978 3312101 220372 -978722
41910 -978722 1997915 5134401 3722561 -192592 -1409605 386748 1766187 1912749
41902 1912749 1973916 650643 -3265045 -6118259 -3883256 85139 -1196630 -7476205
41894 -7476205 -11112688 -8007763 -2112919 1786822 3549095 4451957 4074674 2470831
41886 2470831 1221690 802003 373992 595326 2734850 5037636 4458728 2049289 1803751
41877A803751K264536J281952l97586R76584K572482K33229l110372k224873P07354
41868D107057l11484m110068l868201J190268M275198J908008j395185j068650
41860G26943J395107K620404K348923J671882L04551j815730l013090k095679
41852B143311l14618L87356P386L97751K765602N398773M576164q28357o335528
41843H197840o260650j090982L014417K489341K9200q60301l53445J86174N68575
41834E920169j9939k498795m313901j878114K294620J741457l054378m173533
41826e982414O23435L750359J084873r19376K203167L862242j332888o253371
41818b963973l021121K704946J541572l106816k018225K587215J740974k711916
$$ plain form
41877 1803751 4068287 5350239 4952653 5929237 8501719 8734948 5624576 3399703 4107057
41868 4107057 3795573 -314495 -4182696 -2992428 1282770 3190778 1795593 726943
41860 726943 2122050 4742454 7091377 8763259 9067810 7252080 4238990 2143311
41852 2143311 1828693 2216049 2223435 2621186 5386788 10785561 15361725 14533368 8197840
41843 8197840 1937190 846208 3860625 6349966 6379166 5518865 5165420 5351594 5920169
41834 5920169 5900230 3401435 -912466 -2790580 -495960 1245497 -1808881 -5982414
41826 -5982414 -5358979 -1608620 -523747 -1443123 760044 4622286 3289398 -2963973
41818 -2963973 -5985094 -3280148 -1738576 -4845392 -6863617 -4276402 -2535428 -5247344
41810e247344j154684N393269O060186p23934m585394j343410J398271k59557
41802d62597l17435L273646K888163m207478q469817l056795M846246N930274
41794D24207K451228J539778L042684K709314Q99997j0702j399614m316875m886580
41785D53437o24458L706113L198298P66388J279876K724433O20404l042868l219233
41776E862390r81161j335887l933338l710409Q9613K782104K235455J477512K330604
41767D816883K222683o02375l192701k044019J543513L095300R08863j992435
41759D755712k183364l78630O8334j444376j785472M85133K094251K72512k083768
41750a99668p39206K671203K971594k75001k361465r46399J384390K094713J192800
$$ plain form
41810 -5247344 -6402028 -1008759 5051427 4327493 -257901 -1601311 -203040 -462597
41802 -462597 -780032 2493614 5381777 1174299 -7295518 -10352313 -5506067 424207
41794 424207 2875435 4415213 7457897 10167211 11067208 11056506 9656892 5340017 453437
41785 453437 -171021 3535092 6733390 7499778 8779654 11504087 12124491 9081623 5862390
41776 5862390 4881229 3545342 -387996 -4098405 -4008792 -1226688 1008767 2486279 4816883
41767 4816883 7039566 6437191 3244490 1200471 2743984 5839284 6748147 4755712
41759 4755712 2572348 2193718 2262052 817676 -967796 -482663 1611588 1884100 -199668
41750 -199668 -938874 1732329 4703923 4428922 2067457 1121058 2505448 4600161 5792961
41741E792961j105433m109013m571485n03789L682876K298881k104167j902338
41733b521507L160746N398533J865533j806333k338830l679778p270342p247343
41725a4439321p85140N473377N488368K604181J995869J869763q14175k829240
41717a436318o17831K222588J183133p57306J147915M173893K819065j329088
41709G406051k632397j004702n58130j448300o80539J319895J991065J963751
41701F356694K390764K15530o322196j0709647n560171M921437Q993881L374319
41693C660611l468311m383960j658232m82278j383665j665115M07389M382391
41685d591170P248649M923358k026927o167486j971085N340657O196036K07805
$$ plain form
41741 5792961 4687528 578515 -3992970 -4496759 -813883 1484998 -619169 -2521507
41733 -2521507 639239 6037772 7903305 6096972 3758142 78364 -7191978 -14439321
41725 -14439321 -15224461 -9751084 -4262716 -1658535 337334 2207097 1392922 -1436318
41717 -1436318 -2054149 168439 1351572 594266 1742181 5916074 8735139 7406051
41709 7406051 4773654 3768952 3210822 1762522 1081983 2401878 4392943 6356694
41701 6356694 8747458 8962988 2640792 -8068855 -13629026 -8707589 286292 3660611
41693 3660611 192300 -4191660 -5849892 -6332170 -7715835 -9380950 -8973561 -4591170
41685 -4591170 2657479 7580837 5553910 -613576 -2584661 2755996 8952032 9159837
41677I159837m082401k198592J406778J891228k14303l056783o156988p272288
41669a0523512l194152M083626P830303N322658Q40577j571432k621000l378509
41661c211441k412715K47235J735200J360016J845171L477627K656238j216007
41653D481324l276082q66897K020050J717648P44672K202402L516952J215099
41645A1755168k302325k698083j185255j899534l986029k720281K204019N494152
41637D661832L973451N48428q73383n42362j085986l168153m817553l948535o56773
41628e909034K389907K123796j250299l453813q18641M707028P499053N174157
41620A0462154R94211j266587k005873l478548n163251m538448j537373J066404
$$ plain form
41677 9159837 5077436 2878844 4285622 6176850 5962547 2905764 -3251224 -10523512
41669 -10523512 -13717664 -9634038 -1803735 3518923 4359500 2788068 167068 -3211441
41661 -3211441 -5624156 -5376921 -3641721 -2281705 -436534 3041093 5697331 4481324
41653 4481324 1205242 338345 2358395 4076043 4820715 7023117 10540069 11755168
41645 11755168 9452843 6754760 5569505 3669971 -316058 -3036339 -832320 4661832
41637 4661832 8635283 9183711 8310328 7767966 6681980 3513827 -1303726 -5252261 -5909034
41628 -5909034 -3519127 -1395331 -2645630 -6099443 -6918084 -2211056 5287997 10462154
41620 10462154 11456365 10189778 8183905 4705357 -457894 -4996342 -6533715 -5467311
41612e467311J854994K175206K612646J545035j005753j726751O33799J667883
41604B289748k268932o673641m178605L799840P828194L817352j567968j551611
41596A494377J506243J827406o52930k358646k781482l230696k286482J504299
41588d977911M880298L669604l98282k085672l56434J435130J616061J358788
41580E141582J021731J65118r0840P84887K55383k824787m164559m37125L424982
41571C276372R42604m483037m031551J905912L948566o71059l597469L89178M860819
41562B540335K836897k218709l106647k965J973008J429919N21542l00779j684615
41553A987986k309479j062958L21838M47892R01283K439187K463100j27624j941961
$$ plain form
41612 -5467311 -3612317 -1437111 1175535 2720570 1714817 -11934 621865 2289748
41604 2289748 20816 -6652825 -10831430 -7031590 796604 4613956 3045988 1494377
41596 1494377 3000620 4828026 4175096 1816450 -965032 -4195728 -6482210 -4977911
41588 -4977911 -97613 3571991 3173709 1088037 731603 2166733 3782794 5141582
41580 5141582 6163313 6328431 6237591 7022478 7277861 4453074 288515 -148610 3276372
41571 3276372 4218976 -264061 -4295612 -2389700 1558866 887807 -2709662 -2320484 2540335
41562 2540335 5377232 3158523 51876 48911 2021919 3451838 3973380 3672601 1987986
41553 1987986 -321493 -1384451 -1062613 -614721 286562 2725749 5188849 5061225 3119264
41544C119264r83769p45204l595446n085565r91747M352469L994609n41941j781710
41535b259040J934017M769532K800170j805205n771970p465505m891841K355557
41527a0334285Q807988P557921J34878m489980k275623J105264J62942k474876
41519a805771j910899J026839K592466K548993K537666J360377k494120n722654
41511a867103l430796L026388O679525M097331n14078j784339K3230J046889m4109
41502G232938j099266o77520j89987j240188k802669k486196J44422K909408L604919
41493E395861J991392j003848m442763o707119n369626n0301N333097O084039
41485A230732K887236J391805M159118O200402J838720o098703q827527l571698
$$ plain form
41544 3119264 2135495 1390291 -2205155 -7290720 -8282467 -3929998 64611 -477330 -2259040
41535 -2259040 -325023 4444509 7244679 5439474 -332496 -7798001 -12689842 -10334285
41527 -10334285 -1526297 6031624 6166502 1676522 -599101 506163 669105 -1805771
41519 -1805771 -3716670 -2689831 -97365 2451628 4989294 6349671 3855551 -1867103
41511 -1867103 -5297899 -2271511 4408014 8505345 7991267 6206928 6230158 7277047 7232938
41502 7232938 6133672 5456152 5266165 4025977 1223308 -1262888 -1118466 1790942 5395861
41493 5395861 7387253 6383405 1940642 -4766477 -10136103 -10186404 -4853307 1230732
41485 1230732 4117968 5509773 9668891 15869293 17708013 11609310 2781783 -789915
41477g89915K084917N27431n211898n890515O62408O552509N118322j58456j558719
41468A336084J789263L919121J782832p28541J61232J960893K92570l650186m572626
41459B290642j054621K471842K432692O59138J34342j13430k110355l458698p2109
41450A179443N892992O550945j101540r819882j0938267m910279J310741M297641
41442g538206N855436O549059M361395J94553j726635o44176o47340l093518l662699
41433c52131k06562K542626P83772j436807Q07456M174276K298961l053441m343909
41424A214241l36728K528579J004552q03948K52368J377754R205j488596r03482
41415B853945m51568j956154k492001N87991L979183K700551k266955n179085
$$ plain form
41477 -789915 1295002 1822433 -3389465 -9279980 -8617572 -2065063 3053259 2894803 1336084
41468 1336084 3125347 7044468 8827300 8098759 8259991 10220884 10513454 6863268 2290642
41459 2290642 1236021 3707863 6140555 6799693 6934035 6820605 4710250 1251552 1179443
41450 1179443 7072435 13623380 12521840 2701958 -8236309 -13146588 -11835847 -7538206
41442 -7538206 -1682770 4866289 9227684 9422237 7695602 7051426 6404086 3310568 -352131
41433 -352131 -558693 1983933 2767705 1330898 2138354 6312630 8611591 5558150 1214241
41424 1214241 877513 3406092 4410644 3606696 3859064 5236818 5246023 3757427 2853945
41415 2853945 2402377 446223 -2045778 -1457787 2521396 5221947 2954992 -2224093
41407b224093l135800J343461M685641N875423N618837M341931J808711j930566
41399A6383545n358499n883379k778879Q74953J461931l89745j203468l84330
41391B722129n66591k048075j740515R78145K429471R55401m0199J404250J471948
41382E565964k634521o203405l371472L211335N681737K219197j586312k064983
41374H17540j569657k353992k426821M6467K768158K720351N85611q21813m27786
41365f61942R28268K495472L812910M029947K674131N42401j133807j908284k061321
41356H717775k063405k402229l071265k971000q71176K521573M440056K921133
41348G221462n93088k454800r09695J623492J321611j994420m105098j793813
$$ plain form
41407 -2224093 -5359893 -4016432 669209 6544632 12163469 16505400 18314111 16383545
41399 16383545 11025046 5141667 2362788 3237741 4699672 4309927 3106459 2722129
41391 2722129 2155538 107463 -1633052 -654907 1774564 2729965 2689766 4094016 5565964
41382 5565964 2931443 -3271962 -6643434 -3432099 2249638 4468835 2882523 817540
41374 817540 -752117 -3106109 -5532930 -5486463 -2718305 2046 587657 -234156 -661942
41365 -661942 266326 2761798 6574708 10604655 13278786 13821187 12687380 10779096 8717775
41356 8717775 6654370 4252141 1180876 -1790124 -2661300 -139727 4300329 7221462
41348 7221462 6628374 4173574 3263879 4887371 6208982 4214562 109464 -1684349
41340a684349K549864M009263J761980o35561j316224k270784m275786m165194
41332f026791k32511L313136J721358k617401k829388K548798P055365M871942
41324G804508j684708n449386l237555J021400J833646q78275j884694K003096
41316d71968O724064N788837n12584m842644k762313J549496K259494K41613q9540
41307G884455R68536o21423m675618o125148l018665L45734J72175j538053j077514
41298g685521J170400K205863J395034Q32606J739057K949558K765609Q73605
41290F246211j411023k150733o21963J367423Q68632k777258o494683o170921
41282a1144315q02185O032636Q872312N329564j196998m772680l446482r01594
$$ plain form
41340 -1684349 865515 4874778 6636758 6001197 4684973 2414189 -1861597 -6026791
41332 -6026791 -6259302 -2946166 -1224808 -3842209 -6671597 -4122799 2932566 7804508
41324 7804508 6119800 670414 -2567141 -1545741 287905 -590370 -2475064 -471968
41316 -471968 6252096 12040933 11528349 6685705 3923392 5472888 7732382 7973995 7884455
41307 7884455 8852991 8231568 3555950 -2569198 -5587863 -5242129 -5069954 -6608007 -7685521
41298 -7685521 -6515121 -4309258 -2914224 -2081618 -342561 2606997 5372606 6246211
41290 6246211 4835188 2684455 2062492 3429915 4298547 1521289 -4973394 -11144315
41282 -11144315 -11946500 -5913864 2958448 8288012 7091014 2318334 -1128148 -2029742
41274b029742o38870j109809Q20173L991652M590407K375528O00014Q848j906261
41265F701940m772834m031067J542184N957384L889024j237612k180327J341103
41257G209795K635495j457039n764153m385173J206199M764367L418097j34968
41249G492620k392661k635700j551852P15465L501479M438449J710966k871423
41241H407343n156903l446066k97040J193381J114745J306216J805459J086327
41233F013462q59842k255988k424977k478255k611126j314190J457496K838904
41225a634516R83232j434689n15949L028356M566549K148693q32525q03797J000236
41216F505590R80069j312886k969097k239388m05194R12469J669266J989504J207875
$$ plain form
41274 -2029742 -2668612 -3778421 -2958248 1033404 5623811 7999339 8599353 8608201 6701940
41265 6701940 1929106 -2101961 -559777 5397607 9286631 8049019 5868692 7209795
41257 7209795 9845290 8388251 2624098 -1761075 -554876 4209491 7627588 7492620
41249 7492620 5099959 2464259 912407 1627872 5129351 9567800 11278766 8407343
41241 8407343 3250440 -195626 -492666 700715 1815460 3121676 4927135 6013462
41233 6013462 5153620 2897632 472655 -2005600 -4616726 -5930916 -4473420 -1634516
41225 -1634516 -651284 -2085973 -2601922 426434 4992983 7141676 6309151 5505354 6505590
41216 6505590 7485659 6172773 3203676 964288 559094 1471563 3140829 5130333 6338208
41207F338208o50652k429994l790571n319899n726821k194420M194976O989148
41199b590025K502881l331117j993274M975746P246245O14775o500516n092756
41191d168041J993728N376107K743446R9493R35579J455615j918382n982096n095378
41182d559929R05586O434821O728959K427074k116234l541784k197542p94986
41174C285965r17693j345937k5600K946815N070454M088225M94097k628492k501895
41165H465939J68101J502795r18704m465977m602978j289848Q08952p53603k460499
41156c545822j18239M787628O888095L643487k118596n433962l451097K121266
41148B772760N607186K599289l995705o165013j156445M106460K519763l040275
$$ plain form
41207 6338208 5687556 3257562 -533009 -5852908 -11579729 -13774149 -9579173 -2590025
41199 -2590025 -87144 -3418261 -5411535 -435789 6810456 7425231 924715 -4168041
41191 -4168041 -2174313 3201794 5945240 6044733 6980312 8435927 6517545 535449 -4559929
41182 -4559929 -3654343 2780478 9509437 11936511 9820277 6278493 4080951 3285965
41174 3285965 2368272 1022335 996735 3943550 9014004 13102229 13596326 10967834 8465939
41165 8465939 8634040 10136835 9218131 4752154 149176 -1140672 -331720 -1085323 -3545822
41156 -3545822 -3664061 1123567 8011662 11655149 9536553 4102591 651494 2772760
41148 2772760 8379946 10979235 6983530 818517 -337928 3768532 6288295 3248020
41140C248020m361749j11114L070787J002381k931419m066074k321663L7978J986855
41131d445998K965120K142830M03789O2120J171905J172623o15201j608285n23833
41122G25070L78695m14610r15951J63221J43990k907263n111472j327970O300182
41113b966108R340959L640247m861252p147807j813332M069610M173489m6815
41105D388991k873898k312923j190492j190386l57619K094848K968434K70883
41097A797838k422083j077765K170354K538549N48054O40966L097542L693799
41089A0987254J227104j094074k250083m569856p028359m789300J790321N015459
41081g11534J029425l448012j068863N025138O469447J893117k850581l855748
$$ plain form
41140 3248020 -1113729 -1224843 1845944 2848325 -83094 -4149168 -6470831 -6432853 -4445998
41131 -4445998 -1480878 661952 1065741 1127861 2299766 3472389 2857188 1248903 725070
41122 725070 1103765 689155 -226796 -63575 80415 -2826848 -7938320 -9266290 -2966108
41113 -2966108 6374851 10015098 5153846 -1993961 -3807293 262317 4435806 4388991
41105 4388991 1515093 -797830 -1988322 -3178708 -3536327 -1441479 1526955 1797838
41097 1797838 -624245 -1702010 468344 3006893 3554947 4195913 7293455 10987254
41089 10987254 12214358 11120284 8870201 4300345 -2728014 -7517314 -5726993 -711534
41081 -711534 317891 -3130121 -4198984 826154 7295601 9188718 6338137 2482389
41073B482389k195236K45182K090469J215519k408418m238502r01667L464033
41065b46231K539744k234341l815479o58019J774334P76891J7942J831307L214410
41056C200558K197122J514704K518897J667399k649308n393582k150072L400927
41048D306645M789678K011998r2009J34610N24303L93960O62891k2066l558171
41039I151839p518398p557817m223199j754339n66544K537211O382628N335843
41031A787224o13589l504232O78484N054036K801925j583614j79871M311007K757097
41022A1508467m356105o500047n2295N306921J767117m317586k527734N723120
41014F551858R871867N415287j721767n008675m357460k746274j597026j183714
$$ plain form
41073 2482389 287153 532335 2622804 3838323 1429905 -2808597 -3710264 -246231
41065 -246231 2293513 59172 -3756307 -4414326 -2639992 -1863101 -1845159 -13852 3200558
41056 3200558 5397680 6912384 9431281 11098680 8449372 3055790 905718 4306645
41048 4306645 9096323 11108321 11016312 11150922 11675225 12069185 12732076 12710010 9151839
41039 9151839 1633441 -5924376 -10147575 -11901914 -12468458 -9931247 -3548619 1787224
41031 1787224 1173635 -2330597 -1652113 3401923 6203848 4620234 4440363 8751370 11508467
41022 11508467 7152362 652315 600020 5906941 7674058 3356472 828738 6551858
41014 6551858 16423725 21839012 20117245 15108570 10751110 8004836 6407810 5224096
41006E224096j641030k006514r36099R39680J730355J353483J324354J715123
40998G703448J124792n19488j958175l050112m229497m049942q34183L405766
40990b407391M511153J916298p92444j301749p45725k02674P35499J279506j66131
40981B826342j978999n23907L224063L613257p55125l551782R0841N804934O217394
40972A4967018J267428k893174k842289p12720M55769k15355k154546l649752
40964D222379k480842R20069K647961N59760j953279q58489K327520L317684J683504
40955A0386267J01414q89143k234184k351892M58330L038331J209580k350771
40947G367932j356173L023585K740546l678064p121538j667565N695519N572742
$$ plain form
41006 5224096 3583066 1576552 640453 1580133 3310488 4663971 5988325 7703448
40998 7703448 8828240 8308752 6350577 3300465 -929032 -4978974 -5813157 -2407391
40990 -2407391 2103762 4020060 3227616 1925867 1180142 977468 1712967 2992473 2826342
40981 2826342 847343 323436 3547499 7160756 6405631 2853849 2944690 8749624 14967018
40972 14967018 16234446 13341272 10498983 9786263 10242032 10026677 7872131 4222379
40964 4222379 1741537 2661606 5309567 5869327 3916048 3057559 5385079 8702763 10386267
40955 10386267 10487681 9598538 7364354 5012462 5470792 8509123 9718703 7367932
40947 7367932 6011759 9035344 11775890 8097826 976288 -691277 5004242 10576984
40939A0576984j15996k866063j294601r13916k681307j706373K327145L092464
40931F418337j214351l313391J531936O594307L438675m608466p298882l062426
40923a514261k59520k599695l086833L581366J0841999R375446J079471m091479
40915A3326494k642078n67215k104921l680875j492959J704974J580078q10769
40907E312729j584236k95158P32619R72009J394340J337057k67593j731593n81257
40898E288917K102326L035155J813191Q32099M99035j224952m006652m184162
40890D154957l56524L558129L238483m86868l383240l349443j792410n25148K95165
40881A353101J181867J965543J898194M96302j746757l234501k380362N42274
$$ plain form
40939 10576984 10460988 7594925 6300324 5386408 2705101 998728 3325873 6418337
40931 6418337 5203986 1890595 3422531 10016838 13455513 8847047 1548165 -1514261
40923 -1514261 -1773781 -4373476 -7460309 -3878943 6963056 16338502 17417973 13326494
40915 13326494 10684416 10117201 8012280 4331405 2838446 4543420 6123498 5312729
40907 5312729 3728493 3433335 4165954 5137963 6532303 7869360 7601767 5870174 5288917
40898 5288917 7391243 10426398 12239589 13071688 13570723 12345771 8339119 4154957
40890 4154957 3798433 7356562 10595045 10108177 6724937 3375494 1583084 1057936 1353101
40881 1353101 2534968 4500511 6398705 6895007 5148250 1913749 -466613 75661
40873G5661L097143L034249Q15613r46649o01693Q33452J447226R47060L23838
40864I025900k61733j359005k063294o01683J891091J288160l256596n943711
40856a280871j612328N597452O680439N25674m344153k312500J872422J772292
40848F898427r25890r35138J079316M46879k716682l777834j670715j49109q56068
40839b606814j089530O69000K268136K198965J805922J870352J181405j89291
40831F108145k21650J102106J119929q31202k013852j131228n14996j526635j800262
40822B90355M19855K816313K681263R68061m9983k93727m46784R1227J174548
40813G651128Q41729r41219p96635K478616M427842J414129k746866k238844J154643
$$ plain form
40873 75661 3172804 6207053 7022666 6076017 5474324 6307776 7755002 8702062 9025900
40864 9025900 8764167 7405162 5341868 4740185 6631276 7919436 4662840 -1280871
40856 -1280871 -2893199 2704253 9384692 9910366 5566213 3253713 5126135 6898427
40848 6898427 5972537 5037399 6116715 6563594 3846912 69078 -1601637 -1750746 -2606814
40839 -2606814 -3696344 -3027344 -759208 1439757 3245679 5116031 6297436 6108145
40831 6108145 5886495 6988601 8108530 7277328 5263476 4132248 3617252 2090617 290355
40822 290355 710210 3526523 6207786 7175847 7125864 6832137 6385353 6476580 7651128
40813 7651128 8492857 7551638 6755003 9233619 13661461 15075590 12328724 10089880 11244523
40804A1244523O93177l987074n731152j412300K686249P65150l222397j917144
40796h80968L575142N011344n68852o246984m938422J242974M903936L607108
40788E705278J599097K128123K858995O54828k759269l340384j119660r5022j870892
40779C761094l250918j452780J572614K371351J067955K13612J64892q58054k629924
40770I59842k563205j84632J408631K19082j326069q4350K905961M175248L096685
40761H607193K056491J890896Q47556j396799k433944j409830j063037k890884
40753D207642l533394J77920N007987N121163R88984j130675R50826K009054j668156
40744A2131351n577229l788021J421313K569520j848375n067561j875394L937878
$$ plain form
40804 11244523 11937700 7950626 2219474 807174 3493423 4258573 1036176 -880968
40796 -880968 2694174 7705518 7136666 889682 -4048740 -2805766 2098170 5705278
40788 5705278 7304375 9432498 12291493 12946321 10187052 6846668 5727008 5631986 3761094
40779 3761094 510176 -942604 630010 3001361 4069316 4282928 4447820 3589766 959842
40770 959842 -1603363 -1787995 -379364 -160282 -1486351 -1570701 1335260 5510508 8607193
40761 8607193 10663684 12554580 13402136 12005337 9571393 8161563 7098526 4207642
40753 4207642 674248 852168 5860155 10981318 11970302 10839627 11790453 13799507 12131351
40744 12131351 6554122 2766101 4187414 6756934 4908559 -159002 -2034396 1903482
40736A903482M697878r06999n856654l404923M206613P756502K304179n927510
40728D772568o918734J38322N937081L924479j420575k408185O56343J538219
40720F219518j507527l613454j163418L396400N336162K678178k836655o925251
40712A583953n386618J291044O649966N054122r63616l904532j171609K490776
40704E643486K253649j349571m606134m595979q04232L990887N006564J067969
40696F606639k488894q07843K699294J475781l175468l970970P6426K203332j44162
40687B474135j354333J352254K412028j621956m735670j146197M810991N749327
40679G940579K380961K78778M87709P11340J366793K985264J828269l995799q043371
$$ plain form
40736 1903482 6601360 5694361 -162293 -3567216 639397 8395899 10700078 4772568
40728 4772568 -2146166 -2007844 3929237 7853716 6433141 4024956 4681299 6219518
40720 6219518 4711991 1098537 -64881 3331519 8667681 11345859 8509204 1583953
40712 1583953 -3802665 -2511621 4138345 9192467 8228851 4324319 3152710 5643486
40704 5643486 7897135 6547564 1941430 -2654549 -3458781 532106 5538670 6606639
40696 6606639 4117745 3309902 6009196 7484977 4309509 338539 414965 2618297 2474135
40687 2474135 1119802 2472056 4884084 3262128 -1473542 -2619739 2191252 7940579
40679 7940579 10321540 10600318 11088027 11799367 13166160 16151424 17979693 13983894 5940523
40670E940523l880065L433928L769259k465351n457747j855706J378749P3152
40662I36742r64608J790194L716836N98225l526308k871347J278458L765918L318837
40653H042947K067686P14552j107291k198019j605509r99028j791122k000621
40645A123595O15804M128389M547007J231052k687479m442484l827858k024761
40637a336735l19883M69954P28543J639768L190043L611843J730554j222382l013796
40628E477909k722747j171658Q793l26113j421840j014877J415454K970837J343983
40619D559741r03366K12754L321547L213732p74034l387683j833149J42923p65242
40610C787223j788148N21701L782912L619578P22105j004000q94700r97041r46378
$$ plain form
40670 5940523 2060458 5494386 9263645 6798294 1340547 -515159 863590 936742
40662 936742 -27866 1762328 5479164 6077389 2551081 -320266 958192 4724110 8042947
40653 8042947 10110633 10825185 9717894 7519875 5914366 4915338 3124216 1123595
40645 1123595 1739399 5867788 10414795 11645847 8958368 4515884 688026 -1336735
40637 -1336735 -1656618 -1186664 -458121 1181647 4371690 7983533 9714087 8491705 5477909
40628 5477909 2755162 1583504 1592297 1266184 -155656 -1170533 244921 3215758 4559741
40619 4559741 3656375 3869129 7190676 10404408 9630374 6242691 4409542 4552465 3787223
40610 3787223 1999075 2520776 6303688 9923266 10645371 9641371 8746671 7749630 6803252
40601F803252J167271L699983K701606j488260l851319j938582P99834N21271
40593H415056j828844k935996j940860n22547P9362J4087l16183q01458j378534
40584a215917j950448k153547j116438J584071M462398M800147J649809k372356
40576C687719l202812M37600N142021N807619J096502m710611o449714l946833
40568b138509j136898J00438J777658M737993N866647K932907j254597k991845
40560G893794k953845l186338j831229L428919Q576762O891854o06243n409378
40552A2804296l626393p11767j331774j963145J273461M027648M73355n743258
40544E202423n965445k5054L493322O79316k542004r44555K034111J102284k178531
$$ plain form
40601 6803252 7970523 11670506 14372112 12883852 9032533 7093951 7893785 8415056
40593 8415056 6586212 3650216 1709356 1186809 1266171 1280258 964075 162617 -1215917
40584 -1215917 -3166365 -5319912 -6436350 -4852279 -389881 4410266 6060075 3687719
40576 3687719 484907 922507 6064528 11872147 12968649 8258038 1808324 -2138509
40568 -2138509 -3275407 -3174969 -1397311 3340682 9207329 12140236 10885639 7893794
40560 7893794 4939949 1753611 -77618 3351301 11928063 18819917 18213674 12804296
40552 12804296 9177903 8466136 7134362 5171217 6444678 10472326 10945681 5202423
40544 5202423 -763022 -788076 2705246 3384562 842558 -101997 1932114 3034398 855867
40535H55867k873903p58739O04941L19454M79186J482790J684286J048772J195475
40526D038129K219529K821468K921718K930498J531587k066417m822011l324334
40518F250167Q2018k20125m310029n884595j500751M641463P228998O150528L701622
40509A6139296M46768k708978k923322m4090J182886j976147m925072k471299
40501B720042K597644L750292Q93695m97332J021350J365376r93571k498500j331036
40492G027960l34261j004054m23736K849638M909852K236472k412411l596471
40484I252989l15821L422309L503223o62037n657884o333677r98622N222189N622832
40475A3055501R19548j556437J259965L803655J089193l600609m691261k869338
$$ plain form
40535 855867 -2018036 -2776775 -2171834 -1852380 -1373194 109596 1793882 2842654 4038129
40526 4038129 6257658 9079126 12000844 14931342 16462929 14396512 9574501 6250167
40518 6250167 6332185 6112060 1802031 -4082564 -5583315 -941852 6287146 12437674 16139296
40509 16139296 16586064 13877086 10953764 10909674 12092560 10116413 5191341 2720042
40501 2720042 5317686 9067978 9961673 9464341 10485691 11851067 10857496 8358996 7027960
40492 7027960 6693699 5689645 5265909 8115547 13025399 15261871 12849460 9252989
40484 9252989 8937168 12359477 15862700 15200663 9542779 3209102 2210480 7432669 13055501
40475 13055501 13975049 12418612 13678577 17482232 18571425 14970816 10279555 7410217
40467G410217j981029j439638J608822N061471L843494j581514n024281l298131
40459D599411K18140J515942O74321n60173j777849k826961k711950j001335J506421
40450c64033L796701M676736K796936r39543k531100J96049L433812K373472j260787
40441A2178243k016549O2230k91478l797965m655352o24374K274849n79611m405064
40432a855071k445856L394213O005151M043182K418154L169630K862664k80919
40424A7311148k776167j640673P48554N33269j827407k817726j444675m19265
40416G667058j609522k777107n51253M260862O765680M285341L00652l56196J408911
40407A9394426N64571l709790o126850l232509J400804K861439J772108J557596
$$ plain form
40467 7410217 5429188 3989550 5598372 10659843 14503337 12921823 7897542 4599411
40459 4599411 4817551 6333493 7007814 6447641 4669792 1842831 -869119 -1870454 -364033
40450 -364033 3432668 8109404 10906340 9966797 7435697 7631746 11065558 13439030 12178243
40441 12178243 10161694 10223924 9932446 6134481 1479129 854755 3129604 2549993 -1855071
40432 -1855071 -4300927 -906714 5098437 9141619 11559773 14729403 17592067 17311148
40424 17311148 14534981 12894308 13642862 14176131 12348724 9530998 8086323 7667058
40416 7667058 6057536 3280429 2729176 6990038 13755718 18041059 18341711 17985515 19394426
40407 19394426 19958997 16249207 10122357 6889848 8290652 11152091 12924199 14481795
40399A4481795K154248J263101l70394j88134Q34380o24176l930580m549042j019471
40390H051727K835304L749789K622227R23054j905156n156960n203128n28229
40382E388628M497794M479926m4960l569159k493814J478568M201343L341274
40374A7279600L1469k600305k802594k071403k502344l022241j069598K235759
40366E478343K764711J92603o87701K126526L704098P1615m379302l199550J784690
40357G856033L387883M67258j172315Q79064K168273o2991k171510j203290j85612
40348I962793j838395k572301J474796O543964O012115P02443k335290o20700
40340A7329425R19512j056241k798739j78012L708651K380932m381641r257558
$$ plain form
40399 14481795 16636043 17899144 17528750 17340616 18174996 17550820 13620240 9071198 8051727
40390 8051727 10887031 14636820 17259047 18182101 16276945 11119985 5916857 5388628
40382 5388628 9886422 14366348 14321388 10752229 8258415 9736983 13938326 17279600
40374 17279600 17311069 14710764 11908170 9836767 7334423 4312182 3242584 5478343
40366 5478343 8243054 8435657 7747956 9874482 13578580 13650195 9270893 6071343 7856033
40357 7856033 11243916 11711174 10538859 11417923 13586196 13523205 11351695 10148405 9962793
40348 9962793 8124398 5552097 7026893 13570857 19582972 20285415 17950125 17329425
40340 17329425 18248937 17192696 14393957 14215945 17924596 20305528 15923887 6666329
40332F666329o372463J425469O150867M224020J8721n35644K539227M544628L443481
40323B2104635J929969J652254l1423m662922p939320n064460J407301M494869
40315A3890903K722313J364203L270545M518292J605945k409059k893351p66682
40307B1303109q6282j230227j310033J49425O77137m66110j282376q07084j94860
40298A6752699K10168J340297K503537J623665p91267j550564L3290N09028k125688
40289A8505165m616619l126186R26881L003165J638345p43956j956453j780072
40281A1850270m22032J550603K146416r0271l153544l550468j170512Q82805J338702
40272I381969J953387K987539J767357k062470l754746M20393O794005Q207153
$$ plain form
40332 6666329 293866 1719335 7870202 12094222 12112943 11577299 14116526 18661154 22104635
40323 22104635 24034604 25686858 25655435 20992513 13053193 7988733 9396034 13890903
40315 13890903 16613216 17977419 21247964 25766256 27372201 24963142 22069791 21303109
40307 21303109 21216827 19986600 18676567 18825992 19503129 19037019 17754643 16947559 16752699
40298 16752699 16962867 18303164 20806701 22430366 21639099 20088535 20121825 20630853 18505165
40289 18505165 13888546 10762360 11689241 14692406 16330751 15586795 13630342 11850270
40281 11850270 11428238 12978841 15125257 15034986 11881442 8330974 7160462 8043267 9381969
40272 9381969 11335356 14322895 16090252 14027782 10273036 10693429 17487434 25694587
40264B5694587L191573k714069m571091l069175j213824K81305K051593K997158
40256B2648057J280048k033781k974393N68404N361305N802141N04496n613817
40248B5542460o946748l679154n81019r2146O6785J710157K517747K35252k558639
40239A6214695j880982J238678K193612k9658j643566l09949J767764K084695
40231A9635289J186758K58311r41472j896898o57589K458882L869568J867594
40223B5780443n89433q53756o03893j538635j193107K088229L735324r27472p424376
40214A8473324o646771J605933P381731M515001j544509l102643p21690O23939
40206B0584315N49328K052427M447066M011259N65165k185322k603746k544243
$$ plain form
40264 25694587 28886160 26172091 21601000 18531825 17318001 17599306 19650899 22648057
40256 22648057 23928105 21894324 18919931 19488335 24849640 30651781 31156277 25542460
40248 25542460 18595712 14916558 14335539 14243393 14310178 16020335 18538082 18773334 16214695
40239 16214695 14333713 15572391 17766003 17736345 16092779 15782830 17550594 19635289
40231 19635289 20822047 21080358 20138886 18241988 17584399 20043281 23912849 25780443
40223 25780443 25191010 24337254 23733361 22194726 21001619 23089848 26825172 25897700 18473324
40214 18473324 11826553 13432486 20814217 25329218 23784709 20682066 19960376 20584315
40206 20584315 21133643 23186070 27633136 31644395 32209560 30024238 27420492 24876249
40198B4876249k779546j752620M39262J263590J51038m02070M60961L35082j362093
40189B1229853j090615K750078N418341K151842l806107n010402n38281K867083
40181B3971792R27431k469193k008849J211145K356014N37207m79623J502690
40173B5548614L796858K609109j720015m480960j734885M431463P078224K582234
40165C8110642l684486l559634K347092M764473p44815o645385m385268L036258
40157B9238877O328004L772770J465101J825873J240384q70058k57922K975387
40149D5718416K843199j457924k255453L685441P945504L295648m170438m565335
40141E1039058O08656K911255J728332L270909P403777P220455J824141j217143
$$ plain form
40198 24876249 22096703 20344083 20783345 22046935 22197973 21795903 22256864 22591946 21229853
40189 21229853 20139238 22889316 28307657 30459499 26653392 21642990 21104709 23971792
40181 23971792 24899223 22430030 20421181 21632326 23988340 24525547 24045924 25548614
40173 25548614 29345472 31954581 30234566 25753606 24018721 28450184 35528408 38110642
40165 38110642 34426156 30866522 33213614 37978087 37233272 30587887 26202619 29238877
40157 29238877 35566881 39339651 40804752 42630625 43871009 43000951 42743029 45718416
40149 45718416 48561615 47103691 44848238 48533679 56479183 59774831 55604393 51039058
40141 51039058 51647714 54558969 56287301 59558210 66961987 74182442 76006583 74789440
40133G4789440K178867P561892J0767570J2848709J3928501J1220770O522136
40126A39817885O859203J3190126J6598193J1043445K457647q92680l67023k471981
40118A86234815q052048j3100260j5959228j6939670j4689873r522963o515582
40111A01455191q536935j0054033n230242J602858K100178k467537l470998N64448
40103G5962930K120830j833247m708458j656365K813251L015763O94625M42562
40095G6851891K246317L676161M927013O718606O911367M047157J274992K167525
40087A08821029N052031N758587L768361J338748j425461n806788r934461r912840
40079I7659206n586004j109598P12889J113229J707050J648530l2750j932664
$$ plain form
40133 74789440 76968307 84530199 95297769 108146478 122074979 133295749 139817885
40126 139817885 146677088 159867214 176465407 187508852 189966499 189073819 188706796 186234815
40118 186234815 178182767 165082507 149123279 132183609 117493736 107970773 101455191
40111 101455191 92918256 82864223 77633981 79236839 81337017 78869480 75398482 75962930
40103 75962930 78083760 76250513 71542055 69885690 72698941 75714704 76409329 76851891
40095 76851891 79098208 82774369 87701382 94419988 101331355 105378512 106653504 108821029
40087 108821029 113873060 119631647 123400008 124738756 123313295 117506507 107572046 97659206
40079 97659206 92073202 90963604 91676493 92789722 94496772 96145302 96112552 94179888
40071I4179888k123857r71238l56206r40510j577491j009542Q97165L447011N838595
40062I7383815P421657P636094O164271L537544J561024K427340O771335J2830669
40054A45733749J7980083K0814352K1422173K0510711J9440866K0441618K4542001
40047B90885553K8509003K5950183J3804521k832688j4762068j7986073j6837814
40040C06730617j6970499j7874196j4925466p111160J119755N808242P681117
40033B64458410R143463J0309356J0362825J0444367J2089283J3957338J3032658
40026C43797700Q647239K824326k971301q605398j2635272j2004915n878027K342528
40018C15516880Q610525J2281198J4412686J3197592M530911j1616293k7981693
$$ plain form
40071 94179888 92056031 91084793 90728587 89788077 88210586 87201044 88098209 91545220 97383815
40062 97383815 104805472 112441566 118605837 122143381 123704405 126131745 132903080 145733749
40054 145733749 163713832 184528184 205950357 226461068 245901934 266343552 290885553
40047 290885553 319394556 345344739 359149260 356316572 341554504 323568431 306730617
40040 306730617 289760118 271885922 256960456 249849296 250969051 256777293 264458410
40033 264458410 273601873 283911229 294274054 304718421 316807704 330765042 343797700
40026 343797700 352444939 355269265 352297964 343692566 331057294 319052379 313174352 315516880
40018 315516880 324127405 336408603 350821289 364018881 368549792 356933499 328951806
40011C28951806l6142125l5268810l1812876l0285252k8202880k2271416j5520228
40004A29448219j3474844j5406450j5318782j1308254p669115o606287m579576
39997E5084911J56228K909578K35110l386309k592188o1672j175473l728581j786802
39988D5654802K497633J048043n967253q550353k339752M041500K300210l213484
39980C5471346l616459N40595J965239o75452j797727O59607K293531N24489j428022
39971C3937147r45060k50916j202858j004882K695072O173727M134049j970464
39963D1565815n128021k163027K568092L988074K752017K409786L285139K919089
39955E2196964R92797l32348p08675k123536m427832m467383j408812J043925
$$ plain form
40011 328951806 292809681 257540871 225727995 195442743 167239863 144968447 129448219
40004 129448219 115973375 100566925 85248143 73939889 66270774 59664487 55084911
39997 55084911 55241139 58150717 58385827 54999518 52407330 52345658 51170185 47441604 45654802
39988 45654802 48152435 49200478 43233225 34682872 32343120 36384620 38684830 35471346
39980 35471346 31854887 32395482 34360721 33685269 31887542 32547149 34840680 35365169 33937147
39971 33937147 32992087 32741171 31538313 30533431 33228503 39402230 43536279 41565815
39963 41565815 36437794 34274767 36842859 40830933 43582950 45992736 49277875 52196964
39955 52196964 53189761 52857413 52148738 50025202 45597370 41129987 39721175 40765100
39947D0765100M76976O4567L159403O718355N229944n24200m117092k514452P66130
39938E0024731K060060K129897K844945L582226L079778J729613K02295j616949
39930F4036596l041658k527676j84233K225356M202270O355540P362966N339148
39922H3768309K606606L769056P651980P324091J144814k583390K967273J2554053
39914A19202792J6347989J4051953J3598779J7381907J8069511R513470m624440
39907B03541961j5814638j9880618j8774843j6386383j5121755j4842228j3528464
39900H9193032j0040080o368878n280784n950811m899495j685075p2935j922183
39892E2972791l556106j466235J129130j736930q919078j1780098n783186K184368
$$ plain form
39947 40765100 41242076 41306643 44466046 51184401 56414345 55890145 51773053 49258601 50024731
39938 50024731 52084791 54214688 57059633 60641859 63721637 65451250 65653545 64036596
39930 64036596 60994938 58467262 58283029 60508385 64710655 71066195 78429161 83768309
39922 83768309 86374915 90143971 97795951 105120042 106264856 103681466 106648739 119202792
39914 119202792 135550781 149602734 163201513 180583420 198652931 208166401 203541961
39907 203541961 187727323 167846705 149071862 132685479 117563724 102721496 89193032
39900 89193032 79152952 72784074 67503290 61552479 56652984 54967909 54894974 52972791
39892 52972791 49416685 47950450 49079580 47342650 38423572 26643474 20860288 23044656
39884B3044656K536960l759465o671439j403350N512428O682059L978062L410288
39876C3330199M987301M352090J383146k37349n56416k867086o022127n103753
39868B9266005o80189O28466k957677m832683q36682L883016L533366M81939n9698
39859B8425863J673751K781214L501250M305491K199592l740229p857965n693774
39851B5595193j756180k205946m183125j013526N290854O298899N62968m315071
39843B4274066l053637J683621N269952N806222K954222j418712k233994K499604
39835C5781344O089339J717879n410014m356193L934374O802415p22028q387044
39827C5450072o719742O7431L050347J453985l42802j482610l171893l813807
$$ plain form
39884 23044656 25581616 21822151 15150712 13747362 19259790 25941849 29919911 33330199
39876 33330199 38317500 42669590 44052736 43815387 43258971 40391885 34369758 29266005
39868 29266005 28585816 29214282 26256605 21423922 20587240 24470256 28003622 28485561 28425863
39859 28425863 30099614 32880828 36382078 40687569 42887161 39146932 31288967 25595193
39851 25595193 23839013 21633067 17449942 16436416 21727270 28026169 28589137 24274066
39843 24274066 21220429 22904050 28174002 33980224 36934446 35515734 33281740 35781344
39835 35781344 41870683 43588562 38178548 33822355 37756729 44559144 43837116 35450072
39827 35450072 28730330 28797761 31848108 33302093 32959291 31476681 28304788 24490981
39819B4490981j926222J41109K83674K45230J182042O19229k153039l187513q02243
39810A8893248M52360k264150m187484q28190M000000M601893K603068K561066
39802B5831811L040349m6482m654457n112463j252213J954761J986123j17527
39794B1629902l646183o964705n450521K226987Q650212O257486j046430l286581
39786A8370167N76940K512174m22649k073268J060940L809279J762857j280972
39778B4315468r9327L650198M767672K161959r29029j776327m20063J056877L15005
39769C3042433k244730k652205J423031N815656M772647l03740k799366j140105
39761C5913621k52472k124110k512229N77620K553910K04985k603517j908080
$$ plain form
39819 24490981 22564759 22705868 22989542 23234772 24416814 25036043 22883004 19695491 18893248
39810 18893248 19345608 17081458 12893974 12065784 16065784 20667677 23270745 25831811
39802 25831811 28872160 28825678 24171221 19058758 17806545 19761306 21747429 21629902
39794 21629902 17983719 11019014 5568493 7795480 16445692 22703178 21656748 18370167
39786 18370167 18947107 21459281 21036632 18963364 20024304 23833583 25596440 24315468
39778 24315468 24216141 27866339 32634011 34795970 33866941 32090614 31670551 32727428 33042433
39769 33042433 30797703 28145498 29568529 35384185 40156832 39853092 37053726 35913621
39761 35913621 35661149 33537039 31024810 31602430 34156340 34361325 31757808 29849728
39753B9849728m62419j989851l532087p7919O314097Q602019M621471p52730k874680
39744C9697629k049231q30979m95464r75044j677709j622565k67012J580178K525712
39735C5885515J962395K90237j344538j447771J92375J331879j90098k862063
39727C3817931l207079j065828L36092K5840Q34093M070978O922809P049816N658300
39718E4442952L918131P84986k950453l195726J173494M921704L643510M34448
39710F3173046N91888L213050L545944R64871j149941j582295j691308j009955
39702F6055300K014674N580500N918618K771673p69088k844490k929859O61398
39694G6458726P716734J2238911Q494898M09632k389669J754403M726683K063137
$$ plain form
39753 29849728 29387309 27397458 23865371 23787452 30101549 38703568 43325039 42572309 39697629
39744 39697629 37648398 36817419 36321955 35346911 33669202 32046637 31779625 33359803 35885515
39735 35885515 37847910 38138147 36793609 35345838 35538213 36870092 36679994 33817931
39727 33817931 30610852 29545024 29881116 29906956 30741049 34812027 41734836 48784652 54442952
39718 54442952 58361083 59146069 56195616 52999890 54173384 59095088 62738598 63173046
39710 63173046 63764934 66977984 70523928 71488799 70338858 68756563 67065255 66055300
39702 66055300 68069974 73650474 79569092 82340765 81571677 78727187 75797328 76458726
39694 76458726 84175460 96414371 104909269 105318901 102929232 104683635 109410318 111473455
39686A11473455m53703K469980O401313N066817J438162L129110R989047J4048412
39678A53562593J1054736N502270L424706N216546P119251O403419L590036J562488
39670A97436045L101741P751085J1398201J0813426P872266O763379P696698O826537
39662B59659378K674935j243442j877729j226139k461476m079402k268940J699549
39654B50876734J517092n067623j1529872j0588135m103402j80322j739345l770165
39646B15414962k591718j527748m098301o935550m765423J019223M624711M595906
39638B05736062M248121M582552L293572Q46394Q73977L263373L249988m59462
39630B25634577k879932j034542J036658m57968k597476j757397r36206m567797
$$ plain form
39686 111473455 111019752 113489732 119891045 124957862 126396024 129525134 139514181 153562593
39678 153562593 164617329 170119599 173544305 178760851 185880102 192283521 195873557 197436045
39670 197436045 200537786 208288871 219687072 230500498 238372764 245136143 252832841 259659378
39662 259659378 262334313 261090871 259213142 257987003 255525527 251446125 249177185 250876734
39654 250876734 252393826 247326203 235796331 225208196 221104794 220924472 219185127 215414962
39646 215414962 212823244 211295496 207197195 200261645 195496222 196515445 201140156 205736062
39638 205736062 209984183 214566735 217860307 218706701 219580678 222844051 226094039 225634577
39630 225634577 222754645 221720103 222756761 222298793 219701317 217943920 217007714 212439917
39622B12439917r775655j0034955n502107k633694m376501p399033q941828r885538
39614A53890606j0321336q422365n347593n383075q801765r947641n605142n85064
39606I9476625r65124n333924p290514m562051j184962j186222l737126n157565
39598G0059137l463917k6183K310193K040901j01595k728397n104958o215524
39590E6769657m389859l9602K875353J412012j465096p43420K502514K223583
39582E9145142k616227n305892j437492M017768M211367M27322j116687O13548
39574E7938849R95836j751092l814213k187521J140274K824144K292851Q39867
39566E8278995m43257n19923J297514L630900L679659P82421k317584k809336
$$ plain form
39622 212439917 202664262 192629307 187127200 184493506 180117005 172717972 163776144 153890606
39614 153890606 143569270 135146905 129799312 124416237 115614472 105666831 100061689 99476625
39606 99476625 98511501 93177577 85887063 81325012 80140050 78953828 75216702 70059137
39598 70059137 66595220 66569037 68879230 70920131 70818536 68090139 62985181 56769657
39590 56769657 52379798 52340196 55215549 56627561 55162465 54419045 56921559 59145142
39582 59145142 56528915 51223023 49785531 53803299 58014666 58441988 57325301 57938849
39574 57938849 58934685 57183593 53369380 51181859 52322133 55146277 57439128 58278995
39566 58278995 57835738 57315815 58613329 62244229 65923888 66706309 64388725 61579389
39558F1579389j060657M21245K67882m25845K57156K472604L968706K765489K91675
39549G0537644L1313K540059M292000K901494P25268Q99138K522712L049880K975953
39540I0475461L991970M457990J724226k040634j716020K981393O663583N893523
39532A12431492K822719L60253j233607j503362J163319N159727N150722p11628
39524A23639635o916541p392361k999210J026577K074102J106602p28281k643895
39516A07166628l170787j926480j047216k131778l347280k194752M63990J707103
39508I5519428M33908k181455m467220m773944k458576Q4277n43101k913352j260990
39499G7438975N281257Q968266L843951m666582p004142k899482l2665j343331
$$ plain form
39558 61579389 60518732 60939977 61207859 60782014 61039170 63511774 67480480 70245969 70537644
39549 70537644 70568957 73109016 77401016 80302510 81027778 81926916 84449628 87499508 90475461
39540 90475461 94467431 98925421 100649647 98609013 96892993 99874386 106537969 112431492
39532 112431492 115254211 115614464 114380857 112877495 114040814 119200541 124351263 123639635
39524 123639635 116723094 109330733 106331523 107358100 109432202 110538804 109810523 107166628
39516 107166628 103995841 102069361 101022145 98890367 95543087 93348335 93812325 95519428
39508 95519428 95953336 93771881 89304661 84530717 82072141 82156418 81613317 78699965 77438975
39499 77438975 82720232 91688498 95532449 90865867 83861725 80962243 80929578 79586247
39491G9586247k154168o6761O53505k940351o817216n888917j024148L056301
39483F4404492L602495J147856k266671m382578m380058l901106m246490l395953
39475D6581987N69107M326047K990991j463749j957353K734029N855473L664373
39467F3300905J103594K600914M314553J334456l158155k920762J106936K880705
39459G0563146J306492J081017M092168O360114M424811K3444k892955k656300
39451H2301937n61704Q56664J13239j371434p27159J974707L134726J062891j305547
39442H5478320j663629k263906m732871n317927j011955L284641J037469m777652
39434G0032490n135173R15235M317136j88988o548575p087599k725430J002540
$$ plain form
39491 79586247 77432079 77365318 78018823 75078472 68261256 62372339 61348191 64404492
39483 64404492 68006987 69154843 66888172 62505594 58125536 54224430 49977940 46581987
39475 46581987 47151094 51477141 54468132 53004383 51047030 53781059 59636532 63300905
39467 63300905 64404499 67005413 71319966 72654422 69496267 66575505 67682441 70563146
39459 70563146 71869638 72950655 77042823 83402937 87827748 87851192 84958237 82301937
39451 82301937 81740233 82596897 82710136 81338702 80611543 82586250 85720976 86783867 85478320
39442 85478320 83814691 81550785 76817914 71499987 70488032 73772673 74810142 70032490
39434 70032490 64897317 65812552 70129688 69940700 63392125 56304526 53579096 54581636
39426E4581636K411357K875773J820749j762664n107416m080881J029723N761204
39418E7529481O831838M583785J011790k185242m130750m933909m761427k614494
39410E1331072J795920M932903K204567m695399p817634l264826K987270L648912
39402E1122785K13238j006391O03899L84604k469611l750879k237573j631110
39394D1228962l197570l294155n61596Q99672j101799k391597J69009K354679
39386C4105605n09548m745214l509934J936594L880734K87377k488728l59073
39378B8597813K274788J00063m869345o780226m012126J55011K475717K028092
39370A9969787m40919k602049j763955J600125L552979K045625j28764k59275
$$ plain form
39426 54581636 56992993 59868766 61689515 59926851 54819435 50738554 51768277 57529481
39418 57529481 64361319 68945104 69956894 67771652 63640902 58706993 53945566 51331072
39410 51331072 53126992 58059895 60264462 55569063 47751429 44486603 47473873 51122785
39402 51122785 51336023 50329632 50933531 51318135 48848524 45097645 42860072 41228962
39394 41228962 38031392 34737237 34175641 35075313 33973514 31581917 31750926 34105605
39386 34105605 33596057 28850843 25340909 27277503 31158237 31445614 28956886 28597813
39378 28597813 30872601 30972664 26103319 19323093 15310967 15465978 17941695 19969787
39370 19969787 19528868 16926819 15162864 16762989 20315968 22361593 22232829 21973554
39362B1973554k16188k323329m068393j924325K095659L389885K417308L106532
39354B4450703M847962L249534j151273k639802j41923N26279l097536n408242
39346B0635702k406559J267363N14925j552810K06075L671869L868583K167428
39338B8372576K959026M637525K616352j126105p94176K220203Q81679m724788
39330C5042292o259751q42950L818288J895977j742502n53786L235218L576321
39322C8169107L60146k253902l007181k980524j513956J427600K176448j239694
39314C1138044l716412R3820N945507M797600l256544q023472l712918L000149
39306B6265774K945586l273180p811796o747351l374181j620420j044413O08679
$$ plain form
39362 21973554 21757366 19434037 15365644 13441319 15536978 18926863 21344171 24450703
39354 24450703 29298665 32548199 31396926 28757124 28615201 29141480 26043944 20635702
39346 20635702 18229143 19496506 20011431 18458621 18664696 22336565 26205148 28372576
39338 28372576 31331602 35969127 38585479 37459374 36665198 38885401 39767080 35042292
39330 35042292 28782541 27939591 31757879 33653856 31911354 31357568 34592786 38169107
39322 38169107 38529253 36275351 33268170 30287646 28773690 30201290 32377738 31138044
39314 31138044 27421632 27515452 33460959 38258559 35002015 26978543 23265625 26265774
39306 26265774 29211360 25938180 18126384 11379033 8004852 6384432 5340019 5948698
39298E948698L019860L618811J368840j469901j771953R19839L893035M195321
39290A9722550J569868j646779l173464l033253l075590m236529m850429k803947
39282a527573Q15204K285362L04545j868475j042983J607331L369009M320781
39274H263201N114698L255996k914240q379942o412348R34429M593886J677439
39266F133119r00627J663927M692889K907459q20759j449539j63602k73261k39320
39257A1550286K140492L452949K12273l523721k170559J458168R84143j974754
39249A2129277q87620L090128K342732l571043o337262k548963J318476N70090
39241F105815o20683J970528N078438M238503P89185k077727m112632m726634
$$ plain form
39298 5948698 8968558 12587369 13956209 12486308 10714355 11634194 15527229 19722550
39290 19722550 21292418 19645639 16472175 13438922 10363332 6126803 1276374 -1527573
39282 -1527573 -712369 1572993 1877538 9063 -1033920 573411 3942420 8263201
39274 8263201 13377899 16633895 13719655 5339713 -1072635 -138206 4455680 6133119
39266 6133119 5232492 6896419 11589308 14496767 13676008 12226469 12062867 11789606 11550286
39257 11550286 13690778 17143727 17356000 13832279 11661720 13119888 14104031 12129277
39249 12129277 11241657 14331785 16674517 13103474 6766212 4217249 5535725 6105815
39241 6105815 5485132 7455660 12534098 16772601 17561786 15484059 11371427 6644793
39233F644793j368691M362695N589564L21844l652781k3963N947220N613840R2446
39224B3526967k708686o32518J325229L30605j120967r46679j92248J20299J16469
39215A9818471o80716k327474k713280n48086J570270R94448j92720J263896L576476
39206B0761285K385800k070223n379587n473464l999618k349969q47012m78132
39198B549080j071050J45646L536864L930903j355233n230225k31696P660638
39190I934927N673237n663080j1395981m050826N479450N041095j524247l077485
39182D17090J153490L365396J639730J311041L451886K462119l460260p899858
39174B440634n459296N36689L216031J101799j700261j970351o82715l19840j159769
$$ plain form
39233 6644793 5276102 9638797 15228361 15550205 11897424 11873461 17820681 23434521 23526967
39224 23526967 20818281 20185763 21510992 21841597 20720630 19773951 19581703 19702002 19818471
39215 19818471 19137755 16810281 14097001 13548915 15119185 16113633 15920913 17184809 20761285
39206 20761285 23147085 21076862 15697275 10223811 6224193 3874224 3027212 2549080
39198 2549080 1478030 1623676 5160540 9091443 7736210 2505985 2274289 9934927
39190 9934927 15608164 9945084 -1450897 -5501723 -22273 5018822 3494575 417090
39182 417090 1570580 4935976 6575706 7886747 11338633 13800752 10340492 2440634
39174 2440634 -3018662 -2481973 734058 1835857 135596 -1834755 -2517470 -2837310 -3997079
39165c997079j102100J259640M285412M917608K407638j017859l291862m356180
39157h94782m386834k651492M96540K751091K736884J787611J208139J25680j827475
39148f54638k279233M67557L902068M512532K779432J438112M81292j797509l950244
39139D899369k705287P90353J434337j741290l204487M98300M534270K747737
39131G253302k417915k922656K754197O721968K842842m345100o035510j376929
39123B474199K207647K77151k985175k421811J17129l0837j771995j65304M233461
39114A934465M793357r21944o395896n050438P72451L941227K193203r41218k371302
39105b046095j740722R03782M764939O357638K813278k855727m439895j021272
$$ plain form
39165 -3997079 -5099179 -3839539 445873 5363481 7771119 6753260 3461398 -894782
39157 -894782 -5281616 -7933108 -7436568 -4685477 -1948593 -160982 1047157 1172837 -654638
39148 -654638 -2933871 -2466314 1435754 5948286 8727718 10165830 10647122 8849613 4899369
39139 4899369 2194082 2984435 4418772 2677482 -527005 -28705 4505565 7253302
39131 7253302 4835387 1912731 4666928 11388896 14231738 9886638 3851128 2474199
39123 2474199 4681846 4958997 1973822 -447989 -330860 -361697 -2133692 -2298996 1934465
39114 1934465 6727822 5805878 -590018 -5640456 -4868005 -926778 1266425 325207 -2046095
39105 -2046095 -3786817 -2883035 1881904 8239542 11052820 8197093 3757198 2735926
39097B735926J745988n1155l432396l630689m66721K864777M197136K978135p11236
39088F229765m823245n420794j309121L142688L008262p38336l068285k032214
39080e011280j30826J058399L042081N907052N990922J213712m187212m440284
39072C442564m69885J297198j358632l001105O47647N061017L234731k978554
39064E874981m734409M18553M367095Q62817m497686k837923L956967N847420
39056I257815r9071n466384l173117K873483M598014Q00806l461071m935688m380958
39047c986171k558987Q09711M083245L888679l39399m481379m031953O34644M444209
39038a537401L199025j508649l984469j544452J815253R98171k662593l453664
$$ plain form
39097 2735926 4481914 4430759 998363 -2632326 -3099047 -234270 3962866 6941001 6229765
39088 6229765 1406520 -4014274 -5323395 -2180707 827555 89219 -2979066 -5011280
39080 -5011280 -5142106 -4083707 -1041626 4865426 10856348 12070060 7882848 3442564
39072 3442564 2972679 4269877 2911245 -89860 557787 5618804 8853535 5874981
39064 5874981 1140572 1559125 5926220 6789037 2291351 -546572 3410395 9257815
39056 9257815 9158744 3692360 519243 3392726 7990740 8791546 5330475 394787 -3986171
39047 -3986171 -6545158 -5735447 -1652202 2236477 1897078 -2584301 -6616254 -5981610 -1537401
39038 -1537401 1661624 152975 -3831494 -5375946 -3560693 -2562522 -5225115 -8678779
39030h678779k41602J977795O46869k03719K383117M196129P50951m201736l791144
39021g162119J176331L856454K397843J582334L326975L523499L39748j770410
39013G270655R8325J902467l03363l333283k390938O15453N19890k136082k235159
39004G965R07940K163517j079226m677272l831028M50325L303108K117518j103961
38995a741114k224461Q85083N540000N980869p6377p271134q030320k106004L030192
38986f013266K160126j477602k197454p0408R06880K07381J155190M341862N659234
38977D671943K447899k162223l553204j712457j16424r5887L16556K100626L043027
38968D939856J070810k373398m074604l025024r52620N37608J591804K732117
$$ plain form
39030 -8678779 -8920381 -6942586 -6295717 -6499436 -4116319 79810 830761 -3370975 -7162119
39021 -7162119 -5985788 -2129334 268509 1850843 5177818 8701317 9041065 7270655
39013 7270655 7368980 9271447 8968084 5634801 3243863 3859316 4379206 2243124 7965
39004 7965 915905 3079422 2000196 -2677076 -6508104 -6057779 -2754671 -637153 -1741114
38995 -1741114 -3965575 -3080492 2459508 8440377 8364000 1092866 -6937454 -9043458 -6013266
38986 -6013266 -3853140 -5330742 -7528196 -7598604 -6691724 -6484343 -5329153 -987291 4671943
38977 4671943 7119842 4957619 1404415 -308042 -424466 -520353 -203797 1896829 4939856
38968 4939856 6010666 3637268 -437336 -3462360 -4414980 -3877372 -2285568 446549
38960D46549L303991K196208k83393k019074j144501J390734K219467k81829k990934
38951B837218j626517K594720L421436j554300o296404m345107J669397L921211
38943F21654R81998j109517O70630K107257J51480j521429N05513K874875J337779
38934F620240j641493j270169J316496J685559Q9202m7217N67001j383189m303649
38925A632781l376310O03531J824074p62087k190059r62107j232871l438969j819092
38916i721109M826098Q682182M738741r03800j140683J118127n5785k247544M4545
38907E340772L763884J753177l849083l901394K426176N538965M78313n728690
38899E822120n401975o73240K095835J904788J828220K586591K424489Q10667
$$ plain form
38960 446549 3750540 5946748 5663355 3644281 2499780 3890514 6109981 5828152 2837218
38951 2837218 1210701 3805421 7226857 5672557 -623847 -4968954 -3299557 621654
38943 621654 1603652 494135 1164765 3272022 3423502 1902073 2407586 5282461 6620240
38934 6620240 4978747 3708578 5025074 6710633 6799835 6752618 7319619 5936430 1632781
38925 1632781 -1743529 -1139998 684076 -78011 -2268070 -3230177 -4463048 -7902017 -9721109
38916 -9721109 -4895011 3787171 8525912 7622112 6481429 7599556 7543771 5296227 5340772
38907 5340772 9104656 10857833 7008750 3107356 5533532 11072497 11550810 5822120
38899 5822120 420145 -253095 1842740 3747528 5575748 8162339 10586828 11397495
38891A1397495j449852l858905n436431m309664k01299M351216O550093N493244
38883A2535897J682573l028647n190454k938391N70156P92283j303872q37118
38875B282427K370046K853943j347048m998669l958374j153905m91757l21693
38867d765030K257325N095552M267384N41950k066035j821168K26063K514042
38859F250083K791313p41621n147400m235131K024749N123605J27119n749376
38851D43341l674185L041160M604151L05448j849884O24533J694054j128307k124782
38842A935529J911032N122601J789976m370308n670774j201805K862516J667003
38834D045770l197952o175864l656842K110187N270519L542618J125603J998672
$$ plain form
38891 11397495 9947643 6088738 652307 -3657357 -3858656 492560 7042653 12535897
38883 12535897 14218470 11189823 5999369 3060978 3631134 4423417 3119545 2282427
38875 2282427 4652473 7506416 6159368 1160699 -2797675 -3951580 -4443337 -4765030
38867 -4765030 -2507705 2587847 6855231 7397181 5331146 3509978 3736041 6250083
38859 6250083 9041396 8299775 3152375 -1082756 941993 6065598 6192717 443341
38851 443341 -3230844 -189684 4414467 4719915 2870031 3494564 5188618 4060311 1935529
38842 1935529 3846561 8969162 10759138 6388830 718056 -483749 2378767 4045770
38834 4045770 847818 -5328046 -8984888 -6874701 -1604182 1938436 3064039 5062711
38826E062711L514421J307039k518793k696118j46366k03976k566905j771188
38818a9175K149905K885392q10737k695921n60951j02573l367942l776803J639810
38809d658995N346204K070548j423920J474950M588362j08194o797413m596378
38801d104836L449587M914093j235379l749210R28573L134631k265322o745547
38793e673410k867082L650474M302455Q35734m73108k08318k619408o120731n557553
38784a4730947j019425K853747M322852N142679N482786L918457J216577p23270
38776F463456k342253m489512m990083k024950R68927n76361m460415l977057
38768a5428248J980094P072520O775909L786897K153190J252939j048858l269332
$$ plain form
38826 5062711 8577132 9884171 7365378 4669260 4522894 4318918 1752013 -19175
38818 -19175 2130730 5016122 4205385 1509464 948513 845940 -2522002 -6298805 -4658995
38809 -4658995 687209 2757757 1333837 2808787 7397149 7288955 491542 -4104836
38801 -4104836 -655249 4258844 3023465 -725745 202828 3337459 1072137 -5673410
38793 -5673410 -8540492 -4890018 -587563 248171 -224937 -433255 -3052663 -9173394 -14730947
38784 -14730947 -15750372 -12896625 -8573773 -3431094 2051692 5970149 7186726 6463456
38776 6463456 4121203 -368309 -5358392 -7383342 -6414415 -6990776 -11451191 -15428248
38768 -15428248 -13448154 -6375634 400275 4187172 6340362 7593301 6544443 3275111
38760C275111k512105L87420J779700L78179j563901j966435j247517o40962j18406
38751b228916J181941L278068M690880L511491n64003n191273p123880n424677
38743g870369k234843j8619Q97153J473767K080551K689671L648996M543831L452807
38734H662945l09276l557545k543716J106654J653793k231076m460501l20128
38726a998850N433415M575725k360863o315661k637145K679419K398578j957215
38718a82597m000728k131804L02468J816328L530206M196721R66134m248593n321444
38709e073309r04981K615848L76593l559474k497758K803146N742179L596759
38701C099003K5169j635702k064626k106617m34146K645500L364045j79713m040832
$$ plain form
38760 3275111 763006 1150426 2930126 3308305 1744404 -222031 -1469548 -2110510 -2228916
38751 -2228916 -1046975 2231093 6921973 10433464 9869461 4678188 -2445692 -7870369
38743 -7870369 -10105212 -10123831 -9226678 -7752911 -5672360 -2982689 666307 5210138 8662945
38734 8662945 8353669 4796124 2252408 3359062 5012855 2781779 -1678722 -1998850
38726 -1998850 3434565 8010290 5649427 -666234 -3303379 -623960 1774618 -182597
38718 -182597 -4183325 -6315129 -6012661 -4196333 -666127 3530594 4496728 248135 -5073309
38709 -5073309 -5978290 -3362442 -2985849 -6545323 -9043081 -6239935 -497756 3099003
38701 3099003 3124172 1488470 -576156 -2682773 -3116919 -471419 2892626 2712913 -1327919
38692a327919l616578m60784N22629q33234r9783L386610M252665l11605m878043
38683c366042l245034J984637L061657j286955m227953j391577K925720K733727
38675b811820j158493l393693j793787J105428K583132K307493J247759P76872
38667a137109K102690M347859M343279O80155l434908m098588k036363p81639
38659a4624q65491J95807K735743M079971L085054J433348j48777k723461n223654
38650B553916m320867j97045K000716n57051l573155j853146K907190N020947
38642A981505L167075R18139J95550n67840j740617j173512J035004J100611k453617
38633B462298n053821k065640L731618N029442j08290n448020m916018k40734
$$ plain form
38692 -1327919 -4944497 -5405281 -4882652 -5715886 -5815669 -2429059 1823606 1512001 -3366042
38683 -3366042 -6611076 -4626439 -1564782 -2851737 -7079690 -8471267 -5545547 -2811820
38675 -2811820 -3970313 -7364006 -9157793 -8052365 -5469233 -3161740 -1913981 -1137109
38667 -1137109 965581 5313440 9656719 10336874 6901966 2803378 767015 -14624
38659 -14624 -880115 -684308 2051435 6131406 9216460 10649808 10501031 7777570 2553916
38650 2553916 -1766951 -1963996 36720 -520331 -4093486 -5946632 -3039442 1981505
38642 1981505 5148580 6066719 6262269 5694429 3953812 2780300 3815304 4915915 2462298
38633 2462298 -2591523 -4657163 -925545 4103897 3995607 -1452413 -6368431 -6609165
38625f609165K378890R82595n38495Q25685K847216K206907M0119J35806K797863
38616E067421M010210J222050k879752l919412j370601J301248J189558j115606
38608C505116l018521k855393q47363J807443L712775L488273O61295k892648
38600C560977l586189P7353M696212N043881L57726m505809n043582k058794O88782
38591g69443J459517J046882L41084L7168J226040L497780L910170R19775k141822
38582I527151j253190J817179J691167k388679n434310m345403j702722n65619
38574b654426l10325K22202J9940q58336L69068M117669N577954J245085m767938
38565B960893n769185j710879J701314J871696J815401L550694M234075J003059
$$ plain form
38625 -6609165 -4230275 -3247680 -3786175 -2960490 -113274 2093633 2133752 2269558 5067421
38616 5067421 9077631 10299681 7419929 3500517 2129916 3431164 4620722 3505116
38608 3505116 486595 -2368798 -3216161 -1408718 2304057 5792330 6453625 3560977
38600 3560977 -25212 52141 4748353 9792234 10149960 5644151 600569 -1458225 -769443
38591 -769443 690074 1736956 2078040 2115208 3341248 6839028 10749198 11668973 9527151
38582 9527151 8273961 10091140 11782307 9393628 3959318 -386085 -2088807 -2654426
38574 -2654426 -2964751 -2742549 -2722609 -3580945 -3211877 905792 6483746 7728831 2960893
38565 2960893 -2808292 -4519171 -2817857 -946161 869240 4419934 8654009 9657068
38557I657068l930386n840318l420557J09253J112165r00927l599784m384432
38549a1197918k184254K308643O896301Q408643M866367j495971m907742k137178
38541E56891L001503M016586m411m009783m686186m026507m027912k712167J546312
38532a0345674N601370N377394J658406j597816k744001k726995j670154R79260
38524e468210L809705M422850K719572O11402r29294k221785l159704l371122
38516c586586l157329k432443k59558K671363L360222Q11576j479950m99956J500712
38507c071949J113049l5997J672656M552515L464734j490075m316834k108125
38499b20026R35009M12057k161947k883458j432018l84952p53155r76752M13084
$$ plain form
38557 9657068 5726682 -113636 -3534193 -3424940 -2312775 -3213702 -6813486 -11197918
38549 -11197918 -13382172 -11073529 -4177228 4231415 9097782 7601811 2694069 556891
38541 556891 3558394 7574980 7570569 3560786 -1125400 -5151907 -9179819 -11891986 -10345674
38532 -10345674 -4744304 633090 2291496 693680 -2050321 -4777316 -6447470 -5468210
38524 -5468210 -1658505 2764345 5483917 6095319 5166025 2944240 -215464 -3586586
38516 -3586586 -6743915 -9176358 -9435916 -6764553 -3404331 -2592755 -4072705 -4572661 -3071949
38507 -3071949 -1958900 -1994897 -322241 4230274 7695008 6204933 1888099 -220026
38499 -220026 714983 1127040 -1034907 -3918365 -5350383 -5735335 -6488490 -7465242 -7052158
38490g052158K699197L450025J148740k233687k672043N21279K848132P72222
38482e18293k621405k110915J386714K234821r37602l402576k108875K50778O26620
38473g200733J10501O59710J431166J014734R3552m31345j145464k021370j407717
38464h896966J022573K905255K450584P15241o02065j103459n65262J167704K325109
38455e81286O06548k590495l029384M4996K404402J281864p74287o32589P27637
38446b542594P38601r45797l351933n493953n045033J04068O875129Q401319L255540
38437A995347j709761j252912R09570n92098l422386k033731K299107L332182
38429d74682j29797l034547k288966J0053J564500K571907K962833J736661k79306
$$ plain form
38490 -7052158 -4352961 -902936 245804 -1987883 -4659926 -4138647 -1290515 -518293
38482 -518293 -3139698 -5250613 -3863899 -1629078 -2566680 -5969256 -8078131 -7827353 -7200733
38473 -7200733 -7090232 -6430522 -4999356 -3984622 -3891070 -4322415 -5467879 -7489249 -8896966
38464 -8896966 -7874393 -4969138 -2518554 -1803313 -2405378 -3508837 -4074099 -2906395 -581286
38455 -581286 25262 -2565233 -5594617 -5549621 -3145219 -1863355 -2637642 -3270231 -2542594
38446 -2542594 -1803993 -2749790 -6101723 -11595676 -16640709 -16536641 -9661512 -1260193 1995347
38437 1995347 285586 -967326 -57756 -649854 -4072240 -6105971 -3806864 -474682
38429 -474682 -604479 -3639026 -5927992 -5917939 -4353439 -1781532 1181301 2917962 2638656
38420B638656r91407o47777j209785k297738j702875K15749P96501j94521k98371
38411c691568Q59989P72945j270511k760008k186352r15854J46188J980775M286145
38402b778251M575486K102795n50557j442749j710958k376773j971803L63670
38394c789140K249292J289145j091821j713612r6331J632598K186720K002481
38386B669332J260029n41233k795889l495279j636373R96181J459931r74059l762895
38377f820255l864048j172500J608127K285710J106496o66019k269278k837126
38369a2628893j295288J713012L541165K824461J332268P83185K1155k005590
38361e714525k732283N88117N210512N332364L92139l539227j994846K143881
$$ plain form
38420 2638656 1647249 999472 -210313 -2508051 -4210926 -3995177 -3198676 -3393197 -3691568
38411 -3691568 -2831579 -2058634 -3329145 -6089153 -8275505 -9191359 -9045171 -7064396 -2778251
38402 -2778251 1797235 3900030 3349473 1906724 195766 -2181007 -4152810 -3789140
38394 -3789140 -1539848 -250703 -1342524 -3056136 -3152467 -1519869 666851 2669332
38386 2669332 3929361 3388128 592239 -2903040 -4539413 -3543232 -2083301 -3057360 -6820255
38377 -6820255 -10684303 -11856803 -10248676 -7962966 -6856470 -7522489 -9791767 -12628893
38369 -12628893 -13924181 -12211169 -8670004 -5845543 -4513275 -3730090 -3708935 -5714525
38361 -5714525 -8446808 -7858691 -2648179 2684185 3076324 -462903 -2457749 -313868
38353c13868L325124O90546k086486k486429j669263j721010k687463k976119
38345i924968j676892K63042J198651P98495L52945R55358K114411K569307J699563
38336a650088k57644k365977l025591j347820J001989J307629j12386L7395K516465
38327c896028L377550l5081m045120l438578J008104M114479L775641K248180
38319C109147J023283o45676k280092k017270m08003j39419j394152j491084L16006
38310c927260J714421J572751J218186R56466k80423j198174R66040M643380M406986
38301A0072373p27262m867549l904126j241802j206259j970974o0647K467438
38293a438808J441499j641954j616851J815474L515411Q78309k775736l585813
$$ plain form
38353 -313868 3011256 3701802 1615316 -871113 -2540376 -4261386 -6948849 -9924968
38345 -9924968 -11601860 -11338818 -10140167 -9341672 -8988727 -8033369 -5918958 -3349651 -1650088
38336 -1650088 -1907732 -4273709 -7299300 -8647120 -7645131 -6337502 -6449888 -6412493 -3896028
38327 -3896028 -518478 -553559 -4598679 -8037257 -7029153 -2914674 860967 3109147
38319 3109147 4132430 3486754 1206662 -810608 -1218611 -1358030 -2752182 -4243266 -3927260
38310 -3927260 -2212839 -640088 578098 1534564 1254141 55967 1022007 5665387 10072373
38301 10072373 9345111 4477562 573436 -668366 -1874625 -3845599 -3906246 -1438808
38293 -1438808 2691 -1639263 -3256114 -1440640 2074771 2953080 177344 -3408469
38285c408469j768373K07005P70548l51691k180531k355693M18379L478344K675173
38276b515308j680151m459797k440785J658324L603318L240369L025768L114268
38268C546006J404750k156433m644765m093892j810919J66966J641292K855598
38260c091397K634902J86363k537851k803715p96631J032665J731081K183571
38252a461012K161537N47716j323751o10463J798696J453962k371447m358087
38244d162849j164533K955321K776393n6539j022818n06393j262166j573710J560240
38235b457054M833919K579269k936845m030853k19477J219038j605153j820346
38227d437502L195646N785547P28762n146412l646934J846884K815747n21143
$$ plain form
38285 -3408469 -5176842 -4969837 -4199289 -4550980 -6731511 -9087204 -8668825 -5190481 -2515308
38276 -2515308 -4195459 -8655256 -11096041 -9437717 -5834399 -2594030 431738 3546006
38268 3546006 4950756 2794323 -1850442 -5944334 -7755253 -7588287 -5946995 -3091397
38260 -3091397 -456495 -270132 -2807983 -5611698 -6408329 -5375664 -3644583 -1461012
38252 -1461012 700525 1248241 -75510 -685973 1112723 2566685 195238 -4162849
38244 -4162849 -5327382 -2372061 404332 347793 -675025 -1181418 -2443584 -4017294 -2457054
38235 -2457054 2376865 4956134 2019289 -2011564 -2231041 -1012003 -2617156 -4437502
38227 -4437502 -1241856 4543691 5272453 126041 -3520893 -1674009 1141738 620595
38219F20595j187183J957922L028992l22527l384847k313094P15893J770928J68590
38210A055269k088155l020351k232118j261365j568674j448458K188063P656639
38202g19150Q641402L277062k004454j816855L69420p39778k859426j092789K203016
38193E258448J221181k609490k942510J62262N97265k632320l922091j292606
38185f159861Q29728K64276n9302O42065m78557k328759J04547N638331O307154
38176D759622N03240l133281M8021K680772j376877n508109j671110M702064K859817
38167C864159n273762p758015j362934M395088K749157j487429j551477J448541
38159d976672K566989P49832j582948k555481j409890J644939M187620L443035
$$ plain form
38219 620595 -566588 1391334 4420326 4097799 712952 -1600142 -884249 886679 1055269
38210 1055269 -1032886 -4053237 -6285355 -7546720 -9115394 -10563852 -8375789 -719150
38202 -719150 7922252 11199314 9194860 7378005 7747425 7007647 4148221 3055432 5258448
38193 5258448 6479629 3870139 927629 1089891 1687156 -945164 -4867255 -6159861
38185 -6159861 -5330133 -5065857 -5125159 -4483094 -4961651 -7290410 -7185863 -1547532 4759622
38176 4759622 5262862 2129581 2177602 4858374 3481497 -2026612 -3697722 1004342 3864159
38167 3864159 -1409603 -9167618 -10530552 -6135464 -3386307 -4873736 -6425213 -4976672
38159 -4976672 -2409683 -1659851 -3242799 -5798280 -7208170 -5563231 -1375611 2067424
38151B067424O75003J6198J770229J325538l324135p549066o573440k142749Q37388
38142a2897610J273565J664677L067045M088480L716180K010266j013497m432257
38134b523151n484210k509206K009932M148460L510454K637201K275512P25368
38126D790360k169064l956851l247703j364426N20036K777225M653375L556348
38118E559300p80523m218467l156216M13862J795526J10019j318224l74016J432998
38109e35741K211213K323291K674546K554157P55796k151650l951567l138914
38101G41131p48004N08250n79667j819803m38989K352858K404009q69771k662947
38092a112933n970K944402J147720k881422k721149J624542L796809J328854j184218
$$ plain form
38151 2067424 2742427 2758625 4528854 5854392 2530257 -5018809 -11592249 -13734998 -12897610
38142 -12897610 -11624045 -9959368 -6892323 -2803843 912337 2922603 1909106 -2523151
38134 -2523151 -8007361 -10516567 -8506635 -4358175 -847721 1789480 4064992 4790360
38126 4790360 2621296 -1335555 -4583258 -5947684 -5427648 -2650423 2002952 5559300
38118 5559300 4778777 560310 -2595906 -2182044 -386518 -276499 -1594723 -1968739 -535741
38109 -535741 1675472 3998763 6673309 9227466 9983262 7831612 3880045 741131
38101 741131 -6873 501377 -78290 -1898093 -2337082 15776 2419785 1550014 -1112933
38092 -1112933 -1118903 1825499 2973219 91797 -2629352 -1004810 2791999 4120853 2936635
38083B936635m71328P11861j16734n19523J519659L137842J697961m64915p65148
38074G666310j215731l749669n145132k244904J536880J114574j775694j418574
38066e231940K570097N167503L954593J182587j347040l714394m704427k672312
38058d795333O58358K127217K118330K749489K618462o72468m071607k212104
38050a479656L337375N382211K232481j13819J546686K699316m60301m741619
38042H402674n844099m452872k595700M10856M122871M305178r89848o698274
38034c339214o750591j684446L512927N900526N387931K540062o29997q69060
38026D068138J680223K231085j752513n898521n062101o93444K190906K197386
$$ plain form
38083 2936635 2465307 3177168 3060434 2540911 4060570 7198412 8896373 8431458 7666310
38074 7666310 6450579 2700910 -2444222 -4689126 -3152246 -2037672 -3813366 -5231940
38066 -5231940 -2661843 2505660 6460253 7642840 6295800 2581406 -2123021 -4795333
38058 -4795333 -4136975 -2009758 108572 2858061 5476523 4804055 732448 -1479656
38050 -1479656 1857719 7239930 9472411 9358592 10905278 13604594 13144293 8402674
38042 8402674 2558575 -1894297 -4489997 -4079141 43730 4348908 3359060 -3339214
38034 -3339214 -10089805 -11774251 -8261324 -2360798 3027133 5567195 4937198 4068138
38026 4068138 5748361 7979446 6226933 328412 -4733689 -5427133 -3236227 -1038841
38018a038841J169374m18554k745817l722902j739897N74100K5690j634702p04668
38009a0236217J848267K083075J04368k09912J933213L053884J406821o62052
38001f78553j123783q09094o63725j77527N93589P25971P24972J902973L120678
37992C615501J726340j627753k960442j061462J83660k160921m904528k898662
37984a0088267L254639P109874M177095k574449o147786l329411K310154N022713
37976b65438K916302j357475m271221l851143K21946N817047Q027321L463017
37968A0700356m230623o934158j965417M082448L922577j248030m454132k321399
37960b448378K021850M042389K342979j364536m170997l994952j264623J746245
$$ plain form
38018 -1038841 130533 -288021 -3033838 -6756740 -8496637 -7922537 -7896847 -9531549 -10236217
38009 -10236217 -8387950 -6304875 -6200507 -6410419 -4477206 -1423322 -16501 -678553
38001 -678553 -1802336 -2611430 -3275155 -3452682 -2859093 -2133122 -1408150 494823 3615501
37992 3615501 5341841 3714088 753646 -307816 -124156 -2285077 -7189605 -10088267
37984 -10088267 -6833628 276246 4453341 1878892 -4268894 -7598305 -5288151 -265438
37976 -265438 2650864 1293389 -2977832 -6828975 -6607029 -789982 7237339 10700356
37968 10700356 6469733 -464425 -2429842 1652606 5575183 4327153 -126979 -2448378
37960 -2448378 -426528 3615861 5958840 4594304 423307 -3571645 -4836268 -3090023
37952c090023L556102L919744J949116k828638p069562n767450N09105N230769
37944c590837M970610L506887L859111K619301k682184o727529m001992J621880
37936d24753K842810N85954R14804L221691J435187m016754n652569j325705K266845
37927a52490O89746k180478k189014j078372r17638M46280L927374N389389K108870
37918F043667k094961k890731j984573k784647l629947q46791M110707N918081
37910A840805K692766k019206m041268k437614R02874L333616L354374J641872
37902E268219r7025j142730j466708l95807J988312L125098J008452j935232k061977
37893D290602o82904j860036m534536l272743K306910N682976L170672r98156
$$ plain form
37952 -3090023 466079 4385823 6334939 3506301 -3563261 -9330711 -8821606 -3590837
37944 -3590837 1379773 4886660 8745771 11365072 8682888 1955359 -2046633 -424753
37936 -424753 2418057 3004011 3918815 7140506 8575693 4558939 -1093630 -2419335 -152490
37927 -152490 537256 -1643222 -3832236 -4910608 -5828246 -5381966 -1454592 3934797 6043667
37918 6043667 3948706 1057975 -926598 -3711245 -7341192 -8187983 -4077276 1840805
37910 1840805 4533571 2514365 -1526903 -3964517 -3061643 271973 3626347 5268219
37902 5268219 5171194 4028464 2561756 2165949 4154261 7279359 8287811 6352579 4290602
37893 4290602 3607698 1747662 -2786874 -6059617 -3752707 1930269 5100941 4102785
37885D102785k201572j629002j409856l631K889935K845556k142444o134128l238266
37876f920623K894262M227757K3266l326504k243644O77423K382722K650482J763379
37867B128520k97596k078504j798486l19015q8401j579061l102632l099583p33848
37858a0968606L715960P107280N240771q88729m421599j755372J912778Q47002
37850G89485j997292n53316L338446K791905k066327l842062m6747L075831J171168
37841B661091j480066J47682L262877J884734l565959o631297l647146J875603
37833e492481M166166K052924m59495J31973K296103K158382l40166j371990K13432
37824C354848O71259j964288l611234p31919K843851J393334l211552m053052
$$ plain form
37885 4102785 1901213 272211 -1137645 -1141276 1748659 4594215 2451771 -3682357 -6920623
37876 -6920623 -4026361 201396 224662 -3101842 -5345486 -4668063 -2285341 365141 2128520
37867 2128520 1830924 -247580 -2046066 -2365081 -2453482 -4032543 -7135175 -10234758 -10968606
37858 -10968606 -7252646 -145366 5095405 4206676 -214923 -1970295 -57517 789485
37850 789485 -1207807 -1761123 1577323 4369228 2302901 -1539161 -1585908 1489923 2661091
37841 2661091 1181025 1328707 4591584 6476318 2910359 -3720938 -7368084 -5492481
37833 -5492481 -1326315 726609 267114 399087 2695190 4853572 4513406 3141416 3354848
37824 3354848 4026107 2061819 -1549415 -2281334 562517 1955851 -1255701 -5308753
37816e308753J18764L412712K102785q00358j395492k5629J091180J297861J057942
37807A551012R07795J272522J130413j726422o138664o231679M17555O423213
37799b394255L458575m805483p254220j844006K336074L95713j680586Q96105
37791a0892083L338175Q48655k223415j52900M067588M196257J082555j95344
37783F9488N20783j95717j883853j419298L80941K57054r56896R6060K277738
37774h53700J112259l172235m894763j092115M498422O745711M618295N94622
37766G556496k268077k159622J16296J579300O67126p15991o59309n75800k198247
37757A342172l612724k065308J139861K517986J620333M99490l83749j665561
$$ plain form
37816 -5308753 -5189989 -1777277 325508 -474850 -1870342 -1895971 -804791 493070 1551012
37807 1551012 2458807 3731329 4861742 3135320 -3003344 -9235023 -8817468 -2394255
37799 -2394255 1064320 -3741163 -10995383 -12839389 -10503315 -10107602 -11788188 -10892083
37791 -10892083 -7553908 -6705253 -8928668 -9081568 -5013980 -817723 264832 69488
37783 69488 590271 394554 -1489299 -2908597 -2527656 -2270602 -3227498 -3131438 -853700
37774 -853700 258559 -2913676 -7808439 -8900554 -4402132 2343579 6961874 7556496
37766 7556496 5288419 3128797 3245093 4824393 5491519 4775528 4116219 3540419 1342172
37757 1342172 -2270552 -4335860 -3195999 -678013 942320 1441810 1058061 -607500
37749f07500k162170o75673R40343P35867N71716K395848L261297m9988l889171
37740E20569k370293K499674L320834p12104k968793j044586j27935k698637l932616
37731g513887q57635K320337K270973J924437L079873J745130l407118o031765
37723f469655k531997M75659k452146m603504J669276R456828O475503m210218
37715b190254p622869l49138M900321Q87930l299475N89224N752302L048515l065752
37706a349196l137859P79486K89474k875028L56665Q774438J0140437K57318r468771
37697C766964q256992J47122N628465N490635L166451k13645m882032p301797
37689b454829m059566J246610K126798j108118k415543O7579K001844Q90378n66191
$$ plain form
37749 -607500 -2769670 -3445343 -2505000 -1769133 -1197417 1198431 4459728 4409740 520569
37740 520569 -1849724 649950 3970784 3258680 289887 -754699 -882634 -3581271 -7513887
37731 -7513887 -8371522 -6051185 -3780212 -1855775 1224098 2969228 -437890 -6469655
37723 -6469655 -9001652 -8525993 -10978139 -15581643 -13912367 -4455539 2019964 -2190254
37715 -2190254 -9813123 -10162261 -5261940 -4374010 -7673485 -7084261 -1331959 1716556 -1349196
37706 -1349196 -4487055 -3707569 -3418095 -6293123 -5936458 2837980 12978417 13235735 3766964
37697 3766964 -4490028 -4342906 1285559 6776194 9942645 9729000 4846968 -2454829
37689 -2454829 -6514395 -5267785 -3140987 -4249105 -6664648 -6597069 -4595225 -3704847 -4271038
37680d271038m17792n54859j803815j590307R21885K541124J732598J461682L066963
37671A086441K726435j441756m001499n8259N626134M686060k180902o347570
37663I5084m013316R3790K029836L448010N065589L288409k548003o242348l401061
37654b184010J118542M41754l598063l723152J090586M275023J819740k599218
37646c358798l939477k087175K47626J864457K703191K059099l4725j347788J40290
37637c753300L172779M449608K608074m01526j880338j327797m81414q26497j715594
37628a56005j486541m4726R62387P33459L46957L96224l29468k129648k521898
37619d229259J69651L038115J992540j940416l777027j988433k95990j063671
$$ plain form
37680 -4271038 -4688830 -5243689 -7047504 -8637811 -7715926 -5174802 -3442204 -1980522 1086441
37671 1086441 3812876 2371120 -1630379 -1688638 3937496 8623556 6442654 95084
37663 95084 -3918232 -3824442 -1794606 1653404 6718993 10007402 7459399 1217051 -2184010
37654 -2184010 -1065468 -623714 -4221777 -7944929 -6854343 -2579320 -759580 -3358798
37646 -3358798 -7298275 -9385450 -9137824 -7273367 -4570176 -2511077 -2545802 -3893590 -3753300
37637 -3753300 -580521 3869087 6477161 6075635 4195297 2867500 2386086 1559589 -156005
37628 -156005 -1642546 -1687272 -724885 8574 355531 751755 422287 -1707361 -4229259
37619 -4229259 -4059608 -1021493 971047 -969369 -4746396 -6734829 -7030819 -8094490
37611h094490j565383O83511K993939J680289j680930k493674j00199J805143
37603f771794J185820m0553p1528K52802K15586J165348L637809N070443L008288
37594G652221r10682k876279k089831j237909j724102j467752J065726L231983
37586A643375J593933k210350k731160J496034N007423K562946l462881o185491
37578b286171l165371J498171L486792K751548J239574j28489r47539q91326j068378
37569D88811k911578m735898l021191J409821K805886j295581n606854m592918
37561a7459502l77494J640053J425392K531821M321146K998180o07020j447564
37553f974988J224534K563578N44605q95148Q27202K642334J606878n33430j521204
$$ plain form
37611 -8094490 -9659873 -8976362 -5982423 -4302134 -5983064 -8476738 -8576937 -6771794
37603 -6771794 -5585974 -5626527 -5698055 -5445253 -5229667 -4064319 -426510 4643933 7652221
37594 7652221 6741539 3865260 1775429 537520 -1186582 -2654334 -1588608 1643375
37586 1643375 3237308 1026958 -1704202 -208168 4799255 7362201 3899320 -2286171
37578 -2286171 -5451542 -3953371 -466579 2284969 3524543 3396054 2448515 1557189 488811
37569 488811 -2422767 -7158665 -10179856 -8770035 -5964149 -7259730 -12866584 -17459502
37561 -17459502 -17836996 -16196943 -14771551 -12239730 -7918584 -4920404 -5527424 -6974988
37553 -6974988 -5750454 -3186876 -2642271 -3537419 -2710217 -67883 1538995 1005565 -515639
37544e15639k154325k702672j080009K118052K344223j270136k916311N42585
37536e634232L462429P47425k965007j386829J719141j099734o784691n498813
37528a7440311K730432P161784L395006n24833J346071L339502o90887o120969
37520f804205n353711k743K991125K532286K565818L564736K691443L77141m39780
37511B122110l29577k060889m265135k823134J787664M558925L426823J171565
37503C588352j33775r90990p18788K167969N106730L193469k737460n822888l202022
$$ plain form
37544 -515639 -2669964 -5372636 -6452645 -4334593 -1990370 -3260506 -6176817 -5634232
37536 -5634232 -2171803 -1424378 -4389385 -5776214 -4057073 -5156807 -11941498 -17440311
37528 -17440311 -14709879 -7548095 -4153089 -4677922 -3331851 7651 -683236 -6804205
37520 -6804205 -12157916 -12160659 -9169534 -6637248 -4071430 -506694 2184749 2561890 2122110
37511 2122110 1792533 -268356 -4533491 -7356625 -5568961 -1010036 2416787 3588352
37503 3588352 3454577 2463587 1744799 3912768 9019498 12212967 9475507 3652619 450597
$$ [...]
##END NTUPLES=NMR SPECTRUM
##END=
