##TITLE=31Pdec_SR163_k
 DMSO-d6, 64 sc
 9.2.2023
##JCAMPDX= 6.0         $$ Bruker NMR JCAMP-DX V2.0
##DATA TYPE= NMR SPECTRUM
##DATA CLASS= NTUPLES
##ORIGIN= UXNMR, Bruker Analytische Messtechnik GmbH
##OWNER= root
$$ XWIN-NMR		Version 3.5
$$ Thu Feb  9 16:09:52 2023 Russian Standard Time (UT+4h)  she@DPX200
##.OBSERVE FREQUENCY= 81.013821
##.OBSERVE NUCLEUS= ^31P
##.ACQUISITION MODE= SIMULTANEOUS
##.ACQUISITION SCHEME= undefined
##.AVERAGES= 64
##.DIGITISER RES= 16
##SPECTROMETER/DATA SYSTEM= spect
##.PULSE SEQUENCE= zgpg30
##.SOLVENT NAME= CDCl3
##.SHIFT REFERENCE= (INTERNAL, CDCl3, 0, 248.564)
##AUDIT TRAIL= $$ (NUMBER, WHEN, WHO, WHERE, WHAT)
$$ ##TITLE= Audit trail, XWIN-NMR		Version 3.5
$$ ##JCAMPDX= 5.01
$$ ##ORIGIN= Bruker BioSpin GmbH
$$ ##OWNER= she
$$ F:/spectra/data/she/nmr/P31/1/pdata/1/auditp.txt
$$ ##AUDIT TRAIL=  $$ (NUMBER, WHEN, WHO, WHERE, WHAT)
(   1,<2023-02-09 16:08:01.25 +0400>,<she>,<DPX200>,
      <continue with go, POWCHK disabled, PULCHK disabled
       configuration hash MD5:
       00 E9 B6 7A A2 85 ED C7 34 08 36 98 17 FE 4E 26
       data hash MD5: 32K
       17 93 6F DD E7 34 7A 5F 46 62 74 45 7F 04 9A 61>)
(   2,<2023-02-09 16:08:09.70 +0400>,<she>,<DPX200>,
      <Start of raw data processing
       efp BC_mod = 2 LB = 1 FT_mod = 6 PKNL = 1 PHC0 = -10139.45 PHC1 = -2042.588 SI = 64K 
       data hash MD5: 64K
       46 D4 A1 62 7E D7 2C C4 E9 DF AA 0F 36 09 A0 43>)
(   3,<2023-02-09 16:09:12.50 +0400>,<she>,<DPX200>,
      <pk PHC0 = -287.1653 PHC1 = 721.9999 
       data hash MD5: 64K
       34 87 69 E6 1C 57 CC 78 FD 96 45 9E D3 40 74 A5>)
$$ ##END=
$$ 
$$ hash MD5
$$ E0 04 D0 57 AA 2F 2C 16 1D E1 1E D3 D3 08 8D 97
##$RELAX= 
##$RELAX= 
##$RELAX= 
##$RELAX= 
##$RELAX= 
##$RELAX= 
##$RELAX= 
##$RELAX= 
##$RELAX= 
$$ Bruker specific parameters
$$ --------------------------
##$DU= <F:/spectra>
##$EXPNO= 1
##$NAME= <P31>
##$PROCNO= 1
##$TYPE= <nmr>
##$USER= <she>
##$AMP= (0..31)
100 100 100 100 100 100 100 100 100 100 100 100 100 100 100 100 100 100 
100 100 100 100 100 100 100 100 100 100 100 100 100 100 
##$AQSEQ= 0
##$AQ_mod= 1
##$AUNM= <au_zg>
##$AUTOPOS= <>
##$BF1= 81.014009
##$BF2= 200.13
##$BF3= 200.13
##$BF4= 200.13
##$BF5= 200.13
##$BF6= 200.13
##$BF7= 200.13
##$BF8= 200.13
##$BYTORDA= 1
##$CFDGTYP= 0
##$CFRGTYP= 5
##$CHEMSTR= <none>
##$CNST= (0..31)
1 1 145 1 1 1 1 1 1 1 1 1 1 1 1 1 1 1 1 1 1 1 1 1 1 1 1 1 1 1 1 1 
##$CPDPRG= <waltz16>
##$CPDPRG1= <>
##$CPDPRG2= <waltz16>
##$CPDPRG3= <>
##$CPDPRG4= <mlev>
##$CPDPRG5= <mlev>
##$CPDPRG6= <mlev>
##$CPDPRG7= <mlev>
##$CPDPRG8= <mlev>
##$CPDPRGB= <>
##$CPDPRGT= <>
##$D= (0..31)
0 1 0 0 0 0 0 0 0 0 0 0.03 2e-05 3e-06 0 0 0 0 0 0 0 0 0 0 0 0 0 0 0 0 
0 0 
##$DATE= 1675944386
##$DBL= (0..7)
120 120 120 11 120 120 24 19 
##$DBP= (0..7)
150 150 150 150 150 150 150 150 
##$DBP07= 0
##$DBPNAM0= <>
##$DBPNAM1= <>
##$DBPNAM2= <>
##$DBPNAM3= <>
##$DBPNAM4= <>
##$DBPNAM5= <>
##$DBPNAM6= <>
##$DBPNAM7= <>
##$DBPOAL= (0..7)
0.5 0.5 0.5 0.5 0.5 0.5 0.5 0.5 
$$ [...]
##$SUBNAM2= <"">
##$SUBNAM3= <"">
##$SUBNAM4= <"">
##$SUBNAM5= <"">
##$SUBNAM6= <"">
##$SUBNAM7= <"">
##$SUBNAM8= <"">
##$SUBNAM9= <"">
##$SW= 501.771253377433
##$SWIBOX= (0..15)
0 1 3 0 0 0 0 0 0 0 0 0 0 0 0 0 
##$SW_h= 40650.406504065
##$TD= 32768
##$TD0= 1
##$TE= 0
##$TE2= 300
##$TE3= 300
##$TEG= 300
##$TL= (0..7)
0 120 53 12 22 120 120 120 
##$TP= (0..7)
150 150 150 150 150 150 150 150 
##$TP07= 0
##$TPNAME0= <>
##$TPNAME1= <>
##$TPNAME2= <>
##$TPNAME3= <>
##$TPNAME4= <>
##$TPNAME5= <>
##$TPNAME6= <>
##$TPNAME7= <>
##$TPOAL= (0..7)
0.5 0.5 0.5 0.5 0.5 0.5 0.5 0.5 
##$TPOFFS= (0..7)
0 0 0 0 0 0 0 0 
##$TUNHIN= 0
##$TUNHOUT= 0
##$TUNXOUT= 0
##$USERA1= <user>
##$USERA2= <user>
##$USERA3= <user>
##$USERA4= <user>
##$USERA5= <user>
##$V9= 5
##$VALIST= <valist>
##$VCLIST= <CCCCCCCCCCCCCCC>
##$VD= 0
##$VDLIST= <DDDDDDDDDDDDDDD>
##$VPLIST= <PPPPPPPPPPPPPPP>
##$VTLIST= <TTTTTTTTTTTTTTT>
##$WBST= 1024
##$WBSW= 4
##$XGAIN= (0..3)
0 0 0 0 
##$XL= 0
##$YL= 0
##$YMAX_a= 6087
##$YMIN_a= -6037
##$ZGOPTNS= <>
##$ZL1= 120
##$ZL2= 120
##$ZL3= 120
##$ZL4= 120
##$ABSF1= 0
##$ABSF2= 0
##$ABSG= 0
##$ABSL= 0
##$ALPHA= 0
##$AQORDER= 0
##$ASSFAC= 0
##$ASSFACI= 0
##$ASSFACX= 0
##$ASSWID= 0
##$AUNMP= <proc_1d>
##$AZFE= 0.1
##$AZFW= 0.5
##$BCFW= 0
##$BC_mod= 2
##$BYTORDP= 0
##$COROFFS= 0
##$CY= -3
##$DATMOD= 1
##$DC= 0
##$DFILT= <>
##$DTYPP= 0
##$F1P= 0
##$F2P= 0
##$FCOR= 1
##$FTSIZE= 65536
##$FT_mod= 6
##$GAMMA= 0
##$GB= 0
##$INTBC= 1
##$INTSCL= 6.047779e-11
##$ISEN= 30
##$LB= 1
##$LEV0= 0
##$LPBIN= 0
##$MAXI= 10000
##$MC2= 0
##$MEAN= 0
##$ME_mod= 0
##$MI= 50
##$NCOEF= 0
##$NC_proc= -7
##$NLEV= 6
##$NOISF1= 182.463
##$NOISF2= 159.3651
##$NSP= 0
##$NTH_PI= 0
##$NZP= 0
##$OFFSET= 248.5645
##$PC= 4
##$PHC0= -10426.62
##$PHC1= -1320.588
##$PH_mod= 1
##$PKNL= yes
##$PPARMOD= 0
##$PSCAL= 0
##$PSIGN= 0
##$REVERSE= no
##$SF= 81.0140089999694
##$SI= 65536
##$SIGF1= 159.3651
##$SIGF2= -187.1042
##$SINO= 113.3802
##$SIOLD= 16384
##$SREGLST= <1H.CDCl3>
##$SSB= 0
##$STSI= 65536
##$STSR= 0
##$SW_p= 40650.406504065
##$SYMM= 0
##$S_DEV= 0
##$TDeff= 32768
##$TDoff= 0
##$TI= <>
##$TILT= no
##$TM1= 0
##$TM2= 0
##$TOPLEV= 0
##$USERP1= <user>
##$USERP2= <user>
##$USERP3= <user>
##$USERP4= <user>
##$USERP5= <user>
##$WDW= 1
##$XDIM= 65536
##$YMAX_p= 489662788
##$YMIN_p= -58323995
$$ End of Bruker specific parameters
$$ ---------------------------------
##NTUPLES= NMR SPECTRUM
##VAR_NAME=  FREQUENCY,     SPECTRUM/REAL,   SPECTRUM/IMAG
##SYMBOL=    X,             R,               I
##VAR_TYPE=  INDEPENDENT,   DEPENDENT,       DEPENDENT
##VAR_FORM=  AFFN,          ASDF,            ASDF
##VAR_DIM=   65536,         65536,           65536
##UNITS=     HZ,            ARBITRARY UNITS, ARBITRARY UNITS
##FACTOR=    0.620285442955139, 1,           1
##FIRST=     20137.2065510682, 0,            0
##LAST=      -20513.1999529968, 0,           0
##MIN=       -20513.1999529968, -58323995,   0
##MAX=       20137.2065510682, 489662788,    0
$$ Real data points
##PAGE= N=1
##DATA TABLE= (X++(R..R)), XYDATA
$$ [...]
$$ plain form
41720 -1159549 3054533 3478598 735938 -1096585 -304952 132121 -2750907 -7223472 -9018356
41711 -9018356 -6799398 -3266824 -1492483 -2116630 -3854339 -5086693 -5047739 -4588007 -5269166
41702 -5269166 -6753503 -6412809 -3145911 83829 61302 -1863674 -2177957 -1263183 -2654943
41693 -2654943 -6441653 -8415653 -6934367 -5667495 -7316107 -9264822 -8541091 -6795509
41685 -6795509 -6498781 -6032122 -3217152 -612628 -2003476 -5688494 -6624841 -3986901 -1434685
41676 -1434685 -775311 -588193 -667127 -2485866 -5145298 -5998467 -5633239 -7084053 -9606612
41667 -9606612 -8739095 -3658401 997557 2174706 1848864 1697035 130677 -2871348 -3871576
41658 -3871576 -2235445 -2533454 -6626574 -9023326 -5273798 168150 641877 -2443781
$$ packed form
41720a159549M214082M24065k742660j832523P91633M37073k883028m472565j794884
41711i018356K218958L532574J774341o24147j737709j232354L8954M59732o81159
41702e269166j484337L40694L266898L229740k2527j924976l14283R14774j391760
41693b654943l786710j974000J481286J266872j648612j948715P23731J745582
41685f795509K96728M66659K814970K604524j390848l685018r36347K637940K552216
41676a434685O59374J87118p8934j818739k659432q53169L65228j450814k522559
41667i606612Q67517N080694M655958J177149l25842j51829j566358l002025j000228
41658c871576J636131k98009m093120k396752L749528N441948M73727l085658
$$ plain form
41650 -2443781 -3027131 -945860 -1370970 -5108334 -7081811 -4838841 -1979092 -1821259 -3139035
41641 -3139035 -3884407 -4543351 -5746360 -6052277 -4107913 -741785 2181167 3177068 1359427
41632 1359427 -2555461 -5678636 -5767983 -4231234 -3874078 -4410593 -3192305 87519 2556645
41623 2556645 2035547 -736461 -3439698 -3705918 -424876 4292957 6185102 4203382
41615 4203382 2142570 2008021 -213446 -7271598 -13344835 -11196296 -3739868 -85147
41607 -85147 -1687802 -1783786 1626517 2542914 -1337550 -3822252 -1096734 1650869 -453591
41598 -453591 -4090004 -4899287 -5125049 -7600122 -8665581 -4390949 1384522 2555451 7475
41589 7475 -1609127 -2251905 -4272451 -5427689 -2088095 2847784 2979585 -1858421 -5777099
$$ packed form
41650b443781n83350K081271m25110l737364j973477K242970K859749J57833j317776
41641c139035p45372o58944j203009l05917J944364L366128K922952R95901j817641
41632A359427l914888l123175q9347J536749L57156n36515J218288L279824K469126
41623B556645n21098k772008k703237k66220L281042M717833J892145j981720
41615D203382k060812j34549k221467p058152o073237K148539P456428L654721
41607h5147j602655r5984L410303R16397l880464k484702K725518K747603k104460
41598d53591l636413q09283k25762k475073j065459M274632N775471J170929k547976
41589G475j616602o42778k020546j155238L339594M935879J31801m838006l918678
$$ plain form
41580 -5777099 -5789602 -4163646 -2696116 -950659 212119 -883044 -2996002 -3655599 -3508202
41571 -3508202 -4110280 -3447206 444218 3595059 900040 -4839144 -6407534 -3652744
41563 -3652744 -2973441 -5571387 -5592100 -1395188 820993 -2180286 -5061910 -3586198 -2078167
41554 -2078167 -5668143 -11484539 -13582181 -11701187 -9369263 -7348938 -4557651 -2356209
41546 -2356209 -2760630 -4649733 -5800524 -6337761 -6882908 -6331432 -4818473 -5420518 -9226887
41537 -9226887 -12362608 -11915803 -10895407 -12547716 -13689552 -9631108 -2744482 345644
41529 345644 -1695769 -4419304 -5347474 -5888472 -6076140 -3852485 -171149 1014922 -926722
41520 -926722 -2089459 -434025 1424904 1423372 1280133 2231219 1841000 -1793199 -5844243
$$ packed form
41580e777099j2503J625956J467530J745457J162778j095163k112958o59597J47397
41571c508202o02078O63074L891424L150841k695019n739184j568390K754790
41563c652744O79303k597946k0713M196912K216181l001279k881624J475712J508031
41554b078167l589976n816396k097642J880994K331924K020325K791287K201442
41546b356209m04421j889103j150791n37237n45147N51476J512959o02045l806369
41537i226887l135721M46805J020396j652309j141836M058444O886626L090126
41529C45644k041413k723535r28170n40998j87668K223655L681336J186071j941644
41520i26722j162737J655434J858929j532j43239R51086l90219l634199m051044
$$ plain form
41511 -5844243 -6162062 -2962878 -179682 -316336 -2435945 -4602481 -6098667 -7059844 -7368019
41502 -7368019 -6705224 -5503150 -5106541 -6014019 -6114071 -2599869 3453478 6751125 4153768
41493 4153768 -663016 -1954629 298501 1192554 -1335227 -4007974 -3893478 -2283697
41485 -2283697 -1469611 -1338838 -1157504 -1684701 -3259746 -4141034 -2893301 -578815 1118045
41476 1118045 1992752 2018476 311014 -2590880 -3762954 -1809169 204669 -1329830 -5196002
41467 -5196002 -7117534 -5947868 -4618436 -5015716 -5339211 -3466842 -249986 1906283
41459 1906283 1887425 100587 -2566565 -4821298 -5352122 -4413017 -3911393 -4668856 -4791356
41450 -4791356 -2482584 499914 649895 -2052876 -3383341 -528153 3714328 4514026
$$ packed form
41511e844243l17819L199184K783196j36654k119609k166536j496186r61177l08175
41502g368019O62795J202074L96609r07478j00052L514202O053347L297647k597357
41493D153768m816784j291613K253130Q94053k527781k672747J14496J609781
41485b283697Q14086J30773J81334n27197j575045q81288J247733K314486J696860
41476A118045Q74707K5724j707462k901894j172074J953785K013838j534499l866172
41467e196002j921532J169666J329432l97280l23495J872369L216856K156269
41459A906283j8858j786838k667152k254733n30824R39105N01624p57463j22500
41450d791356K308772K982498J49981k702771j330465K855188M242481P99698
$$ plain form
41442 4514026 1416266 -1475583 -1297709 428645 1022945 389367 58268 424007 774110
41433 774110 822643 523013 -611856 -2371997 -3062647 -1655955 154082 -10716 -1794764
41424 -1794764 -2660421 -1267249 1558389 4422903 5834205 4111895 -442639 -4170756
41416 -4170756 -4146308 -2986480 -5521588 -10761940 -12192113 -7385602 -2107018 -1967018 -4745255
41407 -4745255 -5201391 -3568124 -3833243 -6125244 -6931026 -6036564 -7123954 -10695262 -11971451
41398 -11971451 -8005720 -2506565 -757154 -2949943 -5483645 -6386947 -6316802 -5795671 -4607709
41389 -4607709 -3320935 -2857782 -2761784 -1929166 -913564 -1604679 -4507724 -7980749 -10393655
41380 -10393655 -11519379 -11413459 -9543290 -6102407 -3119754 -2753577 -4576294 -5753179
$$ packed form
41442D514026l097760k891849J77874J726354N94300o33578l31099L65739L50103
41433G74110M8533k99630j134869j760141o90650J406692J810037j64798j784048
41424a794764q65657J393172K825638K864514J411302j722310m554534l728117
41416d170756K4448J159828k535108n240352j430173M806511N278584J40000k778237
41407d745255m56136J633267k65119k292001q05782Q94462j087390l571308j276189
41398a1971451L965731N499155J749411k192789k533702r03302P0145N21131J187962
41389d607709J286774M63153R5998Q32618J015602o91115k903045l473025k412906
41380a0393655j125724J05920J870169L440883K982653L66177j822717j176885
$$ plain form
41372 -5753179 -4336398 -1493225 291088 457792 394039 422417 -1133341 -4840006 -8057113
41363 -8057113 -8092545 -6210476 -5712876 -6634321 -5874190 -3089960 -2367501 -5749153 -8718228
41354 -8718228 -6060985 -8959 2265571 -1262746 -4839424 -3496823 243134 885863
41346 885863 -2136037 -4684493 -4309657 -2727209 -2169106 -2339673 -1764746 -240280 947190
41337 947190 331596 -2386486 -5550598 -6541188 -4714771 -2725060 -3264758 -5108647 -4757706
41328 -4757706 -1909019 -329602 -2342914 -5386306 -6066211 -5210773 -5985909 -8463110 -9449118
41319 -9449118 -7474901 -4767267 -3546802 -3040186 -1567083 371855 888755 -456146
41311 -456146 -2222205 -3072038 -3008598 -2797464 -2970647 -3385915 -3439595 -2927622 -2684565 -3638369
$$ packed form
41372e753179J416781K843173J784313J66704o3753K8378j555758l706665l217107
41363h057113l5432J882069M97600r21445P60131K784230P22459l381652k969075
41354h718228K657243O052026K274530l528317l576678J342601L739957O42729
41346H85863l021900k548456L74836J582448N58103j70567N74927J524466J187470
41337I47190o15594k718082l164112r90590J826417J989711n39698j843889L50941
41328d757706K848687J579417k013312l043392o79905Q55438p75136k477201r86008
41319i449118J974217K707634J220465N06616J473103J938938N16900j344901
41311d56146j766059q49833O3440K11134j73183m15268n3680N11973K43057r53804
$$ plain form
41301 -3638369 -5093525 -5022773 -2630006 306506 1270307 -680637 -4795593 -9301572 -11333930
41292 -11333930 -8221632 -948893 5045729 5187016 1213944 -1409177 -990439 -984004 -3520890
41283 -3520890 -5804017 -5152069 -3975767 -6020407 -9877294 -10523748 -6578585 -1929397
41275 -1929397 58066 61661 -405637 -1876832 -4453142 -5565667 -3329865 -344195 -887692
41266 -887692 -4930927 -7747133 -5619225 183868 5368380 6786637 4400874 773100
41258 773100 -851373 756504 3425617 3708409 525710 -4185831 -8200388 -10850928
41250 -10850928 -12033628 -11199906 -8304291 -4638959 -1885111 -1044442 -2454510 -5430110
41242 -5430110 -7505455 -6117773 -2439574 -1602651 -6710221 -13719206 -15207853 -9290377
$$ packed form
41301c638369j455156P0752K392767K936512R63801j950944m114956m505979k032358
41292a1333930L112298P272739N994622J41287l973072k623121M18738O435k536886
41283c520890k283127O51948J176302k044640l856887o46454L945163M649188
41275a929397J987463L595m67298j471195k576310j112525K235802K985670n43497
41266h87692m043235k816206K127908N803093N184512J418257k385763l627774
41258G73100j624473J607877K669113K82792l182699m711541m014557k650540
41250a0850928j182700Q33722K895615L665332K753848Q40669j410068k975600
41242e430110k075345J387682L678199Q36923n107570p008985j488647N917476
$$ plain form
41234 -9290377 -1962350 401029 -1715259 -3253002 -2119731 -1125468 -2620261 -4796934
41226 -4796934 -5162613 -5033111 -7300671 -10827976 -11018940 -6694931 -2686553 -3395906 -6776485
41217 -6776485 -7861303 -6001797 -4572660 -4758231 -4272769 -2239927 -671979 -157815 1290018
41208 1290018 3306844 1771737 -4686141 -10890416 -11657083 -8736263 -6977942 -6730388
41200 -6730388 -5318993 -3722782 -5417736 -9182857 -9412797 -4598736 -23535 -261181
41192 -261181 -3630214 -6076482 -6398533 -5450832 -3937221 -3226495 -4835526 -6983546 -5388689
41183 -5388689 151631 3984793 2325774 -1405286 -2684186 -3017492 -5765715 -8371461
41175 -8371461 -5520124 1365766 4632116 828755 -5310539 -8582540 -9442337 -10031618
$$ packed form
41234i290377P328027K363379k116288j537743J133271R94263j494793k176673
41226d796934l65679J29502k267560l527305j90964M324009M008378p09353l380579
41217f776485j084818J859506J429137j85571M85462K032842J567948N14164J447833
41208A290018K016826j535107o457878o204275p66667K920820J758321K47554
41200f730388J411395J596211j694954l765121k29940M814061M575201k37646
41192b61181l369033k446268l22051R47701J513611P10726j609031k148020J594857
41183e388689N540320L833162j659019l731060j278900l33306k748223k605746
41175h371461K851337O885890L266350l803361o139294l272001q59797n89281
$$ plain form
41167 -10031618 -9011427 -4321142 1729363 4191884 1521970 -2904578 -5146297 -4553548
41159 -4553548 -2991392 -1656059 160621 3017101 5114850 3869949 -164407 -3215260
41151 -3215260 -3353729 -3239669 -5667159 -8796533 -9036939 -6697884 -4767481 -3480479 -808634
41142 -808634 2233649 1920028 -2099192 -5925245 -7457717 -8348532 -8804676 -6063660 -380687
41133 -380687 2960676 1044346 -2077593 -1958119 -278696 -380376 -804313 1132108 2946849
41124 2946849 514220 -4381254 -6308476 -4484824 -2736540 -2426392 -1825208 -1794291 -5089536
41115 -5089536 -9588612 -9326403 -3961135 -459950 -2642647 -5368741 -3008677 1789866
41107 1789866 2781668 -379854 -2634046 -1217194 1869623 3841377 3584994 860610
$$ packed form
41167a0031618J020191M690285O050505K462521k669914m426548k241719N92749
41159d553548J562156J335333J816680K856480K097749j244901m034356l050853
41151c215260j38469J14060k427490l129374k40406K339055J930403J287002K671845
41142h08634L042283l13621m019220l826053j532472q90815m56144K741016N682973
41133c80687L341363j916330l121939J19474J679423j01680m23937J936421J814741
41124B946849k432629m895474j927222J823652J748284L10148O01184L0917l295245
41115e089536m499076K62209N365268L501185k182697k726094K360064M798543
41107A789866R91802l161522k254192J416852L086817J971754k56383k724384
$$ plain form
41099 860610 -3547349 -7113048 -7625148 -5932469 -4921307 -6101966 -8393435 -9569170
41091 -9569170 -8106069 -4751225 -2656652 -4074965 -6695680 -6176061 -2816976 -1607191
41083 -1607191 -4094982 -5276511 -1953774 869224 -2616797 -9071070 -10269839 -5374274
41075 -5374274 -1733099 -3578870 -6828886 -6621214 -4081948 -3060764 -4675695 -7703015
41067 -7703015 -10803359 -12080053 -9608584 -4527954 -827490 -405915 -1225688 -1658561 -3018441
41058 -3018441 -5875666 -7673541 -6642992 -4634167 -3299748 -1169383 2063542 2290272
41050 2290272 -3091245 -9024948 -8450768 -2575027 558836 -2555424 -6984174 -7711726
41042 -7711726 -6011703 -5100775 -4516613 -2503989 -454069 -859833 -2851788 -3482066 -2358198
$$ packed form
41099H60610m407959l565699n12100J692679J011162j180659k291469j175735
41091i569170J463101L354844K094573j418313k620715N19619L359085J209785
41083a607191k487791j181529L322737K822998l486021o454273j198769M895565
41075e374274L641175j845771l250016K07672K539266J021184j614931l027320
41067g703015l100344j276694K471469N080630L700464M21575q19773m32873j359880
41058c018441k857225j797875J030549K008825J334419K130365L232925K26730
41050B290272n381517n933703N74180N875741L133863l114260m428750p27552
41042g711726J700023R10928N84162K012624K049920m05764j991955o30278J123868
$$ plain form
41033 -2358198 -1787013 -2931564 -4692456 -6098066 -7137768 -7236707 -5468423 -2699193 -1271170
41024 -1271170 -1920170 -2992594 -3377428 -4117584 -6055360 -7899017 -8164706 -7350707 -6446772
41015 -6446772 -4953868 -2703381 -2194792 -5838696 -11182517 -12404522 -7531606 -1220466
41007 -1220466 1188159 -187036 -1582669 -1227048 -327579 148784 510576 499233 -793311
40998 -793311 -2925004 -4316317 -4822641 -6008438 -8375669 -10296282 -10351395 -8916888 -6781839
40989 -6781839 -4163423 -2051504 -2436935 -5485662 -8021781 -6958249 -3529044 -2011626
40981 -2011626 -4199706 -6980617 -6244817 -2089857 1241620 615969 -2129951 -2754488 -368274
40972 -368274 1458865 -121350 -3287071 -4591801 -3991535 -4000465 -5051506 -5211111 -4272818
$$ packed form
41033b358198N71185j144551j760892j405610j039702r8939J768284K769230J428023
41024a271170o49000j072424l84834p40156j937776j843657k65689Q13999R03935
41015f446772J492904K250487N08589l643904n343821j222005M872916O311140
41007a220466K408625j375195j395633L55621Q99469M76363L61792j1343j292544
40998g93311k131693j391313n06324j185797k367231j920613n5113J434507K135049
40989f781839K618416K111919l85431l048727k536119J063532L429205J517418
40981b011626k188080k780911P35800M154960L331477o25651k745920o24537K386214
40972c68274J827139j580215l165721j304730O00266q930j051041j59605R38293
$$ plain form
40963 -4272818 -4358345 -5672730 -5308305 -1969022 1217773 837345 -2280390 -4952493 -6026871
40954 -6026871 -6497941 -6929640 -7214367 -7708345 -8475086 -8480436 -7368629 -6712902 -7602982 -8473163
40944 -8473163 -7444418 -5307505 -3838264 -2735400 -1012750 18455 -1474381 -3908544
40936 -3908544 -3658598 -268119 2942609 3690651 3093866 2737943 2359690 1495008 1029675
40927 1029675 1848558 3512905 5002843 5457810 4139827 1411897 -333149 1091647
40919 1091647 4323929 5626941 3748917 1214739 243318 31400 -760331 -1332838 -428863
40910 -428863 998026 780468 -1548985 -4267922 -5535401 -5105977 -4198491 -4040611 -4512448
40901 -4512448 -4598859 -4330228 -4973493 -6396380 -6093251 -2827879 522952 628445 -1259683
$$ packed form
40963d272818q5527j314385L64425L339283L186795l80428l117735k672103j074378
40954f026871m71070m31699k84727m93978p66741n350J111807O55727q90080q70181
40944h473163J028745K136913J469241J102864J722650J031205j492836k434163
40936c908544K49946L390479L210728P48042n96785l55923l78253q64682m65333
40927A029675Q18883J664347J489938M54967j317983k727930j745046J424796
40919A091647L232282J303012j878024k534178r71421k11918p91731n72507R03975
40910d28863J426889k17558k329453k718937j267479M29424R07486J57880m71837
40901d512448q6411K68631o43265j422887L03129L265372L350831J05493j888128
$$ plain form
40892 -1259683 -1513536 -268977 -894723 -3541171 -4242831 -1536850 805094 -361731 -3176493
40883 -3176493 -4594324 -4713535 -4676422 -3912516 -2420802 -2436521 -4703339 -6258481 -5096404
40874 -5096404 -3652738 -4042580 -3530100 481343 4180450 2036606 -4102421 -6857321
40866 -6857321 -3728824 271649 702009 -1287913 -3164123 -4954157 -6912526 -7556332
40858 -7556332 -6400105 -5276520 -4892315 -3223566 618734 3905393 3892810 1374940 -1396020
40849 -1396020 -3836145 -5978443 -6788888 -5973936 -5375612 -6154966 -6570892 -5050140 -3383730
40840 -3383730 -3814069 -4722699 -2967434 386756 768443 -3109512 -6874639 -6304533 -2599431
40831 -2599431 151189 674354 1143441 2984543 4627701 3986635 1526066 -384222 -687455
$$ packed form
40892a259683k53853J244559o25746k646448p01660K705981K341944j166825k814762
40883c176493j417831j19211L7113P63906J491714j5719k266818j555142J162077
40874e096404J443666l89842N12480M011443L699107k143844o139027k754900
40866f857321L128497M000473M30360j989922j876210j790034j958369o43806
40858g556332J156227J123585L84205J668749L842300L286659j2583k517870k770960
40849a396020k440125k142298q10445Q14952N98324p79354m15926J520752J666410
40840c383730m30339r08630J755265L354190L81687l877955l765127N70106L705102
40831b599431K750620N23165M69087J841102J643158o41066k460569j910288l03233
$$ plain form
40822 -687455 -1050885 -3675750 -8338189 -12382948 -13588885 -12248914 -10063880 -7746118
40814 -7746118 -4745802 -1299467 485940 -1308995 -5582072 -8821467 -9159327 -8533671
40806 -8533671 -9403362 -10439808 -8159630 -2861432 431114 -1365013 -4832800 -5095998
40798 -5095998 -2923790 -2647346 -4524264 -4516231 -1873044 -1157967 -4476793 -6984603 -4197651
40789 -4197651 285839 -302501 -5674113 -9051112 -7279989 -4513561 -4865976 -6808570
40781 -6808570 -7306580 -7093737 -8263794 -9598380 -8258227 -4604827 -1742648 -959201 -830042
40772 -830042 -611476 -1370952 -3240812 -4307378 -3403171 -2042958 -2317927 -4217924 -6102708
40763 -6102708 -6707476 -5752310 -3661097 -1731193 -1664440 -3743512 -6015202 -6296612 -4621693
$$ packed form
40822f87455l63430k624865m662439m044759j205937J339971K185034K317762
40814g746118L000316L446335J785407j794935m273077l239395l37860O25656
40806h533671q69691j036446K280178N298198L292546j796127l467787k63198
40798e095998K172208K76444j876918Q033K643187P15077l318826k507810K786952
40789d197651M483490n88340n371612l376999J771123K766428l52415j942594
40781f808570m98010K12843j170057j334586J340153L653400K862179P83447J29159
40772h30042K18566p59476j869860j066566R04207J360213k74969j899997j884784
40763f102708o04768R55166K091213J929904O6753k079072k271690k81410J674919
$$ plain form
40754 -4621693 -2904689 -2607615 -3534867 -4536862 -4564446 -3249040 -1155007 618704 1434782
40745 1434782 1410917 607356 -1209901 -3543132 -4978456 -4893088 -4363826 -4367556 -4213652 -3210386
40735 -3210386 -2769896 -4710766 -7914181 -8990545 -6593973 -3174335 -1876023 -3250309
40727 -3250309 -5625658 -7315665 -7712453 -7247395 -6917365 -7180502 -7208125 -6041448 -4230100
40718 -4230100 -3137709 -3016658 -3341184 -4544625 -7184206 -9547534 -8899288 -5711670 -3816044
40709 -3816044 -5118585 -6847498 -5830178 -3127651 -2087590 -3456186 -4871936 -4381341
40701 -4381341 -2503735 -1181327 -1795568 -3712672 -4511458 -2940015 -1512655 -3679819
40693 -3679819 -8216360 -9991653 -7385541 -4603459 -4409561 -3569690 391799 2790240
$$ packed form
40754d621693J717004K97074r27252j001995k7584J315406K094033J773711Q16078
40745A434782k3865q03561j817257k333231j435324Q5368N29262l730J53904J003266
40735c210386M40490j940870l203415j076364K396572L419638J298312j374286
40727c250309k375349j690007l96788M65058L30030k63137k7623J166677J811348
40718d230100J092391J21051l24526j203441k639581k363328O48246L187618J895626
40709c816044j302541j728913J017320K702527J040061j368596j415750M90595
40701d381341J877606J322408o14241j917104p98786J571443J427360k167164
40693c679819m536541j775293K606112K782082J93898Q39871L961489K398441
$$ plain form
40685 2790240 -1510517 -8285000 -8583976 -2161781 1612856 -2799981 -10149171 -13341881
40677 -13341881 -12656126 -12012855 -11488411 -8865121 -5426629 -4890213 -7671470 -10204203 -9715534
40668 -9715534 -7035571 -4918181 -5325891 -7854693 -9670097 -7909371 -2995334 1671872
40660 1671872 3750579 3735949 2388347 -548805 -3792885 -4058549 -551473 2790741 2171318
40651 2171318 -1306144 -4286274 -5959385 -7113037 -6904398 -4453946 -1912458 -1923347 -3194896
40642 -3194896 -2519719 -246668 401236 -1058855 -1719815 -280070 1486704 2641909 4249686
40633 4249686 5796588 4704018 907977 -2117179 -2883992 -4482632 -8956287 -12800230
40625 -12800230 -11793655 -7530110 -4816434 -4316539 -2522469 1391876 3545081 1470813
$$ packed form
40685B790240m300757o774483k98976O422195L774637m412837p349190l192710
40677a3341881O85755O43271N24444K623290L438492N36416k781257k532733M88669
40668i715534K679963K117390m07710k528802j815404J760726M914037M667206
40660A671872K078707j4630j347602k937152l244080k65664L507076L342214o19423
40651B171318l477462k980130j673111j153652K08639K450452K541488j0889j271549
40642c194896O75177K273051O47904j460091o60960J439745J766774J155205J607777
40633D249686J546902j092570l796041l025156p66813j598640m473655l843943
40625a2800230J006575M263545K713676M99895J794070L914345K153205k074268
$$ plain form
40617 1470813 -1658627 -1447865 1532075 2838026 256676 -4033725 -7274038 -9324312
40609 -9324312 -10913793 -10906972 -7795326 -3246316 -1355747 -3437040 -5771712 -4431658 -862029
40600 -862029 -79490 -3781283 -8118529 -9033002 -7246947 -6283871 -7400568 -8816086 -9124884
40591 -9124884 -8945136 -8845446 -7720358 -4533304 -666480 982226 -710175 -3769636 -5579193
40582 -5579193 -5834653 -6037480 -6503725 -5655572 -3006485 -1158398 -2974659 -7556478 -11138334
40573 -11138334 -11769919 -10837495 -9722905 -7685941 -4359543 -1837315 -1959663 -3139891
40565 -3139891 -2502960 -249716 856065 16298 -473976 842561 2062917 556503 -3594180
40556 -3594180 -7958829 -10305750 -9874496 -7348845 -4528489 -3055668 -2807777 -2569082 -2436901
$$ packed form
40617A470813l129440K10762K979940J305951k581350m290401l240313k050274
40609i324312j589481O821L111646M549010J890569k081293k334672J340054L569629
40600h62029P82539l701793m337246r14473J786055R63076j116697j415518l08798
40591i124884J79748R9690J125088L187054L866824J648706j692401l059461j809557
40582e579193k55460k02827m66245Q48153K649087J848087j816261m581819l581856
40573a1138334o31585R32424J114590K036964L326398K522228j22348j180228
40565c139891O36931K253244J105781q39767m90274J316537J220356j506414m150683
40556c594180m364649k346921M31254K525651K820356J472821K47891K38695J32181
$$ plain form
40547 -2436901 -3622260 -5318190 -4539343 -888998 1206212 -1935290 -7352212 -8916452
40539 -8916452 -5842344 -3560541 -5807220 -9950133 -11631647 -10448918 -8619763 -6720573
40531 -6720573 -3751812 -41465 2595479 3093420 1782835 -511565 -2479660 -2279153
40523 -2279153 729828 4550098 6241179 4845824 1806576 -877728 -2066674 -1897893
40515 -1897893 -1687995 -2590362 -3803119 -3432732 -1630437 -814339 -1821705 -2415300 -1272434
40506 -1272434 -596044 -2213832 -3893599 -2959088 -1090667 -1389946 -2758815 -2099681 -602490
40497 -602490 -2118779 -5718747 -6006451 -1654952 2343140 2569112 1439516 1210449 -225941
40488 -225941 -3834836 -5343220 -1749060 2518434 1750919 -2078286 -2803095 -198285 317739
$$ packed form
40547b436901j185359j695930P78847L650345K095210l141502n416922j564240
40539h916452L074108K281803k246679m142913j681514J182729J829155J899190
40531f720573K968761L710347K636944M97941j310585k294400j968095K00507
40523b279153L008981L820270J691081j395355l039248k684304j188946J68781
40515a897893K09898r02367j212757L70387J802295Q16098j007366n93595J142866
40506a272434O76390j617788j679767R34511J868421k99279j368869O59134J497191
40497f02490j516289l599968k87704M351499L998092K25972j129596k29067j436390
40488b25941l608895j508384L594160M267494p67515l829205p24809K604810N16024
$$ plain form
40479 317739 -2560160 -3581009 436914 5510134 6619101 4413586 2712003 2611355
40471 2611355 2433741 1477431 545786 -421229 -2477133 -5313794 -6766177 -5489409 -3178389
40462 -3178389 -3030406 -5843947 -8529353 -7592514 -3770943 -1429891 -2877114 -5432692
40454 -5432692 -5625029 -4191902 -4316158 -6237107 -6897348 -4861013 -2558791 -2822700 -5414173
40445 -5414173 -7965388 -8701798 -7380303 -4947125 -3122003 -3242218 -4817667 -6013940
40437 -6013940 -5865693 -5134652 -4880566 -5306822 -6253252 -7679338 -9192010 -9923066 -9270312
40428 -9270312 -7327075 -4746289 -2768389 -2787030 -4771789 -6653661 -6691359 -5972015 -6746171
40419 -6746171 -8511595 -8106153 -4356619 -404517 176997 -1856185 -2537767 -131791 2515448
$$ packed form
40479C17739k877899j020849M017923N073220J108967k205515j701583j00648
40471B611355j77614r56310r31645r67015k055904k836661j452383J276768K311020
40462c178389J47983k813541k685406R36839L821571K341052j447223k555578
40454e432692j92337J433127j24256j920949o60241K036335K302222k63909k591473
40445e414173k551215p36410J321495K433178J825122j20215j575449j196273
40437f013940J48247P31041K54086m26256r46430j426086j512672p31056O52754
40428i270312J943237K580786J977900j8641j984759j881872l7698P19344p74156
40419f746171j765424M05442L749534L952102N81514k033182o81582K405976K647239
$$ plain form
40410 2515448 1732823 -2208098 -5579397 -6144170 -5721372 -6831856 -8520766 -7835061 -4671473
40401 -4671473 -2148073 -1849073 -1872738 -838663 -681432 -3247484 -6766363 -8455591 -8503616
40392 -8503616 -8551370 -8249549 -6759275 -5960935 -8119953 -11315834 -11449494 -8602811 -7226921
40383 -7226921 -9568677 -12828430 -13716702 -12132104 -9027975 -4132614 2187936 7342880
40375 7342880 8832124 6710129 2795740 -949655 -2838656 -2361029 -1178459 -1199417 -1652547
40366 -1652547 -660059 477880 -1742883 -7060284 -10379744 -8387400 -3843483 -1339020
40358 -1339020 -1931941 -4088373 -6705549 -8484286 -7159429 -2578000 1527233 1957031
40350 1957031 608395 1565574 4858122 6249750 2917150 -3112875 -7357052 -7333773 -4703837
$$ packed form
40410B515448p82625l940921l371299n64773M22798j110484j688910O85705L163588
40401d671473K523400K99000k3665J034075J57231k566052l518879j689228m8025
40392h503616m7754L01821J490274P98340k159018l195881j33660K846683J375890
40383g226921k341756l259753q88272J584598L104129M895361O320550N154944
40375G342880J489244k121995l914389l745395j889001M77627J182570k0958m53130
40366a652547R92488J137939k220763n317401l319460J992344M543917K504463
40358a339020n92921k156432k617176j778737J324857M581429M105233M29798
40350A957031j348636R57179L292548J391628l332600o030025m244177K3279K629936
$$ plain form
40341 -4703837 -3475379 -5448009 -7724249 -6567648 -3262148 -2752952 -6031407 -8268812
40333 -8268812 -6424418 -4090513 -5320824 -7768680 -6784320 -3430678 -2919822 -6478336
40325 -6478336 -10046492 -10668862 -9362561 -7443099 -4516124 -1044225 902620 736583
40317 736583 222868 221189 -774096 -3799426 -7432629 -9617418 -9652691 -7891843 -5422426
40308 -5422426 -4391247 -6463545 -10295639 -12417135 -11227377 -8451242 -6306661 -5147229
40300 -5147229 -4476917 -4397686 -4984539 -5364888 -4269231 -1083931 3507166 7287632 7686620
40291 7686620 4502645 768063 -620429 -405057 -1345378 -3871829 -5601181 -4927986 -2951723
40282 -2951723 -1751285 -2461723 -4971347 -7977899 -9660253 -9706162 -9905892 -11204225 -11565700
$$ packed form
40341d703837J228458j972630k276240J156601L305500N09196l278455k237405
40333h268812J844394K333905j230311k447856R84360L353642N10856l558514
40325f478336l568156o22370J306301J919462K926975L471899J946845j66037
40317G36583n13715j679r95285l025330l633203k184789l5273J760848K469417
40308e422426J031179k072298l832094k121496J189758K776135K144581J159432
40300e147229O70312P9231n86853l80349J095657L185300M591097L780466L98988
40291G686620l183975l734582j388492K15372r40321k526451j729352O73195J976263
40282b951723J200438p10438k509624l006552j682354m5909j99730j298333l61475
$$ plain form
40273 -11565700 -9080404 -5751236 -5082214 -6852827 -7748637 -6655701 -5604954 -5528967 -5051326
40264 -5051326 -4132193 -5067808 -8515839 -11725400 -12153120 -10137648 -6921383 -2969284 464428
40255 464428 1151248 -892446 -2525108 -1695135 -384823 -1501050 -4646486 -6824033 -6137406
40246 -6137406 -3475511 -1408694 -1926529 -4234513 -5059546 -2731312 -63265 -596189 -3063852
40237 -3063852 -3385425 -1486999 -1275974 -3604482 -4827677 -3732392 -4002272 -7142274 -8771114
40228 -8771114 -5911456 -2736149 -4091764 -7704367 -8475233 -6949309 -7209123 -8819117
40220 -8819117 -7563903 -3185403 -81684 -276776 -1257468 -1265245 -1616977 -2855320 -3228841
40211 -3228841 -2285970 -1988347 -2948343 -3154329 -1734716 -658018 -1318465 -2456264 -2848527
$$ packed form
40273a1565700K485296L329168O69022j770613q95810J092936J050747P5987M77641
40264e051326R19133r35615l448031l209561m27720K015472L216265L952099L433712
40255D64428O86820k043694j632662Q29973J310312j116227l145436k177547O86627
40246f137406K661895K066817n17835k307984q25033K328234K668047n32924k467663
40237c063852l21573J898426K11025k328508j223195J095285k69880l140002j628840
40228h771114K859658L175307j355615l612603p70866J525924k59814j609994
40220h819117J255214M378500L103719j95092r80692p777l51732j238343l73521
40211c228841R42871K97623r59996k05986J419613J076698o60447j137799l92263
$$ plain form
40202 -2848527 -3270529 -4332622 -4871187 -4033236 -2976957 -3190408 -4681540 -6636758 -8358747
40193 -8358747 -9125550 -8662513 -7841348 -7388501 -6465368 -4508441 -3368032 -4700469 -6329836
40184 -6329836 -5017286 -2088316 -1681991 -3644701 -3689612 -1350375 -1432585 -5179495 -6526807
40175 -6526807 -1597302 3688808 1600330 -5690528 -9260746 -6251601 -2499433 -2638149
40167 -2638149 -4291341 -3678278 -1422905 4392 595036 1312320 907324 -2457868 -7523601
40158 -7523601 -10588316 -9785066 -6962621 -5039104 -4671654 -4314732 -3146311 -2640259 -4213408
40149 -4213408 -6179579 -5310703 -1786006 41514 -2683547 -7349057 -9854355 -10186199
40141 -10186199 -10773953 -11292584 -9567951 -6844440 -7067178 -10220047 -11319180 -7981970
$$ packed form
40202b848527m22002j062093n38565Q37951J056279k13451j491132j955218j721989
40193h358747p66803M63037Q21165M52847R23133J956927J140409j332437j629367
40184f329836J312550K928970M06325j962710m4911K339237q2210l746910j347312
40175f526807M929505N286110k088478p290858l570218L009145L752168j38716
40167b638149j653192O13063K255373J427297N90644P17284m04996l365192n065733
40158g523601l064715Q03250K822445J923517L67450L56922J168421N06052j573149
40149d213408j966171Q68876L524697J827520k725061m665510k505298l31844
40141a0186199n87754n18631J724633K723511k22738l152869j099133L337210
$$ plain form
40133 -7981970 -4508051 -5405540 -8636772 -9261363 -7049549 -5874701 -6994800 -7742564 -6825110
40124 -6825110 -6426242 -7821452 -8570809 -6225674 -2450420 -1128089 -3533737 -7194855
40116 -7194855 -8924675 -7665742 -4717913 -2174712 -1076446 -724931 -15816 751460 285126
40107 285126 -1520212 -3080867 -3095780 -1720276 586839 3752630 6859295 8035717 6995687
40098 6995687 6158680 7482093 9471478 9430524 7642931 6820638 7944843 9382368 10160100
40089 10160100 11350096 13567281 15565521 16189637 15441225 12826051 7426070 1046637
40081 1046637 -1699268 1071838 5311891 6282360 4777971 4399910 4422300 525901 -7191011
40072 -7191011 -12144247 -9447895 -2421246 1940491 1339514 -1033685 -2121710 -1904910
$$ packed form
40133g981970L473919q97489l231232o24591K211814J174848j120099p47764R17454
40124f825110L98868j395210p49357K345135L775254J322331k405648l661118
40116g194855j729820J258933K947829K543201J098266L51515P09115P67276m66334
40107B85126j805338j560655j4913J375504K307115L165791L106665J176422j040030
40098F995687q37007J323413J989385m0954j787593q22293J124205J437525P77732
40089A0160100J189996K217185J998240O24116p48412k615174n399981o379433
40081A046637k745905K771106M240053R70469j504389l78061K2390l896399p716912
40072g191011m953236K696352P026649M361737o00977k373199j088025K16800
$$ plain form
40064 -1904910 -1419094 -1151298 -1746947 -3855861 -6607413 -8050901 -7735118 -7297998 -7860391
40055 -7860391 -8337515 -7246732 -4917232 -2767493 -1413811 -884632 -1922612 -5106408
40047 -5106408 -8578031 -8731225 -4436872 779561 2547496 845791 -807604 -1040249
40039 -1040249 -2369659 -6047632 -8407350 -5547762 262153 2979496 1188394 -121367
40031 -121367 3067781 8869256 13886785 18535802 24550408 30015464 31059367 27197100
40023 27197100 21337144 15460948 9927743 6155816 5676804 6563424 5268231 2729794
40015 2729794 3988038 9990917 14420995 11804462 5053459 1063083 1600308 2936056
40007 2936056 2652728 1933978 1518733 8982 -2898796 -5074078 -5138141 -4279180 -3641821
$$ packed form
40064a904910M85816K67796n95649k108914k751552j443488L15783M37120n62393
40055g860391m77124J090783K329500K149739J353682N29179j037980l183796
40047e106408l471623j53194M294353N216433J767935j701705j653395k32645
40039a040249j329410l677973k359718K859588N809915K717343j791102j309761
40031a21367L189148N801475N017529M649017O014606N465056J043903l862267
40023B7197100n859956n876196n533205l771927m79012Q86620j295193k538437
40015B729794J258244O002879M430078k616533o751003l990376N37225J335748
40007B936056k83328p18750m15245j509751k907778k175282o4063Q58961O37359
$$ plain form
39998 -3641821 -2200852 1319016 5895461 8646780 7050491 991418 -5911093 -7909970
39990 -7909970 -2890159 3813911 4854586 315533 -2505903 226844 3571739 2052481
39982 2052481 -1805411 -2169873 511744 924790 -1835977 -3088606 -869074 838878
39974 838878 -1083928 -4120770 -4718990 -3337153 -1990955 -515523 1315408 1005110 -3395774
39965 -3395774 -9085944 -11180323 -8442376 -3415529 1815320 6767925 10509976 12042145
39957 12042145 12730994 15563615 21864688 30805296 41371271 51983023 58790541 57987945
39949 57987945 50489706 41479738 34693012 29733481 25332950 21873510 19399113 16282161
39941 16282161 11967383 8762290 8784888 10849072 12263897 12171274 11281241 9808909 7719961
$$ packed form
39998c641821J440969L519868M576445K751319j596289o059073o902511j998877
39990g909970N019811O704070J040675m539053k821436K732747L344895j519258
39982B052481l857892l64462K681617M13046k760767j252629K219532J707952
39974H38878j922806l036842n98220J381837J346198J475432J830931l10298m400884
39965c395774n690170k094379K737947N026847N230849M952605L742051J532169
39957A2042145O88849K832621O301073Q940608J0565975J0611752O807518q02596
39949E7987945p498239r009968o786726m959531m400531l459440k474397l116952
39941A6282161m314778l205093K2598K064184J414825r2623q90033j472332k088948
$$ plain form
39932 7719961 5906572 5144956 4710063 3794029 3472331 5320567 8506758 10112878 8450924
39923 8450924 4817371 1847498 920828 1180360 710686 -1148532 -2836226 -2695186 -1532557
39914 -1532557 -1259526 -1294816 785769 4379013 5118800 1036196 -3674807 -3971792 -469907
39905 -469907 2802888 4916991 7987719 11768047 12874192 9615625 3998292 -1246004
39897 -1246004 -4336218 -3429593 1975777 8120296 9587643 6064207 2848101 3388080
39889 3388080 5223794 5104920 4039755 4422920 5615953 5818346 5671631 6420229 6608313
39880 6608313 4417609 1827568 2478230 5950341 7841498 5705568 1863702 -173385
39872 -173385 445894 2251915 3554141 3450895 2166457 878014 337522 -72327 -884379
$$ packed form
39932G719961j813389p61616m34893r16034l21698J848236L186191J606120j661954
39923H450924l633553k969873r26670K59532m69674j859218j687694J41040J162629
39914a532557K73031l5290K080585L593244P39787m082604m711003k96985L501885
39905d69907L272795K114103L070728L780328J106145l258567n617333n244296
39897a246004l090214R06625N405370O144519J467347l523436l216106N39979
39889C388080J835714j18874j065165L83165J193033K02393j46715P48598J88084
39880F608313k190704k590041O50662L472111J891157k135930l841866k037087
39872a73385O19279J806021J302226j03246j284438j288443n40492m09849q12052
$$ plain form
39863 -884379 -993094 695627 2708516 2324243 -581608 -3093320 -2970978 -1045881 425050
39854 425050 157375 -1746077 -4144988 -5114633 -3310311 293270 3153797 4043509 4048709
39845 4048709 4455919 5064288 5217724 5255874 5970067 7213018 7688137 5906925 1480921
39836 1480921 -3847134 -6738732 -5114391 -774255 1946724 702440 -2466608 -3791809
39828 -3791809 -2194096 -314651 -1209832 -4579478 -6917632 -5640020 -2147619 447151
39820 447151 1824255 4170960 7295185 7534865 3423120 -880312 -1142792 521826 -899495
39811 -899495 -5115516 -6966476 -4771512 -2689189 -3420595 -3759266 -225747 4995384 7423261
39802 7423261 6829328 6645589 8409247 10236475 10170814 8319480 5867877 3849040 2559371
$$ packed form
39863h84379j08715J688721K012889l84273k905851k511712J22342J925097J470931
39854D25050k67675j903452k398911r69645J804322L603581K860527Q89712N200
39845D048709M07210O08369J53436L8150P14193J242951M75119j781212m426004
39836A480921n328055k891598J624341M340136K720979j244284l169048j325201
39828c791809J597713J879445q95181l369646k338154J277612L492401K594770
39820D47151J377104K346705L124225K39680m111745m303432k62480J664618j421321
39811h99495m216021j850960K194964K082323p31406l38671L533519N221131K427877
39802G423261n93933j83739J763658J827228o5661j851334k451603k018837j289669
$$ plain form
39793 2559371 957280 -2420948 -6714976 -8392949 -5488000 -881375 832195 -1123660
39785 -1123660 -3508770 -3807538 -2884384 -2869335 -4241734 -5500739 -4844323 -2117944 494519
39776 494519 310527 -2875437 -6567019 -8640011 -9156601 -8666245 -6935129 -4598219 -3711320
39767 -3711320 -4730119 -5055704 -2810047 23325 844630 771616 2471098 5229795 5852118
39758 5852118 3668554 1206012 339148 860705 2207771 3459264 2556628 -893794 -3121961
39749 -3121961 -810242 2731157 1367086 -4016714 -5759338 -918834 3952298 2617818
39741 2617818 -2146329 -4115237 -2945448 -2423561 -3003369 -2289122 -986947 -2205405 -5319597
39732 -5319597 -6096774 -3435919 -1201680 -2291340 -4938755 -6234003 -5748981 -4098648
$$ packed form
39793B559371j602091l378228m294028j677973K904949M606625J713570j955855
39785a123660k385110k98768R23154J5049j372399j259005O56416K726379K612463
39776D94519j83992l185964l691582k072992n16590M90356J731116K336910Q86899
39767c711320j018799l25585K245657K833372Q21305p3014J699482K758697O22323
39758E852118k183564k462542q66864N21557J347066J251493r02636l450422k228167
39749c121961K311719L541399j364071n383800j742624M840504M871132j334480
39741B617818m764147j968908J169789N21887n79808P14247J302175j218458l114192
39732e319597p77177K660855K234239j089660k647415j295248M85022J650333
$$ plain form
39724 -4098648 -1049144 2992771 5975724 6526635 5541075 4209605 2393903 194306
39716 194306 -1056487 -1044561 -1680642 -3981608 -5522258 -3579965 327693 1913084 -158052
39707 -158052 -2678595 -2394902 223381 2515321 2976544 1857183 -148127 -2352476 -3970276
39698 -3970276 -4731671 -5158068 -5545334 -5512930 -5318669 -6263554 -8263033 -8353670 -4138301
39689 -4138301 1841642 4207374 1661463 -1217907 -363104 2502888 3092297 577118
39681 577118 -2489912 -4578513 -6292864 -7929382 -8942642 -9467377 -9745006 -8589861 -5209677
39672 -5209677 -1865080 -1389163 -2498849 -1412913 1891591 3437937 1944390 952470
39664 952470 2585134 4064410 3187888 2553173 4445604 5682390 2488696 -2611946 -4218493
$$ packed form
39724d098648L049504M041915K982953N50911r85560j331470j815702k199597
39716A94306j250793J1926o36081k300966j540650J942293L907658J585391k071136
39707a58052k520543K83693K618283K291940M61223j119361k005310k204349j617800
39698c970276p61395m26397l87266L2404J94261r44885j999479r0637M215369
39689d138301N979943K365732k545911k879370Q54803K865992N89409k515179
39681E77118l067030k088601j714351j636518j013260n24735k77629J155145L380184
39672e209677L344597M75917j109686J085936L304504J546346j493547r91920
39664I52470J632664J479276q76522o34715J892431J236786l193694n100642j606547
$$ plain form
39655 -4218493 -2169447 -516645 116560 2714141 6492598 6077494 -10619 -5767636
39647 -5767636 -5796016 -2605271 -2038815 -4625126 -5902832 -3845182 -1561719 -2140627 -4008863
39638 -4008863 -3207358 1050439 5077324 5352463 3038493 2195278 4003693 5429440 4447531
39629 4447531 3429337 4818552 6185157 3521259 -2097027 -5570054 -4935899 -2965085
39621 -2965085 -1503641 979282 4998955 7662964 6772039 3899652 1498373 25543
39613 25543 -504555 497799 1945723 1371868 -620969 -119042 3487965 4907618 423728
39604 423728 -5882559 -7625728 -4689637 -1785955 -1109483 -1325042 -1818172 -2765994 -2247102
39595 -2247102 1567983 5964465 6352246 3196795 1498937 3111408 4290657 1910337
$$ packed form
39655d218493K049046J652802O33205K597581L778457m15104o088113n757017
39647e767636k8380L190745N66456k586311j277706K057650K283463n78908j868236
39638d008863Q01505M257797M026885K75139k313970q43215J808415J425747r81909
39629D447531j018194J389215J366605k663898n618286l473027O34155J970814
39621b965085J461444K482923M019673K664009q90925k872387k401279j472830
39613B5543n30098J002354J447924n73855j992837N01927L607007J419653m483890
39604D23728o306287j743169K936091K903682O76472k15559m93130r47822N18892
39595b247102L815085M396482L87781l155451j697858J612471J179249k380320
$$ plain form
39587 1910337 -2001654 -3471283 -1388793 1965581 3042446 -336729 -6120066 -8582933
39579 -8582933 -4715183 1082296 2334946 -841228 -2994517 -1972195 -568555 -98756
39571 -98756 1114445 2347374 483583 -3205992 -3460558 -361305 -571710 -5891417 -8738376
39562 -8738376 -4305186 679400 -1375216 -6261516 -4974543 1580175 4849517 2686612
39554 2686612 863330 1486923 34366 -4998482 -8666999 -8216150 -7291372 -8616636 -9491159
39545 -9491159 -7847199 -6302909 -6395913 -4662862 1204692 7301066 9061844 7588629
39537 7588629 6107057 4261084 724881 -2139716 -1546467 420663 -77214 -2248064
39529 -2248064 -2405712 -473357 327375 -759826 -1624080 -2148732 -4399380 -7688881 -8314691
$$ packed form
39587A910337l911991j469629K082490L354374J076865l379175n783337k462867
39579h582933L867750N797479J252650l176174k153289J022322J403640M69799
39571i8756J213201J232929j863791l689575k54566L099253k10405n319707k846959
39562h738376M433190M984586k054616m886300J286973O554718L269342k162905
39554B686612j823282O23593j452557n032848l668517M50849R24778j325264q74523
39545i491159J643960J544290r3004J733051N867554O096374J760778j473215
39537G588629j481572j845973l536203k864597N93249J967130m97877k170850
39529b248064j57648J932355Q00732j087201q64254n24652k250648l289501o25810
$$ plain form
39520 -8314691 -5302700 -2164664 -1468914 -1511683 -272153 859164 -73871 -1682252 -1179173
39511 -1179173 1279402 2965961 2509729 988333 -621222 -2697033 -5182468 -6545281
39503 -6545281 -5816865 -4464497 -4518390 -5233032 -3623814 1067708 5408415 5922166 3752050
39494 3752050 2764857 3798345 3900092 1592150 -369212 952379 4329650 6044016
39486 6044016 4268817 240922 -3300349 -3470430 942885 7216733 10157722 7790170
39478 7790170 3711117 1842563 1282456 -814838 -3629613 -3855935 -1140888 1647129
39470 1647129 2935330 3401639 2793850 -141621 -4191395 -5961352 -4575894 -2823288
39462 -2823288 -2597946 -2307533 -142405 2833284 4454980 4242791 3107505 2024451 1936581
$$ packed form
39520h314691L011991L138036O95750m2769J239530J131317r33035j608381N03079
39511a179173K458575J686559m56232j521396j609555k075811k485435j362813
39503f545281P28416J352368n3893p14642J609218M691522M340707N13751k170116
39494C752050r87193J033488J01747k307942j961362J321591L377271J714366
39486F044016j775199m027895l541271j70081M413315O273848K940989k367552
39478G790170m079053j868554n60107k097294k814775k26322K715047K788017
39470A647129J288201M66309o07789k935471m049774j769957J385458J752606
39462b823288K25342K90413K165128K975689J621696k12189j135286j083054q7870
$$ plain form
39453 1936581 3277655 4906140 5211512 4649717 5223369 7187994 8591100 8544799 8489838
39444 8489838 9425882 10175946 9299094 6774764 3230938 -478999 -2631612 -1835664 862848
39435 862848 3323178 5459503 8152172 9619826 7076531 2263528 583514 3458376
39427 3458376 6204784 5304631 3015579 2290161 1937744 247429 -899570 482764 2526941
39418 2526941 3036372 3535670 5625687 6693610 4030005 336658 60796 2555112 3888710
39409 3888710 3270443 2440751 819488 -2818019 -5399698 -2822267 2317329 2798093 -2824202
39400 -2824202 -7966376 -7429995 -3461619 -589458 507165 1524914 2960112 4368508
39392 4368508 5217753 4144791 446867 -3095918 -2809160 -207843 -780326 -5355695 -7926153
$$ packed form
39453A936581J341074J628485L05372n61795N73652J964625J403106m6301n4961
39444H489838R36044P50064q76852k524330l543826l709937k152613P95948K698512
39435H62848K460330K136325K692669J467654k543295m813003j680014K874862
39427C458376K746408r00153k289052p25418l52417j690315j146999J382334K044177
39418B526941N09431M99298K090017J067923k663605l693347k75862K494316J333598
39409C888710o18267q29692j621263l637507k581679K577431N139596M80764n622295
39400b824202n142174N36381L968376K872161J096623J017749J435198J408396
39392D368508Q49245j072962l697924l542785K86758K601317n72483m575369k570458
$$ plain form
39383 -7926153 -4600276 382087 1292666 -808202 -1075496 1044139 1891269 88190 -1926647
39374 -1926647 -2553004 -3183908 -5090206 -6995009 -6762294 -4019645 -482602 1735172 2145046
39365 2145046 2324786 3711255 5223959 4607531 2045223 267993 696960 1856894 2268278
39356 2268278 2327289 2391739 1777659 890170 1416848 2856479 2060809 -1607284 -3936811
39347 -3936811 -1679123 2200662 2779335 440081 -389284 1505344 2715727 1206350
39339 1206350 -396280 1041445 4495981 6180405 4322980 1092543 35968 2280145
39331 2280145 5467761 6500818 4936440 2942753 2325250 2993474 4154072 5088276 4562481
39322 4562481 1683006 -2039704 -3610771 -2187914 349665 2763465 5445509 7489915
$$ packed form
39383g926153L325877M982363R10579k100868k67294K119635Q47130j803079k014837
39374a926647o26357o30904j906298j904803K32715K742649L537043K217774M09874
39365B145046J79740J386469J512704o16428k562308j777230M28967J159934M11384
39356B268278N9011O4450o14080q87489N26678J439631p95670l668093k329527
39347c936811K257688L879785N78673k339254q29365J894628J210383j509377
39339A206350j602630J437725L454536J684424j857425l230437j056575K244177
39331B280145L187616J033057j564378j993687o17503O68224J160598R34204n25795
39322D562481k879475l722710j571067J422857K537579K413800K682044K044406
$$ plain form
39314 7489915 6615123 3629942 2994733 6342091 9205447 7579824 4336048 4952262 9530980
39305 9530980 13593242 14871275 14633670 13554339 11049920 8267816 7314616 7463995 6072229
39296 6072229 3444894 3009376 6106723 9994521 11759999 11337597 10058744 8932258
39288 8932258 9013632 11041163 13997841 15902907 16255434 16011518 15576076 14955105 15340052
39279 15340052 17919038 21261455 22428899 20828595 18870292 18880249 21219689 24917740
39271 24917740 28095834 28421151 25309508 21060296 18059581 16262116 15368171 16994726
39263 16994726 21373564 24303328 21894153 16846405 15287423 18399798 22066514 23989974
39255 23989974 25764398 28071406 29438322 30362451 33309466 37616118 39497850 38330933
$$ packed form
39314G489915q74792k985181o35209L347358K863356j625623l243776O16214M578718
39305I530980M062262J278033k37605j079331k504419k782104r53200J49379j391766
39296F072229k627335m35518L097347L887798J765478m22402j278853j126486
39288H932258Q1374K027531K956678J905066L52527k43916m35442o20971L84947
39279A5340052K578986L342417J167444j600304j958303R957K339440L698051
39271B4917740L178094L25317l111643m249212l000715j797465q93945J626555
39263A6994726M378838K929764k409175n047748j558982L112375L666716J923460
39255B3989974J774424K307008J366916R24129K947015M306652J881732j166917
$$ plain form
39247 38330933 38028518 40924880 45176956 49561062 55884838 65133398 76082265 89014926
39239 89014926 105547158 123561789 138567936 152203610 172901036 205269955 245367673
39232 245367673 289381544 338408226 388231467 421779605 421466518 386928745 334119149
39225 334119149 279507017 231220609 192181592 163080959 141461997 123621127 108438487
39218 108438487 96223188 85331905 74176447 64952885 60645250 59591405 57636169
39211 57636169 54300772 51955846 50272561 47006897 43600436 44289333 49325953 54152707
39203 54152707 56009294 56977414 59854042 65014890 71859224 79659720 86822510 93029849
39195 93029849 102028050 118321529 141180133 166090785 192212565 224193324 266466526
$$ packed form
39247C8330933l02415K896362M252076M384106O323776R248560J0948867J2932661
39239H9014926J6532232J8014631J5006147J3635674K0697426L2368919M0097718
39232B45367673M4013871M9026682M9823241L3548138l13087l4537773n2809596
39225C34119149n4612132m8286408l9039017k9100633k1618962j7840870j5182640
39218A08438487j2215299j0891283j1155458r223562m307635j053845j955236
39211E7636169l335397k344926j683285l265664l406461O88897N036620M826754
39203E4152707J856587R68120K876628N160848O844334P800496P162790O207339
39195I3029849Q998201J6293479K2858604K4910652K6121780L1980759M2273202
$$ plain form
39188 266466526 319580864 380773854 441582142 484394587 489662788 452299691 388197502
39181 388197502 321218792 265557491 221644271 184434604 151381831 124086101 105509464
39174 105509464 95644447 89640085 82067533 73124286 67474835 66314051 64703845 58912100
39166 58912100 52497740 51510936 56066630 60524941 60977656 59065197 58294828 59364982
39158 59364982 60246545 59409432 57400638 55131456 51882249 46556853 40626030 37392028
39150 37392028 37354480 36955161 33905350 31009159 31624632 33868452 33541761 31085557 30817303
39141 30817303 34067694 37961403 40788657 43628593 46255733 46259048 43181207 39339646
39133 39339646 35828691 31770698 27812217 25850115 25072929 23234373 21940077 24784443
$$ packed form
39188B66466526N3114338O1192990O0808288M2812445N268201l7363097o4102189
39181C88197502o6978710n5661301m3913220l7209667l3052773k7295730j8576637
39174A05509464r865017o004362p572552q943247n649451j160784j610206n791745
39166E8912100o414360r86804M555694M458311M52715j912459p70369J070154
39158E9364982Q81563q37113k008794k269182l249207n325396n930823l234002
39150C7392028l7548l99319l049811k896191O15473K243820l26691k456204k68254
39141C0817303L250391L893709K827254K839936K627140L315l077841l841561
39133C9339646l510955m057993l958481j962102p77186j838556j294296K844366
$$ plain form
39125 24784443 29766179 30466367 26324558 24339966 27805236 31016031 29420155 27623731
39117 27623731 31469814 38434008 42647160 44528089 48436654 54594353 60169814 65177215
39109 65177215 70504065 72849247 68686833 61389210 57616320 57996108 58016913 57153034 60213289
39100 60213289 69443130 81254254 91236482 97231977 97408035 90704912 79842359 69233279
39092 69233279 59573619 48798447 37960981 30944153 28152105 25747258 21818898 18322572
39084 18322572 16172045 13565266 10456244 9776843 12437661 15302570 15710345 14156190
39076 14156190 11348844 6863946 2176651 730508 3007585 5238583 4828447 3550391
39068 3550391 3737836 4938739 6087318 7418559 8396720 7221493 4277602 2762542
$$ packed form
39125B4784443M981736P00188m141809j984592L465270L210795j595876j796424
39117B7623731L846083O964194M213152J880929L908565O157699N575461N007401
39109F5177215N326850K345182m162414p297623l772890L79788K0805q63879L060255
39100F0213289R229841J1811124R982228N995495J76058o703123j0862553j0609080
39092F9233279r659660j0775172j0837466p016828k792048k404847l928360l496326
39084A8322572k150527k606779l109022o79401K660818K864909M07775j554155
39076A4156190k807346m484898m687295j446143K277077K230998m10136j278056
39068C550391J87445J200903J148579J331241R78161j175227k943891j515060
$$ plain form
39060 2762542 4142771 6302150 7676540 9424532 11823062 12791616 12289043 13777414
39052 13777414 18387358 21984118 21643007 20848819 23839277 28613855 31064196 33210095
39044 33210095 40776714 53270996 62576676 62545562 55455200 47462999 41376713 36001534
39036 36001534 30010163 23885932 18823792 15374171 13314255 12307882 12304838 12919437 12745479
39027 12745479 10517129 7159977 5115193 4942281 4349490 1812450 -604146 45166
39019 45166 3210543 5357382 4532505 2577083 2540214 5153881 8419458 10068212 9676471
39010 9676471 8048329 5206538 690662 -3685104 -3859274 1328276 6812479 6547704
39002 6547704 1278297 -2626371 -1826694 666852 1348710 943454 1576241 3043754 4123142
$$ packed form
39060B762542J380229K159379J374390J747992K398530R68554n02573J488371
39052A3777414M609944L596760l41111p94188K990458M774578K450341K145899
39044C3210095P566619J2494282R305680l1114p090362p992201o086286n375179
39036C6001534n991371o124231n062140l449621k059916j006373l044O14599j73958
39027A2745479k228350l357152k044784j72912n92791k537040k416596O49312
39019D5166L165377K146839q24877j955422l6869K613667L265577J648754l91741
39010I676471j628142k841791m515876m375766j74170N187550N484203k64775
39002F547704n269407l904668P99677K493546O81858m05256O32787J467513J079388
$$ plain form
38993 4123142 4619162 4261769 2417742 342181 453471 2004289 1388078 -1589274 -2459849
38984 -2459849 305987 1589566 -2534270 -8010763 -8864184 -5957692 -3984512 -3163064
38976 -3163064 -486826 3084339 3699199 1966510 2584722 6562664 9796699 9880691 8788761
38967 8788761 8089422 6850836 5317283 5497402 6693738 5265084 489083 -3714474
38959 -3714474 -4490301 -3323299 -2286839 -1465750 -1601045 -4440351 -8285951 -8064657 -2778889
38950 -2778889 1559670 -176931 -5462646 -8908595 -9851218 -10664218 -10899328 -8574367 -5380988
38941 -5380988 -5106001 -7399132 -8004566 -5518661 -3640067 -5576143 -9523869 -11224474
38933 -11224474 -8822299 -3942226 476205 2346848 1447301 -908289 -3419378 -5828917
$$ packed form
38993D123142M96020l57393j844027k075561J11290J550818o16211k977352q70575
38984b459849K765836J283579m123836n476493q53421K906492J973180Q21448
38976c163064K676238L571165O14860j732689O18212L977942L234035Q3992j091930
38967H788761o99339j238586j533553J80119J196336j428654m776001m203557
38959c714474p75827J167002J036460Q21089j35295k839306l845600K21294N285768
38950b778889M338559j736601n285715l445949r42623q13000k35110K324961L193379
38941e380988K74987k293131o05434K485905J878594j936076l947726j700605
38933a1224474K402175M880073M418431J870643q99547k355590k511089k409539
$$ plain form
38925 -5828917 -8032460 -9045273 -7958731 -5295143 -2229288 997982 4677595 8106427
38917 8106427 9718915 8612450 5211929 897824 -2396687 -3116664 -1611352 -45872
38909 -45872 -34865 -1253204 -2886015 -4734019 -5796167 -3975214 575287 3638519 1536707
38900 1536707 -3390010 -5208737 -2159227 1307769 900667 -2190121 -3813700 -2310982
38892 -2310982 456749 1970567 1066141 -1989988 -5747477 -8283737 -8879514 -8702539 -8987732
38883 -8987732 -9131277 -7742460 -5196625 -3674586 -4348160 -5727850 -5648553 -4192766 -3462744
38874 -3462744 -4492778 -5669996 -5002084 -3077149 -2471763 -4447222 -7524272 -9414770
38866 -9414770 -9088041 -6755979 -3383383 -793692 -633061 -2285925 -3343587 -3080848 -3467950
$$ packed form
38925e828917k203543j012813J086542K663588L065855L227270L679613L428832
38917H106427J612488j106465l400521m314105l294511p19977J505312J565480
38909d5872J1007j218339j632811j848004j062148J820953M550501L063232k101812
38900A536707m926717j818727L049510L466996m07102l090788j623579J502718
38892b310982K767731J513818r04426l056129l757489k536260n95777J76975k85193
38883h987732j43545J388817K545835J522039o73574j379690P9297J455787P30022
38874c462744j030034j177218O67912J924935O05386j975459l077050j890498
38866i414770L26729K332062L372596K589691J60631j652864j057662K62739l87102
$$ plain form
38857 -3467950 -5255621 -5531576 -1921281 2811372 4068932 2103423 1108909 2061327 1397169
38848 1397169 -2300527 -5354811 -4922720 -3220198 -2693422 -1357172 2671847 5666498
38840 5666498 2981699 -2888038 -5016292 -2055525 501751 -634113 -2377572 -1772949
38832 -1772949 -872548 -2082034 -3405534 -2164910 106079 414388 -803953 -1341508 -1382361
38823 -1382361 -2163200 -2588537 -1241506 34735 -1094972 -2620381 -953393 2394038
38815 2394038 2264015 -1927231 -4948258 -3969850 -2693488 -4790733 -7825218 -7262134 -3295708
38806 -3295708 79534 764388 -129834 -1385101 -2959176 -4634675 -5749380 -6131267 -5871962
38797 -5871962 -4768585 -3191981 -2525668 -3323242 -3924087 -2403936 655817 2572708 1435733
$$ packed form
38857c467950j787671k75955L610295M732653J257560j965509r94514R52418o64158
38848A397169l697696l054284M32091J702522N26776J336250M029019K994651
38840E666498k684799n869737k128254K960767K557276j135864j743459O04623
38832a772949R00401j209486j323500J240624K270989L08309j218341n37555m0853
38823a382361p80839m25337J347031J276241j129707j525409J666988L347431
38815B394038j30023m191246l021027R78408J276362k097245l034485N63084L966426
38806c295708L375242O84854q94222j255267j574075j675499j114705l81887K59305
38797e871962J103377J576604O66313p97574o00845J520151L059753J916891j136975
$$ plain form
38788 1435733 -2032486 -5018235 -4967477 -2294356 -381865 -1413343 -3027849 -1706175
38780 -1706175 1287626 1289116 -2313992 -4806816 -3666406 -2187100 -3020217 -3398179 -795546
38771 -795546 1617231 518797 -782978 2381536 7065741 6337103 321972 -3871842
38763 -3871842 -2961012 -804267 -211553 1092186 4149438 5267008 2250200 -1413700
38755 -1413700 -2304048 -2308244 -4381055 -7305456 -8688248 -9476520 -11258695 -12227987 -10255925
38746 -10255925 -7395567 -6802421 -7285733 -5670075 -3050149 -3551231 -7209373 -9026209
38738 -9026209 -6024850 -1308224 310888 -2271333 -6723056 -10292966 -10920587 -7591245
38730 -7591245 -1841527 2168587 1173579 -3696540 -8224847 -9812358 -9522325 -9173754 -8158970
$$ packed form
38788A435733l468219k985749N0758K673121J912491j031478j614506J321674
38780a706175K993801J490l603108k492824J140410J479306q33117l77962K602633
38771g95546K412777j098434j301775L164514M684205p28638o015131m193814
38763c871842R10830K156745N92714J303739L057252J117570l016808l663900
38755a413700q90348m196k072811k924401j382792p88272j782175r69292J972062
38746a0255925K860358N93146m83312J615658K619926n01082l658142j816836
38738i026209L001359M716626J619112k582221m451723l569910o27621L329342
38730g591245N749718M010114r95008m870119m528307j587511K90033L48571J014784
$$ plain form
38721 -8158970 -4885069 -539294 1227414 -908059 -3826892 -4159219 -2432856 -947883
38713 -947883 193666 1713488 1739758 -1756824 -5829975 -4881287 1253337 6314609 6011214
38704 6011214 2628397 -595706 -4373758 -9189663 -11132277 -7133416 -1238688 -62822
38696 -62822 -3620198 -5962279 -4140452 -1264321 -360104 -172948 1317095 3047278 2780649
38687 2780649 435924 -2447967 -4933369 -6698254 -6975850 -5183391 -2479428 -1594829
38679 -1594829 -4359608 -9180257 -11662450 -8988489 -3506681 -215856 -575762 -1322081
38671 -1322081 -163636 685958 -1121016 -3347786 -2448096 560234 1694168 410479
38663 410479 71059 2094799 3828802 3104441 1311273 517862 458891 73154 -232676
$$ packed form
38721h158970L273901M345775J766708k135473k918833l32327J726363J484973
38713i47883J141549J519822K6270l496582m073151R48688O134624N061272l03395
38704F011214l382817l224103l778052m815905j942614L998861N894728J175866
38696f2822l557376k342081J821827K876131R04217J87156J490043J730183k66629
38687B780649k344725k883891k485402j764885k77596J792459K703963Q84599
38679a594829k764779m820649k482193K673961N481808L290825l59906p46319
38671a322081J158445Q49594j806974k226770Q99690L008330J133934j283689
38663D10479l39420K023740J734003p24361j793168p93411n8971l85737l05830
$$ plain form
38654 -232676 369326 1404819 1976191 2268995 2943477 3814057 4094623 3467232 2341992
38645 2341992 1376216 860027 301819 -1026309 -2734379 -3310129 -2190680 -783684 -399106
38636 -399106 -439093 -4446 228955 -356369 -417727 1029801 1766838 -896746 -5257569
38627 -5257569 -6622361 -3598960 341775 1929137 1480457 671430 218362 737137 2715775
38618 2715775 4351492 2484392 -2754735 -7159713 -8024606 -7449171 -7916761 -7884249 -5198834
38609 -5198834 -2310378 -3523754 -7958866 -9854407 -6608532 -2572114 -2825006 -6049057
38601 -6049057 -6635543 -2671839 1506590 1379122 -1824828 -3333961 -1532034 480706
38593 480706 117503 -968058 -71800 1950916 1926938 -895961 -4039246 -5353566 -4970953
$$ packed form
38654b32676O02002J035493N71372K92804O74482Q70580K80566o27391j125240
38645B341992r65776n16189n58208j328128j708070n75750J119449J406996L84578
38636c99106l9987M34647K33401n85324o1358J447528P37037k663584m360823
38627e257569j364792L023401L940735J587362m48680q09027m53068N18775J978638
38618B715775J635717j867100n239127m404978q64893N75435m67590L2512K685415
38609e198834K888456j213376m435112j895541L245875M036418k52892l224051
38601f049057n86486L963704M178429j27468l203950j509133J801927K012740
38593D80706l63203j085561Q96258K022716k3978k822899l143285j314320L82613
$$ plain form
38584 -4970953 -3795343 -2372721 -1432594 -1402676 -1181656 493637 2392428 2029318 -56716
38575 -56716 -148613 3357828 7140218 7134848 3430854 -815999 -3459817 -4283382 -3445887
38566 -3445887 -1522779 -321239 -1285553 -3183493 -3291528 -1107216 687288 -457718
38558 -457718 -3752477 -6036991 -5617889 -4276540 -4913772 -7573891 -9063555 -7133901 -3706999
38549 -3706999 -2355182 -3454664 -4122148 -2867651 -1722774 -2802230 -4945438 -5470316
38541 -5470316 -3925557 -2262621 -1829205 -1849071 -1079250 150381 347539 -806985 -1348743
38532 -1348743 728392 4175166 5019582 1381040 -3662284 -5634757 -4004356 -2006426
38524 -2006426 -1970478 -3159903 -3955213 -3864922 -3266456 -3108283 -4843446 -8751178 -12499867
$$ packed form
38584d970953J175610J422622R40127K9918K21020J675293J898791l63110k086034
38575e6716r1897L506441L782390n370l703994m246853k643818q23565Q37495
38566c445887J923108J201540r64314j897940j08035K184312J794504j145006
38558d57718l294759k284514M19102J341349o37232k660119j489664J929654L426902
38549c706999J351817j099482o67484J254497J144877j079456k143208n24878
38541e470316J544759J662936M33416j9866P69821J229631J97158j154524n41758
38532a348743K077135L446774Q44416l638542n043324j972473J630401J997930
38524b006426L5948j189425p95310R0291N98466J58173j735163l907732l748689
$$ plain form
38515 -12499867 -13345300 -11403916 -8683608 -5724240 -2105986 402520 -996518 -5513095
38507 -5513095 -8904444 -8902890 -7175485 -5444972 -3608980 -2581562 -4505405 -8223640 -8788151
38498 -8788151 -4109551 1582970 3693856 3139160 3167750 3700366 2640173 324326 -1063650
38489 -1063650 -755409 855920 3575660 5743732 4048466 -1473244 -5078897 -2276027
38481 -2276027 3182590 4020998 -610452 -5047651 -5907321 -5513642 -6469493 -7902074 -8167096
38472 -8167096 -7222795 -5200704 -2007612 826563 1130009 -355986 -500841 1527778 3244260
38463 3244260 3099077 2378508 1958136 648573 -1734950 -2867173 -1497599 15658 -1065422
38454 -1065422 -3970703 -5801780 -5446895 -4257848 -3598923 -3231390 -2071297 -56869 765840
$$ packed form
38515a2499867q45433J941384K720308K959368L618254K508506j399038m516577
38507e513095l391349J554J727405J730513J835992J027418j923843l718235n64511
38498h788151M678600N692521K110886n54696K8590N32616j060193k315847j387976
38489a063650L08241J611329K719740K168072j695266n521710l605653K802870
38481b276027N458617Q38408m631450m437199q59670L93679r55851j432581k65022
38472h167096R44301K022091L193092K834175L03446j485995j44855K028619J716482
38463C244260j45183p20569m20372j309563k383523j132223J369574J513257j081080
38454a065422k905281j831077L54885J189047O58925L67533J160093K014428Q22709
$$ plain form
38445 765840 -2226234 -8658529 -14132363 -14614368 -11190666 -8351293 -8163904 -8719945 -8052162
38436 -8052162 -6607277 -5418997 -4563250 -4181243 -4698861 -5327619 -4496590 -2350693 -754596
38427 -754596 -459250 -483289 -566864 -1729063 -3893414 -5400265 -5386793 -4376429 -2483448
38418 -2483448 180000 1458988 -821674 -4399534 -4278965 -7472 3044165 1447296
38410 1447296 -1635880 -2156340 -1229591 -1823467 -2927123 -1432057 2329618 4984555 4701475
38401 4701475 2178485 -1344796 -3994512 -3091585 1403742 4878649 3158688 -1701069
38393 -1701069 -4344228 -3504514 -2460977 -3097819 -3905300 -3729113 -3369626 -3106216 -2225175
38384 -2225175 -1273359 -1419477 -1683080 -534387 -3452 -3576243 -9556214 -11701534 -8050785
$$ packed form
38445G65840k992074o432295n473834m82005L423702K839373J87389n56041O67783
38436h052162J444885J188280Q55747L82007n17618o28758Q31029K145897J596097
38427g54596K95346k4039q3575j162199k164351j506851J3472J010364J892981
38418b483448K663448J278988k280662l577860J20569M271493L051637j596869
38410A447296l083176n20460R26749n93876j103656J495066L761675K654937k83080
38401D701475k522990l523281k649716R02927M495327L474907j719961m859757
38393a701069k643159Q39714J043537o36842q07481J76187L59487K63410Q81041
38384b225175R51816j46118k63603J148693N30935l572791n979971k145320L650749
$$ plain form
38375 -8050785 -3997987 -4083696 -5766791 -5029765 -3525944 -4991140 -7822670 -7211966 -3176671
38366 -3176671 -660610 -1833591 -3659067 -3789194 -3794533 -4961128 -5587577 -4944768 -5717709
38357 -5717709 -9100879 -11008390 -7625773 -2372771 -2129701 -7324441 -11121610 -9140446
38349 -9140446 -4759659 -2630352 -1783985 930551 4213696 4287816 1650910 351015 802209
38340 802209 -1138215 -6667824 -10744952 -8934333 -3399352 1172845 3974332 6382952
38332 6382952 7027847 3854493 -472232 -904014 2255026 3199512 -859037 -5930889 -7666937
38323 -7666937 -6813168 -5707631 -3835487 -683694 597295 -2770729 -7625455 -8344611
38315 -8344611 -5005836 -3218112 -5734188 -8933914 -8823668 -6345787 -4631739 -4347855
$$ packed form
38375h050785M052798q5709j683095P37026J503821j465196k831530O10704M035295
38366c176671K516061j172981j825476j30127n339j166595o26449O42809p72941
38357e717709l383170j907511L382617N253002K43070n194740l797169J981164
38349i140446M380787K129307Q46367K714536L283145P4120k636906j299895M51194
38340H02209j940424n529609m077128J810619N534981M572197K801487K408620
38332F382952O44895l173354m326725m31782L159040R44486m058549n071852j736048
38323g666937Q53769J105537J872144L151793J280989l368024m854726p19156
38315h344611L338775J787724k516076l199726J10246K477881J714048K83884
$$ plain form
38307 -4347855 -4466982 -5261509 -7569106 -10417683 -12021198 -12433365 -13010766 -13733372 -13105470
38298 -13105470 -10538037 -7092221 -3976051 -1860315 -1443956 -2865972 -4428747 -3738714
38290 -3738714 -698229 2087439 2457681 872472 -1130463 -2994703 -4479928 -4415445 -2043065
38281 -2043065 952163 1689091 -334836 -2271420 -1101176 2990965 6820521 7221805
38273 7221805 3692896 -1285127 -4312695 -4099338 -2688896 -3057607 -5456904 -7240432
38265 -7240432 -6655859 -5235993 -5190474 -5813191 -4596716 -1329664 1317094 1434648 -262390
38256 -262390 -2733561 -6032967 -9049873 -8774644 -4693485 -1795254 -5217035 -12495669
38248 -12495669 -15299999 -9664231 -827530 3723271 2746439 345119 -704104 -1285342
$$ packed form
38307d347855j19127p94527k307597k848577j603515m12167n77401p22606O27902
38298a3105470K567433L445816L116170K115736M16359j422016j562775O90033
38290c738714L040485K785668L70242j585209k002935j864240j485225O4483K372380
38281b043065K995228P36928k023927j936584J170244M092141L829556M01284
38273G221805l528909m978023l027568K13357J410442l68711k399297j783528
38265g240432N84573J419866M5519o22717J216475L267052K646758J17554j697038
38256b62390k471171l299406l016906K75229M081159K898231l421781p278634
38248a2495669k804330N635768Q836701M550801r76832k401320j049223n81238
$$ plain form
38240 -1285342 -2858053 -5419938 -8554018 -11941584 -14429278 -14555283 -12600503 -10730128
38232 -10730128 -10564005 -11515179 -11777146 -10251790 -7498005 -5315286 -5106206 -6242677 -6760659
38223 -6760659 -6059667 -5555910 -5879274 -5400721 -3296768 -2122979 -4595463 -9043760 -11103426
38214 -11103426 -9296667 -5988420 -3357242 -1666518 -1242392 -2504837 -3660012 -1972873
38206 -1972873 1824064 3779020 2333895 293660 103942 762549 873609 1054785 1444308
38197 1444308 529421 -1393847 -1455696 599405 677475 -2935968 -5485410 -2777263 1711361
38188 1711361 2138978 -706441 -2029574 -2008090 -4781252 -9585103 -10722741 -7090674 -4411385
38179 -4411385 -6034688 -8197478 -7264973 -5571379 -6293404 -7718438 -6919624 -4853451 -3364199
$$ packed form
38240a285342j572711k561885l134080l387566k487694j26005J954780J870375
38232a0730128J66123r51174k61967J525356K753785K182719K09080j136471n17982
38223f760659P00992N03757l23364M78553K103953J173789k472484m448297k059666
38214a1103426J806759L308247K631178J690724M24126j262445j155175J687139
38206a972873L796937J954956j445125k040235j89718O58607J11060J81176L89523
38197A444308r14887j923268o1849K055101P8070l613443k549442K708147M488624
38188A711361M27617k845419j323133K1484k773162m803851j137638L632067K679289
38179d411385j623303k162790R32505J693594p22025j425034P98814K066173J489252
$$ plain form
38170 -3364199 -952160 3554416 6363821 3418448 -2249109 -3634728 460837 4176356
38162 4176356 3321263 301960 -882642 -141119 376881 199329 257242 630578 716268
38153 716268 540794 402571 5165 -1089662 -2897153 -5358632 -8154315 -9835988 -8749111
38144 -8749111 -5614165 -3562089 -4360689 -6007481 -5608527 -3460723 -2299865 -3110647 -3868922
38135 -3868922 -2657430 -219220 1266085 685755 -1410678 -3722805 -5030031 -4926192
38127 -4926192 -4372985 -4856697 -6493556 -7694417 -7128030 -5115930 -2697717 -645181 -106183
38118 -106183 -2457558 -6960547 -10076177 -9174666 -5799340 -3133675 -1624316 38768
38110 38768 1020247 -449771 -2432068 -769841 3850831 5362199 1005845 -4258759 -5278046
$$ packed form
38170c364199K412039M506576K809405k945373n667557j385619M095565L715519
38162D176356q55093l019303j184602P41523N18000j77552N7913L73336Q5690
38153G16268j75474j38223l97406j094827j807491k461479k795683j681673J086877
38144h749111L134946K052076p98600j646792L98954K147804J160858q10782p58275
38135c868922J211492K438210J485305n80330k096433k312127j307226J03839
38127d926192N53207m83712j636859j200861N66387K012100K418213K052536N38998
38118a06183k351375m502989l115630R01511L375326K665665J509359J663084
38110C8768R81479j470018j982297J662227M620672J511368m356354n264604j019287
$$ plain form
38101 -5278046 -4061553 -5078411 -7076797 -5522935 -972323 1339495 -316473 -2319595
38093 -2319595 -2468587 -3067051 -5898741 -8961023 -10141538 -10150531 -9874949 -8487814 -6189909
38084 -6189909 -5287055 -6224202 -5858389 -2387215 930377 104472 -3763130 -6235136 -5645610
38075 -5645610 -4348158 -4611873 -5962233 -6521464 -5202103 -2644242 -956858 -1873812 -4342514
38066 -4342514 -5062530 -2455996 1106681 2213634 374789 -2156492 -3457499 -3543641 -3646967
38057 -3646967 -4837871 -6738374 -7270292 -4810519 -802173 1352880 270073 -2400258
38049 -2400258 -5043408 -7532690 -9002980 -7414385 -3078365 233109 6205 -1491412
38041 -1491412 -789979 1785567 3346951 2920685 1838894 852357 -357748 -1399759 -1258728
$$ packed form
38101e278046J216493j016858j998386J553862M550612K311818j655968k003122
38093b319595j48992n98464k831690l062282j180515q993K75582J387135K297905
38084f189909R02854r37147L65813L471174L317592q25905l867602k472006N89526
38075e645610J297452k63715j350360n59231J319361K557861J687384r16954k468702
38066d342514p20016K606534L562677J106953j838845k531281j301007q6142j03326
38057c646967j190904j900503n31918K459773M008346K155053j082807k670331
38049b400258k643150k489282j470290J588595M336020L311474k26904j497617
38041a491412P01433K575546J561384m26266j081791r86537j210105j042011J41031
$$ plain form
38032 -1258728 88485 1726572 2940027 3165542 1845158 -530546 -2435103 -3265106
38024 -3265106 -3720766 -3672420 -2173378 -480254 -1629635 -5221902 -6479646 -3320899 -474478
38015 -474478 -2704194 -7577757 -9787483 -9474304 -10421216 -12256746 -11110912 -7182985 -4998155
38006 -4998155 -5779865 -5801506 -3423096 -1849668 -3010910 -4042251 -2318326 526255 2066281
37997 2066281 2559965 2665862 1578269 -258905 -399741 1350788 1894431 406733 396112
37988 396112 3027614 3316998 -2207554 -8200517 -7022403 -88476 3850700 931426
37980 931426 -3665663 -4382763 -2305016 -1456882 -2598564 -3615063 -3306567 -2173518 -1026037
37971 -1026037 -633740 -1588731 -3411197 -4973809 -6311433 -8276218 -9981860 -9111122 -5949879
$$ packed form
38032a258728J347213J638087J213455K25515j320384k375704j904557q30003
38024c265106m55660M8346J499042J693124j149381l592267j257744L158747K846421
38015d74478k229716m873563k209726L13179r46912j835530J145834L927927K184830
38006d998155p81710k1641K378410J573428j161242j031341J723925K844581J540026
37997B066281M93684J05897j087593j837174j40836J750529N43643j487698j0621
37988C96112K631502K89384n524552n992963J178114O933927L939176k919274
37980I31426m597089p17100K077747Q48134j141682j016499L08496J133049J147481
37971a026037L92297r54991j822466j562612j337624j964785j705642Q70738L161243
$$ plain form
37962 -5949879 -4394821 -6741999 -9726542 -8709072 -4331861 -1600608 -2859761 -5169320
37954 -5169320 -5107731 -3014991 -1360655 -1592743 -3947522 -7816142 -10605582 -8785253 -2401466
37945 -2401466 3568603 4923823 3315183 2798849 3551383 2886871 743839 -673459 -1795774
37936 -1795774 -4769580 -7676575 -5776599 192567 3223682 59948 -4219210 -5210439
37928 -5210439 -6211594 -10628503 -13364092 -7792496 2392812 7162565 4488450 1943853
37920 1943853 3886497 5847761 3833219 1121124 1683320 3120085 1126516 -3364947
37912 -3364947 -6324306 -6866827 -7012282 -7374467 -6947833 -5691923 -4101136 -1433448 2823486
37903 2823486 6728894 7582262 5188731 1798789 -240888 393298 3577218 6938294
$$ packed form
37962e949879J555058k347178k984543J017470M377211K731253j259153k309559
37954e169320O1589K092740J654336k32088k354779l868620k789440J820329O383787
37945b401466N970069J355220j608640n16334P52534o64512k143032j417298j122315
37936a795774k973806k906995J899976N969166L031115l163734m279158r91229
37928e210439j001155m416909k735589N571596J0185308M769753k674115k544597
37920A943853J942644J961264k014542k712095N62196J436765j993569m491463
37912c364947k959359n42521j45455l62185M26634J255910J590787K667688M256934
37903B823486L905408Q53368k393531l389942k039677O34186L183920L361076
$$ plain form
37895 6938294 7185720 3900990 413992 -636975 -774679 -2854232 -6521782 -8763777
37887 -8763777 -7882521 -4913922 -1812821 208888 1107435 1776589 2760996 2987559 1189515
37878 1189515 -1394345 -2021339 -520919 349753 -689545 -1835617 -2102046 -3193837 -5551443
37869 -5551443 -6188938 -3305295 86879 340817 -1671317 -2890579 -3205821 -4791775 -8145001
37860 -8145001 -11887099 -14738743 -15040796 -10856033 -3727916 514858 -1341846 -4845172
37852 -4845172 -4093322 -259267 1382209 469782 1054814 3335701 3109728 -70551 -1183693
37843 -1183693 1873779 4239896 1261368 -5111781 -10004451 -11615437 -10734445 -7971898
37835 -7971898 -4522376 -2773851 -3394963 -4195474 -3915329 -4346763 -6578658 -8199385 -6880030
$$ packed form
37895F938294K47426l284730l486998j050967j37704k079553l667550k241995
37887h763777Q81256K968599L101101K021709Q98547O69154R84407K26563j798044
37878A189515k583860o26994J500420Q70672j039298j146072k66429j091791k357606
37869e551443o37495K883643L392174K53938k012134j219262l15242j585954l353226
37860h145001l742098k851644l02053M184763P128117M242774j856704l503326
37852d845172P51850L834055J641476r12427N85032K280887k25973l180279j113142
37843a183693L057472K366117k978528o373149m892670j610986Q80992K762547
37835g971898L449522J748525o21112q00511K80145m31434k231895j620727J319355
$$ plain form
37826 -6880030 -4038249 -2207558 -1292937 -279130 -137829 -1700341 -2709557 -688534
37818 -688534 2537120 2774404 -657899 -4091894 -4326501 -1754683 1005270 1368547 -1759461
37809 -1759461 -6460581 -8377851 -5385427 -1178785 -1314861 -5816737 -8957986 -7009643
37801 -7009643 -2855568 -1176015 -1865248 -1109669 2386651 5413964 4712939 1064181 -2100693
37792 -2100693 -2734769 -1630307 -761169 -1505422 -3996254 -6771814 -7283665 -4448602 -825317
37783 -825317 -240802 -2607275 -3433241 49885 4639233 5393069 2096090 -1576732 -3779433
37774 -3779433 -5571560 -7086101 -6893994 -5392288 -4699967 -4509372 -2275113 1323646 1732134
37765 1732134 -2486702 -6464697 -5994805 -3705573 -4303994 -7019530 -7612137 -5641010 -4487651
$$ packed form
37826f880030K841781J830691R14621J013807J41301j562512j009216K021023
37818f88534L225654K37284l432303l433995k34607K571818K759953L63277l128008
37809a759461m701120j917270K992424M206642j36076m501876l141249J948343
37801g009643M154075J679553o89233P55579L496320L027313p01025l648758l164874
37792b100693o34076J104462Q69138p44253k490832k775560n11851K835063L623285
37783h25317N84515k366473q25966L483126M589348P53836l296979l672822k202701
37774c779433j792127j514541J92107J501706O92321J90595K234259L598759M08488
37765A732134m218836l977995M69892K289232n98421k715536n92607J971127J153359
$$ plain form
37756 -4487651 -5064987 -4531121 -1555844 1301141 1348719 -1188796 -4496683 -6898334 -6932087
37747 -6932087 -4312669 -1281270 -806544 -3169991 -6064184 -7509144 -6622520 -2854885
37739 -2854885 2273623 3849151 -1556338 -9704118 -12125894 -6747275 -485228 460292
37731 460292 -1798922 -1888627 351133 727485 -2415138 -6477790 -8741415 -8658455 -6539972
37722 -6539972 -3105122 -330983 -99934 -1587844 -1965159 -160958 1595257 613672 -2761384
37713 -2761384 -5145858 -3625169 832701 4119464 3823526 2231703 2663497 3951757
37705 3951757 2034660 -2992074 -5910318 -4163308 -2029363 -3607196 -5656335 -2608766
37697 -2608766 3666656 5242840 -754656 -7885285 -8795006 -3721633 1532007 2972409
$$ packed form
37756d487651n77336N33866K975277K856985M7578k537515l307887k401651l3753
37747f932087K619418L031399M74726k363447k894193j444960Q86624L767635
37739b854885N128508J575528n405489q147780k421776N378619O262047R45520
37731D60292k259214q9705K239760L76352l142623m062652k263625Q2960K118483
37722f539972L434850K774139K31049j487910l77315J804201J756215r81585l375056
37713b761384k384474J520689M457870L286763k95938j591823M31794J288260
37705C951757j917097n026734k918244J747010K133945j577833k049139L047569
37697b608766O275422J576184n997496p130629r09721N073373N253640J440402
$$ plain form
37689 2972409 1161007 -1474994 -3315691 -3808642 -2866874 -860678 871667 302372 -3064021
37680 -3064021 -6180147 -4989175 -144249 2535222 -334786 -4472112 -3957569 -58215
37672 -58215 974340 -2432423 -5562993 -5535902 -4955040 -5955227 -6376940 -4588819 -3099481
37663 -3099481 -3931572 -4612745 -2511145 470843 1468333 1682833 3586849 5788887 5159809
37654 5159809 2066710 -810246 -3081909 -5717261 -7209176 -5512968 -2766779 -3069600
37646 -3069600 -5855523 -6363468 -3006425 425721 835969 -213305 -58291 1179685 1956944
37637 1956944 1728478 612685 -1045462 -2000317 -1357295 -762449 -2489802 -5172659 -4910729
37628 -4910729 -1216876 1881271 1696347 -34624 -1332018 -3103232 -5841060 -7106628
$$ packed form
37689B972409j811402k636001j840697m92951R41768K006196J732345n69295l366393
37680c064021l116126J190972M844926K679471k870008m137326N14543L899354
37672e8215J032555l406763l130570K7091N80862j000187m21713J788121J489338
37663c099481q32091o81173K101600K981988R97490K14500J904016K202038o29078
37654E159809l093099k876956k271663k635352j491915J696208K746189l02821
37646c069600k785923n07945L357043L432146M10248j049274J55014J237976P77259
37637A956944k28466j115793j658147r54855O43022N94846j727353k682857K61930
37628d910729L693853L098147j84924j730971j297394j771214k737828j265568
$$ plain form
37620 -7106628 -5391135 -3363015 -3970590 -5823823 -5734867 -3701446 -2007128 -1124874 57681
37611 57681 1177204 832012 -698655 -1997029 -3035405 -4566620 -5781596 -5224239 -3462485
37602 -3462485 -2336189 -2004172 -1118051 414424 1062628 -117062 -2655985 -5577297 -7602974
37593 -7602974 -7451584 -5665338 -4868014 -6223975 -7243832 -5622818 -3496630 -4514528
37585 -4514528 -7989737 -9865460 -8855754 -7537983 -7418906 -7144876 -6222737 -6385478 -7984734
37576 -7984734 -8764377 -7824949 -7328696 -8351825 -8366012 -5329570 -1529841 -549807 -2380773
37567 -2380773 -4150190 -4156452 -2820314 -992550 423898 313268 -1121363 -1737874 -268692
37558 -268692 1409051 754237 -1918825 -4487632 -6265296 -7662063 -7712454 -5063187 -1188179
$$ packed form
37620g106628J715493K028120o07575j853233Q8956K033421J694318Q82254J182555
37611E7681J119523l45192j530667j298374j038376j531215j214976N57357J761754
37602c462485J126296L32017Q86121J532475O48204j179690k538923k921312k025677
37593g602974J51390J786246P97324j355961j019857J621014K126188j017898
37585d514528l475209j875723J009706J317771J19077K74030R22139j62741j599256
37576g984734p79643R39428M96253j023129j4187L036442L799729R80034j830966
37567b380773j769417o262J336138J827764J416448j10630j434631o16511J469182
37558b68692J677743o54814k673062k568807j777664j396767n0391K649267L875008
$$ plain form
37549 -1188179 420723 -1240276 -3486238 -3834166 -2741914 -1691334 -923496 -386854 -852939
37540 -852939 -2330133 -2961789 -1503267 235737 -405616 -2982834 -4549012 -4024419 -3361519
37531 -3361519 -3814265 -3842794 -2386090 -1682038 -3909061 -6618862 -5370366 -727114 1568063
37522 1568063 -1286117 -4893150 -4299690 -1465114 -1887252 -5880540 -8280058 -6384753
37514 -6384753 -3081730 -1134944 759959 3978880 6231471 5146992 2599120 1841925
37506 1841925 2470485 1932719 464606 467802 1687942 1149005 -1776336 -3895166 -2788219
37497 -2788219 109307 2166730 2658659 1951853 145188 -1802004 -1790621 550572 2415150
37488 2415150 1340852 -1137530 -1539785 798537 3226947 3458417 1584123 -1237635
$$ packed form
37549a188179J608902j660999k245962l47928J092252J050580P67838N36642m66085
37540h52939j477194o31656J458522J739004o41353k577218j566178N24593O62900
37531c361519m52746k8529J456704P04052k227023k709801J248496M643252K295177
37522A568063k854180l607033N93460K834576m22138l993288k399518J895305
37514f384753L303023J946786J894903L218921K252591j084479k547872p57195
37506A841925O28560n37766j468113L196J220140n38937k925341k118830J106947
37497b788219K897526K057423M91929p06806j806665j947192J1383K341193J864578
37488B415150j074298k478382m02255K338322K428410K31470j874294k821758
$$ plain form
37480 -1237635 -3845777 -4820022 -3498887 -1769581 -2600035 -5795691 -7329577 -4476190
37472 -4476190 154204 1853586 -101380 -2231236 -2372492 -2432887 -4565206 -7014126 -6089821
37463 -6089821 -1443469 2840214 2757020 -1410030 -5963050 -7819741 -6793699 -4517158
37455 -4517158 -2454600 -1362320 -1690571 -3321029 -4949096 -4858514 -2894905 -896930 -437240
37446 -437240 -888391 -768981 -237208 -579735 -1590100 -1662947 -906843 -1767778 -5179259
37437 -5179259 -8126938 -7143608 -2913641 848002 2184369 2117527 1633109 253897 -2062913
37428 -2062913 -4132263 -5462012 -6895434 -8503386 -8911177 -7830573 -7194786 -8195738
37420 -8195738 -9004534 -7449633 -4603054 -3409922 -4534159 -5899928 -6067235 -5707773 -5430293
$$ packed form
37480a237635k608142r74245J321135J729306q30454l195656j533886K853387
37472d476190M630394J699382j954966k129856j41256o0395k132319k448920R24305
37463f089821M646352M283683q3194m167050m553020j856691J026042K276541
37455d517158K062558J092280l28251j630458j628067R0582J963609J997975M59690
37446d37240m51151J19410N31773l42527j010365p2847P56104q60935l411481
37437e179259k947679R83330M229967L761643J336367o6842m84418j379212k316810
37428b062913k069350j329749j433422j607952m07791J080604O35787j000952
37420h195738q08796J554901K846579J193132j124237j365769j67307L59462K77480
$$ plain form
37411 -5430293 -4363523 -1957160 329730 473089 -1660681 -4239608 -5394443 -4541895
37403 -4541895 -2307501 -34106 758643 -736102 -3879007 -6929126 -8267964 -7370360
37395 -7370360 -4963959 -2648540 -2079110 -3680591 -5839736 -6021936 -3317283 485956
37387 485956 2924465 3408604 2852528 1451763 -1388883 -4897015 -6839711 -6446553 -5483727
37378 -5483727 -5233038 -4574030 -2915024 -2584816 -5124744 -7071686 -3834281 2747373 5550683
37369 5550683 1755786 -3386585 -4303084 -2136394 -972547 -1091174 -391279 314758 -1354453
37360 -1354453 -4047495 -3935251 -1134585 72189 -1778105 -2889602 -633938 1835840
37352 1835840 430384 -3576486 -5817256 -5503083 -5713510 -7392591 -7147011 -2652418 2531184
$$ packed form
37411e430293J066770K406363K286890J43359k133770k578927j154835Q52548
37403d541895K234394K273395P92749j494745l142905l050119j338838Q97604
37395g370360K406401K315419N69430j601481k159145j82200K704653L803239
37387D85956K438509M84139n56076j400765k840646l508132j942696L93158R62826
37378e483727K50689O59008J659006L30208k539928j946942L237405O581654K803310
37369E550683l794897n142371r16499K166690J163847j18627O99895P06037j669211
37360a354453k693042J12244K800666J206774j850294j111497K255664K469778
37352A835840j405456m006870k240770L14173k10427j679081K45580M494593N183602
$$ plain form
37343 2531184 2484076 -3333121 -8641311 -7756369 -2484486 646224 -931367 -3187875 -2148953
37334 -2148953 524062 1277948 1026481 3332264 7385842 7903534 3008785 -2232721 -2492454
37325 -2492454 935471 2858083 1456413 -441251 -206856 1462941 2107016 175821
37317 175821 -3691700 -6763443 -6373784 -3386728 -2248526 -5587138 -10020055 -10101041 -5711719
37308 -5711719 -2179608 -2806173 -4811963 -4224837 -1774509 -1218712 -3484643 -5555036 -5057574
37299 -5057574 -3475520 -3891319 -6948029 -10185972 -10879694 -8628163 -5176382 -2453079
37291 -2453079 -1292372 -1701696 -3415461 -5690560 -7161872 -6806227 -5094048 -3602600
37283 -3602600 -3391941 -4184914 -5101153 -5578026 -5395319 -4389572 -2605132 -506939 1280659
$$ packed form
37343B531184m7108n817197n308190Q84942N271883L130710j577591k256508J038922
37334b148953K673015P53886k51467K305783M053578N17692m894749n241506k59733
37325b492454L427925J922612j401670j897664K34395J669797O44075j931195
37317A75821l867521l071743L89659K987056J138202l338612m432917q0986M389322
37308e711719L532111o26565k005790N87126K450328N55797k265931k070393M97462
37299e057574J582054m15799l056710l237943o93722K251531L451781K723303
37291b453079J160707m09324j713765k275099j471312L55645J712179J491448
37283c602600K10659p92973r16239m76873J82707J005747J784440K098193J787598
$$ plain form
37274 1280659 2349674 2438899 1194627 -1496416 -4666435 -6235639 -4856781 -2145771
37266 -2145771 -1870821 -5581847 -9845629 -9934086 -6144885 -3694713 -5341925 -7195794 -4437565
37257 -4437565 1277720 4067366 2307820 269883 898680 1738564 175517 -1472680
37249 -1472680 157501 3279920 3208448 -309552 -2634196 -1436967 1270 -1565104
37241 -1565104 -4095187 -3798626 -1669888 -2487419 -7471179 -11625371 -10077007 -4706258
37233 -4706258 -1831666 -4071790 -7364290 -6864787 -3329515 -1346080 -2553729 -3930659
37225 -3930659 -3282455 -3054068 -6266093 -10886855 -11838537 -8089633 -4078362 -3287468 -3928445
37216 -3928445 -3110444 -2207450 -4392866 -8400233 -9196877 -5285792 -1302262 -1545883 -4188772
$$ packed form
37274A280659J069015Q9225j244272k691043l170019j569204J378858K711010
37266b145771K74950l711026m263782q8457L789201K450172j647212j853869K758229
37257d437565N715285K789646j759546k037937O28797Q39884j563047j648197
37249a472680J630181L122419p1472l518000k324644J197229J438237j566374
37241a565104k530083K96561K128738q17531m983760m154192J548364N370749
37233d706258K874592k240124l292500M99503L535272J983435j207649j376930
37225c930659O48204K28387l212025m620762r51682L748904M011271P90894o40977
37216c928445Q18001R02994k185416m007367p96644L911085L983530k43621k642889
$$ plain form
37207 -4188772 -4631285 -2182155 28703 319502 -227569 -1245662 -3777687 -6855155 -7372816
37198 -7372816 -5007029 -3609362 -5344629 -6928419 -5035950 -2342005 -3566039 -7472432
37190 -7472432 -8248442 -4466248 -1161322 -1903370 -3865261 -3053175 -184204 1674918 1989794
37181 1989794 1903986 1035032 -1298016 -3283076 -2469657 472205 2726133 3367072 3798400
37172 3798400 4651522 4728542 3060521 362775 -1468180 -587475 2950982 5994283 5151699
37163 5151699 1874529 1469350 5131735 7098642 3331195 -1297221 -134123 4399736
37155 4399736 4493179 -297777 -2467804 862495 3472031 742373 -3151679 -3088775 -1208402
37146 -1208402 -1720005 -2985901 -1169850 2119419 2439828 278063 -174334 1456197 1554979
$$ packed form
37207d188772m42513K449130K210858K90799n47071j018093k532025l077468n17661
37198g372816K365787J397667j735267j583790J892469K693945j224034l906393
37190g472432p76010L782194L304926p42048j961891Q12086K868971J859122L14876
37181A989794q5808q68954k333048j985060Q13419K941862K253928O40939M31328
37172C798400Q53122P7020j668021k697746j830955Q80705L538457L043301q42584
37163E151699l277170m05179L662385J966907l767447m628416J163098M533859
37155D399736R3443m790956k170027L330299K609536k729658l894052O2904J880373
37146a208402n11603j265896J816051L289269L20409k161765m52397J630531R8782
$$ plain form
37137 1554979 -645688 -1848972 -742853 -103196 -1670047 -3263248 -2655527 -897459
37129 -897459 -20879 -42087 64470 274179 -196140 -1657765 -3741454 -5512144 -5708252
37120 -5708252 -3906864 -1280166 716915 1696358 1390566 -1087124 -5087200 -7065099
37112 -7065099 -4206887 1366916 4820945 4471951 2579781 845453 -1338393 -3798157
37104 -3798157 -4336141 -2152428 -1608 -1032825 -4776956 -7682895 -7023005 -3517058
37096 -3517058 -364378 173770 -863769 -1002578 -406311 -1806311 -5405836 -6923189 -3415177
37087 -3415177 1478431 1850524 -2484611 -6334786 -6606640 -5346499 -5455650 -7160170 -9083928
37078 -9083928 -9738191 -7899888 -4303492 -2345779 -3963343 -5895222 -3980647 -33302
$$ packed form
37137A554979k200667j203284J106119O39657j566851j593201O07721J758068
37129h97459Q76580k1208J06557K09709m70319j461625k083689j770690j96108
37120e708252J801388K626698J997081R79443l05792k477690m000076j977899
37112g065099K858212N573803L454029l48994j892170j734328k183846k459764
37104c798157n37984K183713K150820j031217l744131k905939O59890L505947
37096c517058L152680N38148j037539j38809N96267j400000l599525j517353L508012
37087c415177M893608L72093m335135l850175k71854J260141j09151j704520j923758
37078i083928o54263J838303L596396J957713j617564j931879J914575L947345
$$ plain form
37070 -33302 487472 -2966674 -5513224 -5155566 -5447567 -8277710 -9937650 -7198147 -2478942
37061 -2478942 29177 -539818 -2951018 -6191680 -8173879 -6175465 -1189507 1906965
37053 1906965 820633 -1435643 -2264464 -3171981 -5139976 -5452774 -2712977 -284639 -782415
37044 -782415 -1567296 146371 2045748 907938 -2201938 -5172940 -8571445 -11466256
37036 -11466256 -9027314 -466959 5848661 2820464 -4097320 -4461095 1584808 4549883
37028 4549883 603629 -4195223 -4532288 -1818767 1240496 3911865 4147324 -178757
37020 -178757 -5371223 -4866622 390076 2344090 -1528500 -4436197 -2139356 159086
37012 159086 -2417265 -5880979 -5040907 -2927549 -4970683 -8757106 -7794834 -2543729 330873
$$ packed form
37070c3302N20774l454146k546550L57658k92001k830143j659940K739503M719205
37061b478942K508119n68995k411200l240662j982199J998414M985958L096472
37053A906965j086332k256276q28821r07517j967995l12798K739797K428338m97776
37044g82415p84881J713667J899377j137810l109876k971002l398505k894811
37036a1466256K438942Q560355O315620l028197o917784l63775O045903K965075
37028D549883l946254m798852l37065K713521L059263K671369K35459m326081
37020a78757n192466N04601N256698J954014l872590k907697K296841K298442
37012A59086k576351l463714Q40072K113358k043134l786423R62272N251105K874602
$$ plain form
37003 330873 -1388582 -2841451 -492786 3010198 3905958 2461435 905407 -381800
36995 -381800 -2125461 -3514841 -2804659 -365050 586508 -2533661 -7768596 -9840394 -6227162
36986 -6227162 -403295 2705398 2625245 1923034 938659 -1627089 -3987462 -2708268 832068
36977 832068 1257083 -2170314 -3725745 -486335 2613631 748773 -3275857 -4317998
36969 -4317998 -3150434 -3935234 -6938505 -9361394 -10751878 -12063545 -11519612 -7067362
36961 -7067362 -1458989 543754 -1046265 -2560352 -3327580 -5548758 -8237222 -7534883
36953 -7534883 -3761829 -2358801 -6021988 -10605511 -10938552 -6963774 -2175035 819048
36945 819048 1373241 193409 -787415 -140363 592918 -1448781 -5901620 -9194042 -9609135
$$ packed form
37003C30873j719455j452869K348665L502984Q95760j444523j556028j287207
36995c81800j743661j389380P10182K439609R51558l120169n234935k071798L613232
36986f227162N823867L108693q0153p02211r84375k565748k360373J279194L540336
36977H32068M25015l427397j555431L239410L099966j864858m024630j042141
36969d317998J167564p84800l003271k422889j390484j311667N43933M452250
36961g067362N608373K002743j590019j514087p67228k221178k688464P02339
36953g534883L773054J403028l663187m583523l33041L974778M788739K994083
36945H19048N54193j179832r80824O47052P33281k041699m452839l292422m15093
$$ plain form
36936 -9609135 -8965921 -8378093 -6129355 -1608482 2088895 2078208 -329376 -2097718 -2838299
36927 -2838299 -4088250 -5740145 -5849646 -3399109 626560 4474374 6658905 6413393
36919 6413393 4249201 1640809 -374792 -1634228 -1988607 -1536503 -1761664 -4247783 -7661180
36910 -7661180 -8463549 -5805210 -3225367 -3738010 -5601475 -5365928 -3143104 -1850708 -2442511
36901 -2442511 -3174144 -3327800 -4482443 -7348643 -9824648 -9537214 -6875092 -4318013 -3565116
36892 -3565116 -4182143 -4598019 -3855822 -2606698 -2489000 -4145041 -5982174 -5679602 -3066855
36883 -3066855 -645094 -716194 -2602702 -3512700 -2013927 176227 277908 -2132035 -4545246
36874 -4545246 -4506280 -2451308 -862579 -934166 -1187541 129204 2113764 1835965 -2001575
$$ packed form
36936i609135O43214N87828K248738M520873L697377j0687k407584j768342p40581
36927b838299j249951j651895j09501K450537M025669L847814K184531k45512
36919F413393k164192k608392k015601j259436l54379M52104k25161k486119l413397
36910g661180q02369K658339K579843n12643j863465K35547K222824J292396n91803
36901b442511p31633j53656j154643k866200k476005K87434K662122K557079P52897
36892c565116o17027m15876P42197J249124J17698j656041j837133L02572K612747
36883c066855K421761p1100j886508r09998J498773K190154J01681k409943k413211
36874d545246L8966K054972J588729p1587k53375J316745J984560k77799l837540
$$ plain form
36865 -2001575 -7011098 -9549655 -8799287 -7302076 -7308183 -8056234 -7721469 -6658213 -6544782
36856 -6544782 -6947150 -5644150 -2877026 -2136266 -4963123 -7788743 -6751410 -3496193
36848 -3496193 -2615476 -4694710 -6082681 -5214561 -4624372 -5784457 -6324847 -4391935 -1948315
36839 -1948315 -1009701 38384 2888641 4853202 2314578 -2927455 -5370412 -3471434
36831 -3471434 -1157354 -1237154 -1677539 -16391 2283117 2343069 46648 -2806625 -5464457
36822 -5464457 -7884699 -9151041 -8718271 -7801269 -7078825 -4633545 718147 5375521 4237170
36813 4237170 -2076593 -7213698 -7004503 -3708760 -1265837 -291193 -944 -1344935 -4693155
36804 -4693155 -7013212 -5374840 -1833737 -984229 -3469992 -5662812 -5363021 -3955853
$$ packed form
36865b001575n009523k538557P50368J497211o107p48051L34765J063256J13431
36856f544782m02368J303000K767124P40760k826857k825620J037333L255217
36848c496193Q80717k079234j387971Q68120N90189j160085n40390J932912K443620
36839a948315R38614J048085K850257J964561k538624n242033k442957J898978
36831c471434K314080p9800m40385J661148K299508N9952k296421k853273k657832
36822e464457k420242j266342M32770R17002P22444K445280N351692M657374j138351
36813D237170o313763n137105K09195L295743K442923R74644K90249j343991l348220
36804d693155k320057J638372L541103Q49508k485763k192820K99791J407168
$$ plain form
36796 -3955853 -2794815 -1463770 -563416 -2348352 -6713887 -9670047 -8101080 -3760586
36788 -3760586 -423071 888380 1583141 2155772 1729505 114176 -1776161 -3202619 -3962173
36779 -3962173 -4035769 -3887806 -4337217 -5300381 -5631797 -4829101 -3534973 -1781768 1304051
36770 1304051 5020838 6505611 4281648 574541 -1572694 -1745225 -1193095 -596839 -756180
36761 -756180 -3217959 -7670129 -10684213 -9811903 -7181220 -6222588 -6673154 -5996707 -3997651
36752 -3997651 -2454328 -1654040 -1047494 -1949637 -5473956 -8980383 -9035796 -6869739 -6005477
36743 -6005477 -5542707 -1865371 3217065 3280072 -2148582 -5170427 -1120982 4216565 4090656
36734 4090656 1462645 3200280 7737109 6991948 -485053 -6462450 -4746889 657221
$$ packed form
36796c955853J161038J331045R00354j784936m365535k956160J568967M340494
36788c760586L337515J311451O94761N72631m26267j615329j890337j426458p59554
36779c962173p3596J47963m49411r63164l31416Q02696J294128J753205L085819
36770A304051L716787J484773k223963l707107k147235j72531N52130N96256j59341
36761g56180k461779m452170l014084Q72310K630683R58632m50566O76447J999056
36752c997651J543323Q00288O06546r02143l524319l506427n5413K166057Q64262
36743f005477M62770L677336N082436O3007n428654l021845M049445N337547j25909
36734D090656k628011J737635M536829p45161p477001n977397J715561N404110
$$ plain form
36726 657221 2401043 52373 -838605 2511063 6623850 6828537 2878686 -1244967 -1678630
36717 -1678630 1730928 5379604 5300999 1329904 -2284074 -1600256 1703475 1717566 -3972169
36708 -3972169 -10153080 -10083050 -4145655 1195996 2381951 1996312 2398766 1750966 -740455
36699 -740455 -1011523 3517374 8027168 6864503 2923349 3352076 7761187 8780655 4272004
36690 4272004 583837 1802050 3681886 1701200 -1777541 -2755850 -2145051 -2269367 -1836327
36681 -1836327 532003 2008227 7608 -2640649 -2073581 211899 385940 -1220653
36673 -1220653 -1822029 -1814556 -3490173 -6257523 -8102789 -9638468 -11775587 -11909966 -8041115
36664 -8041115 -4309639 -6018381 -10778572 -11406186 -6784729 -2904970 -3172010 -4645036
$$ packed form
36726F57221J743822k348670q90978L349668M112787K04687l949851m123653m33663
36717a678630L409558L648676p8605l971095l613978O83818L303731J4091n689735
36708c972169o180911P0030N937395N341651J185955l85639M02454o47800k491421
36699g40455k71068M528897M509794j162665l941154M28727M409111J019468m508651
36690D272004l688167J218213J879836j980686l478741r78309O10799j24316M33040
36681a836327K368330J476224k000619k648257N67068K285480J74041j606593
36673a220653o01376P473j675617k767350j845266j535679k137119j34379L868851
36664h041115L731476j708742m760191o27614M621457L879759k67040j473026
$$ plain form
36656 -4645036 -4659456 -4374055 -4137774 -1692324 2696745 4889698 3177704 1049641 1245636
36647 1245636 1650564 -362924 -3667608 -5870537 -6315334 -4747027 -1060387 1868199
36639 1868199 -267927 -6517053 -10194606 -7859043 -4180088 -4643267 -7898047 -9255497
$$ packed form
36656d645036j4420K85401K36281K445450M389069K192953j711994k128063J95995
36647A245636M04928k013488l304684k202929m44797J568307L686640K928586
36639A868199k136126o249126l677553K335563L678955m63179l254780j357450
$$ [...]
##END NTUPLES=NMR SPECTRUM
##END=
