##TITLE=31Pdec_SR163-TFA
  aceton-d6
  24 sc
 29.9.2023
##JCAMPDX= 6.0         $$ Bruker NMR JCAMP-DX V2.0
##DATA TYPE= NMR SPECTRUM
##DATA CLASS= NTUPLES
##ORIGIN= UXNMR, Bruker Analytische Messtechnik GmbH
##OWNER= root
$$ XWIN-NMR		Version 3.5
$$ Fri Sep 29 14:25:10 2023 Russian Standard Time (UT+4h)  she@DPX200
##.OBSERVE FREQUENCY= 81.013821
##.OBSERVE NUCLEUS= ^31P
##.ACQUISITION MODE= SIMULTANEOUS
##.ACQUISITION SCHEME= undefined
##.AVERAGES= 24
##.DIGITISER RES= 16
##SPECTROMETER/DATA SYSTEM= spect
##.PULSE SEQUENCE= zgpg30
##.SOLVENT NAME= Acetone
##.SHIFT REFERENCE= (INTERNAL, Acetone, 0, 248.564)
##AUDIT TRAIL= $$ (NUMBER, WHEN, WHO, WHERE, WHAT)
$$ ##TITLE= Audit trail, XWIN-NMR		Version 3.5
$$ ##JCAMPDX= 5.01
$$ ##ORIGIN= Bruker BioSpin GmbH
$$ ##OWNER= she
$$ F:/spectra/data/she/nmr/P31/1/pdata/1/auditp.txt
$$ ##AUDIT TRAIL=  $$ (NUMBER, WHEN, WHO, WHERE, WHAT)
(   1,<2023-09-29 14:24:05.46 +0400>,<she>,<DPX200>,
      <created by zg, POWCHK disabled, PULCHK disabled
       configuration hash MD5:
       00 E9 B6 7A A2 85 ED C7 34 08 36 98 17 FE 4E 26
       data hash MD5: 32K
       98 BE 44 A4 D4 FB D9 39 3C 7E B0 87 F5 57 22 5A>)
(   2,<2023-09-29 14:24:07.73 +0400>,<she>,<DPX200>,
      <Start of raw data processing
       efp BC_mod = 2 LB = 5 FT_mod = 6 PKNL = 1 PHC0 = -10578.99 PHC1 = -92.71359 SI = 64K 
       data hash MD5: 64K
       96 7B CD 79 16 86 4B BE D9 EC CB F0 52 5B 3F 99>)
(   3,<2023-09-29 14:24:25.70 +0400>,<she>,<DPX200>,
      <pk PHC0 = -21.46313 PHC1 = 0 
       data hash MD5: 64K
       4F EE 73 1F 9A 2E 99 CE 61 E8 D8 E6 5E 93 5C 76>)
(   4,<2023-09-29 14:24:38.40 +0400>,<she>,<DPX200>,
      <abs ABSG = 5 
       data hash MD5: 64K
       D0 51 C0 F4 AF 10 3B D7 BB 6D 5F D3 C8 80 EA 5F>)
$$ ##END=
$$ 
$$ hash MD5
$$ CB 46 DF CB DF 9C 1C F8 6E CD 1E 6C D9 D4 61 0F
##$RELAX= 
##$RELAX= 
##$RELAX= 
##$RELAX= 
##$RELAX= 
##$RELAX= 
##$RELAX= 
##$RELAX= 
##$RELAX= 
$$ Bruker specific parameters
$$ --------------------------
##$DU= <F:/spectra>
##$EXPNO= 1
##$NAME= <P31>
##$PROCNO= 1
##$TYPE= <nmr>
##$USER= <she>
##$AMP= (0..31)
100 100 100 100 100 100 100 100 100 100 100 100 100 100 100 100 100 100 
100 100 100 100 100 100 100 100 100 100 100 100 100 100 
##$AQSEQ= 0
##$AQ_mod= 1
##$AUNM= <au_zg>
##$AUTOPOS= <>
##$BF1= 81.014009
##$BF2= 200.13
##$BF3= 200.13
##$BF4= 200.13
##$BF5= 200.13
##$BF6= 200.13
##$BF7= 200.13
##$BF8= 200.13
##$BYTORDA= 1
##$CFDGTYP= 0
##$CFRGTYP= 5
##$CHEMSTR= <none>
##$CNST= (0..31)
1 1 145 1 1 1 1 1 1 1 1 1 1 1 1 1 1 1 1 1 1 1 1 1 1 1 1 1 1 1 1 1 
##$CPDPRG= <waltz16>
##$CPDPRG1= <>
##$CPDPRG2= <waltz16>
##$CPDPRG3= <>
##$CPDPRG4= <mlev>
##$CPDPRG5= <mlev>
##$CPDPRG6= <mlev>
##$CPDPRG7= <mlev>
##$CPDPRG8= <mlev>
##$CPDPRGB= <>
##$CPDPRGT= <>
##$D= (0..31)
0 1 0 0 0 0 0 0 0 0 0 0.03 2e-05 3e-06 0 0 0 0 0 0 0 0 0 0 0 0 0 0 0 0 
0 0 
##$DATE= 1695983044
##$DBL= (0..7)
120 120 120 11 120 120 24 19 
##$DBP= (0..7)
150 150 150 150 150 150 150 150 
##$DBP07= 0
##$DBPNAM0= <>
$$ [...]
##$SUBNAM3= <"">
##$SUBNAM4= <"">
##$SUBNAM5= <"">
##$SUBNAM6= <"">
##$SUBNAM7= <"">
##$SUBNAM8= <"">
##$SUBNAM9= <"">
##$SW= 501.771253377433
##$SWIBOX= (0..15)
0 1 3 0 0 0 0 0 0 0 0 0 0 0 0 0 
##$SW_h= 40650.406504065
##$TD= 32768
##$TD0= 1
##$TE= 0
##$TE2= 300
##$TE3= 300
##$TEG= 300
##$TL= (0..7)
0 120 53 12 22 120 120 120 
##$TP= (0..7)
150 150 150 150 150 150 150 150 
##$TP07= 0
##$TPNAME0= <>
##$TPNAME1= <>
##$TPNAME2= <>
##$TPNAME3= <>
##$TPNAME4= <>
##$TPNAME5= <>
##$TPNAME6= <>
##$TPNAME7= <>
##$TPOAL= (0..7)
0.5 0.5 0.5 0.5 0.5 0.5 0.5 0.5 
##$TPOFFS= (0..7)
0 0 0 0 0 0 0 0 
##$TUNHIN= 0
##$TUNHOUT= 0
##$TUNXOUT= 0
##$USERA1= <user>
##$USERA2= <user>
##$USERA3= <user>
##$USERA4= <user>
##$USERA5= <user>
##$V9= 5
##$VALIST= <valist>
##$VCLIST= <CCCCCCCCCCCCCCC>
##$VD= 0
##$VDLIST= <DDDDDDDDDDDDDDD>
##$VPLIST= <PPPPPPPPPPPPPPP>
##$VTLIST= <TTTTTTTTTTTTTTT>
##$WBST= 1024
##$WBSW= 4
##$XGAIN= (0..3)
0 0 0 0 
##$XL= 0
##$YL= 0
##$YMAX_a= 1270
##$YMIN_a= -1397
##$ZGOPTNS= <>
##$ZL1= 120
##$ZL2= 120
##$ZL3= 120
##$ZL4= 120
##$ABSF1= 248.5645
##$ABSF2= -253.2056
##$ABSG= 5
##$ABSL= 3
##$ALPHA= 0
##$AQORDER= 0
##$ASSFAC= 0
##$ASSFACI= 0
##$ASSFACX= 0
##$ASSWID= 0
##$AUNMP= <proc_1d>
##$AZFE= 0.1
##$AZFW= 0.5
##$BCFW= 0
##$BC_mod= 2
##$BYTORDP= 0
##$COROFFS= 0
##$CY= -3
##$DATMOD= 1
##$DC= 0
##$DFILT= <>
##$DTYPP= 0
##$F1P= 0
##$F2P= 0
##$FCOR= 1
##$FTSIZE= 65536
##$FT_mod= 6
##$GAMMA= 0
##$GB= 0
##$INTBC= 1
##$INTSCL= 6.047779e-11
##$ISEN= 30
##$LB= 5
##$LEV0= 0
##$LPBIN= 0
##$MAXI= 10000
##$MC2= 0
##$MEAN= 0
##$ME_mod= 0
##$MI= 50
##$NCOEF= 0
##$NC_proc= -10
##$NLEV= 6
##$NOISF1= 182.463
##$NOISF2= 159.3651
##$NSP= 0
##$NTH_PI= 0
##$NZP= 0
##$OFFSET= 248.5645
##$PC= 4
##$PHC0= -10600.45
##$PHC1= -92.71359
##$PH_mod= 1
##$PKNL= yes
##$PPARMOD= 0
##$PSCAL= 0
##$PSIGN= 0
##$REVERSE= no
##$SF= 81.0140089999694
##$SI= 65536
##$SIGF1= 159.3651
##$SIGF2= -187.1042
##$SINO= 113.3802
##$SIOLD= 16384
##$SREGLST= <1H.CDCl3>
##$SSB= 0
##$STSI= 65536
##$STSR= 0
##$SW_p= 40650.406504065
##$SYMM= 0
##$S_DEV= 0
##$TDeff= 32768
##$TDoff= 0
##$TI= <>
##$TILT= no
##$TM1= 0
##$TM2= 0
##$TOPLEV= 0
##$USERP1= <user>
##$USERP2= <user>
##$USERP3= <user>
##$USERP4= <user>
##$USERP5= <user>
##$WDW= 1
##$XDIM= 65536
##$YMAX_p= 319782487
##$YMIN_p= -217595453
$$ End of Bruker specific parameters
$$ ---------------------------------
##NTUPLES= NMR SPECTRUM
##VAR_NAME=  FREQUENCY,     SPECTRUM/REAL,   SPECTRUM/IMAG
##SYMBOL=    X,             R,               I
##VAR_TYPE=  INDEPENDENT,   DEPENDENT,       DEPENDENT
##VAR_FORM=  AFFN,          ASDF,            ASDF
##VAR_DIM=   65536,         65536,           65536
##UNITS=     HZ,            ARBITRARY UNITS, ARBITRARY UNITS
##FACTOR=    0.620285442955139, 1,           1
##FIRST=     20137.2065510682, 0,            0
##LAST=      -20513.1999529968, 0,           0
##MIN=       -20513.1999529968, -217595453,  0
##MAX=       20137.2065510682, 319782487,    0
$$ Real data points
##PAGE= N=1
##DATA TABLE= (X++(R..R)), XYDATA
$$ [...]
$$ plain form
42676 -4634344 -4179393 -4424769 -5424997 -6468690 -6710437 -6030009 -5048849 -4371072 -4027124
42667 -4027124 -3672996 -3130072 -2586510 -2315537 -2314818 -2286204 -1963451 -1423636 -1063521 -1309682
42657 -1309682 -2380910 -4251095 -6685759 -9261820 -11478177 -12994450 -13771165 -13918159
42649 -13918159 -13441816 -12257632 -10486726 -8633512 -7331860 -6849954 -6836971 -6550080 -5340563
42640 -5340563 -3012920 106954 3300752 5683312 6528109 5622027 3395892 647079
42632 647079 -1954730 -4150643 -5969933 -7428843 -8381689 -8596523 -7901242 -6286604 -3984806
42623 -3984806 -1525382 354540 1054031 551061 -467974 -1044631 -635023 613563 2245944
42614 2245944 4044701 6109219 8486504 10905639 12932222 14312126 15147167 15798133
$$ packed form
42676d634344M54951k45376j000228j043693k41747O80428R81160O77777L43948
42667d027124L54128N42924N43562K70973P19K8614L22753N39815L60115k46161
42657a309682j071228j870185k434664k576061k216357j516273p76715j46994
42649a3918159M76343J184184J770906J853214J301652M81906J2983K86891J209517
42640e340563K327643L119874L193798K382560Q44797r06082k226135k748813
42632F47079k601809k195913j819290j458910r52846k14834O95281J614638K301798
42623c984806K459424J879922O99491n02970j019035n76657M09608J248586J632381
42614B245944J798757K064518K377285K419135K026583J379904Q35041O50966
$$ plain form
42606 15798133 16594452 17505315 18032188 17499400 15524435 12232768 8124608 3888316 282824
42597 282824 -2109095 -3221119 -3501316 -3436093 -3152177 -2567990 -1757152 -934811 -161073
42588 -161073 698048 1708984 2787941 3939983 5393976 7362055 9719429 11991775
42580 11991775 13649531 14456900 14650761 14807218 15434857 16620758 18045178 19251023 19809972
42571 19809972 19333490 17556263 14485542 10382430 5627723 766078 -3358215 -5818124
42563 -5818124 -6173937 -4785665 -2531936 -343544 1020559 1106808 9318 -1588858 -2867914
42554 -2867914 -3444572 -3489230 -3403864 -3495196 -3819152 -4128135 -3997127 -3159816 -1711719 98678
42544 98678 2153313 4346108 6272445 7314503 7105200 5786772 3873552 2089451 1281995
$$ packed form
42606A5798133P96319R10863N26873n32788j974965l291667m108160m236292l605492
42597B82824k391919j112024k80197O5223K83916N84187Q10838Q22341P73738
42588a61073Q59121J010936J078957J152042J453993J968079K357374K272346
42580A1991775J657756Q07369J93861J56457O27639J185901J424420J205845N58949
42571A9809972m76482j777227l070721m103112m754707m861645m124293k459909
42563e818124l55813J388272K253729K188392J364103Q6249j097490j598176j279056
42554b867914n76658m4658Q5366r1332l23956l08983J31008Q37311J448097J810397
42544I8678K054635K192795J926337J042058k09303j318428j913220j784101q07456
$$ plain form
42535 1281995 2056084 4170059 6413780 7359562 6344839 3790600 767457 -1622855
42527 -1622855 -2667510 -2262621 -921950 507106 1285277 1070948 -67647 -1780857 -3585186
42518 -3585186 -5059682 -6094654 -7018454 -8386911 -10477499 -12898261 -14753433 -15293222
42510 -15293222 -14414229 -12532083 -10116446 -7527875 -5232850 -3864437 -3860094 -5085826 -6901947
42501 -6901947 -8566204 -9590813 -9906962 -9871247 -10073318 -10966002 -12575031 -14510848 -16182140
42492 -16182140 -16996200 -16518040 -14624124 -11556426 -7826446 -4104017 -1138401 469277
42484 469277 635616 -122351 -1153336 -2232108 -3579686 -5429421 -7763507 -10415872 -13136539
42475 -13136539 -15430047 -16554189 -15954623 -13768676 -10861847 -8357396 -7043310 -7013215
$$ packed form
42535A281995P74089K113975K243721R45782j014723k554239l023143k390312
42527a622855j044655M04889J340671J429056P78171k14329j138595j713210j804329
42518c585186j474496j034972r23800j368457k090588k420762j855172n39789
42510a5293222Q78993J882146K415637K588571K295025J368413M343j225732j816121
42501f901947j664257j024609l16149L5715k02071q92684j609029j935817j671292
42492a6182140q14060M78160J893916L067698L729980L722429K965616J607678
42484D69277J66339p57967j030985j078772j347578j849735k334086k652365k720667
42475a3136539k293508j124142N99566K185947K906829K504451J314086L0095
$$ plain form
42467 -7013215 -7725694 -8488481 -9034842 -9633005 -10576355 -11651753 -12271021 -12137162 -11642216
42458 -11642216 -11538485 -12279654 -13698324 -15194417 -16111870 -15990454 -14652010 -12211340 -9048986
42449 -9048986 -5706176 -2659447 -45171 2427957 5173292 8211130 10988043 12812706
42441 12812706 13456468 13217042 12431537 11158582 9464141 7831336 7015170 7453011 8928667
42432 8928667 10783987 12321773 13066691 12912314 12145457 11171759 10094535 8685428 6865293
42423 6865293 5023840 3641927 2700280 1722164 390289 -1129221 -2524217 -3732849
42415 -3732849 -4825341 -5649558 -5828979 -5109810 -3565419 -1445233 1042502 3716775 6257043
42406 6257043 8166948 8986638 8581905 7236122 5462179 3738547 2410040 1720709 1756909
$$ packed form
42467g013215p12479p62787n46361n98163r43350j075398o19268J33859M94946
42458a1642216J03731p41169j418670j496093r17453J21416J338444K440670L162354
42449i048986L342810L046729K614276K473128K745335L037838K776913J824663
42441A2812706O43762k39426p85505j272955j694441j632805q16166M37841J475656
42432H928667J855320J537786P44918j54377p66857r73698j077224j409107j820135
42423F865293j841453j381913r41647r78116j331875j519510j394996j208632
42415c732849j092492q24217j79421P19169J544391K120186K487735K674273K540268
42406F257043J909905Q19690m04733j345783j773943j723632j328507o89331L6200
$$ plain form
42397 1756909 2281641 2739023 2596328 1755381 605120 -346679 -879442 -1116837 -1247194
42388 -1247194 -1260239 -995555 -428625 161299 368904 8465 -743460 -1524289 -2045640 -2201573
42378 -2201573 -2045632 -1747469 -1506089 -1382404 -1204538 -728977 67782 927650 1585870
42369 1585870 2029223 2378049 2549761 2201581 1100008 -531587 -2149476 -3363838 -4199295
42360 -4199295 -4906863 -5633975 -6309254 -6746648 -6803671 -6529787 -6237450 -6328113 -6901065 -7551985
42350 -7551985 -7684391 -7045585 -5890500 -4655197 -3608592 -2841581 -2425113 -2433025 -2847192
42341 -2847192 -3543332 -4388045 -5320563 -6341531 -7418916 -8375773 -8898321 -8749884 -7999192
42332 -7999192 -6943710 -5775962 -4452827 -2975783 -1644336 -814497 -420864 72390 1182650
$$ packed form
42397A756909N24732M57382j42695q40947j150261r51799n32763k37395j30357
42388a247194j3045K64684N66930N89924K07605l60439p51925p80829n21351j55933
42378b201573J55941K98163K41380J23685J77866M75561P96759Q59868O58220
42369A585870M43353L48826J71712l48180j101573j631595j617889j214362q35457
42360d199295p07568p27112o75279m37394n7023K73884K92337r0663n72952o50920
42350g551985j32406O38806J155085J235303J046605P67011M16468p912m14167
42341b847192o96140q44713r32518j020968j077385r56857n22548J48437P50692
42332g999192J055482J167748J323135J477044J331447Q29839L93633M93254J110260
$$ plain form
42323 1182650 2969413 5071963 6991424 8248474 8473290 7612852 6063751 4420627
42315 4420627 3020372 1808780 635815 -499897 -1578054 -2743948 -4176337 -5845639
42307 -5845639 -7589400 -9358618 -11109575 -12399981 -12414105 -10668606 -7589585 -4162347
42299 -4162347 -1070700 1598871 3879729 5517074 6174355 5779709 4442897 2210877
42291 2210877 -786255 -3979695 -6467083 -7635548 -7564864 -6719615 -5387065 -3620560 -1705894
42282 -1705894 -410796 -520729 -2099123 -4335258 -6191988 -7142834 -7260059 -6772599 -5781232
42273 -5781232 -4404453 -2954986 -1793080 -1062582 -681456 -575483 -860807 -1797957 -3546019
42264 -3546019 -5873848 -8115447 -9570126 -10049904 -9949117 -9736892 -9559873 -9443737 -9599156
$$ packed form
42323A182650J786763K102550J919461J257050K24816q60438j549101j643124
42315D420627j400255j211592j172965j135712j078157j165894j432389j669302
42307e845639j743761j769218j750957j290406j4124J745499L079021L427238
42299d162347L091647K669571K280858J637345O57281l94646j336812k232020
42291B210877k997132l193440k487388j168465P0684Q45249J332550J766505J914666
42282a705894J295098j09933j578394k236135j856730r50846j17225M87460R91367
42273e781232J376779J449467J161906P30498L81126J05973k85324r37150j748062
42264c546019k327829k241599j454679m79778J00787K12225J77019J16136j55419
$$ plain form
42255 -9599156 -10162744 -10726413 -10568423 -9531591 -8415254 -8279796 -9467229 -11399361 -13143688
42246 -13143688 -14002032 -13744153 -12610805 -11138436 -9777022 -8585347 -7358592 -6007938
42238 -6007938 -4665653 -3452219 -2384629 -1625900 -1641447 -2901827 -5445405 -8819898 -12383815
42229 -12383815 -15548143 -17816404 -18855452 -18681035 -17707883 -16506734 -15476125 -14693083
42221 -14693083 -13941629 -12813734 -10913825 -8171955 -5022459 -2200050 -294633 533407
42213 533407 514288 92193 -221113 13332 1036504 2894951 5528113 8721297 11942379
42204 11942379 14413669 15552318 15351099 14251061 12688427 10858092 8834623 6712872
42196 6712872 4557382 2334508 5861 -2312093 -4306582 -5610982 -6077619 -5982687 -5863689
$$ packed form
42255i599156n63588n63669J57990J036832J116337J35458j187433j932132j744327
42246a3143688q58344K57879J133348J472369J361414J191675J226755J350654
42238f007938J342285J213434J067590P58729j5547j260380k543578l374493l563917
42229a2383815l164328k268261j039048J74417R73152J201149J030609P83042
42221a4693083P51454J127895J899909K741870L149496K822409J905417Q28040
42213E33407j9119m22095l13306K34445J023172J858447K633162L193184L221082
42204A1942379K471290J138649k01219j100038j562634j830335k023469k121751
42196F712872k155490k222874k328647k317954j994489j304400m66637R4932J18998
$$ plain form
42187 -5863689 -5980422 -5952295 -5119734 -3323211 -1169926 544192 1519632 1956912 2049596
42178 2049596 1694348 673816 -1038968 -3164548 -5184875 -6543431 -6938993 -6487787 -5513452
42169 -5513452 -4149140 -2257576 183828 2718871 4587904 5317577 5098583 4562958 4224249
42160 4224249 4150789 4110067 3897903 3471764 2875775 2200780 1621227 1303594 1180437 924921
42150 924921 282086 -637169 -1548179 -2468788 -3827085 -5999195 -8838039 -11776134 -14349234
42141 -14349234 -16489864 -18302005 -19715317 -20509109 -20604400 -20101377 -18932964 -16685794 -13047322
42132 -13047322 -8450310 -4045904 -900463 701899 1142647 886830 210386 -657976 -1481420
42123 -1481420 -2230342 -3177721 -4595111 -6343734 -7843388 -8514772 -8324849 -7937792 -8269423
$$ packed form
42187e863689j16733K8127Q32561J796523K153285J714118R75440M37280R2684
42178B049596l55248j020532j712784k125580k020327j358556l95562M51206R74335
42169e513452J364312J891564K441404K535043J869033P29673k18994n35625l38709
42160D224249p3460m0722k12164m26139n95989o74995n79553l17633j23157k55516
42150I24921o42835r19255r11010r20609j358297k172110k838844k938095k573100
42141a4349234k140630j812141j413312p93792r5291N03023J168413K247170L638472
42132a3047322M597012M404406L145441J602362M40748k55817o76444q68362q23444
42123a481420p48922r47379j417390j748623j499654o71384J89923L87057l31631
$$ plain form
42114 -8269423 -9780846 -12137647 -14499158 -16066895 -16429387 -15688617 -14496302 -13797123 -14149755
42105 -14149755 -15198403 -16024041 -16093451 -15677261 -15281597 -14927006 -14166219 -12638466 -10412906
42096 -10412906 -7920789 -5762203 -4472407 -4192040 -4507879 -4770883 -4614966 -4082414 -3295657
42087 -3295657 -2202625 -715076 1010499 2502024 3169994 2651936 1109242 -811184
42079 -811184 -2452513 -3645955 -4680857 -5832624 -7094712 -8375863 -9697020 -11019763
42071 -11019763 -12050769 -12455769 -12215769 -11565811 -10606341 -9214880 -7405111 -5537031 -3987927
42062 -3987927 -2753480 -1596778 -527014 141135 261304 129091 100641 115890 -146976
42053 -146976 -738364 -1368885 -1893089 -2537224 -3496557 -4589658 -5575207 -6614818 -8070501
$$ packed form
42114h269423j511423k356801k361511j567737l62492P40770J192315O99179l52632
42105a4149755j048648q25638o9410M16190L95664L54591P60787J527753K225560
42096a0412906K492117K158586J289796K80367l15839k63004J55917N32552P86757
42087c295657J093032J487549J725575J491525O67970n18058j542694j920426
42079h11184j641329j193442j034902j151767j262088j281151j321157j322743
42071a1019763j031006m05000K40000O49958R59470J391461J809769J868080J549104
42062c987927J234447J156702J069764O68149J20169j32213k8450J5249k62866
42053a46976n91388o30521n24204o44135r59333j093101r85549j039611j455683
$$ plain form
42044 -8070501 -9889550 -11523186 -12512236 -12880451 -12859951 -12503249 -11758110 -10752070 -9810252
42035 -9810252 -9304408 -9632064 -11165398 -13907729 -17174784 -19843220 -21043431 -20585526 -18775683
42026 -18775683 -16008997 -12610191 -8928064 -5428467 -2650759 -1035276 -687883 -1248098
42018 -1248098 -2049717 -2528830 -2552525 -2371221 -2229742 -1983452 -1099115 881575 3795443
42009 3795443 6778000 8786503 9260075 8378241 6856300 5542892 4981160 5051809 5022760
42000 5022760 4192986 2635168 1220028 827354 1583677 2869000 3906316 4261114 3956026
41991 3956026 3355239 2953692 3094670 3762729 4640239 5353675 5643652 5370183 4502493
41982 4502493 3178865 1724549 525032 -167730 -329046 -73867 529062 1541347 3007443
$$ packed form
42044h070501j819049j633636r89050l68215K0500L56702P45139J006040R41818
42035i810252N05844l27656j533334k742331l267055k668436j200211M57905J809843
42026a8775683K766686L398806L682127L499597K777708J615483L47393n60215
42018a248098q01619m79113k3695J81304J41479K46290Q84337J980690K913868
42009C795443K982557K008503M73572q81834j521941j313408n61732P0649k9049
42000E022760q29774j557818j415140l92674P56323J285323J037316L54798l05088
41991C956026o00787m01547J40978O68059Q77510P13436K89977k73469q67690
41982D502493j323628j454316j199517o92762j61316K55179O02929J012285J466096
$$ plain form
41973 3007443 4715188 6178557 6938402 6884020 6258638 5383486 4410059 3293345 1939385
41964 1939385 392187 -1088579 -2178878 -2766842 -3002813 -2976752 -2434626 -1022904 1144161
41955 1144161 3324195 4642588 4666928 3503043 1578220 -483232 -1972494 -2467101 -2197745
41946 -2197745 -1859992 -1956820 -2431891 -2982874 -3536934 -4249794 -5144432 -5968207 -6452862 -6625744
41936 -6625744 -6837292 -7504328 -8757483 -10230581 -11210148 -11104757 -9828104 -7750463 -5388096
41927 -5388096 -3228909 -1708586 -1069819 -1181149 -1687978 -2424791 -3502288 -4882942 -6062927
41918 -6062927 -6381128 -5577549 -3923122 -1922413 -70789 1223858 1797225 1879129 1889934
41909 1889934 1993315 1964871 1540116 754562 -113473 -799525 -1169022 -1180391 -832555 -137671
$$ packed form
41973C007443J707745J463369P59845n4382o25382q75152r73427j116714j353960
41964A939385j547198j480766j090299n87964k35971K6061N42126J411722K167065
41955A144161K180034J318393K4340j163885j924823k061452j489262m94607K69356
41946b197745L37753r6828m75071n50983n54060p12860q94638q23775m84655j72882
41936f625744k11548o67036j253155j473098r79567J05391J276653K077641K362367
41927e388096K159187J520323O38767j11330n06829p36813j077497j380654j179985
41918f062927l18201Q03579J654427K000709J851624J294647N73367Q1904J0805
41909A889934J03381k8444m24755p85554q68035o86052l69497j1369L47836O94884
$$ plain form
41899 -137671 831714 1792381 2230162 1768445 626426 -482699 -1024700 -1082014 -1060766 -1185568
41889 -1185568 -1453381 -1888374 -2561183 -3396657 -4166054 -4654511 -4699307 -4145094 -2966852
41880 -2966852 -1405655 214851 1784165 3302234 4486275 4756318 3751393 1700055
41872 1700055 -855517 -3594346 -6547045 -9755484 -12928942 -15471907 -16853088 -16971807
41864 -16971807 -16148356 -14741842 -12885212 -10704571 -8643420 -7240730 -6502718 -5741061
41856 -5741061 -4218338 -1868266 680096 2609457 3329400 2627499 739816 -1699583
41848 -1699583 -3969008 -5612802 -6504563 -6710453 -6465616 -6192377 -6239569 -6467746 -6243794
41839 -6243794 -5014702 -2872526 -483552 1495442 2845470 3686743 4141996 4227295 3999199
$$ packed form
41899a37671R69385R60667M37781m61717j142019j109125n42001n7314K1248j24802
41889a185568k67813m34993o72809q35474p69397m88457m4796N54213J178242
41880b966852J561197J620506J569314J518069J184041K70043j004925k051338
41872A700055k555572k738829k952699l208439l173458k542965j381181j18719
41864a6971807Q23451J406514J856630K180641K061151J402690P38012P61657
41856e741061J522723K350072K548362J929361P19943p01901j887683k439399
41848a699583k269425j643794q91761k05890K44837K73239m7192k28177K23952
41839f243794J229092K142176K388974J978994J350028Q41273M55253Q5299k28096
$$ plain form
41830 3999199 3607925 3120113 2425312 1482828 633490 530633 1740869 4444839 8364955
41821 8364955 12704230 16173794 17495823 16245522 13191539 9675843 6689233 4542461
41813 4542461 3123438 2131762 1147020 -140261 -1586743 -2636181 -2827625 -2209242 -1226374
41804 -1226374 -310761 367322 836692 1102733 992352 272115 -982694 -2183907 -2593172
41795 -2593172 -1993845 -922528 -174191 -155040 -754235 -1696206 -2846735 -4200553 -5732257
41786 -5732257 -7351873 -8968606 -10518141 -11882073 -12798818 -12928942 -12073332 -10322379 -7971418
41777 -7971418 -5335758 -2690247 -308782 1566074 2795943 3311314 3041799 2009242
41769 2009242 475698 -1168255 -2717531 -4225977 -5720918 -7012705 -7907631 -8470684
$$ packed form
41830C999199l91274m87812o94801r42484q49338j02857J210236K703970L920116
41821H364955M339275L469564J322029j250301l053983l515696k986610k146772
41813D542461j419023r91676r84742j287281j446482j049438j91444O18383R82868
41804a226374R15613O78083M69370K66041j10381p20237j254809j201213m09265
41795b593172N99327J071317P48337J9151n99195r41971j150529j353818j531704
41786e732257j619616j616733j549535j363932r16745j30124Q55610J750953K350961
41777g971418K635660K645511K381465J874856J229869N15371k69515j032557
41769B009242j533544j643953j549276j508446j494941j291787q94926n63053
$$ plain form
41761 -8470684 -8894019 -9158009 -8994596 -8193417 -6818759 -5111285 -3284548 -1433565 472678
41752 472678 2559038 4907014 7360254 9497748 10861094 11204707 10520271 8904666 6525226
41743 6525226 3735007 1117197 -711728 -1405117 -1011343 164019 1767395 3484662
41735 3484662 5037503 6216225 6941258 7256258 7271964 7158205 7137030 7330640 7538239
41726 7538239 7268424 6161517 4438844 2874479 2254061 2830455 4274714 6083638 7951041
41717 7951041 9726603 11122658 11644168 10907823 8972956 6271453 3251594 178670
41709 178670 -2785886 -5513115 -7975997 -10222551 -12150249 -13420664 -13768076 -13349022 -12611990
41700 -12611990 -11798432 -10716930 -9075158 -6938543 -4796133 -3244463 -2646783 -2975049
$$ packed form
41761h470684m23335k63990J63413Q01179J374658J707474J826737J850983J906243
41752D72678K086360K347976K453240K137494J363346L43613o84436j615605k379440
41743F525226k790219k617810j828925o93389L93774J175362J603376J717267
41735C484662J552841J178722P25033L15000J5706j13759k1175J93610K07599
41726G538239k69815j106907j722673j564365o20418N76394J444259J808924J867403
41717G951041J775562J396055N21510p36345j934867k701503l019859l072924
41709A78670k964556k727229k462882k246554j927698j270415l47412M19054P37032
41700a2611990Q13558J081502J641772K136615K142410J551670N97680l28266
$$ plain form
41692 -2975049 -3827192 -4609824 -4848167 -4415035 -3471634 -2220435 -777333 749371 2199223
41683 2199223 3468300 4622748 5833442 7233665 8887328 10811758 12900339 14842816
41675 14842816 16263590 16978796 17014915 16341991 14722251 11937281 8128303 3860609 -101476
41666 -101476 -3092568 -4813692 -5480215 -5632615 -5618443 -5245440 -4044868 -1844066 1042337
41657 1042337 4134953 7107392 9769587 11961084 13608816 14789457 15603867 16030322
41649 16030322 15992700 15550969 14954910 14501300 14334835 14337111 14198284 13676099 12852783 12128096
41639 12128096 11938928 12470577 13554888 14728735 15398832 15085220 13592707 10975191 7467637
41630 7467637 3611537 303715 -1703744 -2566327 -3378096 -5163747 -7896143 -10660877
$$ packed form
41692b975049q52143p82632k38343M33132R43401J251199J443102J526704J449852
41683B199223J269077J154448J210694J400223J653663J924430K088581J942477
41675A4842816J420774P15206L6119o72924j619740k784970l808978m267694l962085
41666a01476k991092j721124o66523j52400J4172L73003J200572K200802K886403
41657A042337L092616K972439K662195K191497J647732J180641Q14410M26455
41649A6030322l7622m41731n96059m53610j66465K276j38827n22185q23316p24687
41639A2128096j89168N31649J084311J173847O70097l13612j492513k617516l507554
41630G467637l856100l307822k007459q62583q11769j785651k732396k764734
$$ plain form
41622 -10660877 -12646999 -13727042 -14161481 -14105294 -13550199 -12537945 -11237690 -9885761 -8783456
41613 -8783456 -8311229 -8778502 -10138342 -11844208 -13094758 -13379522 -12857238 -12128074 -11575298
41604 -11575298 -11008515 -10014662 -8520542 -6826335 -5140320 -3308052 -1078544 1497365
41596 1497365 4036662 6150172 7757432 9099648 10429411 11652372 12336364 12174005
41588 12174005 11385458 10513287 9824941 9081438 7913928 6216187 4052281 1389223 -1799718
41579 -1799718 -5178408 -8037667 -9789370 -10422059 -10404263 -10196133 -9939363 -9572001 -9060942
41570 -9060942 -8397233 -7455431 -6062396 -4263247 -2380158 -716129 688730 1897969
41562 1897969 2798592 3172992 3019424 2621509 2291417 2205861 2492295 3223310 4162574 4670199
$$ packed form
41622a0660877j986122j080043m34439N6187N55095J012254J300255J351929J102305
41613h783456M72227m67273j359840j705866j250550k84764N22284P29164N52776
41604a1575298N66783R93853J494120J694207J686015J832268K229508K575909
41596A497365K539297K113510J607260J342216J329763J222961O83992j62359
41588A2174005p88547q72171o88346p43503j167510j697741k163906k663058l188941
41579a799718l378690k859259j751703o32689J7796K08130K56770L67362N11059
41570i060942O63709R41802J393035J799149J883089J664029J404859J209239
41562A897969R00623L74400j53568l97915l30092q5556K86434P31015R39264N07625
$$ plain form
41552 4670199 4111851 2435958 293655 -1424310 -2171352 -1963324 -1139175 63698 1734791
41543 1734791 4126171 7291746 10910037 14415467 17210810 18768841 18720061 17047716
41535 17047716 14234218 11106497 8413785 6474977 5179634 4283942 3669738 3319928
41527 3319928 3138288 2947491 2704829 2571399 2638645 2692190 2437505 1928504 1570266 1661413
41517 1661413 2109561 2661807 3240454 3915003 4620701 4993051 4435419 2376392 -1307190
41508 -1307190 -5934454 -10174886 -12764109 -13173182 -11671505 -8944662 -5767409 -2851738
41500 -2851738 -690455 585197 1179490 1496423 2013976 3058388 4445860 5396340 5067393
41491 5067393 3298494 780855 -1469230 -2696180 -2589266 -1230655 959874 3385378
$$ packed form
41552D670199n58348j675893k142303j717965p47042K08028Q24149J202873J671093
41543A734791K391380L165575L618291L505430K795343J558031m8780j672345
41535A7047716k813498l127721k692712j938808j295343q95692o14204l49810
41527C319928j81640j90797k42662j33430O7246N3545k54685n09001l58238R1147
41517A661413M48148N52246N78647O74549P05698L72350n57632k059027l683582
41508a307190m627264m240432k589223m09073J501677K726843L177253K915671
41500b851738K161283J275652N94293L16933N17553J044412J387472R50480l28947
41491E067393j768899k517639k250085j226950J06914J358611K190529K425504
$$ plain form
41483 3385378 5587330 7437698 9021916 10435992 11731202 12884253 13663379 13632045 12519728
41474 12519728 10642575 8829016 7858810 8000881 9024087 10445448 11687891 12230649
41466 12230649 11925015 11216832 10861986 11288721 12277849 13254168 13711570 13280302 11646827
41457 11646827 8759762 5131109 1677386 -851379 -2187035 -2331094 -1303982 746831
41449 746831 3357967 5842952 7523310 7865095 6663665 4337925 1893421 278274
41441 278274 -291466 -291916 -315875 -742762 -1832050 -3731796 -6242001 -8786149 -10782298
41432 -10782298 -11981453 -12455220 -12455367 -12350764 -12488185 -12969527 -13695977 -14720694 -16360781
41423 -16360781 -18778989 -21602563 -24186867 -26185838 -27628570 -28448239 -28207121 -26453260
$$ packed form
41483C385378K201952J850368J584218J414076J295210J153051P79126l1334j112317
41474A2519728j877153j813559r70206J42071J023206J421361J242443N42758
41466A2230649l05634p08183l54846M26735R89128R76319M57402m31268j633475
41457A1646827k887065l628653l453723k528765j335656j44059J027112K050813
41449G46831K611136K484985J680358L41785j201430k325740k444504j615147
41441B78274n69740m50k3959m26887j089288j899746k510205k544148j996149
41432a0782298j199155m73767j47J04603j37421m81342p26450j024717j640087
41423a6360781k418208k823574k584304j998971j442732q19669K41118J753861
$$ plain form
41415 -26453260 -23267273 -19330345 -15432032 -11931523 -8688899 -5481715 -2416198 143210
41407 143210 2020804 3473810 4929936 6571652 8242613 9659292 10614339 11077731 11264098
41398 11264098 11565027 12256029 13257948 14293115 15241823 16186446 17116257 17808242 18103742
41389 18103742 18150891 18237034 18460725 18656726 18523861 17687560 15769543 12686661 8965499
41380 8965499 5579218 3311299 2288737 2144611 2496591 3142681 3888998 4412226 4382185
41371 4382185 3643920 2250987 431138 -1406553 -2745511 -3223944 -2874458 -2055350 -1162119
41362 -1162119 -470761 -195063 -491297 -1306475 -2350517 -3366663 -4378257 -5527373 -6687304
41353 -6687304 -7398175 -7262505 -6330806 -5057686 -3965199 -3386936 -3377303 -3661627 -3699526 -3052630
$$ packed form
41415b6453260L185987L936928L898313L500509L242624L207184L065517K559408
41407A43210J877594J453006J456126J641716J670961J416679R55047M63392J86367
41398A1264098L00929O91002J001919J035167R48708R44623R29811O91985K95500
41389A8103742M7149Q6143K23691J96001j32865q36301j918017l082882l721162
41380H965499l386281k267919j022562j44126L51980O46090P46317N23228l0041
41371D382185p38265j392933j819849j837691j338958m78433L49486Q19108Q93231
41362a162119O91358K75698k96234q15178j044042j016146j011594j149116j159931
41353f687304p10871J35670R31699J273120J092487N78263R633k84324l7899O46896
$$ plain form
41343 -3052630 -1874145 -953726 -1084766 -2326536 -3945370 -5056168 -5218528 -4472183 -3095248
41334 -3095248 -1532432 -354120 107980 178470 633810 1893635 3524232 4667597 4832358
41325 4832358 4096538 2674176 619850 -1929971 -4453510 -6236637 -6899694 -6625123 -5804331
41316 -5804331 -4502849 -2363722 905711 4988832 8979258 11939227 13370487 13222298
41308 13222298 11751929 9587325 7708932 6948372 7366941 8295572 9051991 9478536 9784135
41299 9784135 10135058 10549170 10975099 11255254 11141352 10574693 9882825 9485299 9437469 9465817
41289 9465817 9435106 9553279 10065633 10952255 12039658 13264757 14673921 16192404 17482365
41280 17482365 18049445 17530931 15973918 13841096 11651041 9588712 7535856 5443855
$$ packed form
41343c052630J178485R20419j31040j241770j618834j110798j62360P46345J376935
41334c095248J562816J178312M62100P0490M55340J259825J630597J143365J64761
41325D832358p35820j422362k054326k549821k523539j783127o63057K74571Q20792
41316e804331J301482K139127L269433M083121L990426K959969J431260j48189
41308A3222298j470369k164604j878393p60560M18569R28631P56419M26545L05599
41299I784135L50923M14112M25929K80155j13902n66659o91868l97526m7830K8348
41289I465817l0711J18173N12354Q86622J087403J225099J409164J518483J289961
41280A7482365N67080n18514j557013k132822k190055k062329k052856k092001
$$ plain form
41272 5443855 3511002 1963243 840794 98031 -231437 -88839 507240 1527770 2979185
41263 2979185 4737131 6443181 7738464 8519666 8801164 8451434 7344276 5725755 4085808
41254 4085808 2556974 726916 -1759564 -4622386 -7196143 -9097202 -10356790 -10962208
41246 -10962208 -10607942 -9021462 -6321641 -2902015 890529 4766446 8262685 10763573
41238 10763573 11890179 11801004 11017598 9978221 8814077 7501120 6095809 4785489
41230 4785489 3810628 3408641 3740299 4732189 6000270 7047401 7570850 7515850 6864613
41221 6864613 5545188 3629355 1487528 -400413 -1760713 -2582357 -2945104 -2929914 -2658836
41212 -2658836 -2249372 -1676856 -793627 446584 1837669 3027146 3734944 3897921 3721429
$$ packed form
41272E443855j932853j547759j122449p42763l29468J42598N96079J020530J451415
41263B979185J757946J706050J295283P81202K81498l49730j107158j618521j639947
41254D085808j528834j830058k486480k862822k573757j901059j259588o05418
41246a0962208L54266J586480K699821L419626L792544L875917L496239K500888
41238A0763573J126606q9175p83406j039377j164144j312957j405311j310320
41230D785489r74861m01987L31658R91890J268081J047131N23449n5000o51237
41221F864613j319425j915833k141827j887941j360300q21644l62747J5190K71078
41212b658836M09464N72516Q83229J240211J391085J189477P07798J62977j76492
$$ plain form
41203 3721429 3609416 3882437 4430903 4707726 4181012 2795328 962915 -810386 -2214218
41194 -2214218 -3170360 -3762009 -4110585 -4179143 -3706778 -2489025 -731312 1044299 2490319
41185 2490319 3676097 4798881 5876783 6886547 8025826 9584552 11587071 13725580
41177 13725580 15583699 16737240 16721866 15240010 12540257 9394227 6516992 4059630
41169 4059630 1727864 -712062 -3133421 -5168961 -6565999 -7501654 -8558577 -10221271
41161 -10221271 -12312800 -14089866 -15000117 -15161195 -14938817 -14289834 -12871615 -10751395 -8659455
41152 -8659455 -7418531 -7297901 -7979913 -8955351 -9840484 -10471522 -10866529 -11093889 -11149604
41143 -11149604 -11001153 -10703452 -10332157 -9823096 -9082871 -8317073 -8043620 -8644427 -10029447
$$ packed form
41203C721429j12013K73021N48466K76823n26714j385684j832413j773301j403832
41194b214218r56142n91649l48576o8558M72365J217753J757713J775611J446020
41185B490319J185778J122784J077902J009764J139279J558726K002519K138509
41177A3725580J858119J153541j5374j481856k699753l146030k877235k457362
41169D059630k331766k439926k421359k035540j397038r35655j056923j662694
41161a0221271k091529j777066r10251j61078K22378O48983J418219K120220K091940
41152h659455J240924J20630o82012r75438q85133o31038l95007k27360n5715
41143a1149604J48451K97701L71295N09061P40225P65798K73453o00807j385020
$$ plain form
41134 -10029447 -11828449 -13717052 -15377095 -16333247 -16181068 -15029525 -13492869 -12126589
41126 -12126589 -10958295 -9609018 -7748781 -5343824 -2552142 458681 3525802 6381782
41118 6381782 8623530 9835686 9732988 8205321 5371903 1749614 -1702756 -3997981
41110 -3997981 -4779807 -4518045 -3946656 -3351502 -2455986 -876187 1452956 4210468 6850361
41101 6850361 8837907 9922099 10282487 10345332 10383643 10289658 9719635 8429834 6503491
41092 6503491 4309291 2232179 411766 -1239508 -2767255 -4023646 -4843632 -5269419
41084 -5269419 -5488298 -5622412 -5715431 -5873688 -6244503 -6822594 -7391391 -7690515 -7580513 -7077121
41074 -7077121 -6346925 -5670627 -5275317 -5141965 -5032503 -4702867 -4021597 -2941616 -1536742
$$ packed form
41134a0029447j799002j888603j660043r56152J52179J151543J536656J366280
41126a2126589J168294J349277J860237K404957K791682L010823L067121K855980
41118F381782K241748J212156j02698j527667k833418l622289l452370k295225
41110c997981p81826K61762N71389N95154Q95516J579799K329143K757512K639893
41101F850361J987546J084192L60388O2845L8311r3985n70023j289801j926343
41092F503491k194200k077112j820413j651274j527747j256391q19986m25787
41084e269419k18879j34114r3019j58257l70815n78091n68797k99124J10002N03392
41074g077121P30196O76298L95310J33352J09462L29636O81270J079981J404874
$$ plain form
41065 -1536742 -95399 1014486 1717454 2395548 3562849 5366935 7423348 9082128
41057 9082128 9834520 9560150 8495946 6991672 5271895 3401065 1400547 -676625
41049 -676625 -2738069 -4604642 -5999070 -6747560 -7045707 -7385564 -8119714 -9172338 -10241328
41040 -10241328 -11175422 -12034857 -12848795 -13461132 -13640981 -13277753 -12460863 -11421767 -10406507
41031 -10406507 -9559842 -8901988 -8410853 -8122406 -8157578 -8657459 -9660975 -11011309 -12412542
41022 -12412542 -13622607 -14547919 -15097720 -15061967 -14336640 -13259146 -12454016 -12167666 -11887254
41013 -11887254 -10827261 -8781149 -6349463 -4334258 -3064811 -2361776 -1979421 -1864952
41005 -1864952 -1972993 -2027827 -1658343 -746995 508443 1897717 3375797 4826774 5832512
$$ packed form
41065a536742J441343J109885P02968O78094J167301J804086K056413J658780
41057I082128P52392k74370j064204j504274j719777j870830k000518k077172
41049f76625k061444j866573j394428p48490k98147l39857p34150j052624j068990
41040a0241328r34094q59435q13938o12337j79849L63228Q16890J039096J015260
41031a0406507Q46665O57854M91135K88447l5172m99881j003516j350334j401233
41022a2412542j210065r25312n49801L5753P25327J077494Q05130K86350K80412
41013a1887254J059993K046112K431686K015205J269447P03035L82355J14469
41005a864952j08041n4834L69484R11348J255438J389274J478080J450977J005738
$$ plain form
40996 5832512 5936222 5140697 3978913 3086338 2832858 3299576 4327182 5485353 6219611
40987 6219611 6221597 5587452 4533971 3079637 1113406 -1317492 -3888092 -6088545 -7395023
40978 -7395023 -7520331 -6655975 -5391628 -4266801 -3432366 -2772524 -2182260 -1584960 -835559
40969 -835559 160714 1271134 2252403 3025730 3698127 4348886 4947041 5458403 5874505
40960 5874505 6111251 5990330 5353592 4165720 2572417 927941 -355515 -1151315 -1749932
40951 -1749932 -2484292 -3274747 -3718526 -3581495 -3003268 -2259792 -1585707 -1268747 -1642817
40942 -1642817 -2817564 -4545114 -6466337 -8381433 -10206003 -11812170 -13058390 -13916140
40934 -13916140 -14482644 -14930748 -15485168 -16301551 -17213921 -17655757 -17012642 -15179185 -12810733
$$ packed form
40996E832512J03710p95525j161784q92575k53480M66718J027606J158171P34258
40987F219611J986o34145j053481j454334j966231k430898k570600k200453j306478
40978g395023j25308Q64356J264347J124827Q34435O59842N90264N97300P49401
40969h35559R96273J110420R81269P73327O72397O50759N98155N11362M16102
40960E874505K36746j20921o36738j187872j593303j644476j283456p95800n98617
40951a749932p34360p90455m43779J37031N78227P43476O74085L16960l74070
40942a642817j174747j727550j921223j915096j824570j606167j246220q57750
40934a3916140n66504m48104n54420q16383r12370m41836O43115J833457K368452
$$ plain form
40925 -12810733 -10985600 -10439368 -10920889 -11321522 -10682967 -9203539 -8111718 -8429379 -9961178
40916 -9961178 -11581733 -12356343 -12215964 -11659041 -11042988 -10210579 -8692479 -6265155 -3395605
40907 -3395605 -1117806 -372468 -1445269 -4015290 -7531485 -11335410 -14592561 -16559344
40899 -16559344 -17136229 -16975357 -16854762 -17018343 -17194721 -17055396 -16430339 -15203062 -13317371
40890 -13317371 -10951946 -8473352 -6134392 -3999735 -2246204 -1286982 -1358323 -2108585 -2866317
40881 -2866317 -3289093 -3505106 -3630532 -3486190 -2959750 -2387931 -2285947 -2767742 -3448963
40872 -3448963 -3881294 -3888593 -3513907 -2874429 -2119069 -1330459 -376201 992519 2795324
40863 2795324 4702872 6375721 7820063 9273718 10803268 12155416 12996173 13187723
$$ packed form
40925a2810733J825133N46232m81521m00633O38555J479428J091821l17661j531799
40916i961178j620555p74610J40379N56923O16053Q32409J518100K427324K869550
40907c395605K277799P45338j072801k570021l516195l803925l257151j966783
40899a6559344n76885J60872J20595j63581j76378J39325O25057J227277J885691
40890a3317371K365425K478594K338960K134657J753531R59222p1341p50262p57732
40881b866317m22776k16013j25426J44342N26440N71819J01984m81795o81221
40872c448963m32331p299L74686O39478P55360P88610R54258J368720J802805
40863B795324J907548J672849J444342J453655J529550J352148Q40757J91550
$$ plain form
40855 13187723 12826529 12109953 11204759 10189347 9075592 7874230 6604169 5200355
40847 5200355 3453081 1135683 -1763214 -4966391 -8084160 -10821348 -12979629 -14315735
40839 -14315735 -14513550 -13362446 -10947002 -7643874 -3975761 -496050 2281068 4000576
40831 4000576 4573919 4111625 2765704 759866 -1430004 -3158673 -4050246 -4227554 -3907398
40822 -3907398 -2864237 -571195 3090680 7481266 11617615 14738791 16398493 16313644
40814 16313644 14459882 11284688 7568850 3974647 792246 -1921687 -4167631 -6069730
40806 -6069730 -7964291 -10184603 -12676306 -14921828 -16350051 -16809077 -16580468 -15993891 -15200117
40797 -15200117 -14367924 -13903875 -14262068 -15558703 -17498181 -19612698 -21403633 -22329456 -21990501
$$ packed form
40855A3187723l61194p16576r05194j015412j113755j201362j270061j403814
40847E200355j747274k317398k898897l203177l117769k737188k158281j336106
40839a4315735j97815J151104K415444L303128L668113L479711K777118J719508
40831D000576N73343m62294j345921k005838k189870j728669q91573j77308L20156
40822c907398J043161K293042L661875M390586M136349L121176J659702q4849
40814A6313644j853762l175194l715838l594203l182401k713933k245944j902099
40806f069730j894561k220312k491703k245522j428223m59026K28609N86577P93774
40797a5200117Q32193M64049l58193j296635j939478k114517j790935r25823L38955
$$ plain form
40788 -21990501 -20500475 -18524685 -16802435 -15695779 -15217540 -15241631 -15454439 -15249258 -14004967
40779 -14004967 -11564792 -8308466 -4739059 -1161720 2184839 4878961 6412758 6563702
40771 6563702 5587100 4015290 2322912 818716 -240733 -655369 -549426 -533759 -1347079
40762 -1347079 -3213792 -5632615 -7831316 -9312119 -9942401 -9790507 -9150341 -8634639 -8905314
40753 -8905314 -10136779 -11812982 -13108508 -13431703 -12651417 -10989657 -8809181 -6418110
40745 -6418110 -3950405 -1423979 1043068 3100585 4320319 4507988 3842902 2708991
40737 2708991 1438608 266923 -526083 -620226 32123 924576 1198337 239500 -1901979
40728 -1901979 -4605359 -7049822 -8531076 -8678425 -7558670 -5508435 -2778026 558232
$$ packed form
40788b1990501J490026J975790J722250J106656M78239k4091k12808K05181J244291
40779a4004967K440175L256326L569407L577339L346559K694122J533797J50944
40771F563702r76602j571810j692378j504196j059449m14636J05943J5667q13320
40762a347079j866713k418823k198701j480803o30282J51894O40166N15702k70675
40753h905314j231465j676203j295526l23195P80286J661760K180476K391071
40745f418110K467705K526426K467047K057517J219734J87669o65086j133911
40737B708991j270383j171685p93006r4143O52349Q92453K73761r58837k141479
40728a901979k703380k444463j481254j47349J119755K050235K730409L336258
$$ plain form
40720 558232 4265336 7725013 10299895 11861228 12727990 13103158 12816004 11675458 9843128
40711 9843128 7700864 5476010 3165498 811221 -1262264 -2550779 -2764183 -2168742
40703 -2168742 -1495898 -1405892 -2010039 -2916154 -3597951 -3556895 -2275723 556595 4545969
40694 4545969 8510934 11167484 11945805 11143653 9472658 7619882 6097160 5201582 5008562
40685 5008562 5489559 6647316 8432446 10524794 12345059 13401566 13636723 13427894 13254551
40676 13254551 13303556 13298036 12707963 11240671 9208670 7378431 6365872 6128188 6047103
40667 6047103 5523006 4491985 3368165 2530142 1954229 1361931 559751 -556332 -2252866
40658 -2252866 -4885820 -8387642 -11991485 -14696877 -15991543 -16013985 -15156305 -13778763 -12274022
$$ packed form
40720E58232L707104L459677K574882J561333Q66762L75168k87154j140546j832330
40711I843128k142264k224854k310512k354277k073485j288515k13404N95441
40703b168742O72844R0006o04147r06115o81797M1056J281172K832318L989374
40694D545969L964965K656550P78321q02152j670995j852776j522722q95578j93020
40685E008562M80997J157757J785130K092348J820265J056507K35157k08829j73343
40676A3254551M9005n520n90073j467292k032001j830239j012559k37684q1085
40667F047103n24097j031021j123820q38023n75913n92298q02180j116083j696534
40658b252866k632954l501822l603843k705392j294666k2442Q57680J377542J504741
$$ plain form
40649 -12274022 -11047992 -10217674 -9469982 -8395623 -6899538 -5191235 -3517902 -2116570
40641 -2116570 -1362041 -1661838 -3016168 -4750812 -5854222 -5694793 -4464543 -2937845 -1775419
40632 -1775419 -1038037 -357398 499789 1360368 1922925 2104151 1958884 1390352 192773
40623 192773 -1591948 -3552024 -5217631 -6363055 -6941246 -6904320 -6285631 -5407368 -4799830
40614 -4799830 -4802069 -5263895 -5677580 -5607944 -5001539 -4093911 -3056211 -1813642 -242575
40605 -242575 1583269 3506300 5567625 7903470 10285652 12032232 12595885 12111090 11170736
40596 11170736 10198676 9287304 8539534 8198643 8336229 8659865 8781230 8540400 7976473
40587 7976473 7140138 6085063 4955620 3935436 3112022 2448446 1869333 1365425 1070255
$$ packed form
40649a2274022J226030Q30318P47692J074359J496085J708303J673333J401332
40641b116570P54529k99797j354330j734644j103410J59429J230250J526698J162426
40632a775419P37382O80639Q57187Q60579N62557J81226j45267n68532j197579
40623A92773j784721j960076j665607j145424n78191L6926O18689Q78263O07538
40614d799830k239m61826m13685O9636O06405R07628J037700J242569J571067
40605b42575J825844J923031K061325K335845K382182J746580N63653m84795r40354
40596A1170736r72060r11372p47770l40891J37586L23636J21365k40830n63927
40587G976473q36335j055075j129443j020184q23414o63576n79113n03908k95170
$$ plain form
40578 1070255 1226435 1967201 3088287 4105020 4545884 4130952 2753702 523779 -2126163
40569 -2126163 -4604379 -6561871 -7982063 -8789096 -8603501 -7114504 -4575739 -1713004
40561 -1713004 808384 2672581 3784137 4106051 3659912 2546442 955077 -761185
40553 -761185 -2095115 -2647603 -2411814 -1734282 -1051098 -721064 -933789 -1530828 -1973087
40544 -1973087 -1744975 -837774 316372 1346078 2154696 2675697 2768008 2528327 2479798
40535 2479798 3204505 4828495 6976466 9158476 11094674 12725510 14033855 14895791
40527 14895791 15109276 14591284 13499334 12070415 10388458 8448261 6395377 4465826
40519 4465826 2644258 639312 -1637387 -3740863 -5038244 -5309178 -4873455 -4222017 -3663969
$$ packed form
40578A070255J56180P40766J121086J016733M40864m14932j377250k229923k649942
40569b126163k478216j957492j420192q07033J85595J488997K538765K862735
40561a713004K521388J864197J111556L21914m46139j113470j591365j716262
40553g61185j333930n52488K35789O77532O83184L30034k12725n97039m42259
40544a973087K28112R07201J154146J029706Q08618N21001R2311k39681m8529
40535B479798P24707J623990K147971K182010J936198J630836J308345Q61936
40527A4895791K13485n17992j091950j428919j681957j940197k052884j929551
40519D465826j821568k004946k276699k103476j297381k70934M35723O51438N58048
$$ plain form
40510 -3663969 -3227499 -2702478 -1818723 -590201 480312 691882 -292134 -2239772 -4684518
40501 -4684518 -7290085 -9791424 -11719141 -12430123 -11548943 -9359470 -6679765 -4307522
40493 -4307522 -2587811 -1476054 -870047 -738150 -970258 -1301881 -1498327 -1553294 -1634861
40484 -1634861 -1861924 -2147903 -2193391 -1603500 -116816 2163099 4747580 7000594 8413534
40475 8413534 8727424 7941779 6283793 4112614 1805369 -246948 -1613540 -2013033 -1627823
40466 -1627823 -1060590 -781807 -647538 -80107 1308523 3365655 5593043 7533356 8968352
40457 8968352 9884959 10319643 10201987 9365959 7790975 5818541 4013695 2747980 1964556
40448 1964556 1390699 926712 747266 1013953 1565188 1985631 2008812 1778783 1636751 1685014
$$ packed form
40510c663969M36470N25021Q83755J228522J070513K11570r84016j947638k444746
40501d684518k605567k501339j927717p10982Q81180K189473K679705K372243
40493d307522J719711J111757O06007J31897k32108l31623j96446n4967q1567
40484a634861k27063k85979m5488N89891J486684K279915K584481K253014J412940
40475H413534L13890p85645j657986k171179k307245k052317j366592l99493L85210
40466a627823N67233K78783J34269N67431J388630K057132K227388J940313J434996
40457H968352R16607M34684j17656q36028j574984j972434j804846j265715p83424
40448A964556n73857m63987j79446K66687N51235M20443K3181k30029j42032M8263
$$ plain form
40438 1685014 1662403 1262621 502041 -237563 -483462 -57603 644367 752311 -485222
40429 -485222 -3043400 -6094101 -8674971 -10314609 -11046324 -11094549 -10738180 -10289075 -9908136
40420 -9908136 -9451193 -8692290 -7703057 -6855007 -6450315 -6504965 -6906932 -7634745 -8767109
40411 -8767109 -10364606 -12347191 -14389642 -15960028 -16629592 -16419213 -15743192 -14936973 -13884523
40402 -13884523 -12146875 -9427473 -5915583 -2222603 1031969 3639336 5825248 7851524
40394 7851524 9664526 10989526 11650171 11641017 10971343 9670554 7970716 6279599 4893296
40385 4893296 3865225 3164609 2725409 2231076 1126794 -833655 -3102885 -4677442 -5003242
40376 -5003242 -4408959 -3617358 -3016900 -2518679 -1936570 -1243504 -472726 356680 1063127
$$ packed form
40438A685014k2611l99782p60580p39604k45899M25859P01970J07944j237533
40429d85222k558178l050701k580870j639638p31715m8225L56369M49105L80939
40420i908136M56943P58903R89233Q48050M04692n4650m01967p27813j132364
40411h767109j597497j982585k042451j570386o69564K10379O76021Q06219J052450
40402a3884523J737648K719402L511890L692980L254572K607367K185912K026276
40394G851524J813002J325000O60645r154o69674j300789j699838j691117j386303
40385D893296j028071p00616m39200m94333j104282j960449k269230j574557l25800
40376e003242N94283P91601O00458M98221N82109O93066P70778Q29406P06447
$$ plain form
40367 1063127 1228879 559291 -677432 -1743843 -2013693 -1367868 -77474 1448053 2721783
40358 2721783 3281386 3018139 2336102 1782666 1551060 1474554 1393932 1297104 1137438 762583
40348 762583 69563 -924660 -2144828 -3393604 -4266934 -4421129 -3971139 -3325081 -2526251
40339 -2526251 -1123102 1031715 3140624 4058371 3494251 2266749 1322548 847121 519692
40330 519692 361803 962011 2833055 5777187 9007403 11783293 13805729 15088149 15704525
40321 15704525 15792404 15633980 15477120 15250036 14636010 13513779 12198865 11153758 10557537
40312 10557537 10274085 10169545 10307694 10820014 11688199 12691301 13498871 13778097 13285357
40303 13285357 11982536 10133700 8235533 6731749 5746002 5164389 5015300 5640741 7354988
$$ packed form
40367A063127J65752o69588j236723j066411k69850O45825J290394J525527J273730
40358B721783N59603k63247o82037n53436k31606p6506q0622r6828j59666l74855
40348G62583o93020r94223j220168j248776q73330j54195M49990O46058P98830
40339b526251J403149K154817K108909R17747n64120j227502r44201m75427l27429
40330E19692j57889O00208J871044K944132L230216K775890K022436J282420O16376
40321A5704525Q7879j58424j56860k27084o14026j122231j314914j045107n96221
40312A0557537k83452j04540J38149N12320Q68185J003102Q07570K79226m92740
40303A3285357j302821j848836j898167j503784r85747n81613j49089O25441J714247
$$ plain form
40294 7354988 10000179 12997061 15803645 18163450 19952776 21058409 21502653 21458956 20968580
40285 20968580 19796704 17772135 15198561 12764984 11092313 10470799 10894629 12078622
40277 12078622 13422772 14215386 14064101 13136943 11988120 11199841 11114977 11696821 12524775
40268 12524775 13012461 12760390 11743816 10206042 8470136 6879538 5792963 5487547
40260 5487547 6031220 7267719 8897446 10554270 11898560 12782993 13362732 13938560 14600248
40251 14600248 15062279 14946579 14241938 13411312 12990320 13074696 13176400 12537853 10650738
40242 10650738 7669846 4462987 2164686 1467544 2242480 3856218 5824986 8093804
40234 8093804 10734175 13530455 15940322 17413241 17731335 17117113 16069127 15071338 14403605
$$ packed form
40294G354988K645191K996882K806584K359805J789326J105633M44244m3697m90376
40285B0968580j171876k024569k573574k433577j672671o21514M23830J183993
40277A2078622J344150P92614j51285r27158j148823p88279q4864N81844Q27954
40268A2524775M87686k52071j016574j537774j735906j590598j086575l05416
40260E487547N43673J236499J629727J656824J344290Q84433N79739N75828O61688
40251A4600248M62031j15700p04641q30626m20992Q4376J01704o38547j887115
40242A0650738k980892l206859k298301o97142P74936J613738J968768K268818
40234H093804K640371K796280K409867J472919L18094o14222j047986r97789o67733
$$ plain form
40225 14403605 14133639 14137653 14070008 13487023 12219893 10599819 9140785 8011936 6992564
40216 6992564 5921068 4948173 4284378 3912726 3665879 3439531 3257904 3298762 3912783
40207 3912783 5367082 7395903 9208418 10178222 10427370 10557766 10930201 11395358 11593975
40198 11593975 11264078 10328663 8957710 7552441 6446737 5597444 4739653 3826143 3093929
40189 3093929 2686489 2465976 2300921 2328652 2765755 3573157 4467273 5223773 5868279 6603046
40179 6603046 7648993 9157270 11159422 13493818 15778913 17582817 18753908 19561541
40171 19561541 20365632 21131079 21439443 21046074 20237267 19508594 19071675 18859811 18835941
40162 18835941 18992067 19088592 18679447 17477308 15584871 13409838 11491612 10295725 9901176
$$ packed form
40225A4403605k69966M014o7645n82985j267130j620074j459034j128849j019372
40216F992564j071496r72895o63795l71652k46847k26348j81627M0858O14021
40207C912783J454299K028821J812515R69804K49148J30396L72435M65157J98617
40198A1593975l29897r35415j370953j405269j105704q49293q57791r13510p32214
40189C093929m07440k20513j65055K7731M37103Q07402Q94116P56500O44506P34767
40179F603046J045947J508277K002152K334396K285095J803904J171091Q07633
40171A9561541Q04091P65447L08364l93369q08807p28673m36919k11864k3870
40162A8835941J56126R6525m09145j202139j892437k175033j918226j195887l94549
$$ plain form
40153 9901176 9882955 9733550 9424205 9352794 9755359 10431175 11093924 11741814 12589516 13837529
40143 13837529 15584303 17770773 20147786 22500183 24951023 27793271 30924500 33705203
40135 33705203 35537478 36413356 36826523 37423862 38868441 41660404 45702169 50174468
40127 50174468 54174215 57477262 60544806 63964905 68168857 73571943 80596111 89410733
40119 89410733 99793255 111293694 123445687 135861633 148318795 160883353 173990510
40112 173990510 188421446 205058059 224298690 245465928 266877188 286604597 303025394
40105 303025394 314624928 319782487 317363990 307593299 292078185 273001390 252445373
40098 252445373 232181621 213434489 196585064 181390758 167669220 155607802 145431137
$$ packed form
40153I901176j8221j49405l09345p1411M02565O75816O62749O47890Q47702J248013
40143A3837529J746774K186470K377013K352397K450840K842248L131229K780703
40135C3705203J832275Q75878M13167N97339J444579K791963M041765M472299
40127E0174468L999747L303047L067544L420099M203952N403086P024168Q814622
40119H9410733J0382522J1500439J2151993J2415946J2457162J2564558J3107157
40112A73990510J4430936J6636613J9240631K1167238K1411260J9727409J6420797
40105C03025394J1599534N157559k418497r770691j5515114j9076795k0556017
40098B52445373k0263752j8747132j6849425j5194306j3721538j2061418j0176665
$$ plain form
40091 145431137 137130000 130626253 125831030 122310479 119206682 115834227 112255706 109086454
40083 109086454 106916693 106158782 107252320 110604502 116261980 123865314 132975734 143293073
40075 143293073 154567307 166538483 179107169 192465605 206906993 222418008 238370811
40068 238370811 253519174 266284995 275137875 278854778 276680135 268580638 255532926
40061 255532926 239418863 222315839 205635961 189794054 174560031 159677796 145288230
40054 145288230 131951944 120292695 110516616 102227633 94731588 87532660 80590839 74252437
40046 74252437 69017899 65232620 62797640 61188429 59900109 58873448 58361029 58407304
40038 58407304 58649989 58666946 58319205 57642567 56571908 54969400 52882252 50630258 48651093
$$ packed form
40091A45431137q301137o503747m795223l520551l103797l372455l578521l169252
40083A09086454k169761p57911J093538L352182N657478P603334R110420J0317339
40075A43293073J1274234J1971176J2568686J3358436J4441388J5511015J5952803
40068B38370811J5148363J2765821Q852880L716903k174643q099497j3047712
40061B55532926j6114063j7103024j6679878j5841907j5234023j4882235j4389566
40054A45288230j3336286j1659249r776079q288983p496045p198928o941821o338402
40046G4252437n234538l785279k434980j609211j288320j026661n12419M6275
40038E8407304K42685J6957l47741o76638j070659j602508k087148k251994j979165
$$ plain form
40029 48651093 47343541 46965923 47450663 48241757 48501680 47698272 46039633 44288667 43149056
40020 43149056 42824829 43056936 43424836 43589846 43381723 42773614 41793508 40469362 38918895
40011 38918895 37488874 36664330 36707472 37420615 38365747 39279604 40143996 40870499 41122380
40002 41122380 40589838 39380413 38030837 37131262 36953421 37373412 38080587 38887649 39895117
39993 39895117 41353368 43379697 45897044 48855473 52320426 56152326 59679387 61940680
39985 61940680 62359021 61102546 58812689 56179583 53854627 52512460 52644934 54203310
39977 54203310 56574859 58973068 60780616 61529741 60769041 58191650 53950508 48753755
39969 48753755 43561016 39133437 35792320 33494425 32078031 31460401 31635356 32488939
$$ packed form
40029D8651093j307552l77618M84740P91094K59923q03408j658639j750966j139611
40020D3149056l24227K32107L67900J65010k08123o08109r80106j324146j550467
40011C8918895j430021q24544M3142P13143R45132R13857Q64392P26503K51881
40002D1122380n32542j209425j349576q99575j77841M19991P07175Q07062J007468
39993C9895117J458251K026329K517347K958429L464953L831900L527061K261293
39985F1940680M18341j256475k289857k633106k324956j342167J32474J558376
39977E4203310K371549K398209J807548P49125p60700k577391m241142n196753
39969D8753755n192739m427579l341117k297895j416394o17630J74955Q53583
$$ plain form
39961 32488939 33656077 34659034 35263655 35666547 36257247 37210326 38391446 39653840 41088597
39952 41088597 42886350 45035916 47324776 49689512 52476925 56264437 61403486 67739438
39944 67739438 74739860 81857705 88796714 95505108 101972795 108024793 113244026 117030655
39936 117030655 118747048 117923511 114500916 108997119 102422038 95895530 90182109 85459371
39928 85459371 81426868 77568689 73354281 68382528 62573589 56316886 50316891 45106387
39920 45106387 40626835 36329215 31747020 26972817 22559308 18997052 16371753 14545463
39912 14545463 13554564 13677661 15084503 17510040 20311121 22761781 24280061 24570979
39904 24570979 23777741 22453500 21151234 19959546 18562340 16765687 14773080 12880936
$$ packed form
39961C2488939J167138J002957O04621M02892N90700R53079J181120J262394J434757
39952D1088597J797753K149566K288860K364736K787413L787512N139049O335952
39944F7739438P000422P117845O939009O708394O467687O051998N219233L786629
39936A17030655J716393q23537l422595n503797o575081o526508n713421m722738
39928H5459371m032503l858179m214408m971753n808939o256703n999995n210504
39920D5106387m479552m297620m582195m774203m413509l562256k625299j826290
39912A4545463r90899J23097J406842K425537K801081K450660J518280K90918
39904B4570979p93238j324241j302266j191688j397206j796653j992607j892144
$$ plain form
39896 12880936 11148223 9566203 8395860 8086391 8896549 10755168 13399037 16435797
39888 16435797 19377638 21967073 24565656 27970885 32689034 38477819 44599902 50308871
39880 50308871 55049795 58499810 60649308 61689857 61629762 60160339 57108062 52905851
39872 52905851 48395244 44224446 40607669 37518828 34783102 31988551 28681300 24850849
39864 24850849 21051218 17883183 15465894 13536210 11942146 10851810 10492327 10822853
39856 10822853 11505409 12127903 12411372 12229282 11497658 10131859 8155777 5816639 3545181
39847 3545181 1834680 1184926 2029726 4494331 8152652 12146996 15652288 18211168
39839 18211168 19643654 19799882 18559725 16064625 12842462 9630767 7024555 5216963
$$ packed form
39896A2880936j732713j582020j170343l09469Q10158J858619K643869L036760
39888A6435797K941841K589435K598583L405229M718149N788785O122083N708969
39880E0308871M740924L450015K149498J040549o0095j469423l052277m202211
39872E2905851m510607m170798l616777l088841k735726k794551l307251l830451
39864B4850849l799631l168035k417289j929684j594064j090336l59483L30526
39856A0822853O82556O22494K83469j82090p31624j365799j976082k339138k271458
39847C545181j710501o49754Q44800K464605L658321L994344L505292K558880
39839A8211168J432486J56228j240157k495100l222163l211695k606212j807592
$$ plain form
39831 5216963 4026905 3195252 2692352 2749557 3602988 5221625 7259515 9234908 10797637
39822 10797637 11927990 12921525 14137699 15721816 17543484 19319114 20710913 21388248
39814 21388248 21191472 20294869 19069502 17703801 16074203 14078931 11960308 10105521
39806 10105521 8557599 6913539 4791811 2319023 68835 -1475972 -2365731 -3078238
39798 -3078238 -3969265 -4836448 -5058663 -4183324 -2364829 -246042 1518552 2596529 2934622
39789 2934622 2527608 1318408 -645503 -2986499 -5041203 -6266475 -6623624 -6487861 -6202487
39780 -6202487 -5863144 -5539126 -5454454 -5752539 -6210616 -6426301 -6272713 -5974065 -5706718 -5299681
39770 -5299681 -4402129 -2840955 -781503 1327112 2900077 3464595 2941486 1700997 287704
$$ packed form
39831E216963j190058q31653n02900N7205Q53431J618637K037890J975393J562729
39822A0797637J130353R93535J216174J584117J821668J775630J391799O77335
39814B1388248j96776q96603j225367j365701j629598j995272k118623j854787
39806A0105521j547922j644060k121728k472788k250188j544807q89759p12507
39798c078238q91027q67183k22215Q75339J818495K118787J764594J077977L38093
39789B934622m07014j209200j963911k340996k054704j225272l57149J35763K85374
39780f202487L39343L24018Q4672k98085m58077k15685J53588K98648K67347M07037
39770e299681Q97552J561174K059452K108615J572965N64518n23109j240489j413293
$$ plain form
39761 287704 -912874 -1768143 -2290216 -2516753 -2429149 -1916192 -894552 441599 1571553
39752 1571553 2007413 1716244 1084089 465095 -113750 -786606 -1539857 -2162638 -2417543
39743 -2417543 -2171714 -1440777 -431944 483496 971777 956693 605064 132710 -283712
39734 -283712 -446420 -177688 477100 1180021 1532751 1329958 525799 -936721 -3075010
39725 -3075010 -5597296 -7776932 -8701468 -7766411 -5104485 -1641944 1381822 3180112
39717 3180112 3816234 3842921 3632021 3172363 2423446 1595276 992069 752728 828522 1046848
39707 1046848 1098436 668955 -202427 -1003580 -1205799 -798425 -189151 373133 1046612 2063320
39697 2063320 3397573 4871742 6395877 7930826 9322420 10363468 11008860 11374354
$$ packed form
39761B87704j200578q55269n22073k26537Q7604N12957J021640J336151J129954
39752A571553M35860k91169o32155o18994n78845o72856p53251o22781k54905
39743b417543K45829P30937J008833R15440M88281j5084l51629m72354m16422
39734b83712j62708K68732O54788P02921L52730k02793q04159j462520k138289
39725c075010k522286k179636r24536R35057K661926L462541L023766J798290
39717C180112O36122K6687k10900m59658p48917q28170o03207k39341P5794K18326
39707A046848N1588m29481q71382q01153k02219M07374O09274N62284O73479J016708
39697B063320J334253J474169J524135J534949J391594J041048O45392L65494
$$ plain form
39689 11374354 11466168 11007804 9645188 7356689 4642217 2286135 916266 742916 1602705
39680 1602705 3116075 4802610 6227311 7210811 7883573 8428816 8774391 8613646 7713488
39671 7713488 6136389 4222212 2481834 1452687 1414017 2102304 2788944 2737106 1579327
39662 1579327 -679957 -3792027 -7243460 -10273185 -12198592 -12826512 -12470505 -11540288 -10172230
39653 -10172230 -8252716 -5708283 -2730737 236786 2722782 4514130 5797025 7005883
39645 7005883 8479276 10231855 12051521 13784964 15460404 17084750 18371042 18806682
39637 18806682 18101454 16550839 14872551 13649374 12918929 12217990 10930501 8677755
39629 8677755 5603925 2384227 -185375 -1755282 -2560279 -2952359 -2898488 -2032300 -92080
$$ packed form
39689A1374354R1814m58364j362616k288499k714472k356082j369869j73350Q59789
39680A602705J513370J686535J424701R83500O72762N45243L45575j60745r00158
39671G713488j577099j914177j740378j029147l8670O88287O86640n1838j157779
39662A579327k259284l112070l451433l029725j925407o27920L56007R30217J368058
39653a0172230J919514K544433K977546K967523K485996J791348J282895J208858
39645G005883J473393J752579J819666J733443J675440J624346J286292M35640
39637A8806682p05228j550615j678288j223177p30445p00939j287489k252746
39629H677755l073830l219698k569602j569907q04997l92080N3871Q66188J940220
$$ plain form
39620 -92080 2832130 6370577 9951346 12836495 14408348 14644930 14226124 14020060 14468654
39611 14468654 15465814 16625367 17467902 17465714 16226062 13766304 10496364 6864767 3113400
39602 3113400 -613697 -4118330 -7236659 -9934327 -12129878 -13511808 -13754348 -12916209
39594 -12916209 -11428510 -9644384 -7574326 -5123917 -2390987 422569 3249837 6098442
39586 6098442 8765432 10750113 11479278 10606086 8212652 4877855 1507314 -1089985
39578 -1089985 -2575086 -3086441 -2985816 -2645871 -2302729 -1880776 -1012429 520348 2326407
39569 2326407 3604824 3897494 3478151 2896951 2307193 1406658 -40864 -1786512 -3196436
39560 -3196436 -3716908 -3316024 -2572354 -2302952 -3005653 -4602127 -6639217 -8598193 -9971314
$$ packed form
39620i2080K924210L538447L580769K885149J571853K36582m18806k06064M48594
39611A4468654R97160J159553Q42535k188j239652k459758l269940l631597l751367
39602C113400l727097l504633l118329k697668k195551j381930k42540Q38139
39594a2916209J487699J784126K070058K450409K732930K813556K827268K848605
39586F098442K666990J984681P29165q73192k393434l334797l370541k597299
39578a089985j485101n11355J00625L39945L43142M21953Q68347J532777J806059
39569B326407J278417K92670m19343n81200n89758r00535j447522j745648j409924
39560c196436n20472M00884P43670K69402p02701j596474k037090j958976j373121
$$ plain form
39551 -9971314 -10211023 -8831112 -5669485 -1096249 4004882 8540915 11702240 13300315
39543 13300315 13630536 13046580 11781014 10125496 8509105 7244124 6348721 5767923 5637384
39534 5637384 6159965 7306511 8776318 10156695 10989554 10836845 9552458 7505642 5378403
39525 5378403 3726436 2780140 2491959 2527505 2283085 1208193 -812610 -3529158 -6705424
39516 -6705424 -10169102 -13488384 -15938717 -16985467 -16651442 -15306955 -13288313 -10877752
39508 -10877752 -8491851 -6650600 -5755011 -5971790 -7234540 -9189630 -11165341 -12386682
39500 -12386682 -12378304 -11218794 -9411417 -7464739 -5530603 -3439275 -1108122 1151051
39492 1151051 2837074 3747589 4142906 4420683 4739504 4956333 4787472 4010519 2682344
$$ packed form
39551i971314k39709J379911L161627M573236N101131M536033L161325J598075
39543A3300315L30221n83956j265566j655518j616391j264981q95403n80798j30539
39534E637384N22581J146546J469807J380377Q32859j52709j284387k046816k127239
39525E378403j651967r46296k88181L5546k44420j074892k020803k716548l176266
39516f705424l463678l319282k450333j046750L34025J344487K018642K410561
39508a0877752K385901J841251Q95589k16779j262750j955090j975711j221341
39500a2386682Q378J159510J807377J946678J934136K091328K331153K259173
39492A151051J686023R10515L95317K77777L18821K16829j68861p76953j328175
$$ plain form
39483 2682344 1247057 295355 86132 318309 364067 -356886 -2134515 -4755162 -7336304
39474 -7336304 -8593246 -7623190 -4562401 -462759 3451744 6473350 8644667 10533367
39466 10533367 12664996 14947817 16651895 17089145 16297654 14948951 13642138 12454903
39458 12454903 11174936 9784245 8627773 8195066 8811038 10492314 13009489 16008814
39450 16008814 19036772 21527952 22954033 23085026 22042334 20077267 17454311 14642758
39442 14642758 12409049 11403929 11584327 12172958 12261305 11465200 10108766 8927077 8575592
39433 8575592 9265597 10754807 12632773 14549234 16194458 17263725 17601178 17276159 16357089
39424 16357089 14686832 12054392 8550831 4618586 818369 -2302122 -4235487 -4716849
$$ packed form
39483B682344j435287r51702k09223K32177M5758p20953j777629k620647k581142
39474g336304j256942R70056L060789M099642L914503L021606K171317J888700
39466A0533367K131629K282821J704078M37250p91491j348703j306813j187235
39458A2454903j279967j390691j156472m32707O15972J681276K517175K999325
39450A6008814L027958K491180J426081J30993j042692j965067k622956k811553
39442A4642758k233709j005120J80398N88631Q8347p96105j356434j181689l51485
39433H575592O90005J489210J877966J916461J645224J069267L37453l25019r19070
39424A6357089j670257k632440l503561l932245l800217l120491j933365m81362
$$ plain form
39416 -4716849 -3961831 -2523722 -862733 852688 2618722 4513413 6696082 9179056
39408 9179056 11542525 13172701 13914204 14244083 14656191 15096143 15157719 14601209 13463734
39399 13463734 11865000 9987627 8142267 6583041 5283896 4070225 2882336 1699914
39391 1699914 311111 -1531351 -3691289 -5633690 -6900470 -7416007 -7276749 -6475456 -4993649
39382 -4993649 -3040436 -1057436 447631 1003409 269618 -1734877 -4444565 -6897414
39374 -6897414 -8185700 -7868557 -6115323 -3606359 -1281788 22246 -40176 -1116292 -2302237
39365 -2302237 -2617322 -1532923 773995 3565727 5925099 7126487 6886273 5493530
39357 5493530 3775132 2807129 3411598 5683069 8855711 11658679 12998188 12561043 10964442
$$ packed form
39416d716849P55018J438109J660989J715421J766034J894691K182669K482974
39408I179056K363469J630176P41503L29879M12108M39952O1576n56510j137475
39399A3463734j598734j877373j845360j559226j299145j213671j187889j182422
39391A699914j388803j842462k159938j942401j266780n15537J39258Q01293J481807
39382d993649J953213J983000J505067N55778p33791k004495k709688k452849
39374f897414j288286L17143J753234K508964K324571J304034o2422j076116j185945
39365b302237l15085J084399K306918K791732K359372J201388k40214j392743
39357E493530j718398r68003O04469K271471L172642K802968J339509m37145j596601
$$ plain form
39348 10964442 9374232 8824954 9606884 11074209 12075722 11798101 10357718 8586215
39340 8586215 7235578 6415400 5722767 4751579 3477020 2375796 2293396 3968452 7387235
39331 7387235 11585551 15236319 17462683 18076244 17258253 15328159 12800682 10320560
39323 10320560 8335505 6937392 6088633 5819013 6051060 6378426 6259444 5481027 4357511
39314 4357511 3471187 3253798 3764211 4766802 5976692 7214443 8312941 8952900 8756516
39305 8756516 7611224 5801346 3758933 1787230 80894 -1167183 -1879266 -2230136
39297 -2230136 -2450935 -2493970 -2087244 -1172204 -114959 622708 912794 951750 893838 627073
39287 627073 -58589 -1131005 -2187520 -2725207 -2626548 -2405009 -2896812 -4621658 -7398178
$$ packed form
39348A0964442j590210n49278P81930J467325J001513k77621j440383j771503
39340H586215j350637q20178o92633r71188j274559j101224q2400J675056L418783
39331G387235M198316L650768K226364O13561q17991j930094k527477k480122
39323A0320560j985055j398113q48759k69620K32047L27366j18982p78417j123516
39314D357511q86324k17389N10413J002591J209890J237751J098498O39959j96384
39305H756516j145292j809878k042413j971703j706336j248077p12083l50870
39297b230136k20799m3035M06726R15040J057245P37667K90086L8956n7912k66765
39287F27073o85662j072416j056515n37687R8659K21539m91803j724846k776520
$$ plain form
39278 -7398178 -10531058 -13322241 -15462832 -17105423 -18663484 -20466416 -22469755 -24231281
39270 -24231281 -25150697 -24744571 -22814720 -19568974 -15660987 -11936565 -8923166 -6547437
39262 -6547437 -4436306 -2466568 -931306 -206845 -364532 -1079233 -1790955 -1962200 -1332012
39253 -1332012 -18988 1622707 3217809 4430325 4993777 4937183 4759602 5078468 5931416
39244 5931416 6557584 6002443 3883638 579572 -3085493 -6209279 -8138104 -8771160 -8536560
39235 -8536560 -7901371 -6968209 -5688357 -4287446 -3166001 -2443640 -1938425 -1609860 -1668027
39226 -1668027 -2128323 -2573065 -2552070 -2005064 -1130487 -89902 912072 1456538 1150876
39217 1150876 20682 -1523039 -3037167 -4201085 -4767269 -4668129 -4185604 -3796180 -3828903
$$ packed form
39278g398178l132880k791183k140591j642591j558061j802932k003339j761526
39270b4231281r19416M06126J929851L245746L907987L724422L013399K375729
39262f547437K111131J969738J535262P24461j57687p14701p11722j71245O30188
39253a332012J313024J641695J595102J212516N63452n6594j77581L18866Q52948
39244E931416O26168n55141k118805l304066l665065l123786j928825o33056K34600
39235h536560O35189R33162J279852J400911J121445P22361N05215L28565n8167
39226a668027m60296m44742K0995N47006Q74577J040585J001974N44466l05662
39217A150876j130194j543721j514128j163918n66184R9140M82525L89424l2723
$$ plain form
39208 -3828903 -4425029 -5730600 -7803335 -10275840 -12401185 -13579674 -13677392 -12779202 -10910257
39199 -10910257 -8194102 -5079577 -2141977 306839 2291899 3986053 5625068 7483767
39191 7483767 9638744 11689578 12909192 12818425 11614801 10044762 8889340 8493864 8627950
39182 8627950 8735496 8406506 7707009 7088005 6980439 7447131 8138509 8530843 8273053
39173 8273053 7399062 6212267 4952146 3640425 2289410 1136538 529438 625010 1334422
39164 1334422 2532407 4171615 6191393 8460288 10822079 13033476 14602727 14879499
39156 14879499 13495866 10713119 7257595 3820632 713575 -2115108 -4857554 -7626366
39148 -7626366 -10343094 -12764964 -14587926 -15529415 -15409946 -14298240 -12586845 -10784093
$$ packed form
39208c828903n96126j305571k072735k472505k125345j178489r7718Q98190J868945
39199a0910257K716155L114525K937600K448816J985060J694154J639015J858699
39191G483767K154977K050834J219614r0767j203624j570039j155422l95476J34086
39182H627950J07546l28990o99497o19004j07566M66692O91378L92334k57790
39173H273053q73991j186795j260121j311721j351015j152872o07100R5572P09412
39164A334422J197985J639208K019778K268895K361791K211397J569251K76772
39156A4879499j383633k782747l455524l436963l107057k828683k742446k768812
39148g626366k716728k421870j822962r41489J19469J111706J711395J802752
$$ plain form
39140 -10784093 -9161509 -7693852 -6367508 -5377363 -4915836 -4943183 -5358723 -6266097 -7788131
39131 -7788131 -9633670 -11141663 -11882009 -12033954 -12046996 -12088567 -11994358 -11642576 -11138899 -10622358
39121 -10622358 -10090008 -9514096 -9009898 -8742193 -8699796 -8725364 -8852205 -9502139 -11148219
39112 -11148219 -13691380 -16260306 -17754332 -17619450 -16121045 -14004087 -12021613 -10673770
39104 -10673770 -10093694 -10027240 -10033335 -9819754 -9334087 -8514472 -7142818 -5115213 -2763386
39095 -2763386 -720349 522361 814936 201308 -1193012 -3082220 -5018610 -6594135
39087 -6594135 -7602749 -8014876 -7925037 -7546029 -7088897 -6571283 -5890939 -5168326 -4811494
39078 -4811494 -5028317 -5375677 -5018335 -3415154 -596800 3107148 7245197 11055194 13481083
$$ packed form
39140a0784093J622584J467657J326344R90145M61527k7347m15540r07374j522034
39131g788131j845539j507993p40346j51945j3042m1571R4209L51782N03677N16541
39121a0622358N32350N75912N04198K67705M2397k5568j26841o49934j646080
39112a1148219k543161k568926j494026J34882J498405K116958J982474J347843
39104a0673770N80076O6454o095K13581M85667Q19615J371654K027605K351827
39095b763386K043037J242710K92575o13628j394320j889208j936390j575525
39087f594135j008614m12127Q9839L79008M57132N17614O80344P22613L56832
39078d811494k16823l47360L57342J603181K818354L703948M138049L809997K425889
$$ plain form
39069 13481083 13794105 12227767 9795442 7420732 5342184 3361779 1497995 236280
39061 236280 114157 1100233 2424706 3087465 2609649 1328732 -12166 -916005 -1400957
39052 -1400957 -1787275 -2375618 -3299647 -4534707 -5995518 -7687501 -9738229 -12144844 -14477129
39043 -14477129 -16014176 -16308204 -15544847 -14289480 -13014149 -11976841 -11357167 -11180273 -11074617
39034 -11074617 -10376746 -8668453 -6171458 -3571913 -1535541 -396180 -137219 -527380
39026 -527380 -1314279 -2347418 -3447147 -4135491 -3701647 -1776051 1152160 3939986 5581578
39017 5581578 5813901 5094197 4200559 3851104 4437796 5869718 7637519 9117921 9877284
39008 9877284 9745815 8736639 7022583 4981034 3126685 1880415 1380987 1538200 2215233
$$ packed form
39069A3481083L13022j566338k432325k374710k078548j980405j863784j261715
39061B36280j22123R86076J324473O62759m77816j280917j340898r03839m84952
39052a400957l86318n88343r24029j235060j460811j691983k050728k406615k332285
39043a4477129j537047k94028P63357J255367J275331J037308O19674J76894J05656
39034a1074617O97871J708293K496995K599545K036372J139361K58961l90161
39026e27380p86899j033139j099729o88344M33844J925596K928211K787826J641592
39017E581578K32323p19704q93638l49455N86692J431922J767801J480402P59363
39008I877284j31469j009176j714056k041549j854349j246270m99428J57213O77033
$$ plain form
38999 2215233 3242548 4241757 4635793 4065920 2788239 1456512 471245 -255034 -824197
38990 -824197 -946153 -281754 979517 2247116 3234171 4218412 5515405 6958837 8048301
38981 8048301 8415022 8000574 6971866 5655850 4401841 3242664 1717888 -748122
38973 -748122 -4223613 -8086799 -11423540 -13524184 -14107482 -13324895 -11667338 -9763846 -8126785
38964 -8126785 -7002384 -6378398 -6085049 -5966988 -6067333 -6606319 -7652704 -8809492 -9342982
38955 -9342982 -8698397 -6903143 -4531594 -2355142 -959294 -515570 -810019 -1482054 -2220040
38946 -2220040 -2743607 -2771880 -2216382 -1375342 -724114 -452017 -364029 -304693 -497810 -1300488
38936 -1300488 -2687816 -4114858 -4879222 -4571988 -3266224 -1420138 374142 1646278
$$ packed form
38999B215233J027315R99209L94036n69873j277681j331727r85267p26279n69163
38990h24197j21956O64399J261271J267599R87055R84241J296993J443432J089464
38981H048301L66721m14448j028708j316016j254009j159177j524776k466010
38973g48122l475491l863186l336741k100644n83298P82587J657557J903492J637061
38964h126785J124401O23986K93349J18061j00345n38986j046385j156788n33490
38955i342982O44585J795254K371549K176452J395848M43724k94449o72035p37986
38946b220040n23567k8273N55498Q41040O51228K72097Q7988N9336j93117q02678
38936a300488j387328j427042p64364L07234J305764J846086J794280J272136
$$ plain form
38928 1646278 2176770 1993985 1352570 702810 513166 967477 1835097 2695763 3280250
38919 3280250 3588791 3790148 4115154 4783728 5876774 7235079 8553380 9593523 10261192
38910 10261192 10498896 10203563 9284148 7748943 5728403 3471244 1306703 -508475
38902 -508475 -1971822 -3281696 -4511097 -5394320 -5578393 -5117943 -4611901 -4745495 -5684504
38893 -5684504 -6926478 -7695039 -7447833 -6115237 -4060832 -1904876 -240644 698748 1154929
38884 1154929 1536835 1957618 2142373 1803878 990743 6624 -867460 -1413628 -1346807 -414888
38874 -414888 1285032 3259532 5005224 6334765 7235428 7597010 7342417 6771328 6445406
38865 6445406 6573719 6697069 6175179 4900136 3361915 2079141 1159611 397339 -430995
$$ packed form
38928A646278N30492j82785o41415o49760j89644M54311Q67620Q60666N84487
38919C280250L08541K01357L25006O68574J093046J358305J318301J040143O67669
38910A0261192K37704k95333r19415j535205k020540k257159k164541j815178
38902e08475j463347j309874j229401q83223j84073M60450N06042j33594r39009
38893e684504j241974p68561K47206J332596K054405K155956J664232R39392M56181
38884A154929L81906M20783J84755l38495q13135r84119q74084n46168O6821R31919
38874d14888J699920J974500J745692J329541R00663L61582k54593n71089l25922
38865F445406J28313J23350n21890j275043j538221j282774r19530p62272q28334
$$ plain form
38856 -430995 -1463881 -2799155 -4511927 -6668247 -9336950 -12460117 -15642070 -18207441
38848 -18207441 -19625312 -19847484 -19158848 -17797499 -15875709 -13623908 -11502819 -9953089
38840 -9953089 -9044596 -8378882 -7329417 -5444749 -2710728 551585 4008652 7437345
38832 7437345 10544544 12915970 14364140 15221554 16048188 17051497 17953408 18364568 18064222
38823 18064222 16961135 15115035 12930240 11093022 10114995 9989597 10319238 10630885 10568360
38814 10568360 10050666 9377819 8954831 8746278 8222462 7063296 5731891 5081486 5480586
38805 5480586 6522826 7465716 7726725 7130410 6068323 5424166 5984337 7774492 10122861
38796 10122861 12348447 14142482 15335576 15749118 15512966 15230391 15494781 16305023 17110173
$$ packed form
38856d30995j032886j335274j712772k156320k668703l123167l181953k565371
38848a8207441j417871k22172O88636J361349J921790K251801K121089J549730
38840i953089R08493O65714J049465J884668K734021L262313L457067L428693
38832G437345L107199K371426J448170Q57414Q26634J003309R01911M11160l00346
38823A8064222j103087j846100k184795j837218r78027j25398L29641L11647o2525
38814A0568360n17694o72847m22988k08553n23816j159166j331405o50405L99100
38805E480586J042240R42890K61009n96315j062087o44157N60171J790155K348369
38796A0122861K225586J794035J193094M13542k36152k82575K64390Q10242Q05150
$$ plain form
38787 17110173 17308683 16582545 14986818 13037095 11609936 11363359 12113554 12977514 13240097
38778 13240097 12943391 12564015 12334882 12108136 11785447 11586475 11768635 12216353 12443275
38769 12443275 11954547 10522917 8206573 5315572 2423650 221643 -872080 -1036512
38761 -1036512 -987780 -1611489 -3561128 -6929796 -11064045 -14763499 -16938248 -17237562 -16054445
38752 -16054445 -13988119 -11412583 -8496181 -5413097 -2440709 57267 1721398 2395260
38744 2395260 2272909 1739795 1052234 301335 -337962 -601093 -526566 -646354 -1536251 -3219624
38734 -3219624 -5169420 -6845894 -8078075 -8949357 -9476825 -9458963 -8591709 -6755322 -4235115
38725 -4235115 -1599503 719164 2683471 4465562 6143732 7702759 9188567 10626206
$$ packed form
38787A7110173J98510p26138j595727j949723j427159k46577P50195Q63960K62583
38778A3240097k96706l79376k29133k26746l22689j98972J82160M47718K26922
38769A2443275m88728j431630k316344k891001k891922k202007j093723j64432
38761a036512M8732o23709j949639l368668m134249l699454k174749k99314J183117
38752a6054445K066326K575536K916402L083084K972388K497976J664131O73862
38744B395260j22351n33114o87561p50899o39297k63131P4527j19788q89897j683373
38734c219624j949796j676474j232181q71282n27468J7862Q67254J836387K520207
38725d235115K635612K318667J964307J782091J678170J559027J485808J437639
$$ plain form
38717 10626206 11815051 12438641 12446387 12191991 12159149 12666111 13812787 15472852 17200770
38708 17200770 18316202 18321052 17284222 15752535 14282491 13087101 12081876 11158185 10338453
38699 10338453 9668508 9031242 8186810 7074120 6020537 5544341 5925111 7000418 8336673
38690 8336673 9510103 10266737 10568236 10529817 10202157 9364569 7649276 4970068 1782822
38681 1782822 -1136992 -3142613 -3960273 -3666867 -2599089 -1250557 -85900 647829 918105
38672 918105 706951 -135758 -1754053 -3932377 -5911099 -6738690 -6029438 -4425264 -3176967
38663 -3176967 -3142961 -4149899 -5240582 -5420241 -4240350 -1986969 469173 2155681 2648426
38654 2648426 2364661 2149454 2538910 3402966 4149209 4126035 2962895 837760 -1480557
$$ packed form
38717A0626206J188845O23590P746k54396l2842N06962J146676J660065J727918
38708A7200770J115432M850j036830j531687j470044j195390j005225r23691q19732
38699A0338453o69945o37266q44432j112690j053583m76196L80770J075307J336255
38690H336673J173430P56634L01499l8419l27660q37588j715293k679208l187246
38681A782822k919814k005621q17660K93406J067778J348532J164657P33729K70276
38672I18105k11154q42709j618295k178324j978722q27591P09252J604174J248297
38663c176967L4006j006938j090683j79659J179891K253381K456142J686508M92745
38654B648426k83765k15207L89456Q64056P46243k3174j163140k125135k318317
$$ plain form
38645 -1480557 -3054932 -3444119 -2959984 -2253924 -1722228 -1308646 -701615 414137 2174629
38636 2174629 4370060 6411412 7600706 7548103 6343168 4352226 1931751 -637843
38628 -637843 -3040122 -4891352 -5903877 -6085681 -5748296 -5291252 -4965765 -4828655 -4872474
38619 -4872474 -5129965 -5611537 -6141451 -6278691 -5467228 -3406365 -412898 2584968 4572421
38610 4572421 5141559 4740770 4239174 4214554 4584383 4809989 4405745 3318751 1917840
38601 1917840 662570 -202628 -639651 -611394 -59777 868474 1756761 2267576 2506650
38592 2506650 2860617 3460418 3975422 4018464 3634365 3274575 3338947 3826000 4394969 4685260
38582 4685260 4592706 4332950 4292057 4795190 5963585 7713000 9800828 11856605 13456493
$$ packed form
38645a480557j574375l89187M84135P06060N31696M13582O07031J115752J760492
38636B174629K195431K041352J189294n2603j204935j990942k420475k569594
38628f37843k402279j851230j012525j81804L37385M57044L25487J37110m3819
38619d872474k57491m81572n29914j37240Q11463K060863K993467K997866J987453
38610D572421N69138m00789n01596k4620L69829K25606m04244j086994j400911
38601A917840j255270q65198m37023K8257N51617R28251Q88287N10815K39074
38592B506650L53967N99801N15004M3042l84099l59790O4372M87053N68969K90291
38582D685260r2554k59756m0893N03133J168395J749415K087828K055777J599888
$$ plain form
38573 13456493 14282981 14273435 13647632 12823265 12269656 12313433 12974097 13993627 15079842
38564 15079842 16114538 17091409 17883200 18146133 17497408 15810397 13371741 10742528 8380292
38555 8380292 6332490 4339470 2283250 478099 -541731 -455521 695918 2681210
38547 2681210 5193114 7779610 9863684 10989878 11040040 10178680 8645267 6627682 4263867
38538 4263867 1718430 -690644 -2426048 -2907298 -1873181 416530 3340016 6221664
38530 6221664 8518923 9913490 10406813 10291801 9886692 9267420 8310463 6944432 5246401
38521 5246401 3325246 1278243 -675011 -2137971 -2733961 -2350497 -1174779 425701
38513 425701 1982436 2983722 3078875 2381480 1544399 1389953 2333702 4111765 6046037
$$ packed form
38573A3456493Q26488r546o25803q24367n53609M3777O60664J019530J086215
38564A5079842J034696R76871P91791K62933o48725j687011k438656k629213k362236
38555H380292k047802j993020k056220j805151j019830Q6210J151439J985292
38547B681210K511904K586496K084074J126194N0162q61360j533413k017585k363815
38538D263867k545437k409074j735404m81250J034117K289711K923486K881648
38530F221664K297259J394567M93323j15012m05109o19272r56957j366031j698031
38521E246401j921155k047003j953254j462960n95990L83464J175718J600480
38513D25701J556735J001286R5153o97395q37081j54446R43749J778063J934272
$$ plain form
38504 6046037 7544766 8363399 8515052 8102474 7269698 6181019 4936071 3553672 2122573
38495 2122573 922625 284698 312444 803982 1455270 2086031 2663313 3178014 3561844
38486 3561844 3734310 3716140 3668604 3783265 4129030 4635068 5191565 5676654 5908659 5767778
38476 5767778 5482643 5637013 6672290 8414036 10259556 11806350 13123966 14447558
38468 14447558 15853329 17277332 18577043 19407890 19250211 17817869 15395399 12602513
38460 12602513 9854958 7177443 4475559 1816139 -550833 -2296840 -3136502 -2998406
38452 -2998406 -2135780 -989414 88091 935190 1488813 1759974 1909502 2161110 2546408
38443 2546408 2869682 3031459 3262165 3882908 4923669 6176265 7588491 9322221 11252815
$$ packed form
38504F046037J498729Q18633J51653m12578q32776j088679j244948j382399j431099
38495B122573j199948o37927K7746M91538O51288O30761N77282N14701L83830
38486C561844J72466j8170m7536J14661L45765N06038N56497M85089K32005j40881
38476E767778k85135J54370J035277J741746J845520J546794J317616J323592
38468A4447558J405771J424003J299711Q30847j57679j432342k422470k792886
38460A2602513k747555k677515k701884k659420k366972j746007q39662J38096
38452b998406Q62626J146366J077505Q47099N53623K71161J49528K51608L85298
38443B546408L23274J61777K30706O20743J040761J252596J412226J733730J930594
$$ plain form
38434 11252815 12583372 12265085 9927769 6318860 2762866 226971 -1110882 -1593836
38426 -1593836 -1625735 -1456092 -1175049 -742338 -59988 883196 1944632 2946860 3816681
38417 3816681 4536443 5003977 5068438 4755481 4387783 4382385 4853184 5366276 5114419 3470312
38407 3470312 529408 -2833135 -5483166 -6677239 -6313935 -4734122 -2424871 127224
38399 127224 2497200 4394470 5689003 6343382 6353399 5800451 4946809 4206385 3929967
38390 3929967 4153274 4568385 4819978 4864386 4985578 5433414 6116388 6675049 6739920 6055590
38380 6055590 4543099 2472698 500172 -740192 -1131389 -987592 -478470 605992 2456148
38371 2456148 4902096 7638424 10518847 13363862 15684840 16955171 17094300 16388317
$$ packed form
38434A1252815J330557l18287k337316l608909l555994k535895j337853m82954
38426a593836l1899J69643K81043M32711O82350R43184J061436J002228Q69821
38417C816681P19762M67534O4461l12957l67698n398M70799N13092k51857j644107
38407C470312k940904l362543k650031j194073L63304J579813K309251K552095
38399A27224K369976J897270J294533O54379J0017n52948q53642p40424k76418
38390C929967K23307M15111K51593M4408J21192M47836O82974N58661O4871o84330
38380F055590j512491k070401j972526j240364l91197J43797N09122J084462J850156
38371B456148K445948K736328K880423K845015K320978J270331J39129p05983
$$ plain form
38363 16388317 15001111 12928167 10441134 8136302 6312603 4583952 2361584 -474825
38355 -474825 -3621433 -6857643 -10162611 -13381695 -16095005 -17864869 -18398956 -17480584 -15057984
38346 -15057984 -11558869 -7890205 -4885134 -2790408 -1390516 -492672 -83213 -65942 -116430
38337 -116430 48554 319678 222180 -667292 -2321359 -4261348 -5942665 -7121152 -7818613
38328 -7818613 -7994153 -7415457 -5942077 -3817127 -1521185 621713 2538318 4131279
38320 4131279 5130869 5344364 4945051 4395575 4142680 4465701 5510394 7258288 9404051
38311 9404051 11389016 12685568 13094853 12789617 12092425 11200461 10096632 8726982 7237192
38302 7237192 5928678 4921238 3992086 2945661 2119410 2284486 3915651 6681895 9768536
$$ packed form
38363A6388317j387206k072944k487033k304832j823699j728651k222368k836409
38355d74825l146608l236210l304968l219084k713310j769864n34087R18372K422600
38346a5057984L499115L668664L005071K094726J399892Q97844M09459J7271n0488
38337a16430J64984K71124r7498q89472j654067j939989j681317j178487o97461
38328g818613j75540N78696J473380K124950K295942K142898J916605J592961
38320D131279R99590K13495l99313n49476k52895L23021J044693J747894K145763
38311I404051J984965J296552M09285l05236o97192q91964j103829j369650j489790
38302G237192j308514j007440r29152j046425q26251J65076J631165K766244L086641
$$ plain form
38293 9768536 12568804 14883482 16553103 17229221 16691265 15267995 13745343 12805287 12609741
38284 12609741 12935283 13606867 14670343 16126562 17653651 18788162 19393098 19758511 20126374
38275 20126374 20271284 19757505 18550624 17152348 16122728 15689831 15870981 16678640 17954573
38266 17954573 19135444 19480020 18610915 16758598 14519206 12482025 10991331 10015094
38258 10015094 9178176 8096922 6776429 5568153 4682957 3905442 2913982 1752420 794141
38249 794141 281947 104584 86635 347910 1227271 2854469 4883364 6693462 7836657
38240 7836657 8266297 8176332 7728139 6994300 6076794 5128072 4234767 3380430 2539372 1697130
38230 1697130 750662 -469165 -1979963 -3548993 -4906376 -5971453 -6776226 -7273500 -7356418
$$ packed form
38293I768536K800268K314678J669621O76118n37956j423270j522652r40056j95546
38284A2609741L25542O71584J063476J456219J527089J134511O04936L65413L67863
38275B0126374J44910n13779j206881j398276j029620m32897J81150Q07659J275933
38266A7954573J180871L44576q69105j852317k239392k037181j490694r76237
38258A0015094q36918j081254j320493j208276q85196p77515r91460j161562r58279
38249G94141n12194j77363j7949K61275Q79361J627198K028895J810098J143195
38240G836657M29640q9965m48193p33839r17506r48722q93305q54337q41058q42242
38230A697130r46468j219827j510798j569030j357383j065077q04773m97274q2918
$$ plain form
38221 -7356418 -6971468 -6043810 -4384856 -1927048 941742 3524469 5391915 6652725
38213 6652725 7590136 8241403 8483369 8366844 8156915 8101427 8315000 8833956 9613343 10475064
38203 10475064 11200957 11694047 11945439 11851646 11199288 9875050 8009442 5897540 3873054
38194 3873054 2273831 1377068 1220023 1492819 1698136 1466546 742420 -274197 -1300852
38185 -1300852 -2095380 -2490204 -2399245 -1835151 -897052 300880 1675392 3086848 4200029
38176 4200029 4530104 3733983 1885795 -529492 -2859050 -4550131 -5353786 -5439783 -5296085
38167 -5296085 -5370805 -5748293 -6216162 -6639259 -7172963 -8059284 -9249614 -10258766 -10403583
38158 -10403583 -9267152 -7050562 -4493757 -2371163 -1003176 -228023 252930 620865
$$ packed form
38221g356418L84950R27658J658954K457808K868790K582727J867446J260810
38213F652725R37411O51267K41966j16525k09929n5488K13573N18956P79387Q61721
38203A0475064P25893M93090K51392r3793o52358j324238j865608k111902k024486
38194C873054j599223q96763j57045K72796K05317k31590p24126j016617j026655
38185a300852p94528l94824R0959N64094R38099J197932J374512J411456J113181
38176D200029L30075p96121j848188k415287k329558j691081q03655q5997J43698
38167e296085p4720l77488m67869m23097n33704q86321j190330j009152j44817
38158a0403583J136431K216590K556805K122594J367987P75153M80953L67935
$$ plain form
38150 620865 967352 1365538 1815532 2211591 2431804 2394607 2014849 1266048 416230 98041
38140 98041 936615 3021097 5761740 8266605 9877795 10462687 10311548 9750642 8792514
38131 8792514 7179978 4825363 2177556 79694 -777458 -332904 753634 1413132 746250
38122 746250 -1436664 -4561949 -7843687 -10888827 -13694604 -16138796 -17713469 -17881914
38114 -17881914 -16593443 -14331943 -11693823 -8983590 -6175480 -3175629 -90026 2754435
38106 2754435 5050113 6748682 8025485 9020387 9673854 9823018 9400012 8527805 7479696
38097 7479696 6539596 5806547 5099464 4132245 2834657 1461316 391737 -73968 279587
38088 279587 1570025 3616631 5816442 7424111 8047255 7850373 7309612 6836885 6596196
$$ packed form
38150F20865L46487L98186M49994L96059K20213l7197l79758p48801q49818l18189
38140I8041Q38574K084482K740643K504865J611190N84892j51139n60906r58128
38131H792514j612536k354615k647807k097862q57152M44554J086538O59498o66882
38122G46250k182914l125285l281738l045140k805777k444192j574673j68445
38114a7881914J288471K261500K638120K710233K808110K999851L085603K844461
38106B754435K295678J698569J276803R94902O53467J49164m23006q72207j048109
38097G479696r40100p33049p07083r67219j297588j373341j069579m65705L53555
38088B79587J290438K046606K199811J607669O23144j96882n40761m72727k40689
$$ plain form
38079 6596196 6548212 6597564 6690609 6748744 6535338 5762790 4487433 3294541 2838841 3150367
38069 3150367 3582788 3543603 3143035 3032737 3731673 5216779 7044967 8709440 9947365
38060 9947365 10887877 11915700 13263081 14709914 15766198 16140525 15943078 15474147 14975735
38051 14975735 14601984 14434720 14402278 14294813 13987551 13575553 13168468 12631136 11703193
38042 11703193 10363437 8889666 7496281 6074653 4420376 2617922 1051287 88361
38034 88361 -79406 684241 2474572 5060836 7724944 9659807 10632237 11159456 11952853
38025 11952853 13204479 14408310 14797976 13947626 12073551 9863163 7971212 6580507
38017 6580507 5418764 4185505 2880639 1676135 584773 -605540 -2113555 -4006897
$$ packed form
38079F596196m7984M9352R3045N8135k13406p72548j275357j192892m55700L11526
38069C150367M32421l9185m00568j10298O98936J485106J828188J664473J237925
38060I947365R40512J027823J347381J446833J056284L74327j97447m68931m98412
38051A4975735l73751j67264l2442j07465l07262m11998m07085n37332r27943
38042A1703193j339756j473771j393385j421628j654277j802454j566635r62926
38034H8361j67767P63647J790331K586264K664108J934863R72430N27219P93397
38025A1952853J251626J203831L89666q50350j874075k210388j891951j390705
38017F580507j161743j233259j304866j204504j091362j190313j508015j893342
$$ plain form
38009 -4006897 -6207926 -8463479 -10283617 -11121853 -10772893 -9523702 -7825209 -5900413
38001 -5900413 -3770101 -1554273 442855 1965426 3007507 3758090 4424146 5105474 5724093
37992 5724093 6009746 5640326 4539433 3107475 2116471 2231701 3464832 5038952 5900536
37983 5900536 5511588 4194892 2721109 1621130 908193 312767 -376593 -1146147 -1745915
37974 -1745915 -1840772 -1346808 -665947 -415753 -800367 -1333901 -1299484 -443812 855396 2056203
37964 2056203 2980750 3864530 4924682 5912447 6158007 5157166 3123077 861866 -918630
37955 -918630 -2074274 -2810868 -3233976 -3273722 -2912925 -2268815 -1490953 -761347 -349671 -423218
37945 -423218 -739934 -731742 -22972 1235163 2621756 3908839 5154296 6451826 7778712
$$ packed form
38009d006897k201029k255553j820138q38236L48960J249191J698493J924796
38001e900413K130312K215828J997128J522571J042081P50583O66056O81328O18619
37992E724093K85653l69420j100893j431958r91004J15230J233131J574120Q61584
37983E900536l88948j316696j473783j099979p12937n95426o89360p69554n99768
37974a745915r4857M93964O80861K50194l84614n33534L4417Q55672J299208J200807
37964B056203R24547Q83780J060152R87765K45560j000841k034089k261211j780496
37955i18630j155644p36594m23108l9746L60797O44110P77862P29606M11676p3547
37945d23218l16716Q192P08770J258135J386593J287083J245457J297530J326886
$$ plain form
37936 7778712 9091938 10418918 11758339 12925513 13569475 13400293 12432670 10993593 9465962
37927 9465962 8068853 6945998 6353245 6485866 7008731 6982403 5548759 2737311 -493910
37918 -493910 -2954981 -3865360 -3028404 -836365 1724729 3427596 3611314 2725696 1909412
37909 1909412 1973278 2841872 3858433 4354923 3871199 2137395 -796885 -4360098 -7568849
37900 -7568849 -9506593 -9793532 -8718391 -7044290 -5667176 -5261225 -6017960 -7586894 -9239981
37891 -9239981 -10167001 -9781899 -7939893 -4971524 -1512647 1743347 4217564 5544364
37883 5544364 5673611 4899404 3668944 2289438 873862 -414356 -1212922 -1201624 -444497
37874 -444497 633911 1590219 2173893 2276312 1921282 1397370 1184735 1523555 2104231
$$ packed form
37936G778712J313226J326980J339421J167174O43962j69182r67623j439077j527631
37927I465962j397109j122855n92753J32621N22865k6328j433644k811448l231221
37918d93910k461071r10379Q36956K192039K561094J702867J83718q85618q16284
37909A909412O3866Q68594J016561M96490m83724j733804k934280l563213l208751
37900g568849j937744k86939J075141J674101J377114M05951p56735j568934j653087
37891i239981r27020L85102J842006K968369L458877L255994K474217J326800
37883E544364J29247p74207j230460j379506j415576j288218p98566J1298P57127
37874d44497J078408R56308N83674J02419l55030n23912k12635L38820N80676
$$ plain form
37865 2104231 2368481 2130652 1772259 1816767 2452537 3498097 4650142 5628434 6208127
37856 6208127 6350943 6358163 6737854 7781618 9270781 10633253 11360256 11249396 10336338
37847 10336338 8750763 6701282 4499510 2454076 700421 -810644 -2129983 -3158739
37839 -3158739 -3698752 -3599815 -2826979 -1462442 266014 2003813 3449500 4546194 5408755
37830 5408755 6054340 6336670 6203771 5867611 5563687 5222889 4561556 3478855 2189691
37821 2189691 949941 -148129 -1013688 -1384637 -1039242 -156146 694271 959180 466606
37812 466606 -537508 -1555069 -2038046 -1623693 -349788 1338576 2850839 3778139 4056744
37803 4056744 3922157 3711810 3593107 3388630 2706420 1333521 -466727 -2055580 -2823374
$$ packed form
37865B104231K64250k37829l58393M4508O35770J045560J152045R78292N79693
37856F208127J42816P220L79691J043764J489163J362472P27003j10860r13058
37847A0336338j585575k049481k201772k045434j753655j511065j319339j028756
37839c158739n40013R8937P72836J364537J728456J737799J445687J096694Q62561
37830E408755O45585K82330j32899l36160l03924l40798o61333j082701j289164
37821B189691j239750j098070q65559l70949L45395Q83096Q50417K64909m92574
37812D66606j004114j017561m82977M14353J273905J688364J512263R27300K78605
37803D056744j34587k10347j18703k04477o82210j372899j800248j588853p67794
$$ plain form
37794 -2823374 -2557326 -1548922 -423372 226614 210442 -186982 -549974 -773675 -1119343
37785 -1119343 -1841317 -2872312 -3952352 -4983114 -6109856 -7431017 -8725621 -9529042
37777 -9529042 -9447388 -8391125 -6589999 -4466015 -2466020 -923670 -17955 182177 -295542
37768 -295542 -1269191 -2422776 -3491993 -4410515 -5195838 -5755413 -5983971 -6082747 -6579894
37759 -6579894 -7844411 -9599166 -11019433 -11322570 -10248676 -8078118 -5352088 -2618910
37751 -2618910 -335041 1160018 1733541 1611049 1347007 1424953 1801857 2011347 1853260
37742 1853260 1837450 2730252 4706928 7139601 9186027 10366636 10560224 9750698 8054318
37733 8054318 5963018 4347598 4021569 5145694 6992254 8389439 8550000 7505641
$$ packed form
37794b823374K66048J008404J125550O49986j6172l97424l62992k23701l45668
37785a119343p21974j030995j080040j030762j126742j321161j294604q03421
37777i529042Q1654J056263J801126K123984J999995J542350R05715K00132m77719
37768b95542r73649j153585j069217r18522p85323n59575k28558r8776m97147
37759f579894j264517j754755j420267l03137J073894K170558K726030K733178
37751b618910K283869J495059N73523j22492k64042P7946L76904K09490j58087
37742A853260j5810Q92802J976676K432673K046426J180609J93588q09526j696380
37733H054318k091300j615420l26029J124125J846560J397185J60561j044359
$$ plain form
37725 7505641 5764413 3753444 1763476 195276 -581266 -647880 -453481 -200242 354147
37716 354147 1325155 2275601 2638372 2335507 1718932 1125995 803478 1056017 2037112 3431554
37706 3431554 4705125 5676628 6531090 7269572 7502346 6883285 5465802 3540595 1413441
37697 1413441 -525266 -1811547 -2250630 -2132866 -1948366 -1973581 -2193405 -2427466 -2408206
37688 -2408206 -1961250 -1328213 -1134070 -1738070 -2662892 -2927056 -1983165 -170430 1748659
37679 1748659 3299245 4506699 5626993 6848289 8181481 9444576 10268802 10209931 9014023
37670 9014023 6861975 4312671 1931649 -18412 -1508107 -2497810 -2944558 -3009030 -3006115
37661 -3006115 -3045556 -2904977 -2421748 -1906231 -2000507 -3152458 -5301778 -7977436 -10562408
$$ packed form
37725G505641j741228k010969j989968j568200p76542o6614J94399K53239N54389
37716C54147R71008R50446L62771l02865o16575n92937l22517K52539R81095J394442
37706C431554J273571R71503Q54462P38482K32774o19061j417483j925207k127154
37697A413441j938707j286281m39083J17764J84500k5215k19824k34061J9260
37688b408206M46956O33037J94143o04000r24822k64164R43891J812735J919089
37679A748659J550586J207454J120294J221296J333192J263095Q24226n8871j195908
37670I014023k152048k549304k381022j950061j489695r89703m46748o4472K915
37661c006115l9441J40579M83229N15517r4276j151951k149320k675658k584972
$$ plain form
37652 -10562408 -12557254 -13821109 -14629662 -15389445 -16228253 -16890400 -17016609 -16469194 -15410243
37643 -15410243 -14146120 -12899587 -11676883 -10366872 -9019154 -7983917 -7673611 -8151793
37635 -8151793 -8986462 -9504419 -9186622 -7917865 -6009384 -4034303 -2558746 -1895883 -1979579
37626 -1979579 -2374136 -2447285 -1725217 -232848 1527966 2993382 3913171 4347517 4472165
37617 4472165 4505298 4679578 5068141 5455963 5545153 5285018 4855296 4316633 3420266 1811779
37607 1811779 -638838 -3666426 -6638700 -8792432 -9648473 -9289172 -8157401 -6588542
37599 -6588542 -4656461 -2446205 -260903 1527566 2691294 3153624 2957639 2330011 1620518
37590 1620518 1040453 563612 177884 72744 417095 1096647 1893281 2844044 4189794
$$ packed form
37652a0562408j994846j263855q08553p59783q38808o62147j26209N47415J058951
37643a5410243J264123J246533J222704J310011J347718J035237L10306m78182
37635h151793q34669n17957L17797J268757J908481J975081J475557O62863q3696
37626a979579l94557p3149P22068J492369J760814J465416R19789M34346J24648
37617D472165L3133J74280L88563L87822Q9190k60135m29722n38663q96367j608487
37607A811779k450617l027588k972274k153732q56041L59301J131771J568859
37599f588542J932081K210256K185302J788469J163728M62330j95985o27628p09493
37590A620518n80065m76841l85728j05140L44351O79552P96634R50763J345750
$$ plain form
37581 4189794 5994643 8026852 9983413 11567382 12321813 11733438 9748610 7037384
37573 7037384 4515563 2636883 1270336 158688 -708490 -1128661 -861249 265242 2203190
37564 2203190 4506942 6420546 7312230 7070744 6103087 5034220 4404277 4449868 4966605
37555 4966605 5398003 5215519 4295153 2944736 1656581 908676 1063042 2181295 3847805
37546 3847805 5336384 6104718 6126287 5749767 5358110 5215095 5479516 6171595 7114647
37537 7114647 8005246 8557088 8552198 7827393 6338166 4264684 1993433 -49097 -1571808
$$ packed form
37581D189794J804849K032209J956561J583969P54431n88375j984828k711226
37573G037384k521821j878680j366547j111648q67178m20171K67412J126491J937948
37564B203190K303752J913604Q91684k41486r67657j068867o29943M5591N16737
37555D966605M31398j82484r20366j350417j288155p47905J54366J118253J666510
37546C847805J488579P68334K1569l76520l91657j43015K64421O92079R43052
37537G114647Q90599N51842m890p24805j489227k073482k271251k042530j522711
$$ [...]
##END NTUPLES=NMR SPECTRUM
##END=
