##TITLE=31Pdec_SR160_rm1d
 , 64 sc
 17.1.2023
##JCAMPDX= 6.0         $$ Bruker NMR JCAMP-DX V2.0
##DATA TYPE= NMR SPECTRUM
##DATA CLASS= NTUPLES
##ORIGIN= UXNMR, Bruker Analytische Messtechnik GmbH
##OWNER= root
$$ XWIN-NMR		Version 3.5
$$ Tue Jan 17 14:37:16 2023 Russian Standard Time (UT+4h)  she@DPX200
##.OBSERVE FREQUENCY= 81.013821
##.OBSERVE NUCLEUS= ^31P
##.ACQUISITION MODE= SIMULTANEOUS
##.ACQUISITION SCHEME= undefined
##.AVERAGES= 64
##.DIGITISER RES= 16
##SPECTROMETER/DATA SYSTEM= spect
##.PULSE SEQUENCE= zgpg30
##.SOLVENT NAME= CDCl3
##.SHIFT REFERENCE= (INTERNAL, CDCl3, 0, 248.564)
##AUDIT TRAIL= $$ (NUMBER, WHEN, WHO, WHERE, WHAT)
$$ ##TITLE= Audit trail, XWIN-NMR		Version 3.5
$$ ##JCAMPDX= 5.01
$$ ##ORIGIN= Bruker BioSpin GmbH
$$ ##OWNER= she
$$ F:/spectra/data/she/nmr/P31/1/pdata/1/auditp.txt
$$ ##AUDIT TRAIL=  $$ (NUMBER, WHEN, WHO, WHERE, WHAT)
(   1,<2023-01-17 14:35:52.57 +0400>,<she>,<DPX200>,
      <continue with go, POWCHK disabled, PULCHK disabled
       configuration hash MD5:
       00 E9 B6 7A A2 85 ED C7 34 08 36 98 17 FE 4E 26
       data hash MD5: 32K
       BC 9D 12 B2 92 3D 0C 87 7C 01 86 10 BE C4 2C E6>)
(   2,<2023-01-17 14:36:01.25 +0400>,<she>,<DPX200>,
      <Start of raw data processing
       efp BC_mod = 2 LB = 1 FT_mod = 6 PKNL = 1 PHC0 = -11003.26 PHC1 = 158.2578 SI = 64K 
       data hash MD5: 64K
       DD DF 7E D2 57 3C A2 38 77 AA 23 92 62 D7 E9 4C>)
(   3,<2023-01-17 14:36:16.51 +0400>,<she>,<DPX200>,
      <pk PHC0 = -7.168406 PHC1 = 0 
       data hash MD5: 64K
       F1 15 B4 81 0D BD 96 21 2D 54 B9 69 1C DC F7 F4>)
(   4,<2023-01-17 14:36:40.20 +0400>,<she>,<DPX200>,
      <pk PHC0 = -31.52255 PHC1 = 93.60001 
       data hash MD5: 64K
       43 C1 83 9D EA 06 75 9C 0F A8 AD 6D 3E 60 7B 33>)
$$ ##END=
$$ 
$$ hash MD5
$$ BF 64 9B 1E C2 B4 CF E1 F9 EF 0E 04 A7 64 5D DF
##$RELAX= 
##$RELAX= 
##$RELAX= 
##$RELAX= 
##$RELAX= 
##$RELAX= 
##$RELAX= 
##$RELAX= 
##$RELAX= 
$$ Bruker specific parameters
$$ --------------------------
##$DU= <F:/spectra>
##$EXPNO= 1
##$NAME= <P31>
##$PROCNO= 1
##$TYPE= <nmr>
##$USER= <she>
##$AMP= (0..31)
100 100 100 100 100 100 100 100 100 100 100 100 100 100 100 100 100 100 
100 100 100 100 100 100 100 100 100 100 100 100 100 100 
##$AQSEQ= 0
##$AQ_mod= 1
##$AUNM= <au_zg>
##$AUTOPOS= <>
##$BF1= 81.014009
##$BF2= 200.13
##$BF3= 200.13
##$BF4= 200.13
##$BF5= 200.13
##$BF6= 200.13
##$BF7= 200.13
##$BF8= 200.13
##$BYTORDA= 1
##$CFDGTYP= 0
##$CFRGTYP= 5
##$CHEMSTR= <none>
##$CNST= (0..31)
1 1 145 1 1 1 1 1 1 1 1 1 1 1 1 1 1 1 1 1 1 1 1 1 1 1 1 1 1 1 1 1 
##$CPDPRG= <waltz16>
##$CPDPRG1= <>
##$CPDPRG2= <waltz16>
##$CPDPRG3= <>
##$CPDPRG4= <mlev>
##$CPDPRG5= <mlev>
##$CPDPRG6= <mlev>
##$CPDPRG7= <mlev>
##$CPDPRG8= <mlev>
##$CPDPRGB= <>
##$CPDPRGT= <>
##$D= (0..31)
0 1 0 0 0 0 0 0 0 0 0 0.03 2e-05 3e-06 0 0 0 0 0 0 0 0 0 0 0 0 0 0 0 0 
0 0 
##$DATE= 1673951654
##$DBL= (0..7)
120 120 120 11 120 120 24 19 
##$DBP= (0..7)
150 150 150 150 150 150 150 150 
##$DBP07= 0
##$DBPNAM0= <>
$$ [...]
##$SUBNAM2= <"">
##$SUBNAM3= <"">
##$SUBNAM4= <"">
##$SUBNAM5= <"">
##$SUBNAM6= <"">
##$SUBNAM7= <"">
##$SUBNAM8= <"">
##$SUBNAM9= <"">
##$SW= 501.771253377433
##$SWIBOX= (0..15)
0 1 3 0 0 0 0 0 0 0 0 0 0 0 0 0 
##$SW_h= 40650.406504065
##$TD= 32768
##$TD0= 1
##$TE= 0
##$TE2= 300
##$TE3= 300
##$TEG= 300
##$TL= (0..7)
0 120 53 12 22 120 120 120 
##$TP= (0..7)
150 150 150 150 150 150 150 150 
##$TP07= 0
##$TPNAME0= <>
##$TPNAME1= <>
##$TPNAME2= <>
##$TPNAME3= <>
##$TPNAME4= <>
##$TPNAME5= <>
##$TPNAME6= <>
##$TPNAME7= <>
##$TPOAL= (0..7)
0.5 0.5 0.5 0.5 0.5 0.5 0.5 0.5 
##$TPOFFS= (0..7)
0 0 0 0 0 0 0 0 
##$TUNHIN= 0
##$TUNHOUT= 0
##$TUNXOUT= 0
##$USERA1= <user>
##$USERA2= <user>
##$USERA3= <user>
##$USERA4= <user>
##$USERA5= <user>
##$V9= 5
##$VALIST= <valist>
##$VCLIST= <CCCCCCCCCCCCCCC>
##$VD= 0
##$VDLIST= <DDDDDDDDDDDDDDD>
##$VPLIST= <PPPPPPPPPPPPPPP>
##$VTLIST= <TTTTTTTTTTTTTTT>
##$WBST= 1024
##$WBSW= 4
##$XGAIN= (0..3)
0 0 0 0 
##$XL= 0
##$YL= 0
##$YMAX_a= 21479
##$YMIN_a= -27582
##$ZGOPTNS= <>
##$ZL1= 120
##$ZL2= 120
##$ZL3= 120
##$ZL4= 120
##$ABSF1= 0
##$ABSF2= 0
##$ABSG= 0
##$ABSL= 0
##$ALPHA= 0
##$AQORDER= 0
##$ASSFAC= 0
##$ASSFACI= 0
##$ASSFACX= 0
##$ASSWID= 0
##$AUNMP= <proc_1d>
##$AZFE= 0.1
##$AZFW= 0.5
##$BCFW= 0
##$BC_mod= 2
##$BYTORDP= 0
##$COROFFS= 0
##$CY= -3
##$DATMOD= 1
##$DC= 0
##$DFILT= <>
##$DTYPP= 0
##$F1P= 0
##$F2P= 0
##$FCOR= 1
##$FTSIZE= 65536
##$FT_mod= 6
##$GAMMA= 0
##$GB= 0
##$INTBC= 1
##$INTSCL= 6.047779e-11
##$ISEN= 30
##$LB= 1
##$LEV0= 0
##$LPBIN= 0
##$MAXI= 10000
##$MC2= 0
##$MEAN= 0
##$ME_mod= 0
##$MI= 50
##$NCOEF= 0
##$NC_proc= -6
##$NLEV= 6
##$NOISF1= 182.463
##$NOISF2= 159.3651
##$NSP= 0
##$NTH_PI= 0
##$NZP= 0
##$OFFSET= 248.5645
##$PC= 4
##$PHC0= -11041.95
##$PHC1= 251.8578
##$PH_mod= 1
##$PKNL= yes
##$PPARMOD= 0
##$PSCAL= 0
##$PSIGN= 0
##$REVERSE= no
##$SF= 81.0140089999694
##$SI= 65536
##$SIGF1= 159.3651
##$SIGF2= -187.1042
##$SINO= 113.3802
##$SIOLD= 16384
##$SREGLST= <1H.CDCl3>
##$SSB= 0
##$STSI= 65536
##$STSR= 0
##$SW_p= 40650.406504065
##$SYMM= 0
##$S_DEV= 0
##$TDeff= 32768
##$TDoff= 0
##$TI= <>
##$TILT= no
##$TM1= 0
##$TM2= 0
##$TOPLEV= 0
##$USERP1= <user>
##$USERP2= <user>
##$USERP3= <user>
##$USERP4= <user>
##$USERP5= <user>
##$WDW= 1
##$XDIM= 65536
##$YMAX_p= 437181389
##$YMIN_p= -76127718
$$ End of Bruker specific parameters
$$ ---------------------------------
##NTUPLES= NMR SPECTRUM
##VAR_NAME=  FREQUENCY,     SPECTRUM/REAL,   SPECTRUM/IMAG
##SYMBOL=    X,             R,               I
##VAR_TYPE=  INDEPENDENT,   DEPENDENT,       DEPENDENT
##VAR_FORM=  AFFN,          ASDF,            ASDF
##VAR_DIM=   65536,         65536,           65536
##UNITS=     HZ,            ARBITRARY UNITS, ARBITRARY UNITS
##FACTOR=    0.620285442955139, 1,           1
##FIRST=     20137.2065510682, 0,            0
##LAST=      -20513.1999529968, 0,           0
##MIN=       -20513.1999529968, -76127718,   0
##MAX=       20137.2065510682, 437181389,    0
$$ Real data points
##PAGE= N=1
##DATA TABLE= (X++(R..R)), XYDATA
$$ [...]
$$ plain form
42782 1268404 -394307 -1979430 -2412834 -1700810 -807474 -23242 1078445 2173672 2141478
42773 2141478 746878 -729968 -948995 60768 1162947 1353582 611068 -221221 -317255
42764 -317255 442533 1810761 3695928 5543277 5767685 3423609 368956 -260263 1773483
42755 1773483 3287524 2195242 216086 -292426 252317 450564 788601 2019160 2630024
42746 2630024 1103387 -777127 -336780 1358982 1052855 -1133798 -1755614 254257 2078948
42737 2078948 1991107 1819379 3001858 3852290 2777348 1132845 673184 776180 395467
42728 395467 354386 1373106 1980231 833840 -735049 -916032 -440553 -912444 -1691355
42719 -1691355 -1172805 7234 -150778 -1648889 -2624711 -2425911 -2147751 -2286556 -2005276
$$ packed form
42782A268404j662711j585123m33404P12024Q93336P84232J101687J095227l2194
42773B141478j394600j476846k19027J009763J102179J90635p42514q32289r6034
42764c17255P59788J368228J885167J847349K24408k344076l054653o29219K033746
42755A773483J514041j092282j979156n08512N44743J98247L38037J230559O10864
42746B630024j526637j880514M40347J695762l06127k186653o21816K009871J824691
42737B078948q7841j71728J182479Q50432j074942j644503m59661J02996l80713
42728C95467m1081J018720O07125j146391j568889j80983M75479m71891p78911
42719a691355N18550J180039j58012j498111r75822J98800K78160j38805K81280
$$ plain form
42710 -2005276 -746308 1136499 3196057 4846964 4962820 3142335 903720 -14578
42702 -14578 6470 -493017 -1393560 -1419835 -687800 -532109 -916689 -303075 1616549 3086263
42692 3086263 2720130 1172137 -61210 -145172 1029028 2923416 4255428 4060871 3014165
42683 3014165 2572656 2886367 2815437 1910200 1002964 837837 1367044 2304356 3158995 3015626
42673 3015626 1653346 533495 1168197 2877254 3787115 3615691 3582141 3898218 3483428
42664 3483428 2147370 1009477 667351 829741 1621155 3149543 4001419 2649627 345818
42655 345818 -84865 1504606 2511478 2192737 2951163 5830964 8110961 7443795 5635991
42646 5635991 5886309 8346513 10827529 12263256 13068709 13181166 11939521 9410709 6522878
$$ packed form
42710b005276J258968J882807K059558J650907J15856j820485k238615r18298
42702a4578K1048m99487r00543k6275P32035J55691l84580O13614J919624J469714
42692C086263l66133j547993j233347q3962J174200J894388J332012j94557j046706
42683C014165m41509L13711p0930r05237r07236j65127N29207R37312Q54639j43369
42673C015626j362280j119851O34702J709057R09861j71424l3550L16077m14790
42664C483428j336058j137893l42126J62390P91414J528388Q51876j351792k303809
42655C45818m30683J589471J006872l18741P58426K879801K279997o67166j807804
42646E635991K50318K460204K481016J435727Q05453J12457j241645k528812k887831
$$ plain form
42637 6522878 4547313 4999383 8444788 12589212 13627863 10794567 7523479 6700153
42629 6700153 7085656 6209825 4270185 2751583 1501689 34664 -252913 1696030 3804586
42620 3804586 3521611 1835393 1289522 1459027 304863 -1090464 275738 3586048 4431491
42611 4431491 1648319 -530246 1124302 4212790 4897148 3498306 2948028 3843665 4149009
42602 4149009 2777995 865490 -219610 -251710 381547 1267870 1963935 2124469 1655857
42593 1655857 643485 -473160 -852352 -231517 326544 -82402 -302395 1496039 4572270
42584 4572270 6019367 4950347 3906502 4954497 6640419 6534688 4907573 3745469
42576 3745469 3471034 2952048 2008736 1685753 2308893 3260727 4708138 7708465 12117993
$$ packed form
42637F522878j975565M52070L445405M144424J038651k833296l271088q23326
42629F700153L85503q75831j939640j518602j249894j467025k87577J948943K108556
42620C804586k82975j686218n45871J69505j154164j395327J366202L310310Q45443
42611D431491k783172k178565J654548L088488O84358j398842n50278Q95637L05344
42602D149009j371014j912505j085100l2100O33257Q86323O96065J60534m68612
42593A655857j012372j116645l79192O20835N58061m08946k19993J798434L076231
42584D572270J447097j069020j043845J047995J685922j05731j627115j162104
42576C745469k74435n18986r43312l22983O23140R51834J447411L000327M409528
$$ plain form
42567 12117993 15767443 16448572 14075972 10521344 7764946 6378596 5532794 4466753
42559 4466753 3887249 5259155 8435007 11000086 10887713 8877097 7301125 6819404 5964579
42550 5964579 3817691 1569541 839783 1539800 2252910 2189697 1963454 2493161 3654392
42541 3654392 4281827 3532229 2093847 1640855 2851673 4375932 4303204 2453825 582540
42532 582540 304515 1429087 2532959 2661201 2095481 1709107 1918035 2279626 2101209
42523 2101209 1534434 1829511 3913897 6654251 7433649 5238948 2592551 3146104 7272893
42514 7272893 11316125 11772927 9060765 6194549 4852621 4307723 3574880 2666357 1733542
42505 1733542 829293 791307 2474607 4671573 4983911 3653494 4044266 7591997 10676178
$$ packed form
42567A2117993L649450O81129k372600l554628k756398j386350q45802j066041
42559D466753n79504J371906L175852K565079j12373k010616j575972m81721q54825
42550E964579k146888k248150p29758P00017P13110o3213k26243N29707J161231
42541C654392O27435p49598j438382m52992J210818J524259p2728j849379j871285
42532E82540k78025J124572J103872J28242n65720l86374K08928L61591j78417
42523B101209n66775K95077K084386K740354P79398k194701k646397N53553M126789
42514G272893M043232M56802k712162k866216j341928n44898p32843r08523r32815
42505A733542r04249l7986J683300K196966L12338j330417L90772L547731L084181
$$ plain form
42496 10676178 9198982 4508944 1491960 1779133 2509295 1693975 914128 1631207 2299944
42487 2299944 1203070 -356771 -79697 1717973 2779240 2245387 1333657 1203655 1801637
42478 1801637 2569476 3016788 2791163 2199261 2408242 4209852 6763627 8306892 7962736
42469 7962736 6351344 4717969 3922226 3989173 4288890 4347598 4395038 4556336 3835300 1142888
42459 1142888 -2590328 -4789577 -4214151 -2219134 -474426 1088818 3141682 5169248
42451 5169248 6096782 5792568 4872256 3798835 3050918 3280697 4406955 5414929 5808331
42442 5808331 6234104 6966528 7103688 6215038 5375543 5407796 5515588 4969805 4673767 5487369
42432 5487369 6388375 6050452 4997648 4403482 4019266 3214556 2767200 3456997 4120498
$$ packed form
42496A0676178j477196m690038l016984K87173P30162q15320p79847P17079O68737
42487B299944j096874j559841K77074J797670J061267n33853r11730j30002N97982
42478A801637P67839M47312k25625n91902K08981J801610K553775J543265l44156
42469G962736j611392j633375p95743O6947K99717N8708M7440J61298p21036k692412
42459A142888l733216k199249N75426J995017J744708J563244K052864K027566
42451E169248R27534l04214r20312j073421p47917K29779J126258J007974L93402
42442E808331M25773P32424J37160q88650q39495L2253J07792n45783k96038Q13602
42432E487369R01006l37923j052804n94166l84216q04710m47356O89797O63501
$$ plain form
42423 4120498 3472100 2677546 3503023 5005041 4977802 3738160 3212336 3020191 1222363
42414 1222363 -1312317 -1463513 696257 1227952 -1592432 -4490861 -4412800 -2825714 -2276636
42405 -2276636 -1965370 9141 2476019 2829860 1338818 519576 1133867 1774942 1802084
42396 1802084 1878579 1946228 1330615 770081 1795296 3882131 4602647 3135091 1495511
42387 1495511 1481908 2234235 1922310 486404 -533175 -140450 1115294 1887447 1216878
42378 1216878 -618195 -2044299 -1490457 804617 2742755 2666797 1377209 1176083 2961272
42369 2961272 5043623 5280612 3805821 2755199 3400099 4659702 4880767 4000670 3053302
42360 3053302 2450395 1960577 1650956 1432552 353198 -1918950 -3488080 -2289954 487562
$$ packed form
42423D120498o48398p94554Q25477J502018k7239j239642n25824j92145j797828
42414A222363k534680j51196K159770N31695k820384k898429P8061J587086N49078
42405b276636L11266J974511K466878L53841j491042q19242O14291O41075K7142
42396A802084P6495O7649o15613n60534J025215K086835P20516j467556j639580
42387A495511j3603P52327l11925j435906j019579L92725J255744P72153o70569
42378A216878j835073j426104N53842K295074J938138p5958j289588k01126J785189
42369B961272K082351K36989j474791j050622O44900J259603K21065q80097r47368
42360C053302o02907m89818l09621k18404j079354k272148j569130J198126K777516
$$ plain form
42351 487562 1559232 272622 -622624 428023 1529541 1081450 639343 1738726 2574380
42342 2574380 821773 -2231972 -3551051 -2852894 -2026171 -1315580 333882 1905156 1178119
42333 1178119 -1048929 -1425513 691846 2121212 1071812 -105642 859811 2439655
42325 2439655 2244997 1082624 1171893 2062758 1381238 -1176030 -3335129 -3563118 -2670463
42316 -2670463 -1975284 -1692807 -1502530 -1326445 -1117465 -822606 -782355 -1348111 -1986835 -1615633
42306 -1615633 -91139 1329775 1415477 443554 -150721 474678 1509506 1494577 347876
42297 347876 -233146 1079163 3256061 4082374 3032532 1679559 1189108 946496 228114
42288 228114 -298985 167680 1008473 1210772 1113735 1712568 2770605 3069170 2289973 1295198
$$ packed form
42351D87562J071670j286610q95246J050647J101518m48091m42107J099383Q35654
42342B574380j752607l053745j319079O98157Q26723P10591J649462J571274p27037
42333A178119k227048l76584K117359J429366j049400j177454R65453J579844
42325B439655j94658j162373Q9269Q90865o81520k557268k159099k27989Q92655
42316b670463O95179K82477J90277J76085K08980K94859M0251n65756o38724L71202
42306a615633J524494J420914Q5702r71923n94275O25399J034828j4929j146701
42297C47876n81022J312309K176898Q26313j049842j352973m90451k42612p18382
42288B28114n27099M66665Q40793K02299r7037N98833J058037K98565p79197r94775
$$ plain form
42278 1295198 607998 -65802 -681129 -514512 606235 1830707 2632537 3704954 5710182
42269 5710182 7774771 8221200 6658708 4518125 3347604 3199975 3055010 2366911 1580079
42260 1580079 1219648 1146158 1011192 997738 1623378 2948020 4326456 4908774 4284391
42251 4284391 2890754 1863955 1973079 2517167 2050757 615384 185560 1967775 4322453
42242 4322453 4828655 3583576 2606411 2526449 2132381 1156464 1000675 2101719 2947711
42233 2947711 2697936 2510102 2963538 2449179 -18724 -2386348 -2251844 -464741 392653
42224 392653 -75594 -292368 27048 -296980 -1083636 -668648 1042723 1970462 1067119
42215 1067119 -49276 348457 1706956 2456622 2256546 1886804 1920334 2399967 3069453
$$ packed form
42278A295198o87200o73800o15327J66617J120747J224472Q01830J072417K005228
42269E710182K064589M46429j562492k140583j170521j47629j44965o88099p86832
42260A580079l60431p3490j34966j3454O25640J324642J378436N82318o24383
42251D284391j393637j026799J09124N44088m66410j435373m29824J782215K354678
42242D322453N06202j245079r77165p9962l94068r75917j55789J101044Q45992
42233B947711k49775j87834M53436n14359k467903k367624J34504J787103Q57394
42224C92653m68247k16774L19416l24028p86656M14988J711371R27739r03343
42215A067119j116395L97733J358499P49666k00076l69742L3530M79633O69486
$$ plain form
42206 3069453 3328407 2696150 1683918 1381734 1955972 2507486 2552400 2490385 2439048 1962948
42196 1962948 1298488 1388653 2143271 2123434 737434 -588050 -338130 1167064 2677873
42187 2677873 3682330 4170161 3823960 2601462 1321426 683399 451867 370140 837229
42178 837229 1760839 1957817 953913 234048 1152731 2555984 2272220 326151 -1208923
42169 -1208923 -1195249 -352646 672196 2133645 3784794 4595418 4623535 5493475 7892254
42160 7892254 9865981 9002391 5647410 2651365 2118216 3455938 4686476 4740139 3988068
42151 3988068 3064208 1978904 643228 -234947 463058 2794135 5244505 6167014 5375591
42142 5375591 3826685 2143942 300341 -1368947 -1913201 -1031223 91730 -27701 -1313447
$$ packed form
42206C069453K58954o32257j012232l02184N74238N51514M4914o2015n1337m76100
42196A962948o64460R0165P54618j9837j386000j325484K49920J505194J510809
42187B677873J004457M87831l46201j222498j280036o38027k31532q1727M67089
42178H37229R23610J96978j003904p19865R18683J403253k83764j946069j535074
42169a208923J3674Q42603J024842J461449J651149Q10624K8117Q69940K398779
42160G892254J973727q63590l354981k996045n33149J337722J230538N3663p52071
42151C988068r23860j085304j335676q78175O98005K331077K450370R22509p91423
42142E375591j548906j682743j843601j669288n44254Q81978J122953j19431j285746
$$ plain form
42133 -1313447 -2096169 -1072354 1151868 2820085 3105755 2927803 3572940 4999806 5995352
42124 5995352 5798782 4971112 4568462 4929374 5490525 5486255 4635084 3349436 2411310 2324279
42114 2324279 2967217 3938169 5003085 5985222 6530050 6358789 5508651 4074421 2230091
42105 2230091 813716 947539 2320037 2943750 1858129 922349 2121442 4170166 4302062
42096 4302062 2759589 2395724 3844155 4610584 3720258 3523482 5213826 6246568 4817902
42087 4817902 3550204 5245261 7717786 7034269 4006424 2883698 4533034 5606233
42079 5606233 4455895 3316537 3766794 4184255 3240637 2372141 2835637 3208544 1898962
42070 1898962 -151605 -1220125 -1303416 -1080957 -212163 1476364 2689650 2436413 1848338
$$ packed form
42133a313447p82722J023815K224222J668217K85670j77952O45137J426866R95546
42124E995352j96570q27670m02650L60912N61151m270q51171j285648r38126q7031
42114B324279O42938R70952J064916R82137N44828j71261q50138j434230j844330
42105B230091j416375J33823J372498O23713j085621r35780J199093K048724J31896
42096D302062j542473l63865J448431P66429q90326j96776J690344J032742j428666
42087D817902j267698J695057K472525o83517l027845j122726J649336J073199
42079E606233j150338j139358M50257M17461r43618q68496M63496L72907j309582
42070A898962k050567j068520q3291K22459Q68794J688527J213286k53237n88075
$$ plain form
42061 1848338 2481651 3844810 4243512 3264310 1998518 1450155 1808325 2622175 2932264
42052 2932264 2128250 1232824 2016708 4157697 4918563 2735037 -412511 -1444851 377689
42043 377689 3571872 6425421 7629019 6580584 4534808 3877955 4816078 4594432 1683981
42034 1683981 -1334491 -1322697 936957 2560756 3152611 4311154 5735765 5442993 3501649
42025 3501649 2173993 2308832 2709010 3136312 4618774 6343571 5736301 2753998 881572
42016 881572 2209338 4281622 3793034 1122917 -918790 -999819 251586 2195294 4378011
42007 4378011 5722220 5502747 4549998 3964647 3413457 2227321 1274128 1833637 3185953
41998 3185953 3390361 2375676 2249679 4135909 6463841 7235634 6648532 6331186 6780983
$$ packed form
42061A848338O33313J363159L98702r79202j265792n48363L58170Q13850L10089
42052B932264q04014q95426P83884K140989P60866k183526l147548j032340J822540
42043C77689L194183K853549J203598j048435k045776o56853R38123k21646k910451
42034A683981l018472J1794K259654J623799N91855J158543J424611k92772j941344
42025C501649j327656J34839M00178M27302J482462J724797o07270k982303j872426
42016H81572J327766K072284m88588k670117k041707q1029J251405J943708K182717
42007D378011J344209k19473r52749n85351n51190j186136r53193N59509J352316
41998C185953K04408j014685j25997J886230K327932P71793n87102l17346M49797
$$ plain form
41989 6780983 6832202 5528589 3471234 1971961 1542243 1769780 2290492 3093119 3865848
41980 3865848 3932134 3302261 3071504 4025772 5339640 5535234 4432714 3210592 2700301
41971 2700301 2660682 2804008 3498512 5056055 6984863 8278123 8117025 6428229 4252481
41962 4252481 3168464 3534605 3796859 2722589 1794598 3585998 7792621 10985573 10981629
41953 10981629 9551027 9673783 11732586 13841669 14701850 14612985 14565008 15766763 19320469
41944 19320469 24978836 30961862 36442591 43337523 53583462 64892887 71434831 69434863
41936 69434863 60737807 50344868 41780767 35486207 30255376 24850139 18845049 13174074
41928 13174074 9707934 9310672 10326812 9950761 7374911 4730479 4318173 5605347
$$ packed form
41989F780983N1219j303613k057355j499273m29718K27537N20712Q02627P72729
41980C865848O6286o29873k30757R54268J313868J95594j102520j222122n10291
41971B700301l9619J43326O94504J557543J928808J293260j61098j688796k175748
41962D252481j084017L66141K62254j074270r27991J791400M206623L192952l944
41953A0981629j430602J22756K058803K109083Q60181q8865m7977J201755L553706
41944A9320469N658367N983026N480729O894932J0245939J1309425O541944j999968
41936F9434863q697056j0392939q564101o294560n230831n405237o005090n670975
41928A3174074l466140l97262J016140l76051k575850k644432m12306J287174
$$ plain form
41920 5605347 5989851 4282415 2122775 1523392 2231173 2571683 2085142 1863525 2491580
41911 2491580 3167459 3208296 3155958 3698103 4403415 4361200 3579537 3033426 3519970 4876011
41901 4876011 6190110 6643741 6347375 6267729 6974448 7733517 7499286 6540869 6201175
41892 6201175 7225125 9308614 12035436 14941595 16789110 16411211 14495393 12929698
41884 12929698 12159920 11044209 9639208 9739090 11647020 12843857 11539350 9464211
41876 9464211 9181996 10508331 11802696 13067768 15217948 17762595 20012885 23305502
41868 23305502 28961218 35196606 39682108 44388763 53492687 66042463 75089576 75640378
41860 75640378 69749233 61914810 53314440 43600130 35113721 30941101 30047777 28375918
$$ packed form
41920E605347L84504j707436k159640n99383P07781L40510m86541k21617O28055
41911B491580O75879M0837n2338N42145P05312m2215p81663n46111M86544J356041
41901D876011J314099M53631k96366p9646P06719P59069k34231r58417l39694
41892F201175J023950K083489K726822K906159J847515l77899j915818j565695
41884A2929698p69778j115711j405001R9882J907930J196837j304507k075139
41876I464211k82215J326335J294365J265072K150180K544647K250290L292617
41868B3305502N655716O235388M485502M706655R103924J2549776R047113N50802
41860G5640378n891145p834423q600370r714310q486409m172620q93324j671859
$$ plain form
41852 28375918 24848524 23094444 26366975 32923618 37560300 36648677 31021265 24569342
41844 24569342 20413533 18304302 15952094 12715918 10647733 11234560 12732942 12413103
41836 12413103 10396144 9188853 9820497 10570207 9746220 7875907 6488949 6120517 6336615
41827 6336615 6823898 7686394 9139494 11404361 14669587 18958874 24040396 29082951
41819 29082951 32227681 31453629 26773900 20821777 16159568 12806770 9802752 8114880
41811 8114880 9533112 12929890 14440923 12153197 8252696 5469594 3760387 2093339
41803 2093339 1220832 2222539 3812463 3860380 2881948 3352403 5734639 7739654 7818834
41794 7818834 7021580 6683671 6383894 5267459 3716742 2562379 2014945 2413315 4561069
$$ packed form
41852B8375918l527394j754080L272531O556643M636682r11623n627412o451923
41844B4569342m155809k109231k352208l236176k068185N86827J498382l19839
41836A2413103k016959j207291O31644P49710q23987j870313j386958l68432K16098
41827F336615M87283Q62496J453100K264867L265226M289287N081522N042555
41819B9082951L144730p74052m679729n952123m662209l352798l004018j687872
41811H114880J418232L396778J511033k287726l900501k783102j709207j667048
41803B093339q72507J001707J589924M7917r78432M70455K382236K005015P9180
41794G818834p97254l37909k99777j116435j550717j154363n47434L98370K147754
$$ plain form
41785 4561069 8024014 10496768 10509994 9636717 10140559 11379408 10870527 8536927 7261474
41776 7261474 8709837 10978928 11580751 10884264 11036210 12869337 15700159 19272213 23872043
41767 23872043 28835389 32978873 36827187 42590470 51031485 59595671 64633884 64599636
41759 64599636 60196857 52491258 42494528 32216365 24283538 19841734 17739074 16189147
41751 16189147 14392086 12206931 9441371 6426905 4447473 4363435 5185624 5133215 3859951
41742 3859951 2508479 1778458 1308051 1001182 1378969 2093522 1623732 -547025 -2612293
41733 -2612293 -2462696 -227905 2203034 3390405 3069104 1633335 213467 422249 2512865
41724 2512865 4490575 4639423 4112824 4995283 6535860 6037837 3435954 1939709 3294835
$$ packed form
41785D561069L462945K472754J3226q73277N03842J238849n08881k333600j275453
41776G261474J448363K269091O01823o96487J51946J833127K830822L572054M599830
41767B3872043M963346M143484L848314N763283Q441015Q564186N038213l4248
41759F4599636m402779p705599r996730j0278163p932827m441804k102660j549927
41751A6189147j797061k185155k765560l014466j979432q4038Q22189n2409j273264
41742C859951j351472p30021m70407l06869L77787P14553m69790k170757k065268
41733b612293J49597K234791K430939J187371l21301j435769j419868K08782K090616
41724B512865J977710J48848n26599Q82459J540577m98023k601883j496245J355126
$$ plain form
41715 3294835 5286059 5445607 4649919 4937213 5899998 5883111 5362657 6288526 8609785
41706 8609785 10024184 9251390 7558162 6833799 7714607 9699346 11746758 12773649 12804551
41697 12804551 13441888 15986968 19550889 22461931 24918415 28354703 32665196 36402120
41689 36402120 39659737 44081770 49299514 51850095 49019596 42047605 34320759 27924063
41681 27924063 23072232 19288279 15671728 11264338 6545940 3485361 2909530 3098135
41673 3098135 2353437 1556077 2343119 3929954 4002120 2189551 409891 -109235 -20356
41664 -20356 110319 863852 2339638 3179964 2345392 820347 498000 1936482 4006358
41655 4006358 5369117 5627199 5165968 4398486 3385523 2172342 1245446 1119527 1367957
$$ packed form
41715C294835J991224J59548p95688K87294R62785j6887n20454R25869K321259
41706H609785J414399p72794j693228p24363Q80808J984739K047412J026891L0902
41697A2804551O37337K545080L563921K911042K456484L436288M310493L736924
41689C6402120L257617M422033N217744K550581k830499o971991p726846o396696
41681B7924063m851831l783953l616551m407390m718398l060579n75831J88605
41673C098135p44698p97360P87042J586835P2166j812569j779660n19126Q8879
41664b0356J30675P53533J475786Q40326q34572j525045l22347J438482K069876
41655D006358J362759K58082m61231p67482j012963j213181r26896j25919K48430
$$ plain form
41646 1367957 861842 -528492 -1373889 -720453 252126 -3930 -778956 -229039 1199955
41637 1199955 956496 -1456149 -3031281 -1454192 1370569 2156671 1039817 765130 1818310
41628 1818310 1627604 -828867 -2671747 -1143243 2181787 3582334 2362902 1229619
41620 1229619 1865491 2820066 2424186 1452206 1453081 2100470 2037628 1412082 1662498 3117863
41610 3117863 4531090 4986532 4696289 3775991 1907726 -269191 -1049203 119191 1588923
41601 1588923 1753864 1207426 1442745 2425321 2994535 2938848 2885496 2491646 752841 -1671457
41591 -1671457 -2421569 -577540 1755237 2181983 1096449 584149 1186582 1604694 1353296
41582 1353296 1721672 3500103 5344587 5545302 4397912 3472885 3126043 2282382 627706
$$ packed form
41646A367957n06115j390334q45397O53436R72579k56056p75026N49917J428994
41637A199955k43459k412645j575132J577089K824761P86102j116854k74687J053180
41628A818310j90706k456471j842880J528504L325030J400547j219432j133283
41620A229619O35872R54575l95880r71980Q75O47389o2842o25546K50416J455365
41610C117863J413227M55442k90243r20298j868265k176917p80012J168394J469732
41601A588923J64941n46438K35319R82576N69214n5687n3352l93850j738805k424298
41591a671457p50112J844029K332777M26746j085534n12300O02433M18112k51398
41582A353296L68376J778431J844484K00715j147390r25027l46842q43661j654676
$$ plain form
41573 627706 -567010 -297605 845529 1960203 3142664 4345624 4153579 1583097 -1472883
41564 -1472883 -1823482 750287 2879681 2064385 -140826 -717173 634240 1774735 1598089
41555 1598089 1012643 646031 -261655 -2006490 -3096612 -1989116 600258 2227520 1431297
41546 1431297 -773610 -2159182 -1565219 318701 2167207 3431140 4229681 4379102 3485191
41537 3485191 2011411 1154961 1201198 1056187 166617 -188943 1237088 3333360 3770028
41528 3770028 2160647 515423 547003 2012567 3860480 5428627 6044075 4996107 2787615
41519 2787615 1215659 1266615 1895031 1737481 976229 443903 -49464 -1019613 -1707634
41510 -1707634 -972707 446777 431193 -1418094 -2865438 -2027968 151527 1596217 2115864
$$ packed form
41573F27706j194716K69405J143134J114674J182461J202960j92045k570482l055980
41564a472883l50599K573769K129394q15296k205211n76347J351413J140495j76646
41555A598089n85446l66612r07686j744835j090122J107496K589374J627262p96223
41546A431297k204907j385572N93963J883920J848506J263933P98541J49421q93911
41537C485191j473780q56450M6237j45011q89570l55560J426031K096272M36668
41528C770028j609381j645224L1580J465564J847913J568147O15448j047968k208492
41519B787615j571956N0956O28416j57550p61252n32326m93367r70149o88021
41510a707634P34927J419484j5584j849287j447344Q37470K179495J444690N19647
$$ plain form
41501 2115864 3077964 4614674 5125172 3875713 2310307 1798642 1527212 146121 -1501943
41492 -1501943 -1360619 375848 1049937 -545317 -2090550 -991056 1832039 3298852
41484 3298852 2451023 1318176 1729508 3195539 4216100 4023951 2573922 365467 -1028296
41475 -1028296 251615 3933419 7102879 7373306 5809399 5358985 6826020 7887905
41467 7887905 6275111 2701152 -35424 -260346 982053 1474892 443657 -727502
41459 -727502 -277545 1934932 4524692 6243105 6891688 6737038 5854263 4320809 2496330
41450 2496330 818913 -316271 -460256 495141 1723972 2015479 1223837 495855 710762
41441 710762 1398025 1660099 1473631 1457095 1878704 2503301 2984686 2879024 1772441 10258
$$ packed form
41501B115864R62100J536710N10498j249459j565406n11665k71430j381091j648064
41492a501943J41324J736467O74089j595254j545233J099494K823095J466813
41484C298852q47829j132847M11332J466031J020561j92149j450029k208455j393763
41475a028296J279911L681804L169460K70427j563907m50414J467035J061885
41467G887905j612794l573959k736576k24922J242399M92839j031235j171159
41459g27502M49957K212477K589760J718413O48583j54650q82775j533454j824479
41450B496330j677417j135184j43985R55397J228831K91507p91642p27982K14907
41441G10762O87263K62074j86468j6536M21609O24597M81385j05662j106583j762183
$$ plain form
41431 10258 -1171618 -941868 46331 522124 203028 -154486 -6047 462775 951826 1442571
41421 1442571 1893890 2039150 1601834 522784 -886690 -1899476 -1905120 -1246674 -983753
41412 -983753 -1468953 -1864014 -1602823 -1440573 -2095588 -2672126 -1829916 -63722 798003
41403 798003 342275 161079 1271947 2492106 2255666 858902 -213951 -390738 -237950
41394 -237950 -60296 458712 1228822 1474784 860432 134831 140776 655386 821736 509244
41384 509244 517664 1238045 1768490 1012806 -612353 -1415219 -564386 763086 858790 -464626
41374 -464626 -1941435 -2513483 -2079060 -840130 1046148 2975961 3970232 3723612 3006388
41365 3006388 2610408 2455861 2216265 2189753 2712824 3092784 2254650 604737 150374
$$ packed form
41431A0258j181876K29750R88199M75793l19096l57514J48439M68822M89051M90745
41421A442571M51319J45260m37316j079050j409474j012786n644O58446K62921
41412i83753m85200l95061K61191J62250o55015n76538Q42210J766194Q61725
41403G98003m55728j81196J110868J220159k36440j396764j072853j76787J52788
41394b37950J77654N19008P70110K45962o14352p25601N945N14610J66350l12492
41384E09244Q420P20381N30445p55684j625159q02866Q50833J327472R5704j323416
41374d64626j476809n72048M34423J238930J886278J929813R94271k46620p17224
41365C006388l95980j54547k39596k6512N23071L79960q38134j649913m54363
$$ plain form
41356 150374 2064173 4886552 6147085 5353106 4144102 3574030 2833990 1295318 174252
41347 174252 643325 1456517 612237 -1082427 -666536 2307258 4347317 2698079 -689549
41338 -689549 -1963843 -603460 746542 808657 1022023 2144512 2424870 500185 -1996379
41329 -1996379 -2538157 -1122286 293084 1025231 2284146 4476993 5818422 4703260
41321 4703260 2398968 1882299 4030035 6268188 5744288 3006587 1277012 2266016 4202752
41312 4202752 4550198 3270629 2186680 2076800 2047206 1467855 899985 891555 1163335 1360125
41302 1360125 1547671 1635458 1329377 1000321 1544031 2926965 3916707 3825396 3482148 3721271
41292 3721271 3879051 2822104 812101 -754454 -1165356 -997360 -986966 -1092464 -838149
$$ packed form
41356A50374J913799K822379J260533p93979j209004n70072p40040j538672j121066
41347A74252M69073Q13192q44280j694664M15891K973794K040059j649238l387628
41338f89549j274294J360383J350002O2115K13366J122489K80358j924685k496564
41329a996379n41778J415871J415370P32147J258915K192847J341429j115162
41321D703260k304292n16669K147736K238153n23900k737701j729575R89004J936736
41312D202752L47446j279569j083949j09880k9594n79351n67870q430K71780J96790
41302A360125J87546Q7787l06081l29056N43710J382934R89742r1311l43248K39123
41292C721271J57780j056947k010003j566555m10902J67996J0394j05498K54315
$$ plain form
41283 -838149 -145644 394675 90952 -928956 -1581398 -1089861 -217256 -458725 -1991442
41274 -1991442 -3374046 -3487035 -2716534 -1831012 -884455 42363 169411 -848874 -1990492
41265 -1990492 -2181954 -1818356 -1834565 -1986826 -1412694 -360433 150197 129015 543636 1462575
41255 1462575 1784056 1074207 284746 180621 287545 8173 -296331 -90647 321148
41246 321148 382694 308742 776706 1936811 3225589 3799510 2836556 65358 -3392568
41237 -3392568 -5295051 -4300617 -1566947 397032 443821 -261095 22045 1620408 3441832
41228 3441832 4368321 4177981 3389735 2762979 2970416 4302698 6449396 8762113 10836324
41219 10836324 12549932 13436099 12623536 9990191 6944751 5147162 4558785 3774521 2362005
$$ packed form
41283h38149O92505N40319l03723j019908o52442M91537Q72605k41469j532717
41274a991442j382604j12989P70501Q85522R46557R26818J27048j018285j141618
41265a990492j91462L63598j6209j52261N74132J052261N10630k1182M14621R18939
41255A462575L21481p09849p89461j04125J06924k79372l04504K05684M11795
41246C21148O1546p3952M67964J160105J288778N73921r62954k771198l457926
41237c392568j902483R94434K733670J963979M6789p04916K83140J598363J821424
41228C441832R26489j90340p88246o26756K07437J332282K146698K312717K074211
41219A0836324J713608Q86167q12563k633345l045440j797589n88377p84264j412516
$$ plain form
41210 2362005 1584992 2257846 3226319 3122402 2559408 2973161 3872684 3166299 365912
41201 365912 -2299318 -2680594 -1327071 -426089 -1038044 -2275375 -2637809 -1445162 542954
41192 542954 1377260 -508780 -4226874 -6631793 -5587449 -2520371 -600737 -822890 -1365492
41183 -1365492 -766215 103453 -21190 -538877 -204435 399697 -383543 -2230802 -2644478
41174 -2644478 -547970 1721035 1459485 -591160 -1385084 55693 1596084 1564242 1243213
41165 1243213 2659228 5402252 7180487 6719020 4668744 2151770 -116284 -1395298
41157 -1395298 -1045969 545114 2059818 2580240 2245852 1559980 763338 21503 -413696
41148 -413696 -442998 -154961 324826 678530 430545 -321114 -680222 -233733 -11883 -1065976
$$ packed form
41210B362005p77013O72854R68473j03917n62994M13753Q99523p06385k800387
41201C65912k665230l81276J353523R00982o11955j237331l62434J192647J988116
41192E42954Q34306j886040l718094k404919J044344L067078J919634k22153n42602
41183a365492N99277Q69668j24643n17687L34442O04132p83240j847259m13676
41174b644478K096508K269005k61550k050645p93924J440777J540391l1842l21029
41165A243213J416015K743024J778235m61467k050276k516974k268054j279014
41157a395298L49329J591083J514704N20422l34388o85872p96642p41835m35199
41148d13696k9302K88037M79787L53704k47985p51659l59108M46489K21850j054093
$$ plain form
41138 -1065976 -2544921 -2624783 -1196188 -55767 -290573 -1063959 -1351349 -1246765 -920945
41129 -920945 113647 1763793 2757375 2309418 1209681 355140 -446046 -1173741 -706515
41120 -706515 1204565 2539253 1627924 78158 724423 3293213 4712885 3703587 2397364
41111 2397364 2729159 3656433 3305546 2000149 1389359 1684836 1579511 535162 -359823
41102 -359823 42079 1504067 2829167 3187043 2718316 2024914 1368801 650853 182143
41093 182143 838292 2782895 4460613 3951783 1420276 -817840 -1030728 37425 551338
41084 551338 50928 -277208 630088 2458248 3991373 4383624 3899995 3530874 3851105
41075 3851105 4380143 4293953 3504271 2555839 1770452 1260895 1532677 2964701 4663098
$$ packed form
41138a065976j478945p9862J428595J140421k34806p73386k87390J04584L25820
41129i20945J034592J650146R93582m47957j099737q54541q01186p27695M67226
41120g06515J911080J334688r11329j549766O46265K568790J419672j009298j306223
41111B397364L31795R27274l50887j305397o10790K95477j05325j044349q94985
41102c59823M01902J461988J325100L57876m68727o93402o56113p17948m68710
41093A82143O56149J944603J677718n08830k531507k238116k12888J068153N13913
41084E51338n00410l28136R07296J828160J533125L92251m83629l69121L20231
41075C851105N29038q6190p89682r48432p85387n09557K71782J432024J698397
$$ plain form
41066 4663098 5096654 4278653 4161842 6257485 9837546 13052014 14750418 14547867 12370787
41057 12370787 9052633 6377903 5308076 4922826 4161655 3577322 3994408 4532148 3854972
41048 3854972 2605033 2372643 2667165 1465466 -1055231 -2063452 -341197 1464492
41040 1464492 572402 -1823417 -2332818 -143944 2253807 2772813 2068230 1858484 2538507
41031 2538507 3260981 3447090 3307559 3095173 2478473 964327 -1098855 -2344461 -1748276
41022 -1748276 -69262 797513 57635 -1157626 -1438324 -641409 651830 2163995 3598304
41013 3598304 4219854 3803214 3299016 3535089 3972279 3869986 3836593 4674369 5349698 4091610
41003 4091610 1388381 -151534 689170 2225467 2551396 2006519 1923095 2337603 2280686
$$ packed form
41066D663098M33556q18001j16811K095643L580061L214468J698404k02551k177080
41057A2370787l318154k674730j069827l85250p61171n84333M17086N37740o77176
41048C854972j249939k32390K94522j201699k520697j008221J722255J805689
41040A464492q92090k395819n09401K188874K397751N19006p04583k09746O80023
41031B538507P22474J86109j39531k12386o16700j514146k063182j245606N96185
41022a748276J679014Q66775p39878j215261k80698P96915J293239J512165J434309
41013C598304O21550m16640n04198K36073M37190j02293l3393Q37776O75329j258088
41003D091610k703229j539915Q40704J536297L25929n44877q3424M14508n6917
$$ plain form
40994 2280686 1471182 556429 248913 1041579 3025278 5124863 5363849 3020533 -51961
40985 -51961 -1326852 -374491 1195011 1956884 1703455 773897 -272711 -496645 558640
40976 558640 1726012 1111115 -1556612 -4325471 -5018641 -3183219 -71417 2502809 3273455
40967 3273455 2383491 1286939 1071725 977201 -439393 -2751512 -3658454 -1942978 827327
40958 827327 2259618 1785925 632322 136830 991689 3213220 5644747 6105134 3416427
40949 3416427 -811988 -3496526 -3180278 -1002266 1165906 2360031 2300278 995245 -710683
40940 -710683 -1234625 97322 2036794 2927575 2793359 2886420 3391045 2920893 767461
40931 767461 -1468363 -1536250 620243 2735017 2950880 1791782 1109798 1767570 2913776
$$ packed form
40994B280686q09504r14753l07516P92666J983699K099585K38986k343316l072494
40985e1961j274891R52361J569502P61873k53429r29558j046608k23934J055285
40976E58640J167372o14897k667727k768859o93170J835422L111802K574226P70646
40967C273455q89964j096552k15214r4524j416594k312119r06942J715476K770305
40958H27327J432291m73693j153603m95492Q54859K221531K431527M60387k688707
40949C416427m228415k684538L16248K178012K168172J194125n9753j305033j705928
40940g10683n23942J331947J939472Q90781j34216R3061N04625m70152k153432
40931G67461k235824o7887K156493K114774K15863j159098o81984O57772J146206
$$ plain form
40922 2913776 3223636 2345613 1152579 789874 1466371 2244950 2243710 1805724 1843246 2154354
40912 2154354 1494466 -283951 -1364711 -216281 2227853 3951094 4741486 6000204
40904 6000204 7818518 8161052 5669121 1870884 -457885 -356559 787560 1235677 633333
40895 633333 32383 710440 2732242 4450646 3958218 1356657 -1058606 -1363944 -135615
40886 -135615 607252 9790 -918937 -941239 -61381 764300 876894 632314 915000 1921698
40876 1921698 2658300 2136079 942012 765476 2147055 3637488 3724804 2732817 2054579
40867 2054579 2224524 2650668 2746575 2432905 1863790 1400621 1456877 1708229 1094736 -528809
40857 -528809 -1510553 -406925 1755387 2749768 2277136 2012643 2566649 2467269 818902
$$ packed form
40922B913776L09860q78023j193034l62705O76497P78579j240m37986L7522L11108
40912B154354o59888j778417j080760J148430K444134J723241P90392J258718
40904F000204J818314L42534k491931l798237k328769J01326J144119M48117o02344
40895F33333o00950O78057K021802J718404m92428k601561k415263l05338J228329
40886a35615P42867n97462r28727k2302Q79858Q25681J12594k44580K82686J006698
40876A921698P36602n22221j194067j76536J381579J490433Q7316r91987o78238
40867B054579J69945M26144R5907l13670n69115m63169N6256K51352o13493j623545
40857e28809r81744J103628K162312R94381m72632k64493N54006r9380j648367
$$ plain form
40848 818902 -906998 -935524 350633 1384394 1819151 2470476 3504489 4184799 4155787
40839 4155787 3682141 2812328 1601048 1010892 2046372 3769244 3817885 1629551 -387439
40830 -387439 -118250 1130869 568626 -1800839 -3120796 -2001358 -521191 -842955 -1834056
40821 -1834056 -950702 1744070 3698394 3565002 2507327 1628211 336898 -1776433 -3279226
40812 -3279226 -2629642 -495659 1145636 1602096 1799481 2402015 2968316 3024367 2865511
40803 2865511 2950460 3171768 3083123 2560753 2033612 2038173 2459993 2419371 1383024 193221
40793 193221 163789 1228437 2096557 2273738 2425590 2465077 1277543 -748536 -1131629
40784 -1131629 1081473 3169612 2543304 879699 1443218 3639023 3953014 1824752 504005
$$ packed form
40848H18902j725900k8526J286157J033761M34757O51325J034013O80310k9012
40839D155787m73646q69813j211280n90156J035480J722872M8641k188334k016990
40830c87439K69189J249119n62243k369465j319957J119438J480167l21764r91101
40821a834056Q83354K694772J954324j33392j057675q79116j291313k113331j502793
40812c279226O49584K133983J641295M56460J97385O02534N66301N6051j58856
40803B865511Q4949K21308q8645n22370n27141M561M21820m0622j036347j189803
40793A93221k9432J064648Q68120J77181J51852L9487j187534k026079l83093
40784a131629K213102K088139o26308j663605N63519K195805L13991k128262j320747
$$ plain form
40775 504005 1504652 2207305 510373 -1683970 -1837607 -676777 -142716 116662 1311101
40766 1311101 2470527 1970051 791564 1106330 2418676 2303224 641560 -79155 1092947
40757 1092947 2227786 2084071 2164485 3791947 5458668 4964571 2693906 934720 833892
40748 833892 1604628 2199738 2372129 2266359 1996734 1635232 1098763 292742 -337047 -49258
40738 -49258 903820 1067743 -290120 -1787343 -1571048 158827 1550396 1744884 1645492
40729 1645492 1918504 1800011 645298 -591215 -600756 296638 697859 331121 419113 1696438
40719 1696438 3217367 3653137 2964407 2132330 1735810 1472260 888774 62261 -454564
40710 -454564 -174328 727479 1363034 1062690 385580 622684 2146121 3954685 5096565
$$ packed form
40775E04005J000647P02653j696932k194343j53637J160830N34061K59378J194439
40766A311101J159426n00476j178487L14766J312346j15452j661664p20715J172102
40757A092947J134839j43715Q0414J627462J666721m94097k270665j759186j00828
40748H33892P70736N95110J72391j05770k69625l61502n36469q06021o29789K87789
40738d9258R53078J63923j357863j497223K16295J729875J391569J94488r9392
40729A645492K73012j18493j154713j236513r541Q97394M01221l66738Q7992J277325
40719A696438J520929M35770o88730q32077l96520k63550n83486q26513n16825
40710d54564K80236R01807O35555l00344o77110K37104J523437J808564J141880
$$ plain form
40701 5096565 5651665 5866750 5400001 4256944 3457573 3664771 4074503 3980366 4487238
40692 4487238 6892531 10015256 11234971 10026279 8400810 7795591 7681816 7533996 7817136
40683 7817136 8262398 7452532 5266242 3632737 3501605 3133360 1125660 -798510 -225464
40674 -225464 2193386 3806162 3789381 3522554 3745512 3708671 3027366 2345184 2047706 1885307
40664 1885307 1775808 1589797 597497 -1224674 -1917906 318561 3943152 5314057 3353256
40655 3353256 856040 675802 2563281 4448763 5061366 4445216 3383607 3103399 4253872
40646 4253872 5581428 4978722 2434415 516525 1233993 3763231 5967726 6803331 6465488
40637 6465488 5506205 4690039 4597945 4677687 3844095 2506506 2477937 4175626 5595720
$$ packed form
40701E096565N55100K15085m66749j143057p99371K07198M09732r4137N06872
40692D487238K405293L122725J219715j208692j625469o05219j13775j47820K83140
40683G817136M45262q09866k186290j633505j31132l68245k007700j924170N73046
40674b25464K418850J612776j6781k66827K22958l6841o81305o82182k97478j62399
40664A885307j09499j86011r92300j822171o93232K236467L624591J370905j960801
40655C353256k497216j80238J887479J885482O12603o16150j061609k80208J150473
40646D253872J327556o02706k544307j917890P17468K529238K204495Q35605l37843
40637F465488r59283q16166r2094P9742q33592j337589k8569J697689J420094
$$ plain form
40628 5595720 5080876 3501373 2521242 2273871 2102528 2089805 2301990 1858530 370244
40619 370244 -911240 -960521 -721648 -1315853 -1899256 -1293602 -424943 -816471 -1764508 -1567407
40609 -1567407 -659524 -729413 -1407900 -966780 -11720 -983109 -3579564 -4260902 -1551663
40600 -1551663 1404982 1456521 -127255 -139950 1731551 3118215 2723184 1496159 712330
40591 712330 731566 1239988 1428370 549885 -751110 -778647 522746 841012 -947720
40582 -947720 -2274226 -321173 3375079 4696304 2682810 454340 387616 1378148 1584091
40573 1584091 1210559 1325595 1918554 2422902 2720434 2696135 2153806 1818087 2840194
40564 2840194 4652999 5114468 3633170 2252984 2570810 3570084 3846456 3871940 4251498
$$ packed form
40628E595720n14844j579503r80131k47371j71343j2723K12185m43460j488286
40619C70244j281484m9281K38873n94205n83403O05654Q68659l91528r48037J97101
40609a567407R07883o9889o78487M41120R55060r71389k596455o81338K709239
40600a551663K956645N1539j583776j2695J871501J386664l95031j227025p83829
40591G12330J9236N08422J88382q78485j300995k7537J301393L18266j788732
40582i47720j326506J953053L696252J321225k013494k228470o6724R90532K05943
40573A584091l73532J15036N92959N04348K97532k4299n42329l35719J022107
40564B840194J812805M61469j481298j380186L17826R99274K76372K5484L79558
$$ plain form
40555 4251498 3781268 1592592 -442877 -118656 1555149 2025121 1452049 2195425 4505794
40546 4505794 5959617 5358015 4174943 3576233 2780788 1198900 -314895 -1230072 -2024458
40537 -2024458 -2328250 -918418 1481950 2171602 673323 212472 3022835 6669674 7469184
40528 7469184 5502125 3559594 2759381 2079007 1140317 642004 590015 465829 630821
40519 630821 1488088 1992465 1125837 -2440 197254 996778 736627 32399 615090
40510 615090 1724781 1075540 -878006 -1299720 197476 865894 -319742 -1015341 -69248
40501 -69248 160507 -1754700 -3034464 -782956 3253717 5109809 3862826 1583416 -263301
40492 -263301 -1333706 -740968 1775405 3724761 2189999 -1756032 -3851746 -2196853
$$ packed form
40555D251498m70230k188676k035469L24221J673805M69972n73072P43376K310369
40546D505794J453823o01602j183072n98710p95445j581888j513795r15177p94386
40537b024458l03792J409832K400368O89652j498279m60851K810363L646839P99510
40528G469184j967059j942531q00213o80374r38690m98313n1989j24186J64992
40519F30821Q57267N04377q66628j128277J99694P99524k60151p04228N82691
40510F15090J109691o49241j953546m21714J497196O68418j185636o95599R46093
40501f9248K29755j915207j279764K251508M036673J856092j246983k279410j846717
40492b63301j070405N92738K516373J949356j534762l946031k095714J654893
$$ plain form
40484 -2196853 581466 1377890 517849 410316 1871349 3281055 2968787 1475275 1061988
40475 1061988 2858402 4954365 4462146 1493821 -723752 -402326 393857 -488883 -1483353
40466 -1483353 -48318 2558601 2891187 899409 -13484 1374815 2378395 1323835
40458 1323835 429393 1815115 3784846 3690463 2211364 1938791 3153965 3768519 2716132
40449 2716132 1041302 22301 181524 1767925 4324829 6046236 5440363 3601496
40441 3601496 3090600 4463282 5616402 4914021 3319719 2701523 3300839 3838056 3381747
40432 3381747 2250097 1365319 1259705 1634749 1749131 1345196 1021321 1399306 2272709
40423 2272709 3110873 3999962 5283594 6583530 7167991 7139456 7185912 7224503 6539563 5395200
$$ packed form
40484b196853K778319P96424q60041j07533J461033J409706l12268j493512m13287
40475A061988J796414K095963m92219k968325k217573L21426P96183q82740r94470
40466a483353J435035K606919L32586j991778r12893J388299J003580j054560
40458A323835q94442J385722J969731r4383j479099k72573J215174O14554j052387
40449B716132j674830j019001J59223J586401K556904J721407o05873j838867
40441C601496n10896J372682J153120p02381j594302o18196N99316N37217m56309
40432C381747j131650q84778j05614L75044J14382m03935l23875L77985Q73403
40423B272709Q38164Q89089J283632J299936N84461k8535M6456L8591o84940j144363
$$ plain form
40413 5395200 5094563 5916834 6325942 5072927 3010660 1871386 2125932 3019914 3914566
40404 3914566 4525232 4512260 3918786 3432264 3242283 2450068 808649 64099 1818776
40395 1818776 4789188 6294762 6045424 5992787 6473325 5468862 2552626 590821 1712000
40386 1712000 4045023 4767691 4329223 4810587 5666035 4563219 1881376 786792 2379474
40377 2379474 3975352 3343531 1867127 1810826 2724889 2760612 2059111 2413030 4118417
40368 4118417 5301353 4536821 2609427 1232449 1021465 1296910 1388969 1545123 2399950
40359 2399950 3740424 4318996 3308296 1525761 500758 655876 1328411 2226881 3515445
40350 3515445 4564448 4291434 3088872 2730521 3722262 4426655 3705572 2689992 2654468
$$ packed form
40413E395200l00637Q22271M09108j253015k062267j139274K54546Q93982Q94652
40404C914566O10666j2972n93474m86522j89981p92215j641419p44550J754677
40395A818776K970412J505574k49338n2637M80538j004463k916236j961805J121179
40386A712000K333023P22668m38468M81364Q55448j102816k681843j094584J592682
40377B379474J595878o31821j476404n6301R14063L5723p01501L53919J705387
40368D118417J182936p64532j927394j376978k10984K75445R2059J56154Q54827
40359B399950J340474N78572j010700j782535j025003J55118O72535Q98470J288564
40350C515445J049003k73014j202562l58351R91741P04393p21083j015580l5524
$$ plain form
40341 2654468 2808485 1918024 761565 973909 2388200 3548176 4154194 4899094 5362688
40332 5362688 4367161 2443011 1787431 3351974 5719293 7251238 7696181 7300812 6114589
40323 6114589 4859034 4853325 6164300 7168095 6818575 6059439 6024954 6120223 5153642 3414001
40313 3414001 2251458 2184231 2665251 3298601 4067470 4584677 4308377 3568388 3423959
40304 3423959 4322733 5635395 6685537 7579887 8773004 10331165 11906475 13074858
40296 13074858 13481170 12973018 11827833 10628099 9749466 9183188 8934676 9189161 9813497
40287 9813497 10145356 9844844 9673845 10640095 12359990 13159577 12158391 10469035 9777307
40278 9777307 10414551 11468860 12070849 11735645 10215786 8195140 7480017 9044999 11319106
$$ packed form
40341B654468J54017q90461j156459K12344J414291J159976O06018P44900M63594
40332E362688r95527j924150o55580J564543K367319J531945M44943l95369j186223
40323F114589j255555n709J310975J003795l49520p59136l4485R5269r66581j739641
40313C414001j162543o7227M81020O33350P68869N17207k76300p39989j44429
40304C423959Q98774J312662J050142Q94350J193117J558161J575310J168383
40296A3074858M06312n08152j145185j199734q78633n66278k48512K54485O24336
40287I813497L31859l00512j70999R66250J719895P99587j001186j689356o91728
40278I777307O37244J054309O01989l35204j519859k020646p15123J564982K274107
$$ plain form
40269 11319106 11996185 11171953 10814304 11413466 11569691 11109285 11833118 14201408 15995137
40260 15995137 15875792 15802120 17831751 20689309 21964849 21919341 22422616 23597451 24379956
40251 24379956 25190599 26983884 28573085 28151605 26868200 27490580 29827879 31095653
40243 31095653 30865585 31676638 33975988 34569407 31858455 28952586 29073610 30777160 30578360
40234 30578360 28155239 26016601 25469386 25693762 25928746 26138481 26068843 25715892 26286426
40225 26286426 28842819 32331781 34623544 35280179 35822547 37397802 39509822 41148687
40217 41148687 42262130 43944105 47452075 52816926 58537405 63468486 68830792 77001218
40209 77001218 88479445 102040473 118039332 139156221 167544854 204204530 251138503
$$ packed form
40269A1319106O77079q24232l57649N99162J56225m60406P23833K368290J793729
40260A5995137j19345p3672K029631K857558J275540m5508N03275J174835P82505
40251B4379956Q10643J793285J589201m21480j283405O22380K337299J267774
40243C1095653k30068Q11053K299350N93419k710952k905869J21024J703550j98800
40234C0578360k423121k138638n47215K24376K34984K09735o9638l52951N70534
40225B6286426K556393L488962K291763O56635N42368J575255K112020J638865
40217D1148687J113443J681975L507970N364851N720479M931081N362306Q170426
40209G7001218J1478227J3561028J5998859K1116889K8388633L6659676M6933973
$$ plain form
40202 251138503 308200164 363940075 394900966 382238504 329958005 262263407 202545318
40195 202545318 158515986 126361991 101761771 83098293 68764528 56926513 47339976
40188 47339976 40560334 35960980 32376793 29740181 28344367 27381991 25778309 23654241
40180 23654241 21636843 19654598 17668204 16469273 16308729 15824261 13900910 11539361
40172 11539361 10161657 9150930 7188492 5199073 5440280 7851515 9796685 9767961
40164 9767961 9075965 9205110 9606736 9181065 8205848 7520606 7110517 6699607 6627972 7022845
40154 7022845 7212027 7119602 8043539 10587236 12907477 12817554 10890756 9567474 9686342
40145 9686342 9972763 9750604 9883148 10737965 11436108 11808840 13015615 15189880 16379689
$$ packed form
40202B51138503N7061661N5739911L0960891j2662462n2280499o7694598n9718089
40195B02545318m4029332l2153995k4600220j8663478j4333765j1838015r586537
40188D7339976o779642m599354l584187k636612j395814r62376j603682k124068
40180B3654241k017398j982245j986394j198931j60544m84468j923351k361549
40172A1539361j377704j010727j962438j989419K41207K411235J945170k8724
40164I767961o91996J29145M01626m25671r75217o85242m10089m10910p1635L94873
40154G022845J89182r2425R23937K543697K320241q9923j926798j323282J18868
40145I686342K86421k22159J32544Q54817O98143L72732J206775K174265J189809
$$ plain form
40136 16379689 15198659 12980166 11863271 12106470 12805552 13980986 16168191 18823079
40128 18823079 20842749 22099078 23163048 24304920 25917713 28679918 31875237 33161368
40120 33161368 32019228 31786804 35640121 41991960 47008810 50512679 55756769 64233675
40112 64233675 75001713 89008444 109678925 139260893 179604106 235914749 310614783
40105 310614783 388686800 437181389 429737002 371578963 294524868 228059475 180443133
40098 180443133 145660899 118594433 98604618 84479819 73175385 63165405 55229260
40091 55229260 49798845 45800855 42134257 38648737 35577162 33074840 31279713 30035458
40083 30035458 28649402 26538777 24056628 22263452 21875380 22540673 23071697 22542271 21410581
$$ packed form
40136A6379689j181030k218493j116895K43199O99082J175434K187205K654888
40128A8823079K019670J256329J063970J141872J612793K762205L195319J286131
40120C3161368j142140k32424L853317O351839N016850L503869N244090Q476906
40112F4233675J0768038J4006731K0670481K9581968M0343213N6310643P4700034
40105C10614783P8072017M8494589p444387n8158039p7054095o6465393m7616342
40098A80443133l4782234k7066466j9989815j4124799j1304434j0009980p936145
40091E5229260n430415l997990l666598l485520l071575k502322j795127j244255
40083C0035458j386056k110625k482149j793176l88072O65293N31024n29426j131690
$$ plain form
40074 21410581 21200111 22511951 23748536 22737105 19504714 16406763 15319970 15696818
40066 15696818 15861129 15366886 15211589 16039743 17079595 17236997 16719901 16791991 17857683
40057 17857683 18719335 18405116 17895554 18765479 20561469 21153324 19758945 18012133 17689336
40048 17689336 18931669 21126908 23846560 26271866 27402825 27584951 28128862 28826694
40040 28826694 28004636 25816397 24775356 25637831 25773263 23780566 22627548 25060729
40032 25060729 28564244 28812294 26243735 24932571 26090638 27106203 26574006 25948159
40024 25948159 26080908 26210175 26863555 29872204 34704473 38423053 40245918 42729950
40016 42729950 47464683 53081649 58749268 66176574 76577193 88861508 102695399 120706483
$$ packed form
40074B1410581k10470J311840J236585j011431l232391l097951j086793L76848
40066A5696818J64311m94243j55297Q28154J039852J57402n17096P2090J065692
40057A7857683Q61652l14219n09562Q69925J795990N91855j394379j746812l22797
40048A7689336J242333K195239K719652K425306J130959J82126N43911O97832
40040B8826694q22058k188239j041041Q62475J35432j992697j153018K433181
40032B5060729L503515K48050k568559j311164J158067J015565n32197o25847
40024B5948159J32749J29267O53380L008649M832269L718580J822865K484032
40016D2729950M734733N616966N667619P427306J0400619J2284315J3833891J8011084
$$ plain form
40008 120706483 146079991 180099462 222023480 266900257 302040932 311323688 288239044
40001 288239044 243144885 194619976 155182313 127020739 107561005 94209873 84938474
39994 84938474 78617652 75245956 73934776 71801074 67092902 61906504 59171276 58399918
39986 58399918 57238871 55641247 55060669 54627172 51930840 47282289 43644368 42233552
39978 42233552 41419820 40186159 39416353 39199273 38081776 36122040 35861179 38701502 42457693
39969 42457693 44087197 43282553 41984988 41620990 42118846 42760988 42936834 42636473 42882507
39960 42882507 45116798 49655780 55141763 59627776 61714719 60876258 57679037 53821188
39952 53821188 51109693 50118682 50196977 50481508 50315117 49213097 47403112 46097605 46328243
$$ packed form
40008A20706483K5373508L4019471M1924018M4876777L5140675R282756k3084644
40001B88239044m5094159m8524909l9437663k8161574j9459734j3351132r271399
39994H4938474o320822l371696j311180k133702m708172n186398k735228p71358
39986E8399918j161047j597624n80578m33497k696332m648551l637921j410816
39978D2233552q13732j233661p69806k17080j117497j959736k60861K840323L756191
39969D2457693J629504q04644j297565l63998M97856O42142J75846l00361K46034
39960D2882507K234291M538982N485983M486013K086943q38461l197221l857849
39952E3821188k711495r91011P8295K84531j66391j102020j809985j305507K30638
$$ plain form
39943 46328243 47786338 49519172 51146172 52488666 52838862 51900185 50754901 50414438
39935 50414438 49991726 47994119 45087593 43785698 45326254 48349191 50785525 51759342
39927 51759342 51563101 50991558 50865028 51342867 51831292 52183765 53169834 54734365 55019906
39918 55019906 52894995 50425643 50565219 53025089 54916734 55123017 55234928 56013750 55903290
39909 55903290 53988397 51854832 51123565 51137390 50572481 49825758 50397728 52982213 57234699
39900 57234699 62527168 68265057 74546752 83090242 96363921 115413184 139846623 169760809
39892 169760809 204666979 238807780 260238921 258448577 233625967 196932689 161394796
39885 161394796 133416664 112546659 96881960 86447045 81376532 78955567 74768342
$$ packed form
39943D6328243J458095J732834J627000J342494L50196r38677j145284l40463
39935E0414438m22712j997607k906526j301895J540556L022937K436334R73817
39927E1759342j96241n71543j26530M77839M88425L52473R86069J564531K85541
39918E5019906k124911k469352J39576K459870J891645K06283J11911P78822j10460
39909E5903290j914893k133565p31267J3825n64909p46723N71970K584485M252486
39900E7234699N292469N737889O281695Q543490J3273679J9049263K4433439K9914186
39892A69760809L4906170L4140801K1431141j790344k4822610l6693278l5537893
39885A61394796k7978132k0870005j5664699j0434915n070513k420965m187225
$$ plain form
39878 74768342 67115660 58617997 52422874 48288176 44042582 39666397 37478511 38569729
39870 38569729 41380779 44032953 46056114 47562920 48776869 50868305 55331375 61983920
39862 61983920 69457309 78187474 90801018 108455518 128235450 144759707 152978086
39855 152978086 149708900 135414736 115560797 97656456 85379967 77338275 72040297
39848 72040297 70778196 73839174 77248345 76495803 71657624 66190730 62478532 61181878
39840 61181878 62863513 66696995 68805575 65509631 57844686 49993510 43962384 38844795
39832 38844795 34487438 32105429 31307379 30207929 28934764 29480093 31382829 31292273 28221695
39823 28221695 25733361 26870538 29902021 31422415 31051323 30391105 29530941 27636931
$$ packed form
39878G4768342p652682q497663o195123m134698m245594m376185k187886J091218
39870C8569729K811050K652174K023161J506806J213949K091436M463070O652545
39862F1983920P473389Q730165J2613544J7654500J9779932J6524257Q218379
39855A52978086l269186j4294164j9853939j7904341j2276489q041692n297978
39848G2040297j262101L060978L409171p52542m838179n466894l712198j296654
39840F1181878J681635L833482K108580l295944p664945p851176o031126n117589
39832C8844795m357357k382009p98050j099450j273165N45329J902736r0556l070578
39823B8221695k488334J137177L031483J520394l71092o60218q60164j894010
$$ plain form
39815 27636931 25516662 24571169 24191162 23071057 22279829 23890492 26878655 27650622 25019720
39806 25019720 21613806 19583950 17980879 15782783 14538372 15638283 17196782 16521728
39798 16521728 14332473 13591046 14884025 15925921 15423104 14426736 13585323 12200918 11019431
39789 11019431 12912671 18935863 26115373 31188925 34308240 36666800 36803169 32771181
39781 32771181 26623689 22817973 22454225 22810892 22756736 24557380 28974135 32278623 30649159
39772 30649159 25164466 20021569 17487512 16808582 16729213 16812591 16946775 17254198 18034418
39763 18034418 18842833 18614381 17527408 17259171 18392594 19472344 20016112 22156730 27033631
39754 27033631 31613380 32061352 28902911 25794228 24275656 23109699 22128051 22899392
$$ packed form
39815B7636931k120269r45493l80007j120105p91228J610663K988163P71967k630902
39806B5019720l405914k029856j603071k198096j244411J099911J558499o75054
39798A6521728k189255p41427J292979J041896n02817r96368q41413j384405j181487
39789A1019431J893240O023192P179510N073552L119315K358560J36369m031988
39781C2771181o147492l805716l63748L56667n4156J800644M416755L304488j629464
39772C0649159n484693n142897k534057o78930p9369Q3378J34184L07423P80220
39763A8034418Q08415k28452j086973k68237J133423J079750N43768K140618M876901
39754B7033631M579749M47972l158441l108683j518572j165957r81648P71341
$$ plain form
39746 22899392 25247908 26649987 26149031 25967377 27937369 30733860 32010349 31324050
39738 31324050 29718107 28127988 27281216 27575724 28156940 27743116 27054859 28371853 31661858
39729 31661858 33413950 30982320 26197310 22722710 21372091 20185985 17994247 15581354
39721 15581354 13863953 13015306 13246386 14682078 16434864 17277505 17290260 17557846 18252264
39712 18252264 18370416 17531693 16693561 16629136 16851533 16761738 16977565 18530637 21100892
39703 21100892 23013242 23089850 21773013 20161269 18762015 17913131 18653062 21780708 26397734
39694 26397734 31234612 37428968 47189655 58348880 63339868 56949787 43436129 32147956
39686 32147956 26878860 23699624 19119740 15204196 14784771 16241326 16377912 15301809
$$ packed form
39746B2899392K348516J402079n00956j81654J969992K796491J276489o86299
39738C1324050j605943j590119q46772K94508N81216m13824o88257J316994L290005
39729C1661858J752092k431630m785010l474600j350619j186106k191738k412893
39721A5581354j717401q48647K31080J435692J752786Q42641J2755K67586O94418
39712A8252264J18152q38723q38132o4425K22397q9795K15827J553072K570255
39703B1100892J912350P6608j316837j611744j399254q48884P39931L127646M617026
39694B6397734M836878O194356R760687J1159225M990988o390081j3513658j1288173
39686C2147956n269096l179236m579884l915544m19425J456555J36586j076103
$$ plain form
39678 15301809 14900073 14789442 13405742 11529669 11226320 12289849 12854389 12601859 12377222
39669 12377222 11664647 9708126 8219579 9352443 11549362 11286299 8795101 7908657
39661 7908657 9795536 11177258 9977410 8531198 9219658 10753009 11323519 12021836 14045851
39652 14045851 15397831 13907981 11452935 11505125 13890286 15587835 15864093 16993239
39644 16993239 20086609 23588166 26281026 28808012 31425799 32767498 31950233 30087247
39636 30087247 28710519 28062039 27667046 27380605 27256070 27344196 27900285 28818971 28912479
39627 28912479 27034840 23911649 21426167 20078947 18754698 17066954 16028639 15994897
39619 15994897 15922286 15431265 15715365 17395014 19269118 20428103 21845551 24283208 26205483
$$ packed form
39678A5301809m01736j10631j383700j876073l03349J063529N64540k52530k24637
39669A2377222p12575j956521j488547J132864K196919k63063k491198q86444
39661G908657J886879J381722j199848j446212O88460J533351N70510O98317K024015
39652A4045851J351980j489850k455046N2190K385161J697549K76258J129146
39644A6993239L093370L501557K692860K526986K617787J341699q17265j862986
39636C0087247j376728o48480l94993k86441j24535Q8126N56089R18686R3508
39627B8912479j877639l123191k485482j347220j324249j687744j038315l3742
39619A5994897p2611m91021K84100J679649J874104J158985J417448K437657J922275
$$ plain form
39610 26205483 25815260 24085698 23561862 24660068 25274584 24001665 21841189 20392494
39602 20392494 19958948 19945488 19830415 19106909 17270171 14606418 12424650 11944250 13224878
39593 13224878 15349280 17218834 18050230 17652722 16561685 15634762 15327332 15502936 15890980
39584 15890980 16440336 17236733 18283577 19287712 19586585 18678116 17109222 16389611 17569761
39575 17569761 20253189 23320904 25942522 27322787 26457964 23455193 20537862 20126619
39567 20126619 21868281 22959913 21630868 18965731 16963517 16268678 16503303 17394757
39559 17394757 18414403 18399555 16954336 15550754 15780352 16910597 16748907 14897041 13482270
39550 13482270 14171055 16005848 17190330 17689511 18502596 19216539 18382003 16347367 15538372
$$ packed form
39610B6205483l90223j729562n23836J098206O14516j272919k160476j448695
39602B0392494m33546j3460j15073p23506j836738k663753k181768m80400J280628
39593A3224878K124402J869554Q31396l97508j091037r26923l07430J75604L88044
39584A5890980N49356P96397J046844J004135K98873r08469j568894p19611J180150
39575A7569761K683428L067715K621618J380265q64823l002771k917331m11243
39567B0126619J741662J091632j329045k665137k002214o94839K34625Q91454
39559A7394757J019646j4848j445219j403582K29598J130245j61690j851866j414771
39550A3482270O88785J834793J184482M99181Q13085P13943q34536k034636q08995
$$ plain form
39541 15538372 17004352 18588893 18136160 16952167 17705825 19733402 19385461 15347779
39533 15347779 10780896 8989058 9402708 9585400 9089175 8946140 8842298 7562530 5604841
39524 5604841 4807584 5568960 6641123 7458369 8364914 8675197 7140217 4691706 4108130
39515 4108130 6202725 8796051 10336354 11840297 13825588 14116072 11128133 7344543
39507 7344543 6709313 9614810 12955357 14402964 14209360 13237421 11729518 10217936 9572460
39498 9572460 9654089 9425069 8667249 8224000 8418187 8683091 8934486 9782350 11047547
39489 11047547 11623960 11407321 11906900 14089753 16836516 18514152 19079092 19656728 21152040
39480 21152040 24667202 32185875 44284989 56766030 62070045 56168423 43218002 31427369
$$ packed form
39541A5538372J465980J584541m52733j183993P53658K027577l47941m037682
39533A5347779m566883j791838M13650J82692m96225j43035j03842j279768j957689
39524E604841p97257P61376J072163Q17246R06545L10283j534980k448511n83576
39515D108130K094595K593326J540303J503943J985291K90484k987939l783590
39507G344543o35230K905497L340547J447607j93604r71939j507903j511582o45476
39498I572460Q1629k29020p57820m43249J94187K64904K51395Q47864J265197
39489A1047547N76413k16639M99579K182853K746763J677636N64940N77636J495312
39480B1152040L515162P518673J2099114J2481041N304015n901622j2950421j1790633
$$ plain form
39472 31427369 24642937 20194867 15062025 10845741 10477394 12585656 12895628 10430466
39464 10430466 8423400 8661932 8783841 6747645 4518884 4745419 6422819 6929008 6462755
39455 6462755 7097116 8567185 8487207 6475180 4892603 5202749 6286963 6862201 7189318
39446 7189318 7729934 8154823 8402803 9061363 10167973 11097626 11903524 13387845 16030376
39437 16030376 20514880 28606158 40620843 51918482 55284752 48321993 36205589 25879121
39429 25879121 19748629 16272146 13959298 12356887 10825678 8862582 6961432 5649328
39421 5649328 4611249 3918259 4643591 6766034 8013384 6674048 4292695 3609358 4899099
39412 4899099 6338934 6981201 7173666 6808440 5493036 4110624 4033065 4885930 5031273
$$ packed form
39472C1427369o784432m448070n132842m216284l68347K108262L09972k465162
39464A0430466k007066K38532J21909k036196k228761K26535J677400N06189m66253
39455F462755O34361J470069p9978k012027j582577L10146J084214N75238L27117
39446G189318N40616M24889K47980O58560J106610R29653Q05898J484321K642531
39437A6030376M484504Q091278J2014685J1297639L366270o962759j2116404j0326468
39429B5879121o130492l476483k312848j602411j531209j963096j901150j312104
39421E649328j038079o92990P25332K122443J247350j339336k381353o83337J289741
39412D899099J439835O42267J92465l65226j315404j382412p7559Q52865J45343
$$ plain form
39403 5031273 4175191 3578701 3666104 3370471 2168295 1032922 857436 1307991 1709276
39394 1709276 1950467 2182119 2548450 3324146 4429409 4963450 4262130 3182561 3164770
39385 3164770 4275603 5418879 6085000 6391456 5809810 3767155 1421750 778685 1805009
39376 1805009 2493165 2205313 2660015 4662380 6151818 5175508 3067834 2627357 4153062
39367 4153062 5342828 4736375 3386752 2913082 3341489 3536399 3018132 2597279 3233568
39358 3233568 4723159 5960952 6441007 6719713 6976456 6170443 3835740 1869441 2620458
39349 2620458 5352346 6669662 4890021 2065719 919770 1628554 2705338 3342614
39341 3342614 3471975 2913266 1995193 1920288 3094106 4156158 4070684 3988276 5352063
$$ packed form
39403E031273q56082n96490Q7403k95633j202176j135373j75486M50555M01285
39394A709276K41191K31652L66331P75696J105263N34041p01320j079569j7791
39385C164770J110833J143276O66121L06456n81646k042655k345405o43065J026324
39376A805009O88156k87852M54702K002365J489438r76310k107674m40477J525705
39367D153062J189766o06453j349623m73670M28407J94910n18267m20853O36289
39358C233568J489591J237793M80055K78706K56743q06013k334703j966299P51017
39349B620458K731888J317316j779641k824302j145949P08784J076784O37276
39341C342614J29361n58709r18073p4905J173818J062052q5474q2408J363787
$$ plain form
39332 5352063 7272760 7792490 6942014 6388427 6565938 6389809 5585496 5021560 4667314
39323 4667314 3519956 1955618 1873022 3663347 5062228 4182145 2084859 1121438 1991463
39314 1991463 3573717 4548200 4146415 2401332 713903 1076163 3591293 5809929 5704666
39305 5704666 4173054 3205584 2830928 1880618 890515 1666657 3931095 4896498 3055450
39296 3055450 443589 -158975 1134913 2028883 1571488 1285515 2737020 5222695 6453098
39287 6453098 5109112 2333153 675086 1549678 3774812 4882684 3914747 2439692
39279 2439692 2489901 4005222 5047257 4381776 2944482 2387668 2905845 3293982 2859018
39270 2859018 2315673 2640763 3958438 6007128 8733102 11484365 12468990 10551993 7297161
$$ packed form
39332E352063J920697N19730q50476n53587J77511j76129q04313n63936l54246
39323D667314j147358j564338q2596J790325J398881q80083k097286r63421Q70025
39314A991463J582254R74483m01785j745083j687429L62260K515130K218636j05263
39305E704666j531612r67470l74656r50310r90103P76142K264438R65403j841048
39296C055450k611861o02564J293888Q93970m57395k85973J451505K485675J230403
39287F453098j343986k775959j658067Q74592K225134J107872r67937j475055
39279B439692N0209J515321J042035o65481j437294n56814N18177L88137m34964
39270B859018n43345L25090J317675K048690K725974K751263R84625j916997l254832
$$ plain form
39261 7297161 5502734 5595068 5389237 3939011 3288304 4898804 6537412 5292517 2314970
39252 2314970 1450890 3596806 5662844 5568687 5075039 6314947 8252123 8611417 7355924
39243 7355924 6054098 5200843 4368198 3999740 4812974 5987399 6049705 5304273 5479973
39234 5479973 7063496 8765698 9655411 10102431 10408329 10109975 9034888 7740153 6606084
39225 6606084 5690981 5611025 7157131 9676177 11132901 10302238 7949315 5614847 4253799
39216 4253799 4124460 4765048 4949334 3966426 2993391 3695462 5464477 5964503 4673859
39207 4673859 3644951 4083524 4648459 4381883 4755305 6769620 8254810 6792072 3858414
39198 3858414 3124528 5387694 8012928 9046651 9069721 8870637 8053326 6663827 5861115
$$ packed form
39261G297161j794427R2334k05831j450226o50707J610500J638608j244895k977547
39252B314970q64080K145916K066038r4157m93648J239908J937176L59294j255493
39243G355924j301826q53255q32645l68458Q13234J174425O2306p45432J75700
39234E479973J583523J702202Q89713M47020L05898k98354j075087j294735j134069
39225F606084r15103p9956J546106K519046J456724q30663k352923k334468j361048
39216D253799j29339O40588J84286r82908r73035P02071J769015N00026j290644
39207D673859j028908M38573N64935k66576L73422K014315J485190j462738k933658
39198C858414p33886K263166K625234J033723K3070j99084q17311j389499q02712
$$ plain form
39189 5861115 5999740 5961751 5344687 5490598 7201461 9082407 9506321 8841942 8276007
39180 8276007 7643068 6144787 4381357 3792918 4410559 4901224 4808492 5056009 5942867
39171 5942867 6312575 5482686 4583840 4815243 5413030 4814771 3253065 2551310 3416939
39162 3416939 4566432 4882214 4863559 5211718 5461978 5111287 4775221 4889482 4569046
39153 4569046 3442112 3274625 5461471 8016340 8027637 6465150 7006514 10216958 13241741
39144 13241741 16146174 23302236 35368936 44518297 42673391 31852656 21188516 15418752
39136 15418752 11879972 8042672 5591453 5686551 5806021 4076879 2602250 3525871 5137480
39127 5137480 4974080 4019503 4564042 6063341 6440633 5867495 5937657 6247903 5130481
$$ packed form
39189E861115J38625l7989o17064J45911J710863J880946M23914o64379n65935
39180H276007o32939j498281j763430n88439O17641M90665r2732K47517Q86858
39171E942867L69708q29889q98846K31403N97787n98259j561706p01755Q65629
39162C416939J149493L15782j8655L48159K50260l50691l36066J14261l20436
39153D569046j126934j67487K186846K554869J1297j562487N41364L210444L024783
39144A3241741K904433P156062J2066700R149361j844906j0820735j0664140n769764
39136A5418752l538780l837300k451219R5098J19470j729142j474629R23621J611609
39127E137480j63400r54577N44539J499299L77292n73138P0162L10246j117422
$$ plain form
39118 5130481 3193128 2960121 5025718 7295616 8216270 8307638 8205640 7530571 6329361
39109 6329361 5681384 6084036 6675829 6592815 5847225 4660013 3364273 3119401 4962770
39100 4962770 7655524 8261928 5803198 2836542 2272961 3871124 5198616 5082389 4477081
39091 4477081 4273769 3913014 2674991 1302375 1379512 3221261 5154675 5426158 4497925
39082 4497925 4554047 6479365 8330396 7721689 5077617 3214714 3783015 5375622 5505900
39073 5505900 3492811 893193 -254494 823892 3107436 4603892 4126403 2542992
39065 2542992 1885113 3049366 4863141 5638716 5116075 4487360 4892098 6330410 7872213
39056 7872213 8546165 8020713 6683701 5279741 4528702 4852619 6030702 7074902 6959977
$$ packed form
39118E130481j937353k33007K065597K269898R20654R1368j01998o75069j201210
39109F329361o47977M02652N91793q3014p45590j187212j295740k44872J843369
39100D962770K692754O06404k458730k966656n63581J598163J327492j16227o05308
39091D477081k03312l60755j238023j372616P7137J841749J933414K71483r28233
39082D497925N6122J925318J851031o08707k644072j862903N68301J592607J30278
39073E505900k013089k599618j147687J078386K283544J496456m77489j583411
39065B542992o57879J164253J813775P75575n22641o28715M04738J438312J541803
39056G872213O73952n25452j337012j403960p51039L23917J178083J044200j14925
$$ plain form
39047 6959977 5731606 4466317 3928339 3813993 3560832 3166626 2805422 2456631 2437010
39038 2437010 3366077 4968583 6019508 6254891 6946457 8599453 10101327 11974839 17914348
39029 17914348 29354603 40030249 40998942 31656305 21089884 16870001 16987162 15562688
39021 15562688 12063879 10226078 10700128 10345689 8173874 7017047 8599581 10858782
39013 10858782 11295067 9904760 7745530 5424853 4104727 5201773 7677691 8230557
39005 8230557 5826767 3609428 4433099 6873993 7945732 7527563 7206449 6548830 4099498
38996 4099498 1222306 1170820 4105111 6398519 5794324 4325359 4720159 6390540 6882237
38987 6882237 5574923 3935487 3111190 3021496 3254728 3477464 3377453 3237486 4007081
$$ packed form
39047F959977j228371j265289n37978j14346k53161l94206l61204l48791j9621
39038B437010R29067J602506J050925K35383O91566J652996J501874J873512N939509
39029A7914348J1440255J0675646R68693r342637j0566421m219883J17161j424474
39021A5562688l498809j837801M74050l54439k171815j156827J582534K259201
39013A0858782M36285j390307k159230k320677j320126J097046K475918N52866
39005H230557k403790k217339Q23671K440894J071739m18169l21114o57619k449332
38996D099498k877192n1486K934291K293408o04195j468965L94800J670381M91697
38987F882237j307314j639436q24297q9694K33232K22736j00011j39967P69595
$$ plain form
38978 4007081 5841759 7254203 6781982 4861326 2990569 1760834 914360 583596 991397
38969 991397 1505736 1551258 1904637 3324569 4463042 3439473 1365648 1590376 4751235
38960 4751235 7250277 6131085 3203987 2264342 3894465 5452172 5244220 4180164
38952 4180164 3497343 3135812 2788437 2838185 3588356 4647542 5508558 5930648 5651480
38943 5651480 4629930 3609880 3452651 3848585 3713511 2918163 2467211 2778008 3048473
38934 3048473 2795324 2820815 3908708 5477151 6322181 6018588 4884639 3237212 1534443
38925 1534443 783414 1807081 4032885 5598559 4941738 2297128 -322881 -832086 850887
38916 850887 2577274 2367721 824798 277317 1589564 3041186 2787162 1231616 120095
$$ packed form
38978D007081J834678J412444m72221j920656j870757j229735q46474l30764M07801
38969I91397N14339M5522L53379J419932J138473j023569k073825K24728L160859
38960D751235K499042j119192k927098r39645J630123J557707k07952j064056
38952D180164o82821l61531l47375M9748P50171J059186Q61016M22090k79168
38943E651480j021550j020050j57229L95934j35074p95348m50952L10797K70465
38934C048473k53149K5491J087893J568443Q45030l03593j133949j647427j702769
38925A534443p51029J023667K225804J565674o56821k644610k620009n09205J682973
38916H50887J726387k09553j542923n47481J312247J451622k54024j555546j111521
$$ plain form
38907 120095 210800 950813 1898111 3216055 4747887 5572278 4912585 3171367 1763198
38898 1763198 1794179 2857919 3462151 3020620 2889729 4460266 6623497 6746540 4371025
38889 4371025 2104487 2017710 3029739 3333829 3637709 5624576 8223201 8297791 5187195
38880 5187195 1983383 1412001 2482350 2518976 989139 -310400 -73283 1081073 1877177
38871 1877177 1981477 2120539 3132380 4990861 6566463 6561467 4944713 3180333 2696976
38862 2696976 3383536 4001082 3904735 3831003 4814986 6661205 7925970 7545623 6123138
38853 6123138 5136705 5089828 5254753 5299923 5957353 7351194 7876014 6208597 3750470
38844 3750470 3275291 5247576 7259738 7381892 6280622 5386256 4755787 3918202 3357975
$$ packed form
38907A20095R0705P40013R47298J317944J531832Q24391o59693j741218j408169
38898A763198L0981J063740O04232m41531j30891J570537K163231J23043k375515
38889D371025k266538q6777J012029L04090L03880J986867K598625P4590l110596
38880E187195l203812n71382J070349L6626j529837j299539K37117J154356P96104
38871A877177J04300J39062J011841J858481J575602m996j616754j764380m83357
38862B696976O86560O17546r6347p3732R83983J846219J264765l80347j422485
38853F123138r86433m6877J64925M5170O57430J393841N24820j667417k458127
38844C750470m75179J972285K012162J22154j101270q94366o30469q37585n60227
$$ plain form
38835 3357975 3646738 4127088 4009793 4003472 5205239 6870117 7026692 5210348 2995329
38826 2995329 1756945 1477456 1976119 3563360 5697186 6501669 4885650 2277182 1060456
38817 1060456 1784329 2933823 3085909 2274879 1392363 1179468 1846523 2931854 3458871
38808 3458871 2859216 1765101 1277728 1524490 1754567 1867422 2700318 4319847 5210329
38799 5210329 4242968 2634854 2484824 3694974 4065374 2741055 1777572 3173224 5719260
38790 5719260 6483312 4726805 2493669 1448090 1086364 587937 573262 1804675 3464714
38781 3464714 4226494 4208960 4342864 4400145 3415980 1875334 1556929 2813061 3799894
38772 3799894 3271056 2546621 3380553 5083059 5477993 4138394 2932710 3390622 5020924
$$ packed form
38835C357975K88763M80350j17295o321J201767J664878J56575j816344k215019
38826B995329j238384k79489M98663J587241K133826Q04483j616019k608468j216726
38817A060456P23873J149494J52086q11030q82516k12895O67055J085331N27017
38808C458871n99655j094115m87373K46762K30077J12855Q32896J619529Q90482
38799E210329r67361j608114j50030J210150L70400j324319r63483J395652K546036
38790E719260P64052j756507k233136j045579l61726m98427j4675J231413J660039
38781C464714P61780j7534J33904N7281r84165j540646l18405J256132R86833
38772C799894n28838p24435Q33932J702506L94934j339599j205684M57912J630302
$$ plain form
38763 5020924 6450961 6879885 6011935 3872009 1426320 330440 1153329 2614186 3426351
38754 3426351 4085658 5699537 7698210 8244881 6882077 5328718 5231825 6267896 7059135
38745 7059135 6985429 6281743 5114495 3608505 2420367 2250725 2846090 3392713 3935792
38736 3935792 5354781 7504532 8456120 6701863 3619909 2319470 3801932 5647659
38728 5647659 5389878 3965675 4128039 6036703 6784056 4852682 2676704 3059997 4838738
38719 4838738 4637770 2017442 -83776 -35335 450404 -81999 -147020 1815800 4224749
38710 4224749 4607205 3544710 3547473 4884504 5511763 4871343 4670326 5437555 5314866
38701 5314866 3479144 2126671 3213976 5267278 5640861 4523909 4253749 5350989
$$ packed form
38763E020924J430037M28924q67950k139926k445689j095880Q22889J460857Q12165
38754C426351O59307J613879J998673N46671j362804j553359r6893J036071P91239
38745G059135p3706p03686j167248j505990j188138j69642N95365N46623N43079
38736C935792J418989K149751R51588j754257l081954j300439J482462J845727
38728E647659k57781j424203J62364J908664P47353j931374k175978L83293J778741
38719D838738k00968k620328k101218M8441M85739n32403o5021J962820K408949
38710D224749L82456j062495K763J337031O27259o40420k01017P67229j22689
38701E314866j835722j352473J087305K053302L73583j116952k70160J097240
$$ plain form
38693 5350989 5726005 3974361 1415008 159890 552120 1349796 1585424 1412091 1431952
38684 1431952 1756736 1826150 1160519 278987 472662 2323421 4819271 6415922 6641128
38675 6641128 6139657 5560938 5130669 4992372 5099541 4900830 3972426 2905567 2723613
38666 2723613 3413760 3912436 3644712 3176509 3126868 3364194 3685980 4423976 5747782
38657 5747782 6996466 7349393 6732257 5553144 4043541 2462362 1458036 1417118 1712642
38648 1712642 1440335 837561 1115646 2697940 4397083 4780657 3816814 2645307 2094286
38639 2094286 2048540 2123357 2270640 2567954 2950480 3439057 4219653 5159243 5619929 5201884
38629 5201884 4379857 3898494 3806150 3691380 3564544 3594759 3133499 1292243 -1162995
$$ packed form
38693E350989L75016j751644k559353j255118L92230P97676K35628j73333J9861
38684A431952L24784O9414o65631q81532J93675J850759K495850J596651K25206
38675F641128n01471n78719m30269j38297J07169j98711r28404j066859j81954
38666B723613O90147M98676k67724m68203m9641K37326L21786P37996J323806
38657E747782J248684L52927o17136j179113j509603j581179j004326m0918K95524
38648A712642k72307o02774K78085J582294J699143L83574r63843j171507n51021
38639B094286m5746P4817J47283K97314L82526M88577P80596R39590M60686m18045
38629E201884q22027m81363r2344j14770j26836L0215m61260j841256k455238
$$ plain form
38620 -1162995 -1889506 80515 2571112 2859121 1355768 980226 2990384 5299821 5563912
38611 5563912 4350954 3993102 5232949 6513027 6376646 5214936 4278237 3954647 3780710
38602 3780710 3690472 4345475 6020131 7742050 8112890 6925727 5483135 5099907 5624302
38593 5624302 5797778 4912750 3658177 3182279 3601582 3782936 2727147 981118 247344
38584 247344 1369195 3137831 3706066 2944749 2502652 3447375 4893644 5477444 5227778
38575 5227778 5119505 5474295 5821477 5916742 5894182 5654989 5013467 4240621 3636454 2890267
38565 2890267 1794089 1162854 1832716 3071575 3454286 3192870 3868558 5590049 6282173
38556 6282173 4612983 1991494 514216 314105 332642 547125 1666057 3231839 3852988
$$ packed form
38620a162995p26511J970021K490597K88009j503353l75542K010158K309437K64091
38611E563912j212958l57852J239847J280078j36381j161710r36699l23590j73937
38602C780710r0238O55003J674656J721919L70840j187163j442592l83228N24395
38593E624302J73476q85028j254573m75898M19303J81354j055789j746029p33774
38584B47344J121851J768636N68235p61317m42097R44723J446269N83800k49666
38575E227778j08273L54790L47182R5265k2560k39193o41522p72846o04167p46187
38565B890267j096178o31235O69862J238859L82711k61416O75688J721491O92124
38556F282173j669190k621489j477278k00111J8537K14483J118932J565782O21149
$$ plain form
38547 3852988 3301772 2853097 3254049 3603586 2774118 1076488 -75250 336557 2189650
38538 2189650 4598054 6608395 7664865 7721771 7065646 6091068 5166086 4450427 3766017
38529 3766017 2899094 2090097 1885276 2414520 3214235 3846055 4183341 4014695 3120325
38520 3120325 2029583 1828290 2631787 3076726 2145857 765815 545323 1478374 2145499
38511 2145499 1917804 1594145 1763582 1874468 1404460 859729 925664 1446832 1985811 2683499
38501 2683499 3643411 3985871 2736845 656308 -49484 1585187 3789261 4149314 2642907
38492 2642907 1428688 1791555 2704436 2853817 2686539 3323163 4421880 4638528 3794052
38483 3794052 3049969 2978048 2951542 2672993 2816336 3586618 3952025 3124580 1833431 1361808
$$ packed form
38547C852988n51216m48675M00952L49537q29468j697630j151738M11807J853093
38538B189650K408404K010341J056470N6906o56125r74578r24982p15659o84410
38529C766017q66923q08997k04821N29244P99715O31820L37286j68646q94370
38520C120325j090742k01293Q03497M44939r30869j380042k20492R33051O67125
38511B145499k27695l23659J69437J10886m70008n44731O5935N21168N38979O97688
38501B683499R59912L42460j249026k080537p05792J634671K204074L60053j506407
38492B642907j214219L62867R12881J49381j67278O36624J098717K16648q44476
38483C794052p44083p1921k6506k78549J43343P70282L65407q27445j291149m71623
$$ plain form
38473 1361808 2115684 3734621 5688555 7086170 6890159 5235488 3736922 3589691 4085876
38464 4085876 3889807 3030731 2583285 2903920 3229988 2822233 1837668 1267025 2203942
38455 2203942 4559099 6483886 6259457 4907469 5155273 7193091 7689600 4530011 434050
38446 434050 -416295 2171545 4858911 5582144 5145595 4628485 4069764 3764295 4310905
38437 4310905 5013714 4383236 2569947 1380616 1677475 2661640 3782604 5206106 6211626
38428 6211626 5494013 3612683 2886852 4087080 5315147 4994204 3909306 3305623 2983233
38419 2983233 2504059 2478109 3241177 3713218 2971027 1862238 1885125 3328411 5307157
38410 5307157 6714629 6631099 4946446 3036852 2560704 3231808 3242322 2182505 1748285
$$ packed form
38473A361808P53876J618937J953934J397615j96011j654671j498566j47231M96185
38464D085876j96069q59076m47446L20635L26068m07755r84565n70643R36917
38455B203942K355157J924787k24429j351988K47804K037818M96509l159589m095961
38446D34050q50345K587840K687366P23233m36549n17110n58721l05469N46610
38437D310905P02809o30478j813289j189331K96859R84165J120964J423502J005520
38428F211626p17613j881330p25831J200228J228067l20943j084898o03683l22390
38419B983233m79174k5950P63068M72041p42191j108789K2887J443286J978746
38410E307157J407472q3530j684653j909594m76148O71104J0514j059817m34220
$$ plain form
38401 1748285 2996896 4708423 5193331 4089354 1839521 -804203 -2277336 -1252827
38393 -1252827 1179431 2429966 2023047 2024663 3409411 4719057 5098585 5733029 7153063
38384 7153063 8001108 7669858 7265113 6923897 5494076 3918408 4993545 8354370 10119552
38375 10119552 9345886 9898158 13571696 16913808 17980724 20141429 25181961 29382974
38367 29382974 31534397 37282114 49130680 61644058 76594295 111713740 175890435
38360 175890435 240526169 258247314 215388184 148257456 100034717 78068018 63889706
38353 63889706 48234954 37473368 34069899 30743187 24162504 19722662 20184639 20473804
38345 20473804 16701213 11857385 9658978 9443857 9527299 9915308 9790850 7399952 3932905
$$ packed form
38401A748285J248611J711527M84908j103977k249833k643724j473133J024509
38393a252827K432258J250535m06919J616J384748J309646L79528O34444J420034
38384G153063Q48045l31250m04745l41216j429821j575668J075137L360825J765182
38375A0119552p73666N52272L673538L342112J066916K160705N040532M201013
38367B9382974K151423N747717J1848566J2513378J4950237L5119445O4176695
38360A75890435O4635734J7721145m2859130o7130728m8222739k1966699j4178312
38353F3889706j5654752j0761586l403469l326712o580683m439842M61977K89165
38345B0473804l772591m843828k198407k15121Q3442L88009j24458k390898l467047
$$ plain form
38336 3932905 2821299 4134526 4371095 2621687 1963341 3671850 5045662 4406785 3567491
38327 3567491 3830234 4043778 4079057 5665952 8211754 8448439 6039690 4823947 6393324
38318 6393324 7264221 5043933 2650022 3119776 4542416 3898164 2251053 2227404 3425415
38309 3425415 4122361 4815882 6401519 7312480 6030106 4195887 3959886 4562918 4682983
38300 4682983 5562826 8436251 11448468 12549571 12765090 13343374 13060789 12073097 14286910
38291 14286910 21129093 27488196 29822645 33409295 44048001 58406539 73775722 102039306
38283 102039306 156070428 219830579 250699751 223216161 159337681 103438006 75878844
38276 75878844 64152190 52200843 40054183 33497622 30732999 27020685 23157879 21815681
$$ packed form
38336C932905j111606J313227K36569j749408o58346J708509J373812o38877q39294
38327C567491K62743K13544L5279J586895K545802K36685k408749j215743J569377
38318F393324Q70897k220288k393911M69754J422640o44252j647111k3649J198011
38309C425415O96946O93521J585637R10961j282374j834219k36001O03032J20065
38300D682983Q79843K873425L012217J101103K15519N78284k82585r87692K213813
38291A4286910O842183O359103K334449L586650J0638706J4358538J5369183K8263584
38283A02039306N4031122O3760151L0869172k7483590o3878480n5899675k7559162
38276G5878844j1726654j1951347j2146660o556561k764623l712314l862806j342198
$$ plain form
38268 21815681 21094820 17889693 13618681 11311715 10180054 7949271 6001757 7279525
38260 7279525 10649566 11972020 10106942 7825570 6903480 5976236 3769084 1414659
38252 1414659 579058 1397208 3071793 4870724 5932388 5547820 4234988 3413561 3686029
38243 3686029 4471428 5338430 6332585 6882921 6032528 4271948 3551634 4613352 5741432
38234 5741432 5324367 4412604 5150520 7390516 8620686 7202963 4197436 1705506 677701
38225 677701 851346 1681977 2446537 2226958 899878 -173538 538571 2760277 4600850
38216 4600850 4784182 3807330 2674882 1500498 37080 -1192337 -1316591 -406181 552489
38207 552489 956833 1144494 1613548 2357387 3107230 3636111 3618703 2718641 1116073 -379568
$$ packed form
38268B1815681p20861l205127m271012k306966j131661k230783j947514J277768
38260G279525L370041J322454j865078k281372r22090r27244k207152k354425
38252A414659q35601Q18150J674585J798931J061664l84568j312832q21427K72468
38243C686029P85399Q67002R94155N50336q50393j760580p20314J061718J128080
38234E741432m17065r11763P37916K239996J230170j417723l005527k491930j027805
38225F77701J73645Q30631P64560k19579j327080j073416P12109K221706J840573
38216D600850J83332r76852j132448j174384j463418j229417j24254R10410R58670
38207E52489M04344J87661M69054P43839P49843N28881j7408r00062j602568j495641
$$ plain form
38197 -379568 -946774 -279402 1419769 3490693 4842326 4561535 2835537 926771 4895
38188 4895 267866 1252710 2512165 3725705 4529678 4612106 3948701 2942154 2379041 2863772
38178 2863772 3867322 3817103 1988904 -10479 159438 2473057 4357261 3962317 2253513
38169 2253513 1148736 944073 793628 689716 1356281 2582589 3204101 2849577 2507412
38160 2507412 3014993 3862646 3974153 3177255 2437668 2720922 3832728 4566616 4171187
38151 4171187 3420351 3640710 4783904 5387760 4649774 3451519 2799268 2415756 1812457
38142 1812457 1680314 2823886 4356913 4503134 3068643 1790474 2080869 3482479 4646589
38133 4646589 5073908 5492748 6749115 8395694 8557152 5910516 1907323 -178730 928692
$$ packed form
38197c79568n67206O67372J699171K070924J351633k80791j725998j908766r21876
38188D895K62971R84844J259455J213540Q03973Q2428o63405j006547n63113M84731
38178B863772J003550n0219j828199j999383J69917K313619J884204l94944j708804
38169B253513j104777k04663j50445j03912O66565J226308O21512l54524l42165
38160B507412N07581Q47653J11507p96898p39587K83254J111806P33888l95429
38151D171187p50836K20359J143194O03856p37986j198255o52251l83512o03299
38142A812457j32143J143572J533027J46221j434491j278169K90395J401610J164110
38133D646589M27319M18840J256367J646579J61458k646636m003193k086053J107422
$$ plain form
38124 928692 2921599 3153180 2058126 1757107 2556805 3071165 3075970 3707467 4886109
38115 4886109 4970612 3417050 1693818 945510 629945 168501 126894 812755 1279150
38106 1279150 832297 330176 933471 2430977 3598795 3520045 2091843 -8489 -1606818
38097 -1606818 -2081338 -2066225 -2147892 -1427277 881466 2926023 1873194 -1677075 -3731423
38088 -3731423 -2235995 362091 1192299 835525 1182230 1910406 1637035 766767 576267
38079 576267 752176 247627 -564874 -935238 -1758327 -4009225 -6115438 -5599942 -2757972
38070 -2757972 -106826 1309506 2380382 3130982 2520725 1206113 1506089 3829397 5664550
38061 5664550 5113334 3331199 2524652 3387303 5305721 7230425 7584163 5325475 2079000
$$ packed form
38124I28692J992907K31581j095054l01019P99698N14360M805O31497J178642
38115D886109Q4503j553562j723232p48308l15565m61444m1607O85861M66395
38106A279150m46853n02121O03295J497506J167818p8750j428202k100332j598329
38097a606818m74520J5113q1667P20615K308743K044557j052829l550269k054348
38088c731423J495428K598086Q30208l56774L46705P28176k73371q70268j90500
38079E76267J75909n04549q12501l70364q23089k250898k106213N15496K841970
38070b757972K651146J416332J070876P50600o10257j314612K99976K323308J835153
38061E664550n51216j782135q06547Q62651J918418J924704L53738k258688l246475
$$ plain form
38052 2079000 1199784 3535875 6101209 6350960 5662098 6530122 8142017 7542296 4360056
38043 4360056 1461687 735356 741094 -559597 -2648164 -3405095 -2151021 -307590 649121
38034 649121 757216 987065 1882298 3102065 3866245 3566236 2293797 1062477 1082830
38025 1082830 2316594 3140385 2195159 294702 -511861 314402 1295537 1439465 1719065
38016 1719065 3171799 4894003 5319730 4583111 4060068 4067733 3552287 1927162 -73581
38007 -73581 -1394613 -1530210 -505336 1132917 2478808 3113201 3340405 3016141 1236488
37998 1236488 -1687359 -3293836 -1908187 513742 812462 -785690 -1210738 544223
37990 544223 2091143 1731688 898523 1323098 2372152 2820313 3080662 3781153 3876775
$$ packed form
38052B079000q79216K336091K565334K49751o88862Q68024J611895n99721l182240
38043D360056k898369p26331N738j300691k088567p56931J254074J843431R56711
38034F49121J08095K29849Q95233J219767P64180l00009j272439j231320K0353
38025A082830J233764Q23791r45226j900457q06563Q26263R81135J43928K79600
38016A719065J452734J722204M25727p36619n23043P665n15446j625125k000743
38007g3581j321032j35597J024874J638253J345891O34393K27204l24264j779653
37998A236488k923847j606477J385649K421929K98720j598152m25048J754961
37990E44223J546920l59455q33165M24575J049054M48161K60349P00491R5622
$$ plain form
37981 3876775 2243530 -43753 -929932 -43886 1409521 2539305 3031501 2432632 852500
37972 852500 -304437 25392 761632 197330 -1173799 -1267031 277023 1419610 852350
37963 852350 2269 858027 3028090 4351022 3949275 3283202 3877125 5051196 4862266
37954 4862266 2924616 1051079 708403 1051051 573119 -212398 529714 2835318 4442723
37945 4442723 3880152 2363089 1759478 2109821 2322844 2184686 2263563 2482436 2188845
37936 2188845 1455748 1182668 1793277 2579907 2567800 1688781 906702 1119706 1947424 2037191
37926 2037191 920928 -109777 199931 1147163 1281267 883970 1374600 2564407 2781136
37917 2781136 1873061 1571370 2225304 1866257 -216203 -1616997 -452372 1461389 1473992
$$ packed form
37981C876775j633245k287283q86179Q86046J453407J129784M92196n98869j580132
37972H52500j156937L29829P36240n64302j371129r3232J544054J142587n67260
37963H52350q50081Q55758K170063J322932m01747o66073N93923J174071j88930
37954D862266j937650j873537l42676L42648m77932p85517P42112K305604J607405
37945D442723n62571j517063o03611L50343K13023j38158P8877K18873k93591
37936B188845p33097k73080O10609P86630j2107q79019p82079K13004Q27718Q9767
37926B037191j116263j030705L09708R47232J34104l97297M90630J189807K16729
37917B781136r08075l01691O53934l59047k082460j400794J164625J913761J2603
$$ plain form
37908 1473992 297101 600582 2704415 4523727 5070954 5219041 5259265 4377557 2772948
37899 2772948 1975530 2524579 3130350 2637617 1362128 134693 -677667 -949714 -754680
37890 -754680 -664351 -1089500 -1467097 -1144335 -667849 -907320 -1356007 -831039 527906 1652190
37880 1652190 2569487 4036807 5268190 4332891 1328589 -967346 -599599 1085263 1606164
37871 1606164 715777 308030 1612211 3571066 4020190 2142412 -374404 -1071557 202912
37862 202912 1029904 38170 -751305 930248 3455516 3205429 158878 -1743576 -344052
37853 -344052 1890566 2106835 1150057 1307677 2359933 2505963 1695292 1385138 1825070
37844 1825070 1997168 1790031 1988601 2283954 1468561 -160706 -567897 1197092 3451766
$$ packed form
37908A473992j176891L03481K103833J819312N47227J48087M0224q81708j604609
37899B772948p97418N49049O05771m92733j275489j227435q12360k72047J95034
37890g54680R0329m25149l77597L22762M76486k39471m48687N24968J358945J124284
37880A652190R17297J467320J231383r35299l004302k295935L67747J684862N20901
37871A606164q90387m07747J304181J958855M49124j877778k516816o97153J274469
37862B02912Q26992r91734p89475J681553K525268k50087l046551j902454J399524
37853c44052K234618K16269r56778J57620J052256J46030q10671l10154M39932
37844A825070J72098k07137J98570K95353q15393j629267m07191J764989K254674
$$ plain form
37835 3451766 3997943 2743856 1403340 1274729 2050829 2479264 1742756 432707 291497
37826 291497 2449295 5651822 6938396 4737645 817941 -1677019 -1836617 -1499618 -2113758
37817 -2113758 -2622474 -1503232 351019 665610 -711178 -1461666 -351382 886412 222539
37808 222539 -1839513 -3466097 -4024459 -3773859 -2390687 126720 2061608 1822903 656144
37799 656144 1134271 3196683 4212431 3080761 1601946 1200370 986278 210081 77861
37790 77861 1361719 2323196 1244625 -422755 172078 3098080 5432687 5034261 2678795
37781 2678795 375554 -819043 -914766 -186228 1033062 2272254 3005711 2663281 805399
37772 805399 -2176027 -4720460 -5216715 -3672666 -1825522 -1327621 -2018404 -2210466 -680846
$$ packed form
37835C451766N46177j254087j340516j28611P76100M28435p36508j310049j41210
37826B91497K157798L202527J286574k200751l919704k494960j59598L36999o14140
37817b113758n08716J119242J854251L14591j376788p50488J110284J237794o63873
37808B22539k062052j626584n58362K50600J383172K517407J934888k38705j166759
37799F56144M78127K062412J015748j131670j478815m01576k14092p76197j32220
37790G7861J283858R61477j078571j667380N94833K926002K334607l98426k355466
37781B678795k303241j194597r5723P28538J219290J239192P33457l42430j857882
37772H05399k981426k544433m96255J544049J847144M97901o90783j92062J529620
$$ plain form
37763 -680846 1787352 3078465 2007581 -374306 -1908869 -1429394 495258 2406115
37755 2406115 3051740 2081261 264566 -1224223 -2092638 -2969829 -3886456 -3818070 -2510552
37746 -2510552 -1442468 -1634586 -1775402 -348027 1530974 1733423 721544 754134 1937378
37737 1937378 2234541 1537756 2235725 4738489 5865693 3572550 393175 -233664 1186634
37728 1186634 1721944 762168 360406 1545319 2910815 2999876 2273936 2248504 3513132
37719 3513132 4859963 4405492 2069787 494646 2031271 5107438 5855035 3519429
37711 3519429 1389982 1533755 1919735 562045 -812897 -35020 1400743 954116 -368300
37702 -368300 154626 1979678 2096973 74594 -1463240 -1153240 -199028 592428 1682176
$$ packed form
37763f80846K468198J291113j070884k381887j534563M79475J924652J910857
37755B406115O45625r70479j816695j488789q68415q77191r16627O8386J307518
37746b510552J068084j92118j40816J427375J879001K02449j011879L2590J183244
37737A937378K97163o96785O97969K502764J127204k293143l179375o26839J420298
37728A186634N35310r59776m01762J184913J365496Q9061p25940k5432J264628
37719C513132J346831m54471k335705j575141J536625L076167P47597k335606
37711C519429k129447J43773L85980j357690j374942P77877J435763m46627j322416
37702c68300N22926J825052J17295k022379j537834L10000R54212P91456J089748
$$ plain form
37693 1682176 2518968 1738900 151813 321017 2379096 3308695 1457890 -1038050 -1621614
37684 -1621614 -563865 568273 1417382 2193016 2342631 1450414 174742 -814400 -1585917
37675 -1585917 -1940043 -1228801 86831 444559 -392202 -691495 521174 1937937 2245733
37666 2245733 2013924 1998035 1478892 -54289 -1273514 -928085 62069 368580 753097
37657 753097 2572826 4844337 5332468 4097586 3406888 4021328 4030756 2129864 -52036
37648 -52036 -261005 1119771 1750940 702203 -459257 -126644 1100878 1478489 704630
37639 704630 210313 858873 1657585 1459794 893994 1372921 2753470 3393954 2432992
37630 2432992 698625 -742778 -1636893 -1834506 -850895 1137571 2759095 2719508 1198844
$$ packed form
37693A682176Q36792p80068j587087J69204K058079R29599j850805k495940n83564
37684a621614J057749J132138Q49109P75634J49615q92217j275672r89142p71517
37675a585917l54126P11242J315632L57728q36761k99293J212669J416763L07796
37666B245733k31809j5889n19143j533181j219225L45429R90154L06511L84517
37657G53097J819729K271511M88131j234882o90698O14440R428j900892k181900
37648e2036k08969J380776O31169j048737j161460L32613J227522L77611p73859
37639G04630m94317O48560P98712j97791n65800M78927J380549O40484r60962
37630B432992j734367j441403q94115j97613R83611J988466J621524l9587j520664
$$ plain form
37621 1198844 -448770 -1001962 -182591 1340823 2546377 2983618 3043908 3005086 2348274
37612 2348274 791883 -624476 -718803 10290 212555 45377 929163 2906424 4190530
37603 4190530 3847215 3095406 3142608 3404100 2925125 2135295 1966752 2318975 2556493 2650198
37593 2650198 2790591 2679321 2202394 2082781 2877905 3892448 3972509 2973768 1790566
37584 1790566 1339053 1969034 3368059 4636238 4930943 4259679 3141776 1626752 -451556
37575 -451556 -2413996 -3203108 -2962177 -2797221 -2884140 -2366289 -1317450 -993746 -1636136
37566 -1636136 -1860060 -966745 -97931 -244713 -827799 -1153938 -1539239 -2019965 -1724762
37557 -1724762 -550909 344800 673364 1518330 2666187 2047558 -498098 -1702302 411918
$$ packed form
37621A198844j647614n53192Q19371J523414J205554M37241O0290l8822o56812
37612B348274j556391j416359r4327P29093K02265j67178Q83786J977261J284106
37603D190530l43315p51809M7202K61492m78975p89830j68543L52223K37518R3705
37593B650198J40393j11270m76927j19613P95124J014543Q0061r98741j183202
37584A790566m51513O29981J399025J268179K94705o71264j117903j515024k078308
37575d51556j962440p89112K40931J64956q6919N17851J048839L23704o42390
37566a636136k23924Q93315Q68814j46782n83086l26139l85301m80726K95203
37557a724762J173853Q95709L28564Q44966J147857o18629k545656j204204K114220
$$ plain form
37548 411918 2815507 1641918 -1866794 -3155978 -904509 1859521 2654140 2068552 1373624
37539 1373624 783950 565762 1226976 2049966 1625260 193389 -568113 -196136 248905
37530 248905 545246 1594455 3070620 3224344 1666911 175133 14125 459737 686513
37521 686513 1151507 2232066 3222345 3536885 3420374 2895954 1661283 561603 1254780
37512 1254780 3533647 4778622 3209179 216414 -1622191 -1543153 -587649 159887 190512
37503 190512 -624377 -1796232 -2365309 -1907577 -900301 14372 341974 -435995 -2020890
37494 -2020890 -2533517 -438678 2701548 3535387 1449200 -436087 364576 2535810 3368954
37485 3368954 2296183 555762 -879849 -1469366 -800680 279916 -237717 -2639753 -4196369
$$ packed form
37548D11918K403589j173589l508712j289184K251469K764030P94619n85588o94928
37539A373624n89674k18188O61214Q22990m24706j431871p61502L71977M45041
37530B48905K96341J049209J476165J53724j557433j491778j61008M45612K26776
37521F86513M64994J080559R90279L14540j16511n24420j234671j099680O93177
37512A254780K278867J244975j569443k992765j838605P9038R55504P47536L0625
37503A90512q14889j171855n69077M57732J007276R14673L27602p77969j584895
37494b020890n12627K094839L140226Q33839k086187j885287Q00663K171234Q33144
37485C368954j072771j740421j435611n89517O68686J080596n17633k402036j556616
$$ plain form
37476 -4196369 -2595779 731865 2733096 2847905 2678057 2613009 1538407 -430139 -1596875
$$ packed form
37476d196369J600590L327644K001231J14809j69848o5048j074602j968546j166736
$$ [...]
##END NTUPLES=NMR SPECTRUM
##END=
