##TITLE=31Pdec_SR160_rm1.5h
 , 24 sc
 16.1.2023
##JCAMPDX= 6.0         $$ Bruker NMR JCAMP-DX V2.0
##DATA TYPE= NMR SPECTRUM
##DATA CLASS= NTUPLES
##ORIGIN= UXNMR, Bruker Analytische Messtechnik GmbH
##OWNER= root
$$ XWIN-NMR		Version 3.5
$$ Mon Jan 16 15:57:23 2023 Russian Standard Time (UT+4h)  she@DPX200
##.OBSERVE FREQUENCY= 81.020009
##.OBSERVE NUCLEUS= ^31P
##.ACQUISITION MODE= SIMULTANEOUS
##.ACQUISITION SCHEME= undefined
##.AVERAGES= 24
##.DIGITISER RES= 16
##SPECTROMETER/DATA SYSTEM= spect
##.PULSE SEQUENCE= zgpg30
##.SOLVENT NAME= DMSO
##.SHIFT REFERENCE= (INTERNAL, DMSO, 0, 324.946)
##AUDIT TRAIL= $$ (NUMBER, WHEN, WHO, WHERE, WHAT)
$$ ##TITLE= Audit trail, XWIN-NMR		Version 3.5
$$ ##JCAMPDX= 5.01
$$ ##ORIGIN= Bruker BioSpin GmbH
$$ ##OWNER= she
$$ F:/spectra/data/she/nmr/P31/1/pdata/1/auditp.txt
$$ ##AUDIT TRAIL=  $$ (NUMBER, WHEN, WHO, WHERE, WHAT)
(   1,<2023-01-16 15:55:56.31 +0400>,<she>,<DPX200>,
      <created by zg, POWCHK disabled, PULCHK disabled
       configuration hash MD5:
       00 E9 B6 7A A2 85 ED C7 34 08 36 98 17 FE 4E 26
       data hash MD5: 32K
       DC 86 36 64 49 EB F4 95 E5 CC 93 53 9B 4F 42 C4>)
(   2,<2023-01-16 15:55:58.85 +0400>,<she>,<DPX200>,
      <Start of raw data processing
       efp BC_mod = 2 LB = 1 FT_mod = 6 PKNL = 1 PHC0 = -11229.75 PHC1 = 1319.658 SI = 64K 
       data hash MD5: 64K
       EE A3 6D 20 84 87 9F 91 ED 06 55 4A 08 1B B9 78>)
(   3,<2023-01-16 15:56:33.35 +0400>,<she>,<DPX200>,
      <pk PHC0 = -103.7922 PHC1 = 48.00004 
       data hash MD5: 64K
       D9 DA 0A B1 E5 FC 0D DB DD A5 50 1D A2 84 E6 ED>)
$$ ##END=
$$ 
$$ hash MD5
$$ 64 89 F8 29 F3 54 34 F4 D5 6D 1E A3 EB B2 2D 8E
##$RELAX= 
##$RELAX= 
##$RELAX= 
##$RELAX= 
##$RELAX= 
##$RELAX= 
##$RELAX= 
##$RELAX= 
##$RELAX= 
$$ Bruker specific parameters
$$ --------------------------
##$DU= <F:/spectra>
##$EXPNO= 1
##$NAME= <P31>
##$PROCNO= 1
##$TYPE= <nmr>
##$USER= <she>
##$AMP= (0..31)
100 100 100 100 100 100 100 100 100 100 100 100 100 100 100 100 100 100 
100 100 100 100 100 100 100 100 100 100 100 100 100 100 
##$AQSEQ= 0
##$AQ_mod= 1
##$AUNM= <au_zg>
##$AUTOPOS= <>
##$BF1= 81.014009
##$BF2= 200.13
##$BF3= 200.13
##$BF4= 200.13
##$BF5= 200.13
##$BF6= 200.13
##$BF7= 200.13
##$BF8= 200.13
##$BYTORDA= 1
##$CFDGTYP= 0
##$CFRGTYP= 5
##$CHEMSTR= <none>
##$CNST= (0..31)
1 1 145 1 1 1 1 1 1 1 1 1 1 1 1 1 1 1 1 1 1 1 1 1 1 1 1 1 1 1 1 1 
##$CPDPRG= <waltz16>
##$CPDPRG1= <>
##$CPDPRG2= <waltz16>
##$CPDPRG3= <>
##$CPDPRG4= <mlev>
##$CPDPRG5= <mlev>
##$CPDPRG6= <mlev>
##$CPDPRG7= <mlev>
##$CPDPRG8= <mlev>
##$CPDPRGB= <>
##$CPDPRGT= <>
##$D= (0..31)
0 1 0 0 0 0 0 0 0 0 0 0.03 2e-05 3e-06 0 0 0 0 0 0 0 0 0 0 0 0 0 0 0 0 
0 0 
##$DATE= 1673870155
##$DBL= (0..7)
120 120 120 11 120 120 24 19 
##$DBP= (0..7)
150 150 150 150 150 150 150 150 
##$DBP07= 0
##$DBPNAM0= <>
##$DBPNAM1= <>
##$DBPNAM2= <>
##$DBPNAM3= <>
##$DBPNAM4= <>
##$DBPNAM5= <>
##$DBPNAM6= <>
##$DBPNAM7= <>
##$DBPOAL= (0..7)
0.5 0.5 0.5 0.5 0.5 0.5 0.5 0.5 
##$DBPOFFS= (0..7)
$$ [...]
##$SUBNAM2= <"">
##$SUBNAM3= <"">
##$SUBNAM4= <"">
##$SUBNAM5= <"">
##$SUBNAM6= <"">
##$SUBNAM7= <"">
##$SUBNAM8= <"">
##$SUBNAM9= <"">
##$SW= 501.732929998379
##$SWIBOX= (0..15)
0 1 3 0 0 0 0 0 0 0 0 0 0 0 0 0 
##$SW_h= 40650.406504065
##$TD= 32768
##$TD0= 1
##$TE= 0
##$TE2= 300
##$TE3= 300
##$TEG= 300
##$TL= (0..7)
0 120 53 12 22 120 120 120 
##$TP= (0..7)
150 150 150 150 150 150 150 150 
##$TP07= 0
##$TPNAME0= <>
##$TPNAME1= <>
##$TPNAME2= <>
##$TPNAME3= <>
##$TPNAME4= <>
##$TPNAME5= <>
##$TPNAME6= <>
##$TPNAME7= <>
##$TPOAL= (0..7)
0.5 0.5 0.5 0.5 0.5 0.5 0.5 0.5 
##$TPOFFS= (0..7)
0 0 0 0 0 0 0 0 
##$TUNHIN= 0
##$TUNHOUT= 0
##$TUNXOUT= 0
##$USERA1= <user>
##$USERA2= <user>
##$USERA3= <user>
##$USERA4= <user>
##$USERA5= <user>
##$V9= 5
##$VALIST= <valist>
##$VCLIST= <CCCCCCCCCCCCCCC>
##$VD= 0
##$VDLIST= <DDDDDDDDDDDDDDD>
##$VPLIST= <PPPPPPPPPPPPPPP>
##$VTLIST= <TTTTTTTTTTTTTTT>
##$WBST= 1024
##$WBSW= 4
##$XGAIN= (0..3)
0 0 0 0 
##$XL= 0
##$YL= 0
##$YMAX_a= 5560
##$YMIN_a= -7020
##$ZGOPTNS= <>
##$ZL1= 120
##$ZL2= 120
##$ZL3= 120
##$ZL4= 120
##$ABSF1= 0
##$ABSF2= 0
##$ABSG= 0
##$ABSL= 0
##$ALPHA= 0
##$AQORDER= 0
##$ASSFAC= 0
##$ASSFACI= 0
##$ASSFACX= 0
##$ASSWID= 0
##$AUNMP= <proc_1d>
##$AZFE= 0.1
##$AZFW= 0.5
##$BCFW= 0
##$BC_mod= 2
##$BYTORDP= 0
##$COROFFS= 0
##$CY= -3
##$DATMOD= 1
##$DC= 0
##$DFILT= <>
##$DTYPP= 0
##$F1P= 0
##$F2P= 0
##$FCOR= 1
##$FTSIZE= 65536
##$FT_mod= 6
##$GAMMA= 0
##$GB= 0
##$INTBC= 1
##$INTSCL= 6.047779e-11
##$ISEN= 30
##$LB= 1
##$LEV0= 0
##$LPBIN= 0
##$MAXI= 10000
##$MC2= 0
##$MEAN= 0
##$ME_mod= 0
##$MI= 50
##$NCOEF= 0
##$NC_proc= -7
##$NLEV= 6
##$NOISF1= 182.463
##$NOISF2= 159.3651
##$NSP= 0
##$NTH_PI= 0
##$NZP= 0
##$OFFSET= 324.9463
##$PC= 4
##$PHC0= -11333.54
##$PHC1= 1367.658
##$PH_mod= 1
##$PKNL= yes
##$PPARMOD= 0
##$PSCAL= 0
##$PSIGN= 0
##$REVERSE= no
##$SF= 81.0140089999694
##$SI= 65536
##$SIGF1= 159.3651
##$SIGF2= -187.1042
##$SINO= 113.3802
##$SIOLD= 16384
##$SREGLST= <1H.CDCl3>
##$SSB= 0
##$STSI= 65536
##$STSR= 0
##$SW_p= 40650.406504065
##$SYMM= 0
##$S_DEV= 0
##$TDeff= 32768
##$TDoff= 0
##$TI= <>
##$TILT= no
##$TM1= 0
##$TM2= 0
##$TOPLEV= 0
##$USERP1= <user>
##$USERP2= <user>
##$USERP3= <user>
##$USERP4= <user>
##$USERP5= <user>
##$WDW= 1
##$XDIM= 65536
##$YMAX_p= 383838793
##$YMIN_p= -19465520
$$ End of Bruker specific parameters
$$ ---------------------------------
##NTUPLES= NMR SPECTRUM
##VAR_NAME=  FREQUENCY,     SPECTRUM/REAL,   SPECTRUM/IMAG
##SYMBOL=    X,             R,               I
##VAR_TYPE=  INDEPENDENT,   DEPENDENT,       DEPENDENT
##VAR_FORM=  AFFN,          ASDF,            ASDF
##VAR_DIM=   65536,         65536,           65536
##UNITS=     HZ,            ARBITRARY UNITS, ARBITRARY UNITS
##FACTOR=    0.620285442955139, 1,           1
##FIRST=     26325.201586616, 0,             0
##LAST=      -14325.204917449, 0,            0
##MIN=       -14325.204917449, -19465520,    0
##MAX=       26325.201586616, 383838793,     0
$$ Real data points
##PAGE= N=1
##DATA TABLE= (X++(R..R)), XYDATA
$$ [...]
50197b47518p55878j65231Q37620J244351L15953j028681j020228K23799N33856
50188f1957q29808j734322p23057M56197Q7296l04585J021224K238115J027125
50179A176228o65336M48859K840462K185218j193432k587846p41260M86030o90596
50170A258327j105384R82637K327234N01580j718462j243730L59057L88505l49051
50161A400713q7084K21812n43425p45953P00247J363737n33624k250542r50804
50152a424923J220144R82108k49424O13440K240112J324204j048566j217202M64199
50143B904092O63385m82760N8803J861913J379250j384262k572879j336194r85449
50134A05899k296436j728308J765374L848159J513924k072169k520109j46849
$$ plain form
50197 -247518 -1003396 -1168627 -331007 913344 1229297 200616 -819612 -595813 -61957
50188 -61957 -891765 -2626087 -3349144 -2892947 -2805651 -3110236 -2089012 149103 1176228
50179 1176228 510892 959751 3800213 5985431 4791999 2204153 1462893 1948923 1258327
50170 1258327 152943 1135580 3462814 3964394 2245932 1002202 1361259 1749764 1400713
50161 1400713 1313629 1535441 992016 246063 946310 2310047 1776423 -474119 -1424923
50152 -1424923 -204779 777329 527905 1141345 3381457 4705661 3657095 2439893 2904092
50143 2904092 3567477 3084717 3143520 5005433 6384683 5000421 2427542 1091348 105899
50134 105899 -2190537 -3918845 -2153471 1694688 3208612 1136443 -1383666 -1530515
50126a530515J933539K339186J380647n49649k156337j563894M96861P20851j636066
50117e65377k916531o64983K246295J993350n82832j942615j117084K12665J094857
50108b242255J667931J481522K13733r71043j008187p13977j073595j255801l15185
50099d216857P91496R92769J120245J860154J642068o63066k729645j706347J152870
50090a756313K218707R63871R4611N69887L20654j493132k498323q66178J629490
50081h16726K172066P33420m98688m23100K8829j17290m67483k18330L75290L25285
50071A093273m41899p20530J43866R56217L92832o47286j80654J603754K378220
50062D577793J239849j15811n22186j086791k426968k682662m30709K381742K837535
$$ plain form
50126 -1530515 403024 2742210 4122857 3573208 1416871 -147023 349838 1070689 -565377
50117 -565377 -3481908 -4146891 -1900596 92754 -490078 -2432693 -3549777 -3337112 -2242255
50108 -2242255 -574324 907198 1120931 149888 -858299 -1572276 -2645871 -3901672 -4216857
50099 -4216857 -3425361 -2432592 -1312347 547807 2189875 1526809 -1202836 -2909183 -1756313
50090 -1756313 462394 1426265 1520876 2090763 2411417 918285 -1580038 -2446216 -816726
50081 -816726 1355340 2088760 1590072 1166972 1195801 1078511 611028 392698 767988 1093273
50071 1093273 651374 -69156 74710 1030927 1423759 776473 595819 2199573 4577793
50062 4577793 5817642 5701831 5179645 4092854 1665886 -1016776 -1447485 934257 3771792
50053C771792R94520q14553j362408r79739J24464J573605J864934J41197j881956
50044C431856k033407q27378k10273l23335j32401m4176p77796p59934J658126
50035a8718M168388K969296q76367k234118K43125J942066k81290l261219k970069
50026c18906o58247J70989l31306K75997J681860J532754n0023p71718l46613
50017A184787n30722j244435m86144J606856K292279O57840q38377m95485R3118
50008B239717o66783j379887k66727J449084J415735m7108p33759k72500l09201
49999A428571j185058j133478O03736K110037J442327o06791j777473j364686
49991d82815n03334J9642O27351J491605J652311M06894j282948j803086r33347
$$ plain form
50053 3771792 4766312 3951759 2589351 1609612 1734076 3307681 5172615 5313812 3431856
50044 3431856 1398449 571071 360798 37463 -94938 -139114 -916910 -1676844 -18718
50035 -18718 4149670 7118966 6242599 4008481 4251606 6193672 5912382 2651163 -318906
50026 -318906 -977153 -806164 -1137470 -861473 820387 2353141 2303118 1531400 1184787
50017 1184787 654065 -590370 -1076514 530342 2822621 3480461 2642084 2146599 2239717
50008 2239717 1572934 193047 -73680 1375404 2791139 2744031 2010272 1737772 1428571
49999 1428571 243513 -889965 -286229 1823808 3266135 2659344 881871 -482815
49991 -482815 -986149 -966507 -339156 1152449 2804760 3211654 1928706 125620 -807727
49982h07727J30486O48755J043649J510039J244120j27883j441954j486719p72700
49973e9934m48444k17016Q38262J835000R03895j318044j633494J079937L543501
49964D523663K348417j228133l087737j874401o5384Q1839q71176j256494n19187
49955a948593Q37091J963763J889767L50480j359035j615103n85995K18665L10107
49946F1147L97662L80978o15115j951743j644070M22328J765640Q96926n23501
49937h09748m20625Q36435J767771K039460J808128P11371p54247p56264J007263
49928E429544J871232o0362k542854k283915O4026J054873l79367k031461k185135
49919a063419j258944J37156J913260L158376K672804J024110j72301q43375j915704
$$ plain form
49982 -807727 -677241 -28486 1015163 2525202 3769322 3641439 2199485 712766 -59934
49973 -59934 -508378 -725394 112868 1947868 2851763 1533719 -99775 980162 4523663
49964 4523663 6872080 5643947 2556210 681809 616425 698264 -172912 -1429406 -1948593
49955 -1948593 -1111502 852261 2742028 3092508 1733473 118370 -467625 -248960 61147
49946 61147 458809 839787 224672 -1727071 -3371141 -2948813 -1183173 -286247 -809748
49937 -809748 -1230373 -393938 1373833 3413293 5221421 5932792 5178545 4422281 5429544
49928 5429544 7300776 7240414 4697560 2413645 2477671 3532544 3153177 1121716 -1063419
49919 -1063419 -2322363 -2185207 -271947 2886429 5559233 6583343 6411042 5567667 3651963
49910C651963k630765j411985P38323J110480j39564N0023K238284K903984O8607
49901F579350l091187k900180o01082N577j650307k767539j775112p47J068058
49892e133169J676369K514362L182805K629918N62257j789641k436932p84383
49884D21586J149981Q90522j122137j975630l74069J716023K184698J415579P10082
49875E016635J41345n91775j005872j010736j495083k323890j740755N87803K123718
49866b98610J136172l80010k1203R61039J47601j317440m56063K037702K321604
49857D130792m52957k618607j595633N93379J024236P1398j83265M95504Q17114
49848B281961M54542J32485k4052n25009j235848j350331n84234M02730P98952
$$ plain form
49910 3651963 1021198 -390787 347536 1458016 1318452 1368475 3606759 6510743 6579350
49901 6579350 3488163 587983 -13099 -7522 -1657829 -4425368 -6200480 -6201227 -5133169
49892 -5133169 -3456800 -942438 2240367 4870285 5432542 3642901 1205969 421586
49884 421586 1571567 2462089 1339952 -635678 -1009747 706276 2890974 4306553 5016635
49875 5016635 5157980 4566205 3560333 2549597 1054514 -1269376 -3010131 -2422328 -298610
49866 -298610 837562 457552 436349 1397388 1544989 227549 -228514 1809188 4130792
49857 4130792 3677835 1059228 -536405 56974 1081210 1152608 969343 1464847 2281961
49848 2281961 2736503 2868988 2844936 2319927 1084079 -266252 -850486 -447756 351196
49839C51196N09180K59626P48186J490320J070793p72135k120642j302833L22656
49830E56347L9091j919125k222085O53888L783960L604352N16273k234389k930333
49821a52021k455456j781823p48246O03026J454643J506746J415908J429433Q40535
49812B112745n59889j619558j304159k52290J17146m07913o90270N6673J253319
49803a294196J771606J234020K88807j78242o748Q4743m67641r80041k12093J552320
49793A792535K188755N00001j631185j490202N49176J416327j93935k000899j650889
49784e20316P3574J037482R37034P75161N64302k23950q79487m58188P8843q10014
49774E74441k126465j231532J894203L934262K640324k59299j679526r11533M62798
$$ plain form
49839 351196 860376 1120002 1868188 3358508 4429301 3657166 1536524 233691 556347
49830 556347 595438 -1323687 -3545772 -2891884 892076 4496428 5012701 2778312 -152021
49821 -152021 -2607477 -4389300 -5137546 -4534520 -3079877 -1573131 -157223 1272210 2112745
49812 2112745 1552856 -66702 -1370861 -1623151 -1506005 -1913918 -2604188 -2547515 -1294196
49803 -1294196 477410 1711430 2000237 1821995 1815247 1899990 1432349 452308 240215 1792535
49793 1792535 3981290 4481291 2850106 1359904 1909080 3325407 3131472 1130573 -520316
49784 -520316 -446742 590740 1527774 2302935 2867237 2643287 1763800 1305612 1384455 574441
49774 574441 -1552024 -2783556 -889353 3044909 5685233 5425934 3746408 2834875 3297673
49765C297673R31070J12811j449948k530312k069613m90644O43467O40546K91395
49756f23555K10906l3546o11577o76823K70883J401097J673615J054604J69177
49747B834781l63429q4651P79214J041704P3058p84755n9842J100532M49006j367079
49737C618539j416691N65857J303500p83576k858012k079248K63876J343818R65907
49728I23970O42853O24300M07178N03781J299361J575761K88592j525178k361438
49719B379180k231874j569680j65355J294015J090236l86971k77630J871219K323342
49710D326482q27843l552990j826510J703141J951963m42196r31724Q49165J074974
49701B324462r13003j550672K87875J503242P09122M14515J667184J751152n52277
$$ plain form
49765 3297673 4228743 4341554 2891606 361294 -1708319 -2198963 -1555496 -914950 -623555
49756 -623555 -412649 -446195 -1057772 -1734595 -1463712 -62615 1611000 2665604 2834781
49747 2834781 2471352 2386701 3165915 4207619 4280677 3495922 3436080 4536612 4985618 3618539
49737 3618539 2201848 2767705 4071205 3287629 429617 -1649631 -1385755 -41937 923970
49728 923970 1566823 2191123 2598301 3102082 4401443 5977204 6265796 4740618 2379180
49719 2379180 147306 -1422374 -1587729 -293714 796522 409551 131921 2003140 4326482
49710 4326482 3498639 -54351 -1880861 -177720 1774243 1332047 400323 1249488 2324462
49701 2324462 1411459 -139213 148662 1651904 2361026 2775541 4442725 6193877 5641600
49692E641600k164633q98037P15247j30103j761471j135803R93920J506337k13668
49683B553389j903128j906269o25971P79604J341551N80347q22219j350911n23506
49674a877113M81750O41730L25275J90289K00948K60117M68402M25423k62459
49665H54362p06661K14990J540541J225273l61873o20208R76620J624799m77733
49656D270110l145059l302663j054880J121265J684511R18719k33056q11828k60887
49647h13768P87633R70976j7083j065766j275440p34837L08387J552514K026213
49638A738829J093964r3080j9486P02192M48659l63274n0747R87032Q42443k91347
49628D995185n98520n04542j970677l821456k517869J544586L543383J661120
$$ plain form
49692 5641600 3476967 2578930 3294177 3164074 1402603 266800 1260720 2767057 2553389
49683 2553389 650261 -1256008 -1881979 -1102375 239176 819523 -2696 -1353607 -1877113
49674 -1877113 -1395363 -753633 -428358 -238069 -37121 222996 691398 1116821 854362
49665 854362 147701 362691 1903232 3128505 2766632 2146424 3123044 4747843 4270110
49656 4270110 1125051 -2177612 -3232492 -2111227 -426716 492003 258947 -552881 -813768
49647 -813768 -26135 944841 927758 -138008 -1413448 -2148285 -1839898 -287384 1738829
49638 1738829 2832793 2739713 2720227 3422419 3871078 3507804 3457057 4444089 5286532 4995185
49628 4995185 4396665 3892123 1921446 -1900010 -4417879 -2873293 670090 2331210
49620B331210j33297Q64328J503509j208943m242035l258470L85742K153248J205137
49611c99571J44327p0851m47543o62181L31939J424741Q48039l87303p6702J123384
49601A828279P85890r04169j412008j04734J069273J009086N65880K17535o16199
49592B438833j692644j661910o7473J866197K516387J127880j453959k691582
49584C81729o06398K995553L776415O19817k572008k552323r75423m86068j28330
49575D52964J677267K764112M67366l004310l333141p64644P50702K1752n45304
49566a513236Q0720M75503M57434J385801K678641K208551L28910m48234J36354
49557E790444q5826j486315k226731k006818k084640j710255Q60924L741904K929316
$$ plain form
49620 2331210 2197913 3062241 4565750 3356807 -885228 -4143698 -3757956 -1604708 -399571
49611 -399571 -255244 -326095 -773638 -1435819 -1103880 320861 1168900 781597 704895 1828279
49601 1828279 2614169 1710000 297992 193258 1262531 2271617 2837497 3055032 2438833
49592 2438833 746189 -915721 -983194 883003 3399390 4527270 3073311 381729
49584 381729 -224669 2770884 6547299 7167116 4595108 2042785 1067362 581294 452964
49575 452964 2130231 4894343 5361709 2357399 -975742 -1740386 -989684 -967932 -1513236
49566 -1513236 -1432516 -957013 -499579 886222 3564863 5773414 6102324 5654090 5790444
49557 5790444 5704618 4218303 1991572 -15246 -2099886 -3810141 -2949217 792687 3722003
49548C722003q84525k358444K80798K455695P97455j749459j404988M98625P19675
49539B076835m93817j080068j251506k021628j983636N48947L725328M045360
49531C565815J209002j795921k761171j996115o44027N55364J154272J225877
49523E13096J365663J600703J202081K50168p9237L70905J29812j285333k109474
49514A958384j162162N284l47007j177250m22934J511778K301459J085825o53559
49505C099818j319974p56491L03940J150856J380042R11528j40028j479084k226856
49496I23751j242724J086552K268175P04989j526097j313204P10680J149915n82240
49487B179797j436489p7208R90428J40172n10471P37538J783238M50308j528397
$$ plain form
49548 3722003 2837478 479034 759832 3215527 4012982 2263523 858535 1357160 2076835
49539 2076835 1583018 502950 -748556 -2770184 -4753820 -4204873 -479545 3565815
49531 3565815 4774817 2978896 217725 -1778390 -2422417 -1867053 -712781 513096
49523 513096 1878759 3479462 4681543 4931711 4852474 5223379 5353191 4067858 1958384
49514 1958384 796222 801506 454499 -722751 -1145685 366093 2667552 3753377 3099818
49505 3099818 1779844 1023353 1327293 2478149 3858191 4769719 4629691 3150607 923751
49496 923751 -318973 767579 3035754 3740743 2214646 901442 1612122 2762037 2179797
49487 2179797 743308 666100 1656528 1796700 1286229 2023767 3807005 4257313 2728916
49478B728916j543983m68195m56317p19978O07953K165076J121445j706182k598214
49469h69479n51812J548618J561689N39184K4714j19329l32367k15364L14728
49460A900582N68231M20670N16509P66404K40270j102377k102663k135174j717678
49451b645226j153652n1742J420639K181978J692019P25237K07395Q9049k08537
49442B257160p92538j088695m80328Q08450J585202J040326J03462K95538J181541
49433D910118P23345j295755k377115j097688M36179r5667j458090r98352R64904
49424b88121J856075J032847K29576K17552k9515q16293j091881o02721k63121
49415B44398j41764N62324J327773O05693j278986k073335j101216k67057o28683
$$ plain form
49478 2728916 1184933 716738 260421 -459557 148396 2313472 3434917 1728735 -869479
49469 -869479 -1421291 127327 1689016 2228200 2252914 2133585 1801218 1585854 1900582
49460 1900582 2468813 2889483 3405992 4172396 4412666 3310289 1207626 -927548 -2645226
49451 -2645226 -3798878 -3850620 -2429981 -248003 1444016 2169253 2376648 2465697 2257160
49442 2257160 1464622 375927 -104401 704049 2289251 3329577 3433039 3728577 4910118
49433 4910118 5633463 4337708 1960593 862905 1299084 1203417 -254673 -1253025 -288121
49424 -288121 1567954 2600801 2830377 3047929 3018414 2202121 1110240 507519 244398
49415 244398 102634 664958 1992731 2598424 1319438 -753897 -1855113 -2122170 -2750853
49406b750853n66918J161744K859951K355287M26974k81619J087514K722744K490172
49397I504996N7289k957497m294612l035791o72966M79307K5846m26181Q8668
49388a230941P90906J005759J192939J376068N56527j090194j393768P02997K845899
49379D756192K170039o44014k405928j785572m42255q3567n11003p75681n56507
49370b78296r693N10922M12061l90346q03116J25051J414329J199603m45963j418128
49360C16424o16633O15228P14187R953k83589Q7434N85857R22094J034853Q59213
49350D245021P57315J206991J568168N66494j289333j632116J11958J046204j057654
49341E523048l765721l137036L05560K341410J416549L02732Q35169J093858m46173
$$ plain form
49406 -2750853 -3317771 -2156027 703924 3059211 3486185 3204566 4292080 7014824 9504996
49397 9504996 9562285 6604788 2310176 -725615 -1398581 -919274 -893428 -1319609 -1230941
49388 -1230941 -440035 565724 1758663 3134731 3691258 2601064 1207296 1910293 4756192
49379 4756192 6926231 6282217 3876289 2090717 1648462 1564895 1053892 278211 -278296
49370 -278296 -287989 222933 634994 244648 -558468 -433417 980912 2180515 1734552 316424
49360 316424 -300209 315019 1029206 1039159 755570 843004 1428861 2350955 3385808 4245021
49350 4245021 5002336 6209327 7777495 8343989 7054656 5422540 5534498 6580702 5523048
49341 5523048 1757327 -1379709 -1074149 1267261 2683810 2986542 3821711 4915569 4469396
49332D469396j711715o86605P62894N288j719633j444913L51252O84169o34851
49323G5282p39632J142769K218745P84081j054035r03332L64449M86812o88304
49314A686835j435052p05130R40428K134875J669072m05054k234897j945591j62080
49305d56594P99745L61977K01285R57888J000947m57778j582100r04504J56128
49296G6994k23000j201002r37190K49397P73945O48468J030204J720508J452218
49287C590542K25618p04611q67554q09135o54283j46203K58511J676k71210K96901
49277I20252Q94004J6605j820549k238503j86690K432303K824411K90225k941074
49268A90984l612015p73678K600049K693305n7980j172320J419625L986038K546701
$$ plain form
49332 4469396 2757681 2071076 2833970 2839258 1119625 -325288 25964 710133 75282
49323 75282 -664350 478419 2697164 3481245 2427210 1523878 1888327 2375139 1686835
49314 1686835 251783 -453347 487081 2621956 4291028 3885974 1651077 -294514 -456594
49305 -456594 343151 705128 906413 1864301 2865248 2407470 825370 -79134 76994
49296 76994 -146006 -1347008 -2284198 -2034801 -1260856 -612388 417816 2138324 3590542
49287 3590542 3816160 3111549 2243995 1434860 780577 634374 892885 894561 623351 920252
49277 920252 1814256 1830861 10312 -2228191 -2414881 17422 2841833 3132058 190984
49268 190984 -3421031 -4194709 -1594660 1098645 1040665 -131655 1287970 5274008 7820709
49259G820709r62674j918660l82347l47893k382211k480264Q51571L550480K274453
49250F023164o18905j412195q12187j648129l267561k477195Q92060L271085K440782
49241B390919K97622l05432P14202J284737K52358j349078j781259o93062M82183
49232A293190K61386j013559j591316n41143J207645K146973J667532J81185j226680
49223B385213j225494L85912J633825L88447k216063k519280N13025L180252J952387
49214D478224j489519k704268p03862J285599Q97906n57741r12524k00179L35863
49205D29499M87545Q31575J216409Q35875m72730j761126j773221j67387J749670
49196A376109J867638k99605k397317j787527Q04372J975635L23048j639814j316260
$$ plain form
49259 7820709 6858035 4939375 4557028 4209135 1826924 -653340 198231 3748711 6023164
49250 6023164 5404259 3992064 3179877 1531748 -1735813 -4213008 -3320948 -49863 2390919
49241 2390919 2688541 2383109 3097311 4382048 4634406 3285328 1504069 811007 1293190
49232 1293190 1554576 541017 -1050299 -1591442 -383797 1763176 3430708 3611893 2385213
49223 2385213 1159719 1545631 3179456 3567903 1351840 -1167440 -654415 2525837 4478224
49214 4478224 2988705 284437 -419425 866174 1764080 1206339 293815 93636 429499
49205 429499 917044 1748619 2965028 3800903 3328173 1567047 -206174 -373561 1376109
49196 1376109 3243747 2944142 546825 -1240702 -436330 1539305 1862353 222539 -1093721
49187a093721K85968O41655j13449K28334J845548K293524L74356j955070k493119
49178A4026j483575k07548J117493K397039K348516K78877j942207j949932k81446
49169B91243N27908j76148o33548q384L71254k26693m26835P18490J731443R08190
49159C076920r71647j846215j217308j79846N63367J113667J317199P39749m96721
49150B099165j806934k707164k641035j083168J326727K768404K423496J583286
49142A962777J399121R33716q13169k342040j569845N42546J050814n13470j560678
49133i10228o36855N71094L49879l95870p8892Q83375J018719K28373k83230J97827
49123I44192J307324K223652K056563L20963k159923l479291k596674n99557N90225
$$ plain form
49187 -1093721 -807753 -166098 -279547 -51213 1794335 4087859 4462215 2507145 14026
49178 14026 -1469549 -1677097 -559604 1837435 4185951 4464828 2522621 572689 291243
49169 291243 819151 643003 9455 1071 372325 145632 -281203 437287 2168730 3076920
49159 3076920 2105273 259058 -958250 -1138096 -574729 538938 1856137 2595886 2099165
49150 2099165 292231 -2414933 -5055968 -6139136 -4812409 -2044005 379491 1962777
49142 1962777 3361898 4295614 3482445 1140405 -429440 113106 1163920 650450 -910228
49133 -910228 -1547083 -975989 -626110 -1021980 -1100872 -217497 801222 1029595 746365 944192
49123 944192 2251516 4475168 6531731 6852694 4692771 1213480 -1383194 -1982751 -1392526
49114a392526K90088o40428j009650l12897R70650J705731J177090N1916l11176
49105E28798L36318P75030M2575j221747j573390m24963J333645K075000R45344
49096B816610r60091j466016n7603J133795L27784j008343l56482J556710J576659
49087C563023p60178k225885r85763N77252k0766j349784q21990Q10178R18546
49078b95367m33411p71929M38615R72859k97174j509561p74062R98851J517433
49069a53746K11683j224223j020204N62761J454501K88889j515063j240678J323658
49060a312422L223098K430182O64520L14331M75721j072253l283756k955659k05636
49051a721874J080045q27835k795947j816107N59624J324742Q99377J599675K895993
$$ plain form
49114 -1392526 -1102438 -1742866 -2752516 -3065413 -2094763 -389032 788058 839974 528798
49105 528798 865116 1640146 1682721 460974 -1112416 -1537379 -203734 1871266 2816610
49096 2816610 1856519 390503 332900 1466695 1794479 786136 429654 1986364 3563023
49087 3563023 2802845 576960 -408803 168449 147683 -1202101 -2024091 -1213913 -295367
49078 -295367 -728778 -1500707 -1062092 -89233 -386407 -1895968 -2670030 -1671179 -153746
49069 -153746 57937 -1166286 -2186490 -1623729 -169228 119661 -1395402 -2636080 -1312422
49060 -1312422 1910676 4340858 5005378 5319709 5795430 4723177 1439421 -1516238 -1721874
49051 -1721874 -641829 -1469664 -4265611 -6081718 -5522094 -4197352 -3297975 -1698300 1197693
49042A197693J957676j345060l404531j706045J772593L282309J837486k91689
49034C300432p46411M36559J349506O25696q92968j198654P6137Q60195m05679
49025C404813k047995j296629J264319J902833r28236l909978l182528M78931
49017d314470L050284K697949J281784P75506Q53598O08753L32679L17636l60025
49008E243694k199528l549230k369684O95674K701926J965723q3311r45618J34314
48999A593960J888934K685397J795838l66667k467449k977069j507427M79495
48991A125012R61094l38481j479681o88137J233932J812961K06079j571090j341763
48982h0074L55376J291073P84322K67797O31309P82097l58345j787058j610729
$$ plain form
49042 1197693 3155369 1810309 -1594222 -3300267 -1527674 1754635 3592121 3300432
49034 3300432 2554021 2990580 4340086 4965782 4072814 2874160 2950297 3810492 3404813
49025 3404813 1356818 60189 1324508 3227341 2299105 -1610873 -4793401 -4314470
49017 -4314470 -1264186 1433763 2715547 3491053 4344651 4953404 5286083 5603719 5243694
49008 5243694 3044166 -505064 -2874748 -2179074 522852 2488575 2405264 1459646 1593960
48999 1593960 3482894 6168291 7964129 7597462 5130013 2152944 645517 1125012
48991 1125012 2086106 1747625 267944 -420193 813739 2626700 2832779 1261689 -80074
48982 -80074 275302 1566375 2350697 2618494 3249803 4031900 3673555 1886497 275768
48973B75768L33491K174227K156242L90004j443234j755726o14688K81408l47988
48964A449504j498314j101855Q64738K062654J150571k88476l49138L51713J76438
48955B817835n68717l66430O69579R92077K26031o43040j360858k302431k430000
48946b965954j30078L398772M373166J288542k707407l793118j946615J15247
48938b367445P51917L26536l52143n91903L00162J983025K665502J293636o19792
48929C389495r81650j18816J14400m49603k95754O96295O79324j033592k461943
48920d61844j741891K41098J343254J025536K96151k43510p04158q12511j46892
48911a204767O25690K40896j191655j986577j100984N28173J434496J445167J320078
$$ plain form
48973 275768 609259 2783486 4939728 5329732 3886498 2130772 1516084 1797492 1449504
48964 1449504 -48810 -1150665 -285927 1776727 2927298 2638822 2289684 2641397 2817835
48955 2817835 2249118 1882688 2552267 3544344 3770375 3127335 1766477 -535954 -2965954
48946 -2965954 -3096032 302740 4675906 5964448 3257041 -536077 -2482692 -2367445
48938 -2367445 -1615528 -1288992 -1641135 -2233038 -1932876 50149 2715651 4009287 3389495
48929 3389495 2407845 2289029 2403429 1953826 1658072 2354367 3033691 2000099 -461844
48920 -461844 -2203735 -1962637 -619383 406153 702304 458794 -245364 -1057875 -1204767
48911 -1204767 -579077 -338181 -1529836 -3516413 -4617397 -4089224 -2654728 -1209561 110517
48902A10517J355573J204065N86708m83033j649375j889034k28364K329561K848344
48893D184962N6105l103767k758262N41985K409337P54039j550377j212502R49084
48884B70604J903245Q03847p07751j254862p23901M95668J468335Q89984j010061
48875B135108j893243m22392J406381J170529k13679l57719K69149o71776k687402
48866a265044k604111K16661K498870J970143L67531R797L43739q4543o79030
48857G74013j76280P57013O28204l20245p20544m73664o86551j629002k254967
48848d102023j650023l2119J512799J864091R57064K29912J047335K528392K343566
48839D698994R1941j808682j470028p3324K37781m95072o98617l7741L18592k08868
$$ plain form
48902 110517 1466090 2670155 3256863 2773830 1124455 -764579 -992943 1336618 4184962
48893 4184962 4241067 1137300 -1620962 -1078977 1330360 2084399 534022 -678480 270604
48884 270604 2173849 2977696 2269945 1015083 291182 786850 2255185 3145169 2135108
48875 2135108 241865 -180527 1225854 2396383 2182704 1824985 2094134 1422358 -1265044
48866 -1265044 -3869155 -3652494 -1153624 816519 1184050 1193847 1537586 1453043 774013
48857 774013 597733 1354746 1982950 1662705 942161 468497 -218054 -1847056 -4102023
48848 -4102023 -5752046 -5784165 -4271366 -2407275 -1450211 -1220299 -172964 2355428 4698994
48839 4698994 4790935 2982253 1512225 1438901 1676682 1181610 482993 445252 763844 554976
48829E54976q46438q12519k72801K20889M95928P10061Q33831M21544p86833j901891
48819a383253j324229J005584K654143J527976r27527j399527N82955K006102
48811B742224Q91053j008963j180593Q3850O91974j37149j344859j717331r20954
48802a900748M63011J239523P07912k32113j65428O06332N19640m47428n17994
48793B72707Q12065J706393R49919j85401k64556J01694k68900j197820j967726
48784d1625k425932k182573n22380J810709K716165J729141P66172P78430K44780
48775B872887j475437k139727k26807K025052J902350M07286K01086J045534M79542
48766E091766j900974l759532l297222j059562J220601K041299J013048m70027
$$ plain form
48829 554976 -291462 -1103981 -1376782 -1155893 -659965 50096 883927 1305471 518638 -1383253
48819 -1383253 -2707482 -1701898 952245 2480221 1552694 153167 736122 2742224
48811 2742224 3633277 2624314 1443721 1527571 2219545 2082396 737537 -979794 -1900748
48802 -1900748 -1437737 -198214 509698 277585 112157 718489 1238129 790701 272707
48793 272707 1084772 2791165 3741084 3555683 3291127 3392821 3123921 1926101 -41625
48784 -41625 -2467557 -4650130 -5172510 -3361801 -645636 1083505 1849677 2628107 2872887
48775 2872887 1397450 -742277 -969084 1055968 2958318 3365604 3566690 4612224 5091766
48766 5091766 3190792 -568740 -3865962 -4925524 -3704923 -1663624 -650576 -1120603
48758a120603l88839J162704J882754P58886m42562l36075l7351n14960n40011
48749D23943O34318J239114O7288j009743k47645P95098J36026j069319q77900
48740I1180o1917j38336l12077M21416O81153m33093o85019J349338K676609N66237
48730D155491k134294j349821J286396J438780l42830k63857J190738J07785l158573
48721I29815l863828p62649K024637J820102N09163l6180m89758j056479o21003
48712a546180K85608q6607j097864p55471J44341l83148q16383J352806L594616
48703F91718J569290k442414k107861K042132K931526q47061k509309P93197K969005
48694C090223K38857j933425J048503M246154J734018l107778l591960n76502
$$ plain form
48758 -1120603 -1509442 -346738 1536016 2294902 1852340 1516265 1478914 963954 423943
48749 423943 1058261 2297375 2364663 1354920 1107275 1902373 2038399 969080 91180
48740 91180 29263 -109073 -421150 266 681419 248326 -436693 912645 3589254 4155491
48730 4155491 2021197 671376 1957772 3396552 3053722 2789865 3980603 4088388 929815
48721 929815 -2934013 -3696662 -1672025 148077 657240 621060 131302 -925177 -1546180
48712 -1546180 -1260572 -1347179 -2445043 -3200514 -3056173 -3439321 -4255704 -2902898 691718
48703 691718 2261008 -181406 -2289267 -247135 2684391 1837330 -671979 121218 3090223
48694 3090223 3329080 1395655 2444158 6690312 8424330 5316552 1724592 1148090
48686A148090M97834p91388q57186M09711L46186n73699K287J054712O1596j712648
48676d14505j274646N41340P59226l00654k33737O63062N96780K35317P82521
48667A354704M89364k002473l515724j003870K285870J384174k012228k333036
48659e353219N40246J823999N56417L72436J818347J352130j246943j639818J287759
48650d88646K993194Q76395j617567j184850L12101P9490q13305j76605J244548
48641A224755J570630R97139N84908Q295j292465k463852k454823j477235k43720
48632c546368Q14552J101825L04245m96611P9220J530901K185940J664391O76920
48623D315015p61740k517577k868977p93347J417642J153799j45501N06526K063250
$$ plain form
48686 1148090 1645924 854536 -2650 407061 753247 179548 181835 1236547 1298143 -414505
48676 -414505 -1689151 -1147811 -388585 -689239 -922976 -259914 336866 572183 1354704
48667 1354704 1844068 -158405 -3674129 -4677999 -2392129 -1007955 -3020183 -5353219
48659 -5353219 -4812973 -2988974 -2432557 -2060121 -241774 1110356 -136587 -1776405 -488646
48650 -488646 2504548 3380943 1763376 578526 890627 970117 156812 -19793 1224755
48641 1224755 2795385 3792524 4377432 4385727 3093262 629410 -1825413 -3302648 -3546368
48632 -3546368 -2731816 -1629991 -1325746 -1822357 -1743137 -212236 1973704 3638095 4315015
48623 4315015 3553275 1035698 -1833279 -2626626 -1208984 -55185 -200686 305840 2369090
48614B369090J124488j597921j962825L79446J219504p93212j824104J13968J489509
48605E17943l70672k297143o14333K523377K560512l93156k286110j378394J56621
48596a581355L18324k79784l11046J55718J88831l48899l87515Q73602K287317
48587I15193J760036m46021j224266R54656L157313K056775j066152k662884k404083
48578A040567k292018j932354L79757K847379J945733j206143j914620L61279
48570g70420J280371n88038j568825j10969K75346k033029l114614l68598K555995
48561d442781J820398m96401o73289N99617Q46511O09501J220688J258135m72501
48552B69878j657095l13383J296191O61541m17715M53139J419944m3569j907404
$$ plain form
48614 2369090 3493578 1895657 -67168 312278 1531782 738570 -1085534 -971566 517943
48605 517943 147271 -2149872 -2764205 -240828 2319684 1926528 -359582 -1737976 -1581355
48596 -1581355 -1263031 -1542815 -1853861 -1698143 -1509312 -1858211 -2245726 -1372124 915193
48587 915193 2675229 2229208 1004942 1959598 5116911 7173686 6107534 3444650 1040567
48578 1040567 -1251451 -3183805 -2804048 43331 1989064 782921 -1131699 -770420
48570 -770420 509951 -78087 -1646912 -1757881 -1482535 -3515564 -6630178 -6998776 -4442781
48561 -4442781 -2622383 -3118784 -3792073 -3192456 -2345945 -1736444 -515756 742379 269878
48552 269878 -1387217 -1700600 -404409 257132 -160583 292556 1712500 1668931 -238473
48543b38473r52240J444329J942095J018314R91011R07403j115800k893303j363011
48534b59675J321189R80928j141847o19702J942017J961530n43984q49360J685915
48525D477011K158778j119760l530780k226139p06235j964275k876265K44346
48517e543319M908610N898859K633673r48878k033014j190201k94350o72019k367118
48508C92243l659339k501660N52030K497994J812167K33729k72042p0002k12881
48499a227761m70125l81167l58525m90487j8489R95732J350248Q83658Q95044
48490A178128J570880J349546j25196r32686j04244N57532m61121j824433j730865
48481e22459p66826l25677j7500J107819K191793J694737l5986j287216j379198
$$ plain form
48543 -238473 -1190713 253616 2195711 3214025 4205036 5112439 3996639 1103336 -259675
48534 -259675 1061514 2042442 900595 280893 2222910 4184440 3640456 2791096 4477011
48525 4477011 6635789 5516029 1985249 -240890 -947125 -2911400 -5787665 -5543319
48517 -5543319 -634709 5264150 7897823 6948945 4915931 3725730 3431380 2759361 392243
48508 392243 -3267096 -5768756 -5216726 -2718732 -906565 -672836 -944878 -1014880 -1227761
48499 -1227761 -1697886 -2079053 -2437578 -2928065 -2946554 -1950822 -600574 283084 1178128
48490 1178128 2749008 4098554 3973358 3040672 2936428 3493960 3032839 1208406 -522459
48481 -522459 -1289285 -1614962 -1632462 -524643 1667150 3361887 3325901 2038685 659487
48472F59487r06288k50435O10062J291088J308638Q79404N19972K66922n6662
48463D322188l38187m07560j84945N22595J496855J544977j07499j948521j636939
48454C262964M30009J262116l14948j819326r78306Q54019J039227l61692j158866
48445B215197n23344K15914j12158j009688j124162K12950K080788K476431N43323
48436D975251j774072j799841M9069O14943j221038k636773j214706J216360J396747
48427c94060m48216j257381J45893J677976J351757j79478j010609m81032M83017
48418a12133Q75392P93383R48097J182559L40684j634484k516630n20012K395982
48409A752838K457907n94762k909155j957405L28914J146705O20988J12538n39062
$$ plain form
48472 659487 -246801 -497236 112826 1403914 2712552 3591956 4111928 4378850 4322188
48463 4322188 3984001 3576441 3391496 3914091 5410946 6955923 6848424 4899903 3262964
48454 3262964 3692973 4955089 4640141 2820815 1842509 2696528 3735755 3374063 2215197
48445 2215197 1691853 1907767 1795609 785921 -338241 -125291 1955497 4431928 4975251
48436 4975251 3201179 1401338 1450407 2065350 844312 -1792461 -3007167 -1790807 -394060
48427 -394060 -842276 -2099657 -1953764 -275788 1075969 896491 -114118 -595150 -112133
48418 -112133 763259 1556642 2504739 3687298 4027982 2393498 -123132 -643144 1752838
48409 1752838 4210745 3615983 706828 -1250577 -921663 225042 846030 958568 419506
48400D19506j615668j693764J37J340019L38513j257781n83249J558196K028548
48391E34457N37197k49658N52957R90756K60466O0540R56345Q17889j393669l124081
48381e6801j807910J023928J750409k60410k015623j191008J012000J924232Q65584
48372A244401o31903j348201j591079j729093j142543K79535J010483R5725o14259
48363d426934R86913L182171K335090j026883k182683M47399K449316O08896j488475
48354H84810N55079L941019K518740l176540o075439k813724K038506L306595
48346A179046J648226M22231L39134J60505k03539j92236l31101j143307j641006
48337B37953o62821J295210K695486K404628J45590k942396m099658j589267K092861
$$ plain form
48400 419506 -1196162 -2889926 -2889789 -1549770 -1211257 -2469038 -3052287 -1494091 534457
48391 534457 1071654 821996 1374953 2365709 2626175 2686715 3643060 4460949 3067280 -56801
48381 -56801 -1864711 -840783 909626 649216 -1366407 -2557415 -1545415 378817 1244401
48372 1244401 612498 -735703 -2326782 -4055875 -5198418 -4918883 -3908400 -3812675 -4426934
48363 -4426934 -3440021 -257850 2077240 1050357 -1132326 -684927 1764389 2373285 884810
48354 884810 1439889 5380908 7899648 4723108 -1352331 -4166055 -2127549 1179046
48346 1179046 2827272 3249503 3588637 3749142 3545603 3353367 3022266 1878959 237953
48337 237953 -424868 870342 3565828 5970456 6116046 3173650 -926008 -2515275 -422414
48328d22414K412380r73095l223615j017813K830650L687313J363193p60585r58926
48319B937088m52105m63370p51195q35854p02247l71189l9958k52268r80591j250343
48309c162032n12237N21553J104951J344204J245240L91912p40298r20175l22498
48300a049380m27903r93535J03431K685168L208659J74399k599408j317945J910581
48291A694067K413643Q2868j189176L7601J329027J048626L07403K5992l37401
48282E412650p58534n49563m77975j813331l207775j982677J219810K717477J283972
48273A844054l57259l69885k28287r67816r63148N40993J314628J0157j119147
48264b95710j10310J098263Q7883j606925j037422J137667J886803P99661J84321
$$ plain form
48328 -422414 1989966 1016871 -2206744 -3224557 -393907 3293406 4656599 3896014 2937088
48319 2937088 2484983 2021613 1270418 434564 -267683 -638872 -678830 -931098 -1911689 -3162032
48309 -3162032 -3674269 -3152716 -2047765 -703561 541679 933591 193293 -726882 -1049380
48300 -1049380 -1477283 -2470818 -2367387 317781 3526440 3700839 1101431 -216514 1694067
48291 1694067 4107710 4190578 3001402 3039003 4368030 5416656 5724059 5750051 5412650
48282 5412650 4654116 4104553 3626578 1813247 -1394528 -3377205 -2157395 560082 1844054
48273 1844054 1486795 1116910 888623 -79193 -1042341 -501348 813280 823437 -295710
48264 -295710 -406020 692243 780126 -826799 -1864221 -726554 1160249 1959910 2144231
48255B144231Q05878J000080L2947o85221j86337N98478M50992p52888k354459
48246A053701l184812j994375P46015K240973O51611j781546j436000J404135
48238b300298K934059J475264m91127n92694L09343N89973O00592J090576J231003
48229D846691K95797n73050l86861l72788j688387k635033r80150J915545K409124
48220B830888j69180k577841k408341r37446k45114q4578P10135J709399J810069
48211F37991J339979J233564J046189j74620j646006j589515m0915J058912O57130
48202B522709l92687j237854j909342j912579k40401K234490K666048J35264k345657
48193d80009j776594N75738J366625K85913j03617R20425J098329p16620k416527
$$ plain form
48255 2144231 2950109 3950189 3983136 3297915 3111578 3710056 4161048 3408160 1053701
48246 1053701 -2131111 -4125486 -3379471 -1138498 -486887 -2268433 -3704433 -2300298
48238 -2300298 633761 2109025 1617898 1025204 1334547 1924520 2525112 3615688 4846691
48229 4846691 5142488 4569438 4182577 3809789 2121402 -513631 -1493781 421764 2830888
48220 2830888 2661708 83867 -2324474 -3261920 -3507034 -3591612 -2881477 -1172078 637991
48211 637991 1977970 3211534 4257723 4083103 2437097 847582 806667 1865579 2522709
48202 2522709 2130022 892168 -1017174 -2929753 -3170154 -935664 1730384 1865648 -480009
48193 -480009 -2256603 -1680865 -314240 -28327 -131944 788481 1886810 1170190 -1246337
48184a246337j931397k26822O71719P61358J270441K112334K105139J062352l584
48175D575203m48434m95985m41220l95013n62121r14805r11783k96829K42688
48166C51701k4064p57245j093770q50171m03118J67749R88297J804510K222555
48157B406444K166568J515920o5382k137461l060432j753402N11536J305148k5065
48148H63874j646036j543409K83718K053622K039190J46074j902941k084427j92734
48139a983069J772125J742466j64339j920497j795755P2506J990736K333429J188120
48130C235722L20825Q78790J516664J96389k347686l091610j160212P37163N98084
48121H84129J75211J451030K519234M12420l389685m206057p49147L086197L571160
$$ plain form
48184 -1246337 -3177734 -3404556 -2732837 -1971479 -701038 1411296 3516435 4578787 4575203
48175 4575203 4126769 3630784 3189564 2794551 2232430 1317625 405842 109013 351701
48166 351701 327637 -429608 -1523378 -2373549 -2776667 -2608918 -1620621 183889 2406444
48157 2406444 4573012 6088932 6023550 3886089 825657 -927745 -416209 888939 863874
48148 863874 -782162 -2325571 -2041853 11769 2050959 2197033 294092 -1790335 -1983069
48139 -1983069 -210944 1531522 1367183 -553314 -2349069 -2276563 -285827 2047602 3235722
48130 3235722 3556547 4435337 5952001 6148390 3800704 709094 -451118 286045 884129
48121 884129 1059340 2510370 5029604 5442024 2052339 -2153718 -2902865 183332 3754492
48112C754492J212024j348719k677685k608691j357799L4812J97673o01486p06445
48103d101824Q7688K05654m16090M19537L015468L862298N87548l550574l590673
48094c480968J44603K784155K090978Q57449J488163K164775N30088j841605j774493
48085B963145L64819J235757j99019j297496l08080P73954k83832k038872j684775
48076d74399K29445O34767r80362j759702k53428J330969R98823L4360J89320
48067e0207N21275l89691j348332o34096O54286N10219l03201J02390Q60300Q18
48057g6239j162341K17154K908945K669680q02551l044649j956133n63013r00166
48048b709313m92204K132387L465334O90217k780633k269436P24910J205483j239630
$$ plain form
48112 3754492 4966516 3617797 940112 -1668579 -3026378 -2991566 -2793893 -3395379 -4101824
48103 -4101824 -4014136 -3808482 -4224572 -3805035 -789567 3072731 3660279 109705 -3480968
48094 -3480968 -3336365 -552210 1538768 2396217 3884380 6049155 6579243 4737638 2963145
48085 2963145 3327964 4563721 4364702 3067206 2759126 3533080 3249248 1210376 -474399
48076 -474399 -244954 389813 -590549 -2350251 -2603679 -1272710 -273887 -239527 -50207
48067 -50207 471068 81377 -1266955 -1901051 -1246765 -736546 -1039747 -937357 -77057 -76239
48057 -76239 -1238580 -1021426 1887519 4557199 3754648 709999 -1246134 -1809147 -2709313
48048 -2709313 -3201517 -1069130 2396204 3086421 305788 -1963648 -1238738 -33255 -1272885
48039a272885k337739k66719K059131K022805N27793m80584n42130n3172M96180
48030A52680L42961n98420r32226J94510J176554L62064p70802K53772K533417
48021B714510K832814N30843j749630k225779j489881k02964J413423J921722
48013C745058M9214k202852j536989J291808K107632q1569j484716R1831J719329
48004C698746N46597j495742j327007J83108L12554o72609m79909Q60081J149316
47995B775135o4747p75550K31449J701584J821201L47748j396329j890552r32759
47986A817180r3022r34807k633336k681276l40159K221960K864043J859992O31522
47977B712097j28688k60748J22628j6144j540627k866686j443175J741422K498101
$$ plain form
48039 -1272885 -3610624 -3877343 -1818212 204593 732386 251802 -290328 -343500 152680
48030 152680 495641 -102779 -1035005 -840495 336059 698123 -72679 181093 2714510
48021 2714510 5547324 6078167 4328537 2102758 612877 409913 1823336 3745058
48013 3745058 3794272 1591420 54431 1346239 3453871 3372302 1887586 1979417 3698746
48004 3698746 4245343 2749601 1422594 1605702 1918256 1245647 765738 1625819 2775135
47995 2775135 2710388 1934838 2166287 3867871 5689072 6036820 4640491 2749939 1817180
47986 1817180 1724158 789351 -1843985 -4525261 -4865420 -2643460 220583 2080575 2712097
47977 2712097 2583409 2322661 2445289 2429145 888518 -1978168 -3421343 -1679921 818180
47968H18180k62481k375942r53008R59726j45841j882684r6644L388763L151465
47959B601534q61192k924954m89601K210960J151867j779414k600167r77421P17643
47950b950745J426830J681315J593443R56242L04874J91330K51839P5969k2204
47941C508893R8027n6885n08660n99175m50775r95567j862291j134156J649913
47932c50676L991864L391562N15531j950575k518837j677135m27606N69484Q93778
47923B437390M43928n30420j705067k490800j876284K85723K099118J562267l14274
47914h8419n72021J190135K039495L36386j729620j822022q88780o83703m11366
47905b629915J254380K788266J788482q41440j946584p29034P05231R74521O25694
$$ plain form
47968 818180 555699 -1820243 -2773251 -1813525 -1959366 -3842050 -3938694 -549931 2601534
47959 2601534 1740342 -1184612 -1674213 536747 1688614 -90800 -2690967 -3668388 -2950745
47950 -2950745 -1523915 157400 1750843 2707085 3011959 3203289 3455128 3531097 3508893
47941 3508893 3606920 3550035 3041375 2442200 1991425 995858 -866433 -2000589 -350676
47932 -350676 3641188 7032750 7548281 5597706 3078869 1401734 974128 1543612 2437390
47923 2437390 2881318 2350898 645831 -1844969 -3721253 -3435530 -1336412 225855 -88419
47914 -88419 -660440 529695 2569190 2905576 1175956 -646066 -1534846 -2218549 -2629915
47905 -2629915 -1375535 1412731 3201213 2359773 413189 -315845 389386 1363907 1989601
47896A989601o0533j414237k382585j217397J285144K081248L03308j250686k48059
47887i14196J899788K347668N22824j916642l286720k780931o10676J581799J816442
47878a340644L19641m88396M82292J306836K54409j251711q88421Q82890J725988
47869A002884J018718J64463n2133q1700N8554P32385J085655q7289j700245j164610
47859I76682J449945K596549O9111l473133l860864r15604J704911J544311p7646
47850A4262p20691o7571M26958o1913q45388r20951k62688K29467j42453r16787
47840c267755q65942M46864J856013J914834Q03123O0285L82718P51932K08233
47831B290305o10350o58990l25252o72728j317994p76079R65868J987372J216248
$$ plain form
47896 1989601 1929068 514831 -1867754 -3085151 -1800007 281241 584549 -666137 -914196
47887 -914196 985592 3333260 3856084 1939442 -1347278 -4128209 -4738885 -3157086 -1340644
47878 -1340644 -1021003 -1509399 -1027107 279729 534138 -717573 -1605994 -723104 1002884
47869 1002884 2021602 2186065 2133932 2052232 2110786 2843171 3928826 3841537 2141292 976682
47859 976682 2426627 5023176 5092287 1619154 -2241710 -3157314 -1452403 91908 14262
47850 14262 -706429 -774000 -347042 -408955 -1254343 -2175294 -2437982 -2208515 -2350968 -3267755
47840 -3267755 -4133697 -3686833 -1830820 84014 887137 947422 1330140 2082072 2290305
47831 2290305 1679955 1020965 695713 22985 -1295009 -2071088 -1105220 882152 2098400
47822B098400M7314P5180O86937N13856O4295P20714J720095P29226k242868l993193
47812D19956k351710O95541J740867M27040p07276q3245J184897J351778K11538
47803B889386j157077j700832j037675M38670J742675K059383J470070N86368
47795E290968l35763j320834j921596j423743J2932J108839P43843p97195k023375
47786f65924j564590N60936K778022L290478J872156M3934p43723n51937k43421
47777D775931j65474k73080p61849j560756j863310j272762o84525p11200j42274
47768b659299K084144M074428K795368j198876l664129k173831Q69525K079892
47760B207222J424390P55258K92887p23458j460621o32031O09430j041j895184
$$ plain form
47822 2098400 2145714 2220894 2907831 3421687 3485982 4206696 5926791 6656017 4413149 419956
47812 419956 -1931754 -1236213 504654 931694 224418 141173 1326070 2677848 2889386
47803 2889386 1732309 31477 -1006198 -567528 1175147 3234530 4704600 5290968
47795 5290968 4955205 3634371 1712775 289032 301964 1410803 2154646 1357451 -665924
47786 -665924 -2230514 -1669578 1108444 4398922 6271078 6315012 5571289 5019352 4775931
47777 4775931 4610457 4337377 3575528 2014772 151462 -1121300 -1805825 -2517025 -2659299
47768 -2659299 -575155 3499273 6294641 5095765 1431636 -742195 127330 2207222
47760 2207222 3631612 4386870 4679757 3956299 2495678 1863647 2473077 2472036 576852
47751E76852k161878k31769J100473K56614o48591L43624J526358N20037j291435
47742i715o71609K072363L192346J206827r28691o25825M07516o33305k764224
47733A245683k677944m5886K036765J916374J306073J430908O82026j732925k849106
47724A311968j27226L409722K581563j985950m015749o20667L374047K538056
47716F465764j607498l686455k297340m74869K7628K93388N39938n01140j863052
47707c103636m28530L581375N175993J317142m071996n085426j560312J742447
47699b432943K149862J302752Q72896J62072j178211j506712j2628J331816O19350
47690A308254j001803j221750j02859M71495O5989J08019J153106J856403J182190
$$ plain form
47751 576852 -1585026 -1816795 -716322 -459708 -1108299 -764675 761683 1281720 -9715
47742 -9715 -681324 1391039 4583385 5790212 4861521 4235696 4643212 4009907 1245683
47733 1245683 -1432261 -1478147 558618 2474992 3781065 5211973 5893999 4161074 1311968
47724 1311968 1184742 4594464 7176027 5190077 1174328 553661 3927708 6465764
47716 6465764 4858266 1171811 -1125529 -1600398 -1572770 -1279382 -739444 -1240584 -3103636
47707 -3103636 -3532166 49209 5225202 6542344 2470348 -2615078 -4175390 -2432943
47699 -2432943 -283081 1019671 1892567 2054639 876428 -630284 -642912 688904 1308254
47690 1308254 306451 -915299 -1018158 -546663 -480674 -372655 780451 2636854 3819044
47681C819044j7835m52888j99098r4105k01037q276K60695k67708j563922k189692
47671i14822j023693R33762J401904k90650j979296j199778J458443K847669J339232
47662B572771j031158j401078K00450J469994J315037Q03752Q47280R06663L91199
47653F074910l14138p98200j211272j400643q47286O9574K55282j87008J6413
47644A657632Q08340M90785j118078j677079n4970J434686P30925m66343K52998
47635B058896J618636Q88782j171318j539369j88508J93783o28273n8942K165852
47626C339539K913712Q55996j385165j708003j237275r95658Q3926J806407J476711
47617E150190j347103k759737l33236K582416J989683p00699j843053j654581
$$ plain form
47681 3819044 3801209 3348321 3149223 3055118 2854081 2845805 3106500 2838792 1274870 -914822
47671 -914822 -1938515 -1004753 397151 106501 -1872795 -3072573 -1614130 1233539 2572771
47662 2572771 1541613 140535 340985 1810979 3126016 3929768 4777048 5683711 6074910
47653 6074910 5760772 4962572 3751300 2350657 1503371 1572945 1828227 1641219 1657632
47644 1657632 2465972 2956757 1838679 161600 106630 1541316 2272241 1805898 2058896
47635 2058896 3677532 4566314 3394996 1855627 1667119 1860902 1232629 1173687 3339539
47626 3339539 6253251 7109247 5724082 4016079 2778804 1783146 1867072 3673479 5150190
47617 5150190 3803087 1043350 710114 3292530 5282213 4581514 2738461 1083880
47609A083880k334202k665525m8223L592431L702559M53258j396820k54284K92302
47600B425376j604769k623520k85804K300893J332049j406878j305761J803109
47592F34695L342906Q67603k315307j866591J414304K634759k36672l149455j529745
47583b03503K806468L803634l0195l306494j803602J549267J980201L17299M04813
47574E517888J802301P67162k603650l984646j792704O33766P41190M6342M27542
47565A555191J200035J371253J331558J033548l14123j840058j569655j0410L56606
47556C113945m24566J02810J674984J075902j807948k812752k99381J916121R37375
47547C476490p86626l68783Q77434J040597J321061K457236J874257j448276l470315
$$ plain form
47609 1083880 -1250322 -3915847 -3964070 -371639 3330920 3784178 2387358 2133074 2425376
47600 2425376 820607 -1802913 -2088717 212176 1544225 137347 -1168414 634695
47592 634695 3977601 4845204 2529897 663306 2077610 4712369 4475697 1326242 -203503
47583 -203503 2602965 6406599 6376404 3069910 1266308 2815575 4795776 5113075 5517888
47574 5517888 7320189 8087351 5483701 1499055 -293649 340117 1081307 1127649 1555191
47565 1555191 2755226 4126479 5458037 6491585 6177462 4337404 2767749 2757339 3113945
47556 3113945 2689379 2792189 4467173 5543075 3735127 922375 622994 2539115 3476490
47547 3476490 2689864 2321081 3198515 4239112 5560173 8017409 9891666 8443390 4973075
47538D973075j064124K367751K191495j15038k73317J327951J285283k11793l67495
47529A0113788N17995J54045n22189R12541K747464J339491j936892k147139J110104
47520A2289208L215939K260026J129935J311477P84296o51277N6464L373034N369640
47511B9138742M066209K654485L940024O176007P093461P808112R838021J2067112
47503H2782173J3611244J6286921K1459283K7720095L4226105M2405369N0699651
47496B89190841N1103946L5995388P548618k2877964m3964185n1181440m6863915
47489B18951289l7295606k8939268k4365209k1458453j7602613j3366488j0696897
47482F5226755r429645p969425o122233m857821m150562l243092k379828k316689
$$ plain form
47538 4973075 3908951 6276702 8468197 8353159 8079842 9407793 10693076 10481283 10113788
47529 10113788 10631783 10785828 10263639 11176180 13923644 15263135 13326243 11179104 12289208
47520 12289208 15505147 17765173 18895108 20206585 20990881 20339604 20396068 23769102 29138742
47511 29138742 33204951 35859436 39799460 45975467 53068928 60877040 70715061 82782173
47503 82782173 96393417 112680338 134139621 161859716 196085821 238491190 289190841
47496 289190841 340294787 376290175 383838793 360960829 316996644 265815204 218951289
47489 218951289 181655683 152716415 128351206 106892753 89290140 75923652 65226755
47482 65226755 55797110 47827685 41705452 36847631 32697069 29453977 27074149 24757460
47474B4757460k648085k322867j326133m41787K1434L0489p69872k150442k724801
47465A2425396j645029K1383Q72559J056277J193162O73929j116092k815605k439439
47456H226541l43537J055954M70184r89922j818178j866328j668424j240630l57768
47447A467892N68248P49405K14877N0523Q34973J323882P390j995208j607138
47438A614844J614397L802441J858070j763924k444478j29894J207554J44638
47430E903648o49391J87399M31466j104009j980548n05091J008894J53570j475829
47421A970109j120975O84279J526216R86177K47561m69092j400172j673580p14108
47412C6415J93343o9933m27302L11660J117323O67657k44402m28661l97379n18207
$$ plain form
47474 24757460 22109375 19786508 18460375 18018588 18040022 18070511 17300639 15150197 12425396
47465 12425396 10780367 10801750 11674309 12730586 13923748 14597677 13481585 10665980 8226541
47456 8226541 7883004 8938958 9409142 8419220 6601042 4734714 3066290 1825660 1467892
47447 1467892 2036140 2785545 3000422 3050945 3885918 5209800 5217190 3221982 1614844
47438 1614844 3229241 7031682 8889752 7125828 4681350 4551456 5759010 5903648
47430 5903648 5254257 5441656 5873122 4769113 2788565 2283474 3292368 3445938 1970109
47421 1970109 849134 1533413 3059629 4045806 4293367 3824275 2424103 750523 36415
47412 36415 229758 159825 -267477 44183 1161506 1829163 1584761 1156100 758721 240514
47402B40514N01425K647772K840057m91938l647590k515382R62538J722546o35161
47393A624781j928705m25065J236974J164682N61867L60068l39026j548065j670009
47384i62498l50020R38888J523488J823517J224705r14465k461453p64359K349194
47375B406997K346479q66886k497897n30650J402808O38764l50119P23166J428063
47366D700725p04089l071039k076338P33217J256128n66509j314504M7080J176270
47357A80941P10779j14189j75070J86275N11143N57015l76547k248329l024690
47348c792672r94458K218215L326931J607218p93891k155119k379983j512345
47340d476104K57133J403860N79591q13169k41270J831859K364323N32176j007969
$$ plain form
47402 240514 741939 3389711 6229768 5737830 2090240 -425142 537396 2259942 1624781
47393 1624781 -303924 -728989 507985 1672667 2234534 2594602 2255576 707511 -962498
47384 -962498 -1312518 -373630 1149858 2973375 4198080 3283615 822162 57803 2406997
47375 2406997 4753476 3886590 1388693 858043 2260851 2899615 2549496 3272662 4700725
47366 4700725 3996636 925597 -1150741 -417524 838604 272095 -1042409 -995329 180941
47357 180941 891720 777531 602461 788736 1299879 1856894 1480347 -767982 -3792672
47348 -3792672 -4787130 -2568915 758016 2365234 1571343 -583776 -2963759 -4476104
47340 -4476104 -4218971 -2815111 -2235520 -3048689 -3289959 -1458100 906223 1438399 430430
47331D30430m54432N89437K72296n47533l58128K34946q8063q56615q16171j91949
47321a785782M2406J27376P53086J149760N6145j804209k266183p59276R90297
47312c496380J511043J214545J047564R94680O64585K64724J29287k7952o01884
47303A700212j228313j078186P4857J412077J718875N64725j004349j296634L9654
47294I02918J306383Q25020p45897j385766p01784k21183n21461j68787J488767
47285G78210K509711J154287j054513j393434j12973J15490j338768k020736m48836
47276a811562J391024J054911p93475j642943p43846M03743N96770K82511L74945
47267h87922R35795J312336R70963M1409p42086p73575l06037m1113n853M18540
$$ plain form
47331 430430 -24002 565435 837731 290198 -67930 167016 78953 -777662 -1593833 -1785782
47321 -1785782 -1743376 -1616000 -862914 286846 342991 -1461218 -3727401 -4486677 -3496380
47312 -3496380 -1985337 -770792 276772 1271452 1936037 2200761 2330048 2302096 1700212
47303 1700212 471899 -606287 -531430 880647 2599522 3164247 2159898 863264 902918
47294 902918 2209301 3034321 2288424 902658 200874 -20309 -541770 -710557 778210
47285 778210 3287921 4442208 3387695 1994261 1881288 1996778 658010 -1362726 -1811562
47276 -1811562 -420538 634373 -159102 -1802045 -2545891 -2142148 -1545378 -1262867 -887922
47267 -887922 47873 1360209 2331172 2372581 1630495 856920 550883 509770 503917 922457
47257I22457J233508J562376J022536L63135J89089J9482o94944j502849j665518
47248A449272j193132n03865J85958N49932J39875o83782q10798l3089N14733
47239c84896L12743M39502J499538K067833Q16089j020704j228337R1053P66098
47230C358919k03192j401597j069466Q01967K507444K123532n81067l278084l183436
47221i24980o34549J030444J14518j068779j43901J429406J084221l64412m33772
47212H8196M04044j72954j573194j052189J023614J346693m25474p88052J268700
47203A19384J964913p94753l215300j389794K389725L239115R30141q43739o63977
47194A735715l91326q81118j005791q10308j648217k804424j772355J218837K581704
$$ plain form
47257 922457 2155965 3718341 4740877 5104012 5293101 5312583 4617639 3114790 1449272
47248 1449272 256140 -247725 -61767 488165 628040 -55742 -866540 -899629 -384896
47239 -384896 -72153 367349 1866887 3934720 4750809 3730105 2501768 2592821 3358919
47230 3358919 3155727 1754130 684664 1486631 3994075 6117607 5536540 2258456 -924980
47221 -924980 -1559529 -529085 -414567 -1483346 -1627247 -197841 886380 521968 88196
47212 88196 492240 319286 -1253908 -2306097 -1282483 64210 -361264 -1149316 119384
47203 119384 2084297 1289544 -1925756 -3315550 -925825 2313290 3243431 2399692 1735715
47194 1735715 1344389 463271 -542520 -1352828 -3001045 -5805469 -7577824 -6358987 -3777283
47185c777283P92732r02417N45253L148482L019037L85247j058881J3170J059540
47176C224880L34433m46931L90594J215620k09251k667935l041729r95097P98970
47167a396446Q34933K84532J42415j55498n26342L44557K116460K288319L11278
47158D244208q25227N63880J567927n35105l123257k144052J014312J639028n30782
47149A870932j194500R31996K142205M70156j028957R7531J582219Q02450p93096
47140D880936q40772k35153p43285j316030l16929Q98296J74220j527224j817276
47131h43217r28106p18091r51461J5528J722839K058398P48220m67078p30006
47122i2974n69881n7486R91161J524106N22282p83270n22866N90453M10593q07936
$$ plain form
47185 -3777283 -2984551 -3886968 -3341715 -193233 2825804 3211051 2152170 2165340 3224880
47176 3224880 3559313 3112382 3502976 4718596 4509345 1841410 -1200319 -2195416 -1396446
47167 -1396446 -561513 -276981 -134566 -290064 -816406 -471849 1644611 3932930 4244208
47158 4244208 3418981 3982861 5550788 5015683 1892426 -251626 762686 2401714 1870932
47149 1870932 676432 1608428 3750633 4220789 3191832 3289363 4871582 5674032 4880936
47140 4880936 4040164 3805011 3061726 1745696 1428767 2327063 2501283 974059 -843217
47131 -843217 -1771323 -2489414 -3440875 -3425347 -1702508 355890 1104110 637032 -92974
47122 -92974 -662855 -720341 270820 1794926 2317208 1533938 1011072 1601525 2012118 1204182
47112A204182q15611N47841R51061l04924r33786M66381J904304R87975j447834
47103B559589k443899p50414J713133K068169k47868k516986j695188J474194
47095A60730K858507M55581k517289k131880O10352J741131N16327k34713N43975
47086B002721O95767o09924r75389R48263K678777J618912r81061k099259j162604
47077B116203j1591J05224l91721n80356M5651J209050J714005O22380j063295
47068C765550j296229N0895Q92895J51225q21103q94137r30765j566456j535085
47059b183210n8280J174037O17191l37986L01319J505349Q11252j407669k314439
47050a892436r74758N58822P37498L49648K21412l24804j493242j675938J83384
$$ plain form
47112 1204182 388571 936412 1887473 1582549 648763 1115144 3019448 4007423 2559589
47103 2559589 115690 -634724 1078409 3146578 2898710 381724 -1313464 160730
47095 160730 3019237 3474818 957529 -1174351 -563999 1177132 1693459 1458746 2002721
47086 2002721 2698488 2088564 1113175 2061438 4740215 6359127 5378066 3278807 2116203
47077 2116203 2104612 2209836 1818115 1237759 1283410 2492460 4206465 4828845 3765550
47068 3765550 2469321 2520216 3413111 3564336 2743233 1849096 918331 -648125 -2183210
47059 -2183210 -2241490 -1067453 -450262 -788248 -486929 1018420 1829672 422003 -1892436
47050 -1892436 -2867194 -2308372 -1570874 -1221226 -999814 -1324618 -2817860 -4493798 -4310414
47041d310414K358967K341296K71107j338059r52204M68335J284661J056959K40530
47032A421178p57873j505627j402602m55105L95036N22110O10614J390499J961167
47023B179397Q80762j241725k069110q88637K22055l96026j356267m58943J754429
47014a374065K732312J544342k35538j067991j033439q06317o21967m73532j59191
47005a495386P63323J945722J744649o27178l029421k619304R5734J826603J184195
46996b11063J30903K46705M21559m87056j340812q63192P1896K88935N75161J857523
46986F90559K684609J152558j555660k266505l41149J294580K03415k274395k811563
46977c223551k91907K828965L449473J519870p4212M09165J028345o97556l303699
$$ plain form
47041 -4310414 -1951447 389849 660956 -677103 -1629307 -1160972 123689 1180648 1421178
47032 1421178 663305 -842322 -2244924 -2700029 -2304993 -1782883 -1172269 218230 2179397
47023 2179397 3060159 1818434 -250676 -1139313 -917258 -1313284 -2669551 -3128494 -1374065
47014 -1374065 1358247 2902589 2667051 1599060 565621 -240696 -862663 -1336195 -1495386
47005 -1495386 -732063 1213659 2958308 2331130 -698291 -3317595 -3221861 -1395258 -211063
46996 -211063 -80160 166545 588104 101048 -1239764 -2102956 -2031060 -1742125 -1166964 690559
46986 690559 3375168 4527726 2972066 705561 364412 1658992 1862407 -411988 -3223551
46977 -3223551 -3515458 -686493 2762980 4282850 4208638 4617803 5646148 4948592 1644893
46968A644893k971942N21265K981825J966838J38126L45941R39726o38426k529023
46959B399223j235731J938054K196330j267864l836173k337722Q41098K095064
46951G92279J450163Q85313O15234l49932j646357j910061q32293O92867J707623
46942A404836J504573q2269j793979j695392J69277J304138J20471j746557j941714
46933b756616p30090M1206J39681Q43166K167906K485097J123799m58048p13977
46924B142124O506K16775o40892j516854j060849N90704J620146N99975j437780
46915E19855k013632m15594J417311J733694J145483R35468P49557l66535j759992
46906A945615j924403q49327J20579K92084r1257r24263j873897j688091J14202
$$ plain form
46968 1644893 -1327049 -805784 2176041 4142879 4281005 4626946 5566672 4928246 2399223
46959 2399223 1163492 3101546 5297876 4030012 193839 -2143883 -1302785 792279
46951 792279 2242442 3127755 3742989 3393057 1746700 -163361 -995654 -302787 1404836
46942 1404836 2909409 2827140 1033161 -662231 -492954 811184 931655 -814902 -2756616
46933 -2756616 -3486706 -3445500 -3305819 -2462653 -294747 2190350 3314149 2856101 2142124
46924 2142124 2148630 2365405 1724513 207659 -853190 -262486 1357660 1957635 519855
46915 519855 -1493777 -1909371 -492060 1241634 2387117 3322585 4072142 3705607 1945615
46906 1945615 21212 -828115 -707536 -415452 -506709 -1430972 -3304869 -4992960 -4878758
46897d878758J646116J145404K25911J487678L411384J826523k879084m730910
46889b745736o99244M000366K976640k077156l987077m01533L576611L148175
46881C791046l47567k717548k484307j093264R8367Q22876J055325Q53989N85943
46872E64860M51331K21208k03473n72992p27250o02234l4620O34610M03954p14305
46862e78911p98042J302177L313485K266225o62580j391221Q18775K163464M15967
46853F849339j708217j405624k86213r35812k085381j078343J016489R94350r74916
46844C85672j629749m0216J227914O60829j37349K35332P90122N22593L17318
46835B332466J004481J574148Q05376q08261j931688j990640j108563L21450J332088
$$ plain form
46897 -4878758 -3232642 -2087238 -1861327 -373649 3037735 4864258 1985174 -2745736
46889 -2745736 -3444980 555386 3532026 1454870 -2532207 -2933740 642871 3791046
46881 3791046 3443479 725931 -1758376 -2851640 -2753273 -1930397 -875072 -21083 564860
46872 564860 1016191 1237399 1033926 460934 -266316 -868550 -903170 -268560 135394 -578911
46862 -578911 -1376953 -74776 3238709 5504934 4842354 3451133 4269908 6433372 6849339
46853 6849339 5141122 3735498 3449285 2513473 428092 -650251 366238 1360588 385672
46844 385672 -1244077 -1284293 -56379 604450 467101 702433 1492555 2015148 2332466
46835 2332466 3336947 4911095 5716471 4908210 2976522 985882 -122681 198769 1530857
46826A530857R10318n07468j233411n69513L17736K59506l73873n52845L3597
46817a85096R57665J525379J046200m61313j817864j899646j070829l23591L78818
46808a850277J347106J573973J30225j449083r22692P84543O80222j148550j207745
46799b062278J570263L548115J943702q97089j562560q15062j291289k337545
46791a903743j212710J739038L110083J496353q01691j474537p86578R5726Q74480
46782A136421J281005M10445j864494l887599l640906q45426K646403M320349
46774d43802L078708K83853j535374j277498n2942O82413O90524L47659j28316
46765A645225k72727L05714O18207p79040k784255k227577J138256L005289M52414
$$ plain form
46826 1530857 2441175 1933707 700296 130783 448519 708025 334152 -218693 -185096
46817 -185096 772569 2297948 3344148 2882835 1064971 -834675 -1905504 -2229095 -1850277
46808 -1850277 -503171 1070802 1201027 -248056 -1170748 -386205 294017 -854533 -2062278
46799 -2062278 -492015 3056100 4999802 4102713 2540153 1725091 433802 -1903743
46791 -1903743 -3116453 -1377415 1732668 3229021 2427330 952793 166215 261941 1136421
46782 1136421 2417426 2827871 963377 -2924222 -6565128 -7410554 -4764151 -443802
46774 -443802 2634906 2918759 1383385 105887 52945 735358 1425882 1773541 1645225
46765 1645225 1372498 1678212 2296419 1517379 -1266876 -3494453 -2356197 649092 1101506
46756A101506l116028k545716J472619L609614J741459q98096j473177j062150
46748a169969j334355j540568o32029N43691J057799J581833K472350K268156
46740C246908P7148k169960j950693L28648J899734J245481l93052j083744o24939
46731E75531l96780j115480j471227J27521K650636L020160L80036k190679j895363
46722c15645j31686K97094r0639R45614K466631J497529j322498k025281J71002
46713A492121J454633o9335j256907L72088K271768J316428j224188k607605l082122
46704a333119l656496k620348J287399M801532M031508O42907o60028N96856R75839
46695D066050k53874l84514Q41520L22193k281658k921126J70396K960074J734964
$$ plain form
46756 1101506 -2014522 -4560238 -3087619 521995 2263454 1365358 -107819 -1169969
46748 -1169969 -2504324 -4044892 -4676921 -4133230 -3075431 -1493598 978752 3246908
46740 3246908 3324056 1154096 -796597 -467949 1431785 2677266 2284214 1200470 575531
46731 575531 178751 -936729 -2407956 -2280435 370201 3390361 3770397 1579718 -315645
46722 -315645 -447331 -150237 -240876 704738 3171369 4668898 3346400 1321119 1492121
46713 1492121 2946754 2877419 1620512 1992600 4264368 5580796 4356608 1749003 -1333119
46704 -1333119 -4989615 -7609963 -6322564 -1521032 2510476 3153383 2493355 3090211 4066050
46695 4066050 3812176 3427662 4269182 4591375 2309717 -611409 -441013 2519061 4254025
46686D254025j248640j775937k06146L9588j471735j858787m0806J529886P71161
46677g391j077452j462479J05804J782424J882671Q11549K50720O77336O53850
46668C617032o55653j457361J83947K518774J759652k064512m239839j894515
46660b232475J763506K257278J97098n73261O81917J139423l32717j509614r06297
46651D84858m1326l54000o97213L49360J734607J488580j74190j139905l53516
46642A297255R07990Q60853m38594j084932J68795J848833J391532r86558k003192
46633A961982j41476J520637q7708k621477j530238K322901L285111k65044l020616
46624A424072r17136K646757K399126q72680k519026j466724n35741q43696p48894
$$ plain form
46686 4254025 3005385 1229448 1023302 1062890 -408845 -2267632 -2308438 -778552 -7391
46677 -7391 -1084843 -2547322 -2441518 -659094 1223577 2035126 2285846 2963182 3617032
46668 3617032 2961379 1504018 1687965 4206739 5966391 3901879 -337960 -2232475
46660 -2232475 -468969 1788309 1985407 1412146 2094063 3233486 2900769 1391155 484858
46651 484858 443532 89532 -607681 -258321 1476286 2964866 2790676 1650771 1297255
46642 1297255 2205245 3066098 2627504 1542572 1711367 3560200 4951732 3965174 1961982
46633 1961982 1820506 3341143 3253435 631958 -898280 1424621 4709732 4444688 1424072
46624 1424072 506936 3153693 5552819 4680139 2161113 694389 158648 -685048 -1433942
46615a433942J86599N77114L92397P33503O62793j486824l705925k034003K629265
46606c479023M524445J478417j678680p36216J659629J119851j233214j389748
46598B65461M76454P61938j099307j895421k15069J508217J126929m53336j485041
46589a009175j657926j296706l99939P48326J546666J979190K259881J845028
46581D015345L60421r75715p23658M61237Q91762O39619R06761J166126j75687
46572F566211k329082k476087j76497J534531N33949j486376j821481k77503J449450
46563A517115K066097J145587r96481k809284k529601o27798M60122j80824p28709
46554b683776J51655J096553M91561q38289j045561J48388J661490K441479J683940
$$ plain form
46615 -1433942 -1247343 -670229 -277832 455671 1118464 -368360 -4074285 -6108288 -3479023
46606 -3479023 1045422 2523839 845159 108943 1768572 2888423 1655209 265461
46598 265461 741915 1503853 404546 -1490875 -1705944 -197727 929202 475866 -1009175
46589 -1009175 -2667101 -3963807 -4363746 -3615420 -2068754 -89564 2170317 4015345
46581 4015345 4375766 3400051 2676393 3137630 4029392 4669011 5575772 6741898 6566211
46572 6566211 4237129 1761042 1584545 3119076 3653025 2166649 345168 67665 1517115
46563 1517115 3583212 4728799 3732318 923034 -1606567 -2234365 -1774243 -1955067 -2683776
46554 -2683776 -2532121 -1435568 -944007 -1782296 -2827857 -2679469 -1017979 1423500 3107440
46545C107440n71461k253614j020318J788008J945556j306891l242165o61182
46537b214627K698861J804053j650443k074367R71622K464816L56824j620911
46529G35828p57638M88491m47126j593197j66867K410503K823149R74594o20323
46520C847414j060705j427062j817120j139634K84305N89924p73690k046988j530883
46511e074439M68385K408525L052741K028825m2749j686421j725391n65086L14822
46502h20788J69040l99153n50368j15210O31491J301371J427950R20577M97710
46493C062620Q30524J250346L97907j572084k664595j640744J33733N10103n72252
46484b64442j360107r39824o3660N94895J299208J900862J321238n35979j700288
$$ plain form
46545 3107440 2535979 282365 -737953 1050055 2995611 1688720 -1553445 -2214627
46537 -2214627 484234 2288287 637844 -1436523 -464901 1999915 2356739 735828
46529 735828 -21810 466681 19555 -1573642 -1740509 669994 3493143 4467737 3847414
46520 3847414 2786709 1359647 -457473 -1597107 -1312802 -722878 -1496568 -3543556 -5074439
46511 -5074439 -4606054 -2197529 855212 2884037 2841288 1154867 -570524 -1135610 -820788
46502 -820788 -651748 -1050901 -1601269 -1716479 -1084988 216383 1644333 2564910 3062620
46493 3062620 3893144 5143490 5541397 3969313 1304718 -336026 -202293 307810 -264442
46484 -264442 -1624549 -2564373 -2628033 -2033138 -733930 1166932 2488170 1952191 251903
46475B51903m86380J878699K607243R44119j165768j865406j270727m47571j0577
46466D35535j06501n05812l64531Q87700K205278J878937Q4808j145845q85964
46457B483605l50729l53022P3837J358944J954444Q93600l04960k88698l16716
46448E150305j554353k035473K84626K993231J867370k440175m647328k291317
46440b673114J110758J648521J04040n56308K27943R80901J038764P05700L9004
46431B626209o81870o47344j18489o18919k055360j812666J203206L812067K669675
46422D376509o17021j842456n27683m8003j635190k328736o8917K687031K648645
46413B644179N18904n52894R2072J60262j409406k626157j744782j75233k12727
$$ plain form
46475 251903 -234477 1644222 4251465 5195584 4029816 2164410 893683 446112 435535
46466 435535 329034 -176778 -541309 346391 2551669 4430606 4515414 3369569 2483605
46457 2483605 2132876 1779854 1853691 3212635 5167079 6060679 5755719 5467021 5150305
46448 5150305 3595952 1560479 1845105 4838336 6705706 4265531 -381797 -2673114
46440 -2673114 -1562356 86165 190205 -366103 -138160 842741 1881505 2587205 2626209
46431 2626209 1944339 1296995 1178506 559587 -1495773 -3308439 -2105233 1706834 4376509
46422 4376509 3759488 1917032 1389349 1341346 -293844 -2622580 -2691497 -4466 2644179
46413 2644179 3163083 2610189 2702261 2862523 1453117 -1173040 -2917822 -3093055 -3305782
46404c305782j161899l00929K426903L602109J429327j073891m74069J614673
46396B756442J019953k208389l814331k143459l13770m31507l40951J541868K669458
46387a264686J057167m97469Q05976K292673K99495k738669j837326J749521K191593
46378B058275r91879k034055R95248K625653n99519l844770j644349L353480M654684
46369D572768J429668j590033j585278j15112P61235O75104j75677j136087p54885
46360B081703J098761K000202L81262j507571r62127O73419L06761j697919k408587
46351c4096j208508O8728Q56739J736892J585725q12238l035098j652388J752182
46342g42062K305034k69406j120960J344077K559654k96359l136018j454326K563441
$$ plain form
46404 -3305782 -4467681 -4768610 -2341707 1260402 2689729 1615838 1141769 2756442
46396 2756442 3776395 1568006 -2246325 -4389784 -4703554 -5135061 -5476012 -3934144 -1264686
46387 -1264686 -207519 -704988 100988 2393661 2693156 -45513 -1882839 -133318 2058275
46378 2058275 1066396 -967659 27589 2653242 2053723 -1791047 -3435396 -81916 4572768
46369 4572768 6002436 4412403 2827125 2712013 3473248 4148352 3972675 2836588 2081703
46360 2081703 3180464 5180666 5561928 4054357 3092230 3765649 4072410 2374491 -34096
46351 -34096 -1242604 -1173876 -317137 1419755 3005480 2193242 -841856 -2494244 -742062
46342 -742062 1562972 1293566 172606 1516683 4076337 3779978 643960 -810366 1753075
46333A753075L846610J968757K83071q2871p70500k049753k304131j214938j98415
46324A230905R2184J83533J69362j50826j96950L73989N16930m28376j035883
46315G54868M8598J564862J528990L44741l98623q70774k028795k938830k028731
46306d023694o7328J036901J455903K364990K683339N83972k289333k172297J011524
46297E83977L086785J647304r79993j909655j395606q10938o4904R63281R55458
46288B075709o90716k103199j370301O18098J493014N26090r96360j694710j265615
46279c407990l18693K66775K39846K32282N10836K16000q64071r06338J307863
46270b723490L397117K156537j198788k323072l96678P48688q14010j880009L48489
$$ plain form
46333 1753075 5599685 7568442 7851513 7768642 6998142 4948389 2644258 1429320 1230905
46324 1230905 1323089 1506622 1675984 1525158 1328208 1702197 2219127 1790751 754868
46315 754868 803466 2368328 3897318 4242059 3843436 2972662 943867 -1994963 -4023694
46306 -4023694 -4091022 -3054121 -1598218 766772 3450111 4034083 1744750 -427547 583977
46297 583977 3670762 5318066 4338073 2428418 1032812 221874 156970 1120251 2075709
46288 2075709 1384993 -718206 -2088507 -1470409 22605 548695 -447665 -2142375 -3407990
46279 -3407990 -3726683 -3459908 -3220062 -2987780 -2476944 -2260944 -3125015 -4031353 -2723490
46270 -2723490 673627 2830164 1631376 -691696 -1088374 -339686 -1153696 -3033705 -2685216
46261b685216L446698L523656P73750j822972k885815k736891j365725O76287
46253c076228J326550p2853q22690J152130L355780K204416j212241k630986q11006
46244e87128J467983J964299J057505l14304j555457j580076q6947Q52373m80285
46235G37963j963855m53293K652711K919108j44967k243658j190293M1841j096834
46226g41277k427591j020175J899105L067518J861433O3707j223014j897820j587277
46217b005391l90313K82136l82022j015202k60473P42691J43521j417218j638707
46208e940978p153J656919J852622Q57765l25684r39457l98990J356195L186729
46199A297968L387294J358394j669459l552859k885347k98594J805854J623922
$$ plain form
46261 -2685216 761482 4285138 5058888 3235916 350101 -2386790 -3752515 -3076228
46253 -3076228 -1749678 -1822531 -2645221 -1493091 1862689 4067105 2854864 223878 -587128
46244 -587128 880855 2845154 3902659 3588355 2032898 452822 365875 1218248 737963
46235 737963 -1225892 -1679185 973526 3892634 3747667 1504009 313716 355557 -741277
46226 -741277 -3168868 -4189043 -2289938 777580 2639013 2702720 1479706 -418114 -2005391
46217 -2005391 -2395704 -2113568 -2495590 -3510792 -3771265 -3028574 -2885053 -4302271 -5940978
46208 -5940978 -5948131 -4291212 -2438590 -1580825 -1906509 -2845966 -3244956 -1888761 1297968
46199 1297968 4685262 6043656 4374197 821338 -2064009 -2362603 -556749 1067173
46191A067173J00632l56516P29052J462951Q17228J41168M45057M29628j019904
46182C816469k311378j432588O00613J104540k67863j355271r16036J11989O62208
46173A2683P04933L46304k66605j64807J315037K669966J734133q11531j904155
46164C635958o01818M96242n75546k097515j541538N67678J789157J290235J19580
46155C082433q96889j410204o54481J413149K718209J226307j754450k837551
46147H86523j172021O66491P48284J10636P1097j26063j234812j788202l25588
46138b163655J610977J317727r09336j993599m50060J708182J942735L03037j218296
46129A47712j257236k31328M80818J17092m95320J35461J909115K768263J548404
$$ plain form
46191 1067173 1167805 811289 1540341 3003292 3820520 3961688 4406745 4836373 3816469
46182 3816469 1505091 72503 673116 1777656 1509793 154522 -761514 -649525 12683
46173 12683 717616 1063920 797315 632508 1947545 4617511 6351644 5540113 3635958
46164 3635958 3034140 3530382 2954836 857321 -684217 -116539 1672618 2962853 3082433
46155 3082433 2185544 775340 120859 1534008 4252217 5478524 3724074 886523
46147 886523 -285498 380993 1129277 1239913 1311010 1184947 -49865 -1838067 -2163655
46138 -2163655 -552678 765049 -144287 -2137886 -2587946 -879764 1062971 1366008 147712
46129 147712 -1109524 -1340852 -860034 -742942 -1238262 -1102801 806314 3574577 5122981
46120E122981m2679L0502Q01272o1552k090835k520903q26691M83671R9116l74462
46110F20420R4885J25752q67040r18439R07236K221473J102278o27200o86445
46101A972920j69627q91099j505371m8253J839719J377270m27058o71114J08941
46092A586328p34761k408533j698317Q66747J359041p16321j467524N34858J997808
46083f80674J119679N36168J691215J672348j116042l134486j518150P51721J2301
46074f65920j654902l36550K479489K301811o81560k094274p06781K00944j080356
46065b238099k178600j084669R61002K178076K558035K373413J151925p92149
46057B928934j980610j681038n09823Q93875J966436J507095p51815k415934j108947
$$ plain form
46120 5122981 5080302 5110804 5912076 5850524 3759689 1238786 412095 895766 994882 620420
46110 620420 715305 841057 -25983 -944422 -37186 2184287 3286565 2659365 1972920
46101 1972920 1803293 912194 -593177 -641430 1198289 2575559 2148501 1477387 1586328
46092 1586328 851567 -1556966 -3255283 -2388536 -1029495 -1745816 -3213340 -2678482 -680674
46083 -680674 439005 975173 2666388 4338736 3222694 88208 -1429942 -678221 -665920
46074 -665920 -2320822 -2657372 -177883 2123928 1442368 -651906 -1358687 -1157743 -2238099
46065 -2238099 -4416699 -5501368 -4540366 -2362290 195745 2569158 3721083 2928934
46057 2928934 948324 -732714 -1242537 -348662 1617774 3124869 2373054 -42880 -1151827
46048a151827J514687J661486q18604k164051o27364J169590R27837j6553J33760
46039F28961N29261M3143j40348J055412J957513P50492j125723j115815K66931
46030B849827L95088j120000j977921r41389O17933J288105J482386J954552K157906
46021F706487J169035o93693k120212k319170j708580j176965r33756l10977J066783
46012c21048K171957J475710q05094k370359j528059N45234J307018J41425j142335
46003e25551j075169m00663n37276j234879r91144N44923J961879K199368J941703
45994A883191J945922J225004j246809l670294k883796Q23055L078996J177745
45986B333014j941979j882399R24786K304652P13756j084039q20868K76404L55184
$$ plain form
46048 -1151827 362860 2024346 1205742 -958309 -1585673 -416083 511754 495201 628961
46039 628961 1158222 1201365 1061017 2116429 4073942 4824434 3698711 2582896 2849827
46030 2849827 3244915 2124915 146994 -794395 -176462 1111643 2594029 4548581 6706487
46021 6706487 7875522 7181829 5061617 2742447 1033867 -143098 -1076854 -1387831 -321048
46012 -321048 1850909 3326619 2521525 151166 -1376893 -831659 475359 616784 -525551
46003 -525551 -1600720 -2001383 -2538659 -3773538 -4764682 -4219759 -2257880 -58512 1883191
45994 1883191 3829113 5054117 3807308 137014 -2746782 -1923727 1155269 2333014
45986 2333014 391035 -1491364 -566578 1738074 2451830 1367791 546923 823327 1178511
45977A178511j09316J19693O62673M73062k94630q38527r88586q19683j41177
45968g57980P05290P93221J72275M1457N65475K94516j147202j788795l42775
45959a464518J375091J131449k10537l07307P17374P05817o75833j298701j0019
45950c7184J641446J770878N12733o52938o60790M88470J750059J491742r40717
45941E363699l893464m724636k705496L23895K268688K701967K354453J820910
45933C510016J221765M44817n64001j375322j218523j72727L49633o45220k037405
45924d86967k005177o74812L20467O44467J505126K844651K602771j16669l015065
45915A618792l281448j085911J102693J779673J440086R07517K39565n94654j082345
$$ plain form
45977 1178511 1069195 1188888 1851561 2324623 2029993 1191466 202880 -616803 -757980
45968 -757980 -52690 740531 912806 954263 1519738 1814254 667052 -1121743 -1464518
45959 -1464518 -89427 1042022 831485 524178 1241552 1947369 1271536 -27165 -37184
45950 -37184 1604262 3375140 3887873 3234935 2574145 3062615 4812674 6304416 5363699
45941 5363699 1470235 -3254401 -5959897 -5636002 -3367314 -665347 1689106 3510016
45933 3510016 4731781 5176598 4612597 3237275 2018752 1846025 2195658 1550438 -486967
45924 -486967 -2492144 -3166956 -2846489 -2202022 -696896 2147755 4750526 4633857 1618792
45915 1618792 -1662656 -2748567 -1645874 133799 1573885 2481402 2720967 2126313 1043968
45906A043968o63498N14655J512099J323533O069j042420o38137M24932K81938
45897B763139j160332j793720m42805J161919Q98825n79114j026088j03347M06402
45888A24879l58270j158539q45512L1125M53854M10503L80012L30219p5173q71262
45878a578164j701779j803176l10765K400138M044646K755054K4750p70140Q04722
45869C865286J411398q59347l111291j814386J704312L099223J282602n59504
45861E018293j72327Q67825L58184j202606k008429j682536j018306l79745J90636
45852b9011L24675K9486J00971P43697P49899p49596k529917k503278k24565K700461
45842a387178M163636K968893k98403l109021k933569k81228J570593R31159m6070
$$ plain form
45906 1043968 380470 895125 2407224 3730757 3736826 2694406 2056269 2481201 2763139
45897 2763139 1602807 -190913 -633718 528201 1427026 847912 -178176 -281523 124879
45888 124879 -233391 -1391930 -2237442 -2206317 -1752463 -1341960 -961948 -631729 -706902 -1578164
45878 -1578164 -3279943 -5083119 -5393884 -2993746 1050900 3805954 3830704 3060564 3865286
45869 3865286 5276684 4417337 1306046 -508340 1195972 4295195 5577797 5018293
45861 5018293 4845966 5713791 6071975 4869369 2860940 1178404 160098 -219647 -29011
45852 -29011 295664 325150 426121 1169818 1919717 1170121 -1359796 -3863074 -4087639 -1387178
45842 -1387178 2776458 5745351 5446948 2337927 -595642 -876870 693723 1624882 1578812
45833A578812Q51942J935004K96189k954582l770418j166728J532643J929270
45825B32132J387430J399616P24755j525512k938949j104680K093513K874863
45817C143168J110522j4241N62165M04953j707030l219452j776532Q88380J491090
45808H83023m0138r76528j08911J008715J039979N89039M00561L1872o94609q13260
45798A319743p9126J7211j245703j893170o1763K457978K270930m99238k158213
45789A28649q13376J182235J137305l68636j278618j068760j94811J318779K751464
45780B794231K179000o09657k542245j227828J160686R59290j389226k235495
45772i11244m38380J438702J515784O88374J6591o84154j052538j13656J231357
$$ plain form
45833 1578812 2430754 4365758 4661947 1707365 -2063053 -3229781 -1697138 232132
45825 232132 1619562 3019178 3743933 2218421 -720528 -1825208 268305 3143168
45817 3143168 4253690 4239449 4801614 5206567 3499537 280085 -1496447 -608067 883023
45808 883023 842885 -133643 -242554 766161 1806140 2395179 2795740 2827612 2133003 1319743
45798 1319743 1240617 1257828 12125 -1881045 -1942808 515170 2786100 2286862 128649
45789 128649 -684727 497508 1634813 1266177 -12441 -1081201 -1276012 42767 2794231
45780 2794231 4973231 4363574 1821329 593501 1754187 2713477 1324251 -911244
45772 -911244 -1349624 89078 1604862 2293236 2309827 1625673 573135 459479 1690836
45763A690836O92687j521565k360234n91894J266983J101473K23249M79105J230186
45754B210826J275077J127063J190468K45102j877962k664798o73962J469019
45746B300833Q51711j158411j492669n29504p79133j884417j232068J050667J958443
45737i14548N70108p96338q79262j087219j850943j123837J717432L684274K223415
45728A543082q91695k129633r63805L37082N29857N37348J102819J444908O66157
45719B176120q34777j897479j815332o81901Q58821J767012J025977j255191l169962
45710c826712k472130O65232L253176K909175Q05731l52915l64580j053064k235479
45701b671566j566630R94197K247908Q57988k82245Q84445J889080L85490j161812
$$ plain form
45763 1690836 2383523 861958 -1498276 -2090170 -823187 278286 501535 980640 2210826
45754 2210826 3485903 4612966 5803434 6048536 4170574 1505776 831814 2300833
45746 2300833 3152544 1994133 501464 -28040 -807173 -2691590 -3923658 -2872991 -914548
45737 -914548 -344440 -1140778 -2020040 -3107259 -4958202 -6082039 -4364607 -680333 1543082
45728 1543082 651387 -1478246 -2442051 -2104969 -1575112 -1037764 65055 1509963 2176120
45719 2176120 1341343 -556136 -2371468 -3053369 -2194548 -427536 598441 -656750 -3826712
45710 -3826712 -6298842 -5633610 -2380434 528741 1334472 981557 616977 -436087 -2671566
45701 -2671566 -4238196 -3243999 -996091 -138103 -420348 464097 2353177 2738667 1576855
45692A576855J68864J904468J58387k910671k060682J781682K310292j751323
45684A177872m169099j049458L397720M017480J892127N65130J127j325162k216768
45675B290969j079529N40068O91547M38989Q93806J23883k801843m104234p33155
45666c739499L431011K692675j341046k279960O46861J821768r13460k845317
45658b526967p49543J811600Q42095j629528j438803J159780K881609K695784
45650C046027J967552J236042K46746k13283M62001Q07476o17415k349691k029316
45641B556139l35688O7539j035110j210309L02937J251130K66350p23490K93961
45632A433459J945928J559567m90110j201395L55677J402074l53397k982692k955279
$$ plain form
45692 1576855 1745719 3650187 3808574 897903 -1162779 618903 2929195 1177872
45684 1177872 -2991227 -4040685 -642965 3374515 5266642 5831772 5832899 4507737 2290969
45675 2290969 1211440 1751508 2443055 2882044 3775850 3899733 1097890 -3006344 -3739499
45666 -3739499 -308488 2384187 1043141 -1236819 -589958 1231810 318350 -2526967
45658 -2526967 -3276510 -1464910 -622815 -2252343 -3691146 -2531366 350243 3046027
45650 3046027 5013579 6249621 6496367 6283084 6745085 7552561 6935146 4585455 2556139
45641 2556139 2220451 2287990 1252880 42571 345508 1596638 1862988 1139498 1433459
45632 1433459 3379387 4938954 4448844 3247449 3603126 5005200 4651803 1669111 -1286168
45623a286168l36426J373579N24917n50655K33346J259942K47397j523429j174881
45614a232378Q57820J375045m68938k004464j324391M42611J787448K659221K709172
45605D801146Q50544k011284k836835q12624J037861N68528k54593O28982J337612
45596C309337m15441k471536j325739J734526K418612M54202k46410J487749K124586
45587G069886l41904k839776k128351M45891J683185J105027J70824o97212j627604
45578B839966j678466k83667J051164P79920j66999J4930J078517J489733J031218
45569F156316N55495R0237p68427j421422j183176p93655j136680j426817o61430
45560e89559K24069r2154p25594j19328Q67504L73101p90208k69037J442946J513636
$$ plain form
45623 -1286168 -1622594 -249015 275902 -274753 -41407 1218535 1465932 -57497 -1232378
45614 -1232378 -374558 1000487 531549 -1472915 -2797306 -2354695 -567247 2091974 4801146
45605 4801146 5651690 3640406 803571 -9053 1028808 1597336 1342743 1971725 3309337
45596 3309337 2893896 422360 -903379 831147 3249759 3703961 3457551 4945300 7069886
45587 7069886 6727982 3888206 1759855 2205746 3888931 4993958 5164782 4467570 2839966
45578 2839966 1161500 877833 1928997 2708917 2541918 2556848 3635365 5125098 6156316
45569 6156316 6711811 6802048 6033621 4612199 3429023 2635368 1498688 71871 -589559
45560 -589559 -365490 -457644 -1183238 -1302566 -435062 -61961 -852169 -1121206 321740 1835376
45550A835376j86222n81587J177315J884610l32172k595818j877622J45314M1559
45541d89247j846302k261458j29806K329381K998045J880821J58612q22608j91109
45532A626329J184871R90934j364224l199383k121926L91570J409127R95378J182444
45523A095120J740072P07406j349548j616419J12777P83220p53224j744229l67457
45514a392282J047870R5229j433226m93499K052204K641641M06702j771958j473287
45505c20606N23307J999656J904204P43278l45301n63047k38992n06948j561027
45496A634524j919507n06484J274242J093536j031389k651780k055369K3720K007820
45487b130687L185944L318071K050565k58757k101734k274018j270748m34440
$$ plain form
45550 1835376 1649154 1067567 2244882 4129492 3797320 1201502 -676120 -530806 -489247
45541 -489247 -2335549 -4597007 -4726813 -2397432 600613 2481434 2640046 1817438 1626329
45532 1626329 2811200 3802134 2437910 -761473 -2883399 -2491829 -1082702 -87324 1095120
45523 1095120 2835192 3542598 2193050 576631 689408 1472628 719404 -1024825 -1392282
45514 -1392282 -344412 -249183 -1682409 -2175908 -123704 2517937 2924639 1152681 -320606
45505 -320606 202701 2202357 4106561 4849839 4504538 3941491 3702499 3195551 1634524
45496 1634524 -284983 -791467 482775 1576311 544922 -2106858 -4162227 -4138507 -2130687
45487 -2130687 1055257 4373328 6423893 6165136 4063402 1789384 518636 84196
45479H4196j86551N9254O02311J069662J273855J495187J665563J120668l34081
45470F850064j767983k160720j566034n77129O87592J977221J960778k74994k833571
45461B295224k417106R83357L091805Q34690l108819l813019q43301J680767J298775
45452B373k2919J1853M89253m12053k031916k329931r24274Q58215J963379K110712
45442b85308J263099K9751k49005Q38281J793697J108088o30425j682658j435200
45433G50320o26472q3594k48328j106348j692053p39937J297147K273811J385559
45424A210105M06422N95866N56030q45179j739599l08121J440690N35220j720001
45415A31433j463707J421408L060156J734364p9336n76003j145070k475248k320076
$$ plain form
45479 84196 -102355 -43101 559210 1628872 2902727 4397914 6063477 7184145 6850064
45470 6850064 5082081 2921361 1355327 778198 1465790 3443011 5403789 5128795 2295224
45461 2295224 -121882 861475 3953280 4787970 1679151 -2133868 -2977169 -1296402 2373
45452 2373 -20546 -8693 480560 68507 -1963409 -4293340 -5217614 -4359399 -2396020 -285308
45442 -285308 977791 1007542 758537 1596818 3390515 4498603 3868178 2185520 750320
45433 750320 123848 40254 -208074 -1314422 -3006475 -3746412 -2449265 -175454 1210105
45424 1210105 1616527 2212393 2768423 1923244 183645 -124476 1316214 1851434 131433
45415 131433 -1332274 89134 3149290 4883654 4804318 4228315 3083245 607997 -1712079
45406a712079L87679K647481J532354j381254k551267j325294L95713J452596
45398e54071J780070J142901j1140o1771J135027J079316j368419l173150j603437
45389a634674Q10008M7104k470198j870923J981661L933615J744489p03466j56360
45380A681256J213019N48639o82077j02503P97199m36593k190249j204198J634776
45371A259269K466497N95888r39248p48298o85973j537938j362988M05235J021360
45362D73804j110538l094483j553556K084199L423345J183073j508160j740367
45354a842683j97422P16112L12917L1070J037856K340421J714820j306141l929463
45345a122513k849507J350346M239027K953402j17979q19434R98726J778648j72096
$$ plain form
45406 -1712079 -1324400 1323081 2855435 1474181 -1077086 -2402380 -2006667 -554071
45398 -554071 1225999 2368900 2357760 2295989 3431016 4510332 3141913 -31237 -1634674
45389 -1634674 -824666 -777562 -3247760 -5118683 -3137022 796593 2541082 1837616 1681256
45380 1681256 2894275 3442914 2760837 2658334 3455533 3018940 828691 -375507 1259269
45371 1259269 3725766 4321654 3382406 2634108 1948135 410197 -952791 -547556 473804
45362 473804 -636734 -3731217 -5284773 -3200574 222771 1405844 -102316 -1842683
45354 -1842683 -2040105 -1323993 -1011076 -980006 57850 2398271 4113091 2806950 -1122513
45345 -1122513 -3972020 -2621674 1617353 4570755 4452776 3633342 4632068 6410716 6238620
45336F238620k353816k035355l8327R75758K98779o02495p34437n51483m48169
45327G49075Q1986J265547K058668J197620j003549k620110k201803n22029M01161
45318e93434j9111k41302R12404K220232J819878K03173m04837N28316J094957
45309E520276L4129j450765j852673j476592j151652n65943M87704P48799o05551
45300c12268j916669j238032L06264L0895j828053k139392J88451K251283J405085
45291c252436r76309j783962l67214J509487K496669K378826J008389j243252
45283b29802k518301j187149J532995K680385J423573p8541l3280P31286O36608
45274B957774k81167r91373j101504p52995j7975O05435K82607o11008m99607
$$ plain form
45336 6238620 3884804 1849449 1811122 2786880 3085659 2483164 1748727 1197244 749075
45327 749075 831061 2096608 4155276 5352896 4349347 1729237 -472566 -994595 -593434
45318 -593434 -612545 -853847 58557 2278789 4098667 4301840 3897003 4425319 5520276
45309 5520276 5554405 4103640 2250967 774375 -377277 -943220 -455516 293283 -312268
45300 -312268 -2228937 -3466969 -3160705 -3129810 -4957863 -7097255 -6908804 -4657521 -3252436
45291 -3252436 -4228745 -6012707 -6379921 -4870434 -2373765 5061 1013450 -229802
45283 -229802 -2748103 -3935252 -2402257 278128 1701701 1623160 1589880 2321166 2957774
45274 2957774 2676607 1685234 583730 -169265 -187240 418195 700802 89794 -409813
45265d09813O62223N72049j605715k699859J04280L928253L412655j131291l547268
45256g14486q16614K644842K147191l33007l74293J244241L65195k902166l955138
45247b694235j034505K224857K536158R91556q7014n72411r41042m56975R27002
45238H93391J445548L21622o27373q5531M32069n36319j516587o38321R03609
45229E92108P18388q89771j652144r22615K5934M73626O57379M40785k11068k07177
45219i74555J054537J945759Q07100j014310r30532P71466J385983M2500j316197
45210A771751j276630o31529l63029k93320k32847m95052q62313p03800k22615
45201c309384j6820L12714J350199K176161J550755K32842j36208J90763o3217
$$ plain form
45265 -409813 252410 824459 -781256 -3481115 -3376835 551418 3964073 2832782 -714486
45256 -714486 -1531100 1113742 3260933 2927926 2553633 3797874 4163069 1260903 -2694235
45247 -2694235 -3728740 -1503883 1032275 2023831 1936817 1364406 423364 -33611 893391
45238 893391 2338939 2660561 2033188 1947657 2379726 1843407 326820 -311501 592108
45229 592108 1310496 420725 -1231419 -2154034 -2128100 -1654474 -997095 -556310 -767378 -974555
45219 -974555 79982 2025741 2832841 1818531 887999 1659465 3045448 3087948 1771751
45210 1771751 495121 -136408 -499437 -792757 -1025604 -1520656 -2382969 -3086769 -3309384
45201 -3309384 -3326204 -3013490 -1663291 512870 2063625 2296467 2160259 2351022 2287805
45192B287805l42770O74146J801992O90513j844109k683488j604025j366521k217636
45183d604093j094807K386860M082940J785710r49525m37133J645325J826705
45175D641982M57636l8655K41509k99861j283977j472105j509885k282630k431767
45166c977753p35406J028686R11835L58838J372518K362157R40840j198995q73235
45157A89485P99640L19277j628273j114384J846149K848766M89468j404928m17410
45148A927790Q44462J9917q49314N72947K457978J811587p45057k272073j720415
45139B047822l59740M86605K11875j127181k192655j270611J132950K487338J884407
45130C300810J104359J092252L26663j760552k843955j389511N24806N88372j26794
$$ plain form
45192 2287805 1945035 2619181 4421173 5111686 3267577 584089 -1019936 -2386457 -4604093
45183 -4604093 -5698900 -3312040 770900 2556610 1607085 1169952 2815277 4641982
45175 4641982 5099618 5060963 5302472 5002611 3718634 2246529 736644 -1545986 -3977753
45166 -3977753 -4713159 -3684473 -2772638 -2413800 -1041282 1320875 2261715 1062720 189485
45157 189485 989125 1308402 -319871 -1434255 411894 3260660 3750128 2345200 1927790
45148 1927790 2772252 2792169 1942855 2515802 4973780 6785367 6040310 3768237 2047822
45139 2047822 1688082 2174687 2386562 1259381 -933274 -2203885 -1070935 1416403 3300810
45130 3300810 4405169 5497421 5824084 4063532 1219577 -169934 354872 943244 816450
45121H16450K88207Q40055l34023k113039j974059r3796J319959J677048J904153
45112B330955J742320L39005j228253j160144p0708J19814k76441L82906J232830
45103C412284j39591k840497k936590L99948K910468J291040k022923k540427
45095b466288J87298K745255K641233N30383j561505k296847j583134l44886L57052
45086a791439M33513M84046M32149k64070q86614J68700K523588L316963R78920
45077E395756k186550k936649j247172M07278Q36686R44832J294747J186803L24142
45068D019873m93679p61658q77100r96019o74526p2649j11247p81165o62890Q46138
45058e64922J978259P55600j857840k666836l63822K518457K696886K46091j751634
$$ plain form
45121 816450 1104657 1944712 1610689 -502350 -2476409 -2570205 -1250246 426802 2330955
45112 2330955 4073275 4412280 3184027 2023883 1953175 2072989 1796548 2179454 3412284
45103 3412284 3272693 432196 -2504394 -2104446 806022 2097062 74139 -2466288
45095 -2466288 -2278990 466265 3107498 3637881 2076376 -220471 -1803605 -2148491 -1791439
45086 -1791439 -1357926 -873880 -441731 -705801 -1592415 -1423715 1099873 4416836 5395756
45077 5395756 3209206 272557 -974615 -567337 269349 1214181 2508928 3695731 4019873
45068 4019873 3526194 2764536 1887436 891417 216891 144242 32995 -748170 -1411060 -564922
45058 -564922 1413337 2168937 311097 -2355739 -2719561 -201104 2495782 2741873 990239
45049I90239j389485j11114n6459p73769k75395J352091J680350k56536k028212
45040h68290j144787J179039J671813k63115j778210p74788J257197J606536K962
45031H88357j502966j462186m12802L43302K01966m51242o07769N49491K474582
45022B0733L223788J525867j354130k877124k181900n74745P40810J748505K229502
45013B501306J347580m00634q00292Q85477K057689L20939k513411k800098o36000
45004c7444L37557j173368k113718k79175J928302J389921p28302r92424R18611
44995g50040K168692J372213O2740m24573o52305j126119j063188O625J197562
44986G91607J573386J093840p7531j663816k465856j284879R42890J783084N75455
$$ plain form
45049 990239 -399246 -510360 -566819 -1340588 -1615983 -263892 1416458 1159922 -868290
45040 -868290 -2013077 -834038 837775 574660 -1203550 -1978338 -721141 885395 888357
45031 888357 -614609 -2076795 -2489597 -2146295 -1944329 -2395571 -3003340 -2453849 20733
45022 20733 3244521 4770388 3416258 539134 -1642766 -2217511 -1476701 271804 2501306
45013 2501306 3848886 3448252 2647960 3533437 5591126 5912065 3398654 598556 -37444
45004 -37444 300113 -873255 -2986973 -3266148 -1337846 52075 -676227 -1668651 -750040
44995 -750040 1418652 2790865 2853605 2429032 1776727 650608 -412580 -405955 791607
44986 791607 2364993 3458833 3381302 1717486 -748370 -2033249 -1090359 692725 1268180
44977A268180p96442q87039l42794N6483O52913J240252O29483p89171o38460
44968C93405J556815K747561R00823j487815j330950Q3537k83395j678344j067745
44959a66108R86680Q59091j794936l049967r63616J597197J852120P74746Q182
44950A03389r93803k332458j801527J264935L323943J312744k347667l110013
44942d580457q37752Q81683P03051O67157J698857J939942K78958j591549j725772
44933b565882l14961J288461K162586J937434R12779K57253N91659O30545r19967
44924C979907k617344j970022L20192Q71369j106879k286570l42005K345293K242541
44915A436482k90581k003611j421657p3373L25817j42969m01318J81121J209254
$$ plain form
44977 1268180 471738 -415301 -758095 -701612 -48699 1191553 1821036 1031865 393405
44968 393405 1950220 4697781 5598604 4110789 2779839 2863376 2579981 901637 -166108
44959 -166108 820572 1679663 -115273 -3165240 -4128856 -2531659 -679539 95207 103389
44950 103389 -890414 -3222872 -5024399 -3759464 -435521 877223 -1470444 -4580457
44942 -4580457 -5418209 -4536526 -3833475 -3166318 -1467461 472481 751439 -840110 -2565882
44933 -2565882 -2880843 -1592382 570204 2507638 3420417 3677670 4269329 4899874 3979907
44924 3979907 1362563 -607459 -287267 584102 -522777 -2809347 -3151352 -806059 1436482
44915 1436482 1145901 -857710 -2279367 -2352740 -2026923 -2169892 -2571210 -2390089 -1180835
44906a180835J515439L24230j487102k019074n93858J518531K822195K831423
44898C730949J480783r05594k632628j813071N83860J263503n13284j351187Q59253
44889G02584K879972R03409k889982l061868P55234L183588J265044j453647r34232
44880A350102J287616J212276j145433k173811n11681J098521J97336j873005
44872e58079k145216j69588J635623J378478K1698k41977Q89537J526392M40129
44863B776997j095888j165637Q5302R27462O51925J25544j07892n88328j432479
44854A77006j598245m46721J063898J603188J124173N56150M52942O10961N87218
44845D130570J04554o70831r95956k54977R76078J297142K60085j001740j365789
$$ plain form
44906 -1180835 334604 658834 -828268 -2847342 -3441200 -1922669 899526 3730949
44898 3730949 5211732 4306138 1673510 -139561 444299 1707802 1194518 -156669 702584
44889 702584 3582556 4485965 1595983 -1465885 -710651 2472937 3737981 2284334 1350102
44880 1350102 2637718 3849994 2704561 530750 19069 1117590 1314926 -558079
44872 -558079 -2703295 -2872883 -1237260 141218 162916 -79061 810476 2336868 2776997
44863 2776997 1681109 515472 600774 1528236 2180161 2305705 2197813 1609485 177006
44854 177006 -1421239 -1867960 -804062 799126 1923299 2479449 2932391 3543352 4130570
44845 4130570 4235124 3564293 2568337 2313360 3289438 4586580 4846665 3844925 2479136
44836B479136j101065j001143r42249k80848P67709J196797O06798k85906o44102
44827G95127l63591K35415R33212J404699R88412n51797k088082j910983K1583
44818e36005J490579P27116r69793r72262O20949R81757q39199j971178j48958
$$ plain form
44836 2479136 1378071 376928 -565321 -846169 -78460 1118337 1725135 1439229 795127
44827 795127 431536 666951 1600163 3004862 3993274 3441477 1353395 -557588 -536005
44818 -536005 954574 1681690 711897 -260365 360584 1342341 503142 -1468036 -1616994
$$ [...]
##END NTUPLES=NMR SPECTRUM
##END=
