##TITLE=31Pdec_SR160_oil_EtAc
 , 24 sc
 18.1.2023
##JCAMPDX= 6.0         $$ Bruker NMR JCAMP-DX V2.0
##DATA TYPE= NMR SPECTRUM
##DATA CLASS= NTUPLES
##ORIGIN= UXNMR, Bruker Analytische Messtechnik GmbH
##OWNER= root
$$ XWIN-NMR		Version 3.5
$$ Wed Jan 18 16:09:56 2023 Russian Standard Time (UT+4h)  she@DPX200
##.OBSERVE FREQUENCY= 81.013821
##.OBSERVE NUCLEUS= ^31P
##.ACQUISITION MODE= SIMULTANEOUS
##.ACQUISITION SCHEME= undefined
##.AVERAGES= 24
##.DIGITISER RES= 16
##SPECTROMETER/DATA SYSTEM= spect
##.PULSE SEQUENCE= zgpg30
##.SOLVENT NAME= CDCl3
##.SHIFT REFERENCE= (INTERNAL, CDCl3, 0, 248.564)
##AUDIT TRAIL= $$ (NUMBER, WHEN, WHO, WHERE, WHAT)
$$ ##TITLE= Audit trail, XWIN-NMR		Version 3.5
$$ ##JCAMPDX= 5.01
$$ ##ORIGIN= Bruker BioSpin GmbH
$$ ##OWNER= she
$$ F:/spectra/data/she/nmr/P31/1/pdata/1/auditp.txt
$$ ##AUDIT TRAIL=  $$ (NUMBER, WHEN, WHO, WHERE, WHAT)
(   1,<2023-01-18 16:08:36.60 +0400>,<she>,<DPX200>,
      <created by zg, POWCHK disabled, PULCHK disabled
       configuration hash MD5:
       00 E9 B6 7A A2 85 ED C7 34 08 36 98 17 FE 4E 26
       data hash MD5: 32K
       C9 9F 1D DA 63 57 6F CF 01 90 6B 47 8D C3 22 12>)
(   2,<2023-01-18 16:08:54.93 +0400>,<she>,<DPX200>,
      <Start of raw data processing
       efp BC_mod = 2 LB = 1 FT_mod = 6 PKNL = 1 PHC0 = -10977.72 PHC1 = 67.05779 SI = 64K 
       data hash MD5: 64K
       15 95 5F DB 9E A3 71 55 75 4F 03 C2 9A 3C 40 B9>)
(   3,<2023-01-18 16:09:10.53 +0400>,<she>,<DPX200>,
      <pk PHC0 = 6.205297 PHC1 = 0 
       data hash MD5: 64K
       45 8B 1C 67 6A 65 49 03 D7 08 92 C4 B6 16 70 79>)
$$ ##END=
$$ 
$$ hash MD5
$$ B5 75 F7 E5 9A 0A FE 5E 19 D6 61 6D 94 89 A9 B4
##$RELAX= 
##$RELAX= 
##$RELAX= 
##$RELAX= 
##$RELAX= 
##$RELAX= 
##$RELAX= 
##$RELAX= 
##$RELAX= 
$$ Bruker specific parameters
$$ --------------------------
##$DU= <F:/spectra>
##$EXPNO= 1
##$NAME= <P31>
##$PROCNO= 1
##$TYPE= <nmr>
##$USER= <she>
##$AMP= (0..31)
100 100 100 100 100 100 100 100 100 100 100 100 100 100 100 100 100 100 
100 100 100 100 100 100 100 100 100 100 100 100 100 100 
##$AQSEQ= 0
##$AQ_mod= 1
##$AUNM= <au_zg>
##$AUTOPOS= <>
##$BF1= 81.014009
##$BF2= 200.13
##$BF3= 200.13
##$BF4= 200.13
##$BF5= 200.13
##$BF6= 200.13
##$BF7= 200.13
##$BF8= 200.13
##$BYTORDA= 1
##$CFDGTYP= 0
##$CFRGTYP= 5
##$CHEMSTR= <none>
##$CNST= (0..31)
1 1 145 1 1 1 1 1 1 1 1 1 1 1 1 1 1 1 1 1 1 1 1 1 1 1 1 1 1 1 1 1 
##$CPDPRG= <waltz16>
##$CPDPRG1= <>
##$CPDPRG2= <waltz16>
##$CPDPRG3= <>
##$CPDPRG4= <mlev>
##$CPDPRG5= <mlev>
##$CPDPRG6= <mlev>
##$CPDPRG7= <mlev>
##$CPDPRG8= <mlev>
##$CPDPRGB= <>
##$CPDPRGT= <>
##$D= (0..31)
0 1 0 0 0 0 0 0 0 0 0 0.03 2e-05 3e-06 0 0 0 0 0 0 0 0 0 0 0 0 0 0 0 0 
0 0 
##$DATE= 1674043716
##$DBL= (0..7)
120 120 120 11 120 120 24 19 
##$DBP= (0..7)
150 150 150 150 150 150 150 150 
##$DBP07= 0
##$DBPNAM0= <>
##$DBPNAM1= <>
##$DBPNAM2= <>
##$DBPNAM3= <>
##$DBPNAM4= <>
##$DBPNAM5= <>
##$DBPNAM6= <>
##$DBPNAM7= <>
##$DBPOAL= (0..7)
0.5 0.5 0.5 0.5 0.5 0.5 0.5 0.5 
##$DBPOFFS= (0..7)
$$ [...]
##$SUBNAM2= <"">
##$SUBNAM3= <"">
##$SUBNAM4= <"">
##$SUBNAM5= <"">
##$SUBNAM6= <"">
##$SUBNAM7= <"">
##$SUBNAM8= <"">
##$SUBNAM9= <"">
##$SW= 501.771253377433
##$SWIBOX= (0..15)
0 1 3 0 0 0 0 0 0 0 0 0 0 0 0 0 
##$SW_h= 40650.406504065
##$TD= 32768
##$TD0= 1
##$TE= 0
##$TE2= 300
##$TE3= 300
##$TEG= 300
##$TL= (0..7)
0 120 53 12 22 120 120 120 
##$TP= (0..7)
150 150 150 150 150 150 150 150 
##$TP07= 0
##$TPNAME0= <>
##$TPNAME1= <>
##$TPNAME2= <>
##$TPNAME3= <>
##$TPNAME4= <>
##$TPNAME5= <>
##$TPNAME6= <>
##$TPNAME7= <>
##$TPOAL= (0..7)
0.5 0.5 0.5 0.5 0.5 0.5 0.5 0.5 
##$TPOFFS= (0..7)
0 0 0 0 0 0 0 0 
##$TUNHIN= 0
##$TUNHOUT= 0
##$TUNXOUT= 0
##$USERA1= <user>
##$USERA2= <user>
##$USERA3= <user>
##$USERA4= <user>
##$USERA5= <user>
##$V9= 5
##$VALIST= <valist>
##$VCLIST= <CCCCCCCCCCCCCCC>
##$VD= 0
##$VDLIST= <DDDDDDDDDDDDDDD>
##$VPLIST= <PPPPPPPPPPPPPPP>
##$VTLIST= <TTTTTTTTTTTTTTT>
##$WBST= 1024
##$WBSW= 4
##$XGAIN= (0..3)
0 0 0 0 
##$XL= 0
##$YL= 0
##$YMAX_a= 4079
##$YMIN_a= -4046
##$ZGOPTNS= <>
##$ZL1= 120
##$ZL2= 120
##$ZL3= 120
##$ZL4= 120
##$ABSF1= 0
##$ABSF2= 0
##$ABSG= 0
##$ABSL= 0
##$ALPHA= 0
##$AQORDER= 0
##$ASSFAC= 0
##$ASSFACI= 0
##$ASSFACX= 0
##$ASSWID= 0
##$AUNMP= <proc_1d>
##$AZFE= 0.1
##$AZFW= 0.5
##$BCFW= 0
##$BC_mod= 2
##$BYTORDP= 0
##$COROFFS= 0
##$CY= -3
##$DATMOD= 1
##$DC= 0
##$DFILT= <>
##$DTYPP= 0
##$F1P= 0
##$F2P= 0
##$FCOR= 1
##$FTSIZE= 65536
##$FT_mod= 6
##$GAMMA= 0
##$GB= 0
##$INTBC= 1
##$INTSCL= 6.047779e-11
##$ISEN= 30
##$LB= 1
##$LEV0= 0
##$LPBIN= 0
##$MAXI= 10000
##$MC2= 0
##$MEAN= 0
##$ME_mod= 0
##$MI= 50
##$NCOEF= 0
##$NC_proc= -9
##$NLEV= 6
##$NOISF1= 182.463
##$NOISF2= 159.3651
##$NSP= 0
##$NTH_PI= 0
##$NZP= 0
##$OFFSET= 248.5645
##$PC= 4
##$PHC0= -10971.51
##$PHC1= 67.05779
##$PH_mod= 1
##$PKNL= yes
##$PPARMOD= 0
##$PSCAL= 0
##$PSIGN= 0
##$REVERSE= no
##$SF= 81.0140089999694
##$SI= 65536
##$SIGF1= 159.3651
##$SIGF2= -187.1042
##$SINO= 113.3802
##$SIOLD= 16384
##$SREGLST= <1H.CDCl3>
##$SSB= 0
##$STSI= 65536
##$STSR= 0
##$SW_p= 40650.406504065
##$SYMM= 0
##$S_DEV= 0
##$TDeff= 32768
##$TDoff= 0
##$TI= <>
##$TILT= no
##$TM1= 0
##$TM2= 0
##$TOPLEV= 0
##$USERP1= <user>
##$USERP2= <user>
##$USERP3= <user>
##$USERP4= <user>
##$USERP5= <user>
##$WDW= 1
##$XDIM= 65536
##$YMAX_p= 521808697
##$YMIN_p= -163531759
$$ End of Bruker specific parameters
$$ ---------------------------------
##NTUPLES= NMR SPECTRUM
##VAR_NAME=  FREQUENCY,     SPECTRUM/REAL,   SPECTRUM/IMAG
##SYMBOL=    X,             R,               I
##VAR_TYPE=  INDEPENDENT,   DEPENDENT,       DEPENDENT
##VAR_FORM=  AFFN,          ASDF,            ASDF
##VAR_DIM=   65536,         65536,           65536
##UNITS=     HZ,            ARBITRARY UNITS, ARBITRARY UNITS
##FACTOR=    0.620285442955139, 1,           1
##FIRST=     20137.2065510682, 0,            0
##LAST=      -20513.1999529968, 0,           0
##MIN=       -20513.1999529968, -163531759,  0
##MAX=       20137.2065510682, 521808697,    0
$$ Real data points
##PAGE= N=1
##DATA TABLE= (X++(R..R)), XYDATA
$$ [...]
42495a619936k370702m606458l445487K140222Q899545R646040J567840p834796
42487B376268q254738M99118P913495N915675j680386n081300p92413N221511
42479F117230N568655k24796n954425o023586j624017Q25485k217282o113354
42471i646090l337147O030344J2816804R684185J77892o308675n769866j654043
42463A993404J895809L331683J249355m985614j1091040j0097343j208223P830330
42455a1081639R559753M435309k054941n841821n899252l558014k308391m203214
42447b0952210m937762J931894J3492638J7161706O743756p508820j1397205m176776
42439i642779L850883O550070N866847L459029j509618o230150n188175P36400
$$ plain form
42495 -1619936 -3990638 -8597096 -12042583 -9902361 -1002816 8643224 10211064 2376268
42487 2376268 -5878470 -5379352 2534143 8449818 6769432 1688132 895719 6117230
42479 6117230 11685885 11461089 5506664 -516922 -2140939 -1315454 -3532736 -9646090
42471 -9646090 -12983237 -6952893 5863911 15548096 15725988 9417313 3647447 1993404
42463 1993404 3889213 7220896 8470251 3484637 -7606403 -17703746 -18911969 -11081639
42455 -11081639 -1521886 2913423 858482 -4983339 -10882591 -14440605 -16748996 -20952210
42447 -20952210 -25889972 -23958078 -10465440 6696266 13440022 5931202 -5466003 -9642779
42439 -9642779 -5791896 758174 6625021 10084050 8574432 2344282 -2843893 -2107493
42431b107493L705423J38344l994794k335377K836078M606569P42290m591066
42423a000026o248890k845289K413213M500744J742579j752314j061291K723137
42415a528137M012320R17916k186635j317691J620124J860387k149710p281973
42407f053399q853928m650926K764923P830513P376677L377102r63372n340327
42399d512737r592678r744480k234649Q723787J3659799Q806171L03076l877938
42391A530351k723070j188793k720734m700505j678185O492211J1440539N524406
42383A1976220n920727q943641m07108O030983k3416r224306p233398K083447
42375a1661946L697832k708241k347835Q252561J3271900K462061j2243604j4609429
$$ plain form
42431 -2107493 1597930 1736274 -2258520 -4593897 -1757819 2848750 3591040 -1000026
42423 -1000026 -7248916 -10094205 -7680992 -3180248 -1437669 -3189983 -4251274 -1528137
42415 -1528137 2484183 3402099 1215464 -102227 1517897 3378284 1228574 -6053399
42407 -6053399 -14907327 -19558253 -16793330 -8962817 -1586140 1790962 827590 -4512737
42399 -4512737 -14105415 -23849895 -26084544 -17360757 -3700958 5105213 5408289 1530351
42391 1530351 -1192719 -2381512 -5102246 -9802751 -11480936 -4988725 6451814 11976220
42383 11976220 6055493 -2888148 -3295256 2735727 2712311 -6511995 -13745393 -11661946
42375 -11661946 -7964114 -10672355 -13020190 -4767629 8504271 10966332 -1277272 -15886701
42367a5886701n588177L673385R155841J2350916J0421285J294640p234274o218074
42359A968841K96305J363720l620814n404087r54616K676331J222911n93793J721681
42350a323521N243713M810012k18967o502915r931804p952121k668724m81999
42342a9026326l832883n474182K322989J4432241J7142319O412469o321593q967056
42334c312022k243151M968502P384584N751733J911047l253304q208224j0540346
42326g541181q671807l311284K388092N084296M904034M953774N576219K979194
42318F361337k827996m141859L095091Q845962J147504j3077233j3625536L326484
42310a0896246J6112400P360015r811863j0182067O448005J4918256J779467j5390289
$$ plain form
42367 -15886701 -21474878 -17801493 -8645652 3705264 14126549 15421189 8186915 1968841
42359 1968841 2265146 3628866 8052 -5396035 -6350651 -3674320 -2451409 -3045202 -1323521
42350 -1323521 3920192 8730204 8511237 2008322 -7923482 -15875603 -18544327 -19026326
42342 -19026326 -22859209 -28333391 -26010402 -11578161 5564158 11976627 5655034 -3312022
42334 -3312022 -5555173 -586671 6797913 12549646 14460693 11207389 2999165 -7541181
42326 -7541181 -16212988 -19524272 -17136180 -12051884 -7147850 -2194076 3382143 6361337
42318 6361337 3533341 -608518 2486573 11332535 12480039 -597194 -14222730 -10896246
42310 -10896246 5216154 12576169 2764306 -7417761 -969756 13948500 15727967 337678
42302C37678j3950624K090450J0003532J379714q374628m520728O945847J0701920
42294D613161L912407l573986n729118n579602m936239m85079O860214Q868518
42286C950276K130490m613825k464743M433945N571704p69353p367413r443096
42278h572015p548788k044988N924820R872485M321149n038649p504383l182609
42270a3772978j685124m872426l924332L620503P832081L435552m04735L836112
42262e935347Q318256L668695l711344k056175N410801N832440j665909n385592
42254D475825j196881J957293j075981l181526J580621P350636N938581j151702
42246A4696866o447728o385465k437261K493535M576155Q94117n345393o342360
$$ plain form
42302 337678 -13612946 -11522496 -1518964 -139250 -8513878 -13034606 -6088759 4613161
42294 4613161 8525568 4951582 -777536 -6357138 -11293377 -11778456 -4918242 3950276
42286 3950276 6080766 1466941 -997802 3436143 9007847 8238494 871081 -8572015
42278 -8572015 -16120803 -18165791 -12240971 -2368486 1952663 -3085986 -10590369 -13772978
42270 -13772978 -15458102 -20330528 -24254860 -20634357 -12802276 -9366724 -9771459 -5935347
42262 -5935347 2382909 6051604 2340260 284085 5694886 11527326 9861417 4475825
42254 4475825 3278944 5236237 4160256 978730 2559351 9909987 15848568 14696866
42246 14696866 8249138 1863673 -573588 1919947 6496102 7390219 2044826 -4297534
42238d297534k04645N167501K928459k969609m011940R63521N686948N550137
42230H812838J465209l632173p346630p748422m639945o36433J492447J764009
42222a0469100J575128J161066M73398N65858J819618K634115K016156J550186
42214A326425K686252L965454K989030m73976m670262p139116n252577J189833
42206e378937P090749O195626l43624m638121l391347k157386m523462m478021
42198a1624523L379955J2079928J0272110j011945r276629p490262j039536K814427
42190a896475L641746L702777K829758J086872O57636J567221N47462k562632
42182I574365k396033L751526R682355P526183j412916q376801q614867n888769
$$ plain form
42238 -4297534 -4502179 665322 3593781 624172 -3387768 -2424247 3262701 8812838
42230 8812838 10278047 6645874 -700756 -8449178 -13089123 -13725556 -12233109 -10469100
42222 -10469100 -8893972 -7732906 -7259508 -6693650 -4874032 -2239917 -223761 1326425
42214 1326425 4012677 7978131 10967161 10493185 5822923 -1316193 -6568770 -5378937
42206 -5378937 1711812 7907438 7563814 2925693 -465654 -2623040 -7146502 -11624523
42198 -11624523 -8244568 3835360 14107470 13095525 3818896 -3671366 -4710902 -1896475
42190 -1896475 1745271 5448048 8277806 9364678 10022314 11589535 12136997 9574365
42182 9574365 7178332 10929858 20612213 28138396 26725480 18348679 9733812 3845043
42174C845043m872631l940063J060364Q211278R645022J765499q322447j0552210
42166c160145m469981Q57854m60853m266548m131545k27417L427051N574863O704075
42157a52646N640568K455263R07723K446105J994762l812352q827045o026830
42149e374452L04492J158126j714760Q56465P826915P633552k207701r150463
42141f67826m764139K836715L603537J396838M768196J0350675P706927l417725
42133B1813198j2009702j0910156m079329J350231L024221K361202J001433r0194
42125B460904o61744q11947K41429L244245N927472M367446j002902m746272m005421
42116E013210k339459l267268m746846l656077j329241n98199r86102l83686J814051
$$ plain form
42174 3845043 -1027588 -4967651 -3907287 4303991 13949013 15714512 7392065 -3160145
42166 -3160145 -7630126 -6772272 -7233125 -11499673 -15631218 -15858635 -12431584 -6856721 -152646
42157 -152646 5487922 7943185 8850908 11297013 13291775 9479423 652378 -5374452
42149 -5374452 -5069960 -3911834 -5626594 -4770129 3056786 10690338 8482637 -667826
42141 -667826 -5431965 -2595250 1008287 2405125 7173321 17523996 25230923 21813198
42133 21813198 9803496 -1106660 -5185989 -3835758 -811537 1549665 2551098 2460904
42125 2460904 1799160 987213 1228642 4472887 10400359 14767805 13764903 9018631 5013210
42116 5013210 2673751 -593517 -5340363 -8996440 -10325681 -10923880 -11909982 -12293668 -10479617
42107a0479617N571498J0012482J0905707M400601m925814p465106k743382r80965
42099D295404o401440r853726m830602O49569j891381o090476k132815N503956
42091b0751511O291535K687953M781880J0477967Q317969j413134n575054M47215
42083E264820O006983K951106l940114p838705q124733m275894N167540J3292942
42075H503945Q296899p644270j6316965q055803M111766M378936l251379m180806
42067a4157677L710539R588573P581268K598353l89827k404783m933772o072646
42059d479972m136258o06216J830820J955267Q02219Q20831K994847M659334K701558
42050F542430j476919l917112m116406l965874k043284L685681Q162987L736704
$$ plain form
42107 -10479617 -4908119 5104363 16010070 20410671 15484857 8019751 5276369 4295404
42099 4295404 -2106036 -11959762 -16790364 -16140795 -18032176 -24122652 -26255467 -20751511
42091 -20751511 -14459976 -11772023 -6990143 3487824 11805793 10392659 4817605 5264820
42083 5264820 11271803 14222909 10282795 2444090 -5680643 -9956537 -4788997 8503945
42075 8503945 16800844 9156574 -7160391 -15216194 -11104428 -6725492 -9976871 -14157677
42067 -14157677 -10447138 -858565 6722703 9321056 8931229 6526446 1592674 -4479972
42059 -4479972 -8616230 -9222446 -7391626 -5436359 -4634140 -3813309 -818462 3840872 6542430
42050 6542430 5065511 1148399 -2968007 -6933881 -8977165 -5291484 2871503 6608207
42042F608207o445907j0023432l392075K934440J678257j17709N226740J2149713
42034H618234J1490405N165742N48335k360344o805382q735505k942221M517432
42026I496696K832130o585330j1420381o047758K932973Q501357J0189369Q703455
42018A8602511L481218k647572m711940l149433k965847m830560m490731j301658
42010b014012P52373J134745L402223O726455N608910M474l078443q39270J037871
42001A2735326j307127l895023l298638k472241l094489p24018N678706P601920
41993A1224416p56113j0599069r461623N0936L962748j821119n821973Q45232
41985a2376565J0904357J1448771J288411r067024j1090625n472408K540371Q692518
$$ plain form
42042 6608207 162300 -9861132 -13253207 -10318767 -8640510 -8758219 -3531479 8618234
42034 8618234 20108639 25274381 25822716 23462372 16656990 7921485 4979264 9496696
42026 9496696 12328826 5743496 -5676885 -11724643 -8791670 -290313 9899056 18602511
42018 18602511 22083729 19436157 14724217 11574784 8608937 3778377 -712354 -2014012
42010 -2014012 -1261639 -126894 3275329 10001784 15610694 15615168 12536725 11697455 12735326
42001 12735326 11428199 7533176 4234538 1762297 -1332192 -2056210 3622496 11224416
41993 11224416 10468303 -130766 -9592389 -9541453 -5578705 -7399824 -13221797 -12376565
41985 -12376565 -1472208 9976563 11264974 2197950 -8892675 -14365083 -11824712 -3132194
41977c132194J0144236N777898j430373n651689m481878j866288k395970m825986
41969g862244m475003n22421L230033M526092M971134N191919K518414l692625
41961C885299q488282p240062k418596J51034q0560J180145M727678O066072L385771
41952A168499J530038M370066P621209M547338l362382p369426l403166K520475
41944G622651L055035r70635l745186l596083l259045k800049P91222O208044
41936C305954P158992K091472k099138p86502N13845m013071q666076m207090
41928f701614N845675Q751243J988309l257734m65212L011384O08784j750963
41920H029872K327010O223598Q31079q403561q586427k62452K812043m634067
$$ plain form
41977 -3132194 7012042 12789940 11359567 5707878 1226000 -640288 -3036258 -7862244
41969 -7862244 -12337247 -12859668 -9629635 -5103543 -132409 5059510 7577924 3885299
41961 3885299 -4602983 -11843045 -14261641 -14110607 -14191167 -13011022 -8283344 -2217272 1168499
41952 1168499 2698537 7068603 14689812 19237150 15874768 8505342 5102176 7622651
41944 7622651 10677686 9707051 5961865 2365782 -893263 -3693312 -2902090 3305954
41936 3305954 10464946 12556418 10457280 9670778 10184623 6171552 -2494524 -6701614
41928 -6701614 -855939 7895304 9883613 6625879 6160667 9172051 9780835 8029872
41920 8029872 10356882 16580480 17411559 9007998 421571 159119 2971162 -1662905
41912a662905j0994021n430646O414601J1098593N231929k396432l449046J113281
41904g4646M315758J662661m342507p190084l761722J995366M020555J479918
41896a894701j395785j812934j186487j338966j580145p58025N89011J614112
41888g763920K691765M157674M866535L272014n66440m643757o566637n575061
41880a0127827l062974o64580J666253M385699O036259M797757J942802L37796
41872E311185l63759k674836n230979l533420J906186M789237L008571J994697
41864E206882M091299L162319l496557o596718J631686J2271066J0730259j170714
41856B5829522p952845l833134J240484K60446j101040J527501J324704o928118
$$ plain form
41912 -1662905 -12656926 -18087572 -11672971 -574378 4657551 2261119 -1187927 -74646
41904 -74646 4241112 5903773 1561266 -5628818 -9390540 -7395174 -3374619 -1894701
41896 -1894701 -3290486 -5103420 -6289907 -7628873 -9209018 -9967043 -9378032 -7763920
41888 -7763920 -5072155 -914481 3952054 7224068 6657628 2013871 -4552766 -10127827
41880 -10127827 -13190801 -13855381 -12189128 -7803429 -1767170 3030587 4973389 5311185
41872 5311185 4947426 2272590 -2958389 -6491809 -4585623 203614 3212185 5206882
41864 5206882 9298181 12460500 8963943 2367225 3998911 16269977 27000236 25829522
41856 25829522 17876677 14043543 15284027 15544473 14443433 15970934 17295638 10367520
41848A0367520j4838086j1754390j090389N204493L975080K432959M643576O235418
41840E176181L112465k358325n773213n725941k577361L123038Q594017Q896195
41832A2467056K410069n390349o813811p68983N539225M860004j763651o996316
41824C543244o572929l275760j121941J75686K392555M214186L543581J781555
41816D680177J320517P10240k831791p337571p477334j681560O082459J0809498
41808D274635R383228J550480p457297q691447l11646O722936K052482p958799
41800d35428q098041L063500J1088240P720972J458062J236539K762763n92238
41792A8204369m538976k316291J984970L28322m726491m320944J249678L132658
$$ plain form
41848 10367520 -4470566 -16224956 -17315345 -12110852 -8135772 -5702813 -1059237 5176181
41840 5176181 8288646 5930321 157108 -5568833 -8146194 -5023156 3570861 12467056
41832 12467056 14877125 9486776 2672965 1903982 7443207 12303211 10539560 3543244
41824 3543244 -3029685 -6305445 -7427386 -7251700 -4859145 -644959 2898622 4680177
41816 4680177 6000694 6710934 3879143 -3458428 -10935762 -12617322 -6534863 4274635
41808 4274635 13657863 15208343 7751046 -940401 -1252047 5470889 7523371 -435428
41800 -435428 -8533469 -5469969 5618271 13339243 14797305 16033844 18796607 18204369
41792 18204369 13665393 11349102 13334072 13662394 8935903 4614959 5864637 8997295
41784H997295j115266m131636j418473J999073L69728m353646o207903k957824
41776h818652K196341M067488K35298n474279n807598O19738N769112K688023
41768d524529l707445l436497L067841N309446q75705o758582m255641K186521
41760a2994591L429375n08401k124683R77597L219018R36983j946560q60010K119457
41751g751815K216132j40824o23845J228990J373154j179492k188874J37494J264809
41742e664271j761176m146741r93056L860390M143403J979518L061246M487598
41734D966911p91150q828979p885184J575908N036326k836356q271247n91045
41726a7624816R863968Q572838k19233k651890J433637J292284l986435n022444
$$ plain form
41784 8997295 7882029 3750393 2331920 4330993 4700721 347075 -5860828 -8818652
41776 -8818652 -6622311 -2554823 -2319525 -7793804 -13601402 -12981664 -7212552 -4524529
41768 -4524529 -8231974 -11668471 -8600630 -3291184 -4166889 -10925471 -15181112 -12994591
41760 -12994591 -9565216 -10073617 -12198300 -11220703 -8001685 -7064702 -9011262 -9871272 -7751815
41751 -7751815 -5535683 -5676507 -6300352 -5071362 -3698208 -4877700 -7066574 -6929080 -5664271
41742 -5664271 -7425447 -11572188 -12565244 -8704854 -4561451 -2581933 479313 4966911
41734 4966911 4175761 -4653218 -12538402 -10962494 -5926168 -8762524 -17033771 -17624816
41726 -17624816 -7760848 811990 592757 -2059133 -625496 666788 -3319647 -8342091
41718h342091k87978K133300Q88239L039109P695749M551042o729304j1425432
41710h477366j575645J0484517R610964j650501r623983q312980k270072K990001
41702h825065M590896Q85518n942205r206387n149819K578246R268342J3886389
41694B085915J3997965M999559r100613j3803272l009755Q418252L633384j0610693
41686c389258j2443639L070942J6414377J1168332n109947j4445999j1859043
41679a6594235n720973j692517K713170R023954J2579251R233813K173313j706214
41671A0009562k88152K142112J527313q37447j354805K62414J441538J161258
41663A4063793J16660k202871n609983n416814K341296J1219949Q840661n229705
$$ plain form
41718 -8342091 -8630069 -6496769 -5608530 -2569421 5126328 9677370 2948066 -8477366
41710 -8477366 -10053011 431506 10042470 8391969 -1232014 -9544994 -11815066 -8825065
41702 -8825065 -4234169 -3348651 -9290856 -18497243 -23647062 -21068816 -11800474 2085915
41694 2085915 16083880 21083439 11982826 -1820446 -4830201 3588051 7221435 -3389258
41686 -3389258 -15832897 -12761955 3652422 14820754 9710807 -4735192 -16594235
41679 -16594235 -22315208 -24007725 -21294555 -12270601 308650 9542463 11715776 10009562
41671 10009562 9721410 11863522 13390835 12553388 11198583 11460997 12902535 14063793
41663 14063793 14180453 11977582 6367599 950785 3292081 14512030 23352691 18122986
41655A8122986j5218202r449589L368750P282566J406797k655881r17745m87088
41647A452594l832073l907322J837473N179024P18469m255871p24371Q412591
41639D880514J2726014P463445l249694j2186326j3511057o101436L296713M999579
41631a682248j396104n246325N393O542261M040419m093269n791466J538124P935703
41622A852488N689052j658013o689124p135515m641269n8005O194231J1619420
41614E173265J2248450N750870n415387j3545027j1675701k640701K025377l137262
41606a1216116q474265k458614R760541J1838492M0819j0381488o582617M931680
41598a2541568R916433O167527J880865l4350m268554j0844311j1649085k505670
$$ plain form
41655 18122986 2904784 -6544805 -3176055 4106511 5513308 2857427 1939682 1452594
41647 1452594 -2379479 -6286801 -4449328 729696 1448165 -2807706 -3532077 4880514
41639 4880514 17606528 25069973 21820279 9633953 -3877104 -9978540 -6681827 -1682248
41631 -1682248 -3078352 -8324677 -8319284 -1777023 2263396 -1829873 -7621339 -6083215 1852488
41622 1852488 7541540 5883527 -805597 -7941112 -12582381 -12640386 -6446155 5173265
41614 5173265 17421715 23172585 17757198 4212171 -7463530 -10104231 -8078854 -11216116
41606 -11216116 -19690381 -22148995 -12388454 -549962 -509143 -10890631 -17473248 -12541568
41598 -12541568 -2625135 3542392 5423257 5388907 1120353 -9723958 -21373043 -23878713
41590b3878713R035473J2740804P825685J475283j543508k688432m105620m305327
41582e444355j156004L610458N652546L291343n58772k145878q92372J225549
41574C582515K526636K043524j226967o306947q224599k462423P344081J0703686
41566G979506K635997q683635j1310270m416563J941780J473819o39003K859335
41558h159034J0034895J2883745Q383433R94486m288036o040021m188676N42710
41550A0163502M070309J475494n553144q838850m545497Q16831l82691n811997
41542h606043o986443j227127O396560J1075675J1648418P449127p94247p302982
41534A1652938o444414k150718l540136r641465q637369L452786J3786645J0022748
$$ plain form
41590 -23878713 -14843240 -2102436 5723249 7198532 5655024 2966592 -1139028 -5444355
41582 -5444355 -6600359 -2989901 2662645 5953988 5395216 3249338 2356966 3582515
41574 3582515 6109151 8152675 6925708 618761 -7605838 -10068261 -2724180 7979506
41566 7979506 10615503 1931868 -9378402 -13794965 -11853185 -10379366 -11018369 -8159034
41558 -8159034 1875861 14759606 23143039 24137525 19849489 13809468 9620792 10163502
41550 10163502 14233811 15709305 10156161 1317311 -3228186 -2411355 -2794046 -8606043
41542 -8606043 -15592486 -16819613 -10423053 652622 12301040 19750167 18955920 11652938
41534 11652938 5208524 3057806 -482330 -10123795 -18761164 -15308378 -1521733 8501015
41526H501015j930834p115604k155593L907039N103433L595667J283813k479169
41518H709767m768106j084216N075884M214974m981978j2072532r045333n90656
41510a4542196M109051L573886K995555N312052Q085630P283546J468001o351566
41502A1933959j0380704p628066j372880L423304O045776P443672N255122j696049
41494A3024134o803500k855242N241295N414329l111622p716849j851717N009882
41486F350710K828121l914764m868890J07705K664238p05828m953045m015696
41478f507449K836437J0071185R231867k294638j4432613j3294405P27836J2098174
41470a563606J0736014L675690J009317J191039j329333l932096k084389R4822
$$ plain form
41526 8501015 6570181 -545423 -2701016 1206023 6309456 9905123 11188936 8709767
41518 8709767 3941661 2857445 7933329 12148303 7166325 -4906207 -13951540 -14542196
41510 -14542196 -10433145 -6859259 -3863704 1448348 9533978 16817524 18285525 11933959
41502 11933959 1553255 -6074811 -7447691 -4024387 2021389 9465061 14720183 13024134
41494 13024134 6220634 3365392 8606687 14021016 10909394 3192545 1340828 6350710
41486 6350710 9178831 5264067 395177 502882 3167120 2461292 -2491753 -6507449
41478 -6507449 -3671012 6400173 15632040 13337402 -1095211 -14389616 -13661780 -1563606
41470 -1563606 9172408 12848098 13857415 15048454 13719121 9787025 7702636 7797458
41462G797458l012217o973363m416921J461390K225498j157902j025414K654622
41454b446849K819933j351823l282191q88501R49648K36537P02503L953889O703920
41445G397066O313746K857730k967711q115184o902377O51697N240292J312957
41437E788216k854213J038728M960870k972212j5524528j4547110k20216P987705
41429a6342760J679229n128756p94544O694680O524635K631579K667199K689482
41421F20744l793573j0929668p950493L908381J2753646J1072487J923992o374387
41413A231129o413735K652376J1191993P007612q415818j8922880j3979750j693036
41405b7342109M684391M359598M553278O266277N188360K168711K361942N743629
$$ plain form
41462 7797458 4785241 -2188122 -6605043 -5143653 -2918155 -4076057 -5101471 -2446849
41454 -2446849 373084 -978739 -4260930 -5149431 -4199783 -3963246 -3260743 693146 7397066
41445 7397066 13710812 16568542 13600831 5485647 -1416730 -765033 4475259 5788216
41437 5788216 2934003 3972731 8933601 5961389 -9563139 -24110249 -24330465 -16342760
41429 -16342760 -14663531 -19792287 -20586831 -13892151 -7367516 -4735937 -2068738 620744
41421 620744 -3172829 -14102497 -22052990 -18144609 -5390963 5681524 7605516 1231129
41413 1231129 -5182606 -2530230 8661763 15669375 7253557 -11669323 -25649073 -27342109
41405 -27342109 -22657718 -18298120 -13744842 -7478565 -2290205 -121494 2240448 7984077
41397G984077O740194K592641l789893q200274q099666l369507K300305L578956
41389b63167K3028l011670k064421O88498L142501N982834P241985K467212n765472
41380H441328p770170j708189J342455n105031j0693735m240535O921265P256894
41372e555718l018704r046130m161267K786757L885771K714002M478972O229431
41364a686886L004704k960114n073259j052780N119449P781565L969246m540618
41356D561307j1580060j0789602j831917P827092R265846J562346o156731m851061
41348a1992780K633466N021439o25254l573000L242330R501469K773970r301805
41340b320165q469467M922055J0895646O11093j0743585q673133O48349N116684
$$ plain form
41397 7984077 14724271 17316912 13527019 5326745 -2772921 -6142428 -3842123 -263167
41389 -263167 -240139 -3251809 -5316230 -4627732 -1485231 4497603 11739588 14206800 8441328
41380 8441328 671158 -1037031 305424 -4799607 -15493342 -19733877 -12812612 -5555718
41372 -5555718 -8574422 -17620552 -21781819 -18995062 -15109291 -12395289 -7916317 -1686886
41364 -1686886 1317818 -1642296 -6715555 -7768335 -2648886 5132679 9101925 4561307
41356 4561307 -7018753 -17808355 -19640272 -11813180 -2547334 -984988 -7141719 -11992780
41348 -11992780 -9359314 -4337875 -4963129 -8536129 -5293799 4207670 6981640 -2320165
41340 -2320165 -10789632 -5867577 5028069 5639162 -5104423 -13777556 -13129207 -8012523
41332h012523N545534P388470P198974J183734l644053m58439M618189L458130
41324A7278016J83643J655853L421786j119455o858076o468296m370323o482647
41316b759499o277505K240817Q080824o29376j3141994j0629840K713066O780078
41308a3623429q23444l542204L154685N661040m91762k580799M438514Q492004
41300F84605L361931o74016K244943K888127l029558m500136L334981O770363
41292A1081240l254820j2845240o439037P597764J0081276m35356r063080p789352
41284a1066605k075158J791212L213107L049363J933800J285642R13464q22891
41276a778066j901152J521137O106819L926921l177894l999940K994172N238772
$$ plain form
41332 -8012523 -2466989 4921481 12120455 13304189 9660136 9201697 13819886 17278016
41324 17278016 17461659 19117512 22539298 21419843 14561767 8093471 3723148 -2759499
41316 -2759499 -9037004 -6796187 1284637 655261 -12486733 -23116573 -20403507 -13623429
41308 -13623429 -14446873 -17989077 -14834392 -9173352 -9665114 -12245913 -7807399 684605
41300 684605 4046536 3372520 5617463 8505590 5476032 975896 4310877 11081240
41292 11081240 7826420 -5018820 -11457857 -3860093 6221183 5785827 -3277253 -11066605
41284 -11066605 -13141763 -11350551 -8137444 -5088081 -3154281 -1868639 -955175 -1778066
41276 -1778066 -3679218 -2158081 3948738 7875659 4697765 697825 3691997 8930769
41268H930769k586314q161930k350134M760767J583233m876734k045171O237233
41260A491719P258703O11012m200155m654460m611593k934584K519328N426397
41252I06367K68248m900773l24386O969755L685903n960045o215852L201902O585380
41243D216499o38911m784821J640694P267555J551389q327564r786647k575031
41235a1436837M813133P762319O752612K706728k403630n262093n487554n433508
41227g988830m330057O38608O495126O292340P08153j405565K989518O086585
41219I485878K333944k820497k881481m74444p12316j468547J889299O761814
41211A2113650O032212j408311q539519q203685m00000P667283Q169612J037934
$$ plain form
41268 8930769 6344455 -1817475 -4167609 593158 2176391 -2700343 -4745514 1491719
41260 1491719 8750422 9361434 5161279 506819 -4104774 -7039358 -4520030 906367
41252 906367 1174615 -3726158 -4050544 2919211 6605114 645069 -5570783 -2368881 4216499
41243 4216499 3577588 -1207233 433461 7701016 9252405 924841 -8861806 -11436837
41235 -11436837 -6623704 1138615 7891227 10597955 8194325 2932232 -2555322 -7988830
41227 -7988830 -12318887 -11680279 -5185153 1107187 1815340 409775 3399293 9485878
41219 9485878 11819822 8999325 6117844 5643400 4931084 3462537 5351836 12113650
41211 12113650 18145862 16737551 8198032 -5653 -405653 7261630 15431242 16469176
41203A6469176n216452m190374m37097j768896n743752l223921N453712R173354
41195A0515750L027875m595467o037943m634149n137956m245010J493511O936155
41187b677234O136032J964528m2657p13548k130550q51276M448397N889510j810449
41178A0212753q949136l721676P080359N934233p833196j4876847l903408J2039142
41170d017776J4731131M420088n123408o573005l491358M0498L452824M733625
41162H172619P54044n995441p740766j186105P382720R470216M022912k875284
41154A2004915n936144n165010l101872j106560K36482k24033k394829l459713
41146i146764j568945J88692k126019n856410m326282K232978N568409K425656
$$ plain form
41203 16469176 11252724 7062350 6625253 4856357 -887395 -4111316 1342396 10515750
41195 10515750 13543625 8948158 2910215 -1723934 -6861890 -11106900 -9613389 -2677234
41187 -2677234 3458798 5423326 5380669 4667121 2536571 1685295 6133692 12023202 10212753
41178 10212753 1263617 -2458059 4622300 10556533 2723337 -12153510 -16056918 -4017776
41170 -4017776 10713355 15133443 10010035 3437030 -54328 -13830 3438994 8172619
41162 8172619 8926663 2931222 -4809544 -5995649 1387071 10857287 14880199 12004915
41154 12004915 6068771 903761 -2198111 -3304671 -3068189 -3292222 -5687051 -9146764
41146 -9146764 -10715709 -10527017 -12653036 -18509446 -22835728 -20602750 -15034341 -12608685
41138a2608685P54750O670423J2660574Q310573k509519o843579k494982N8168
41130C997723m140923p512293m275393O95766K767495N545361J0507382R676154
41122A7261272j191517j1098115p608373M025675Q255090J852304l964302k483417
41114E048617O42424j50125k076960j919179k236540m686533m868785O67163P656038
41105a923880R346587N080140j2193j621060l49858m86875m724802r073915o166275
41096i932131L413017Q454608J979956p192434p208706j685340k104891n970601
41088b0246522j53133J3977929J8561730P455356l094673j042840L038986k918661
41080A5578172j0442707o680775J773910R39875n632264n067342L3079k299600
$$ plain form
41138 -12608685 -11853935 -5183512 7477062 15787635 13278116 6434537 3939555 3997723
41130 3997723 -143200 -7655493 -11930886 -11235120 -8467625 -2922264 7585118 17261272
41122 17261272 16069755 4971640 -2636733 1388942 9644032 11496336 7532034 5048617
41114 5048617 5691041 5540916 3463956 1544777 -691763 -5378296 -10247081 -9579918 -1923880
41105 -1923880 7422707 12502847 12490654 10869594 10519736 10032861 5308059 -3765856 -9932131
41096 -9932131 -6519114 1935494 3915450 -3276984 -10485690 -12171030 -14275921 -20246522
41088 -20246522 -20399655 -6421726 12140004 19595360 16500687 15457847 18496833 15578172
41080 15578172 5135465 -1545310 228600 1168475 -4463789 -9531131 -9498052 -11797652
41072a1797652p863372j426232J3665061J6263659J702078q873514j772701Q723935
41064H621262N503490m627661n301100K287697M240122k384676p450305n628076
41056d739247k374422k648402m318775l674128l88214L618618N987024N346226
41048c191320L475596L486590M113779N04588o889915j0164008m497469M782320
41040h379839R718828Q762268M544222r31157m447743j877967M322574M964361
41032A6675547k447613p636034k545530M981717K502162p581269j1284687l237111
41024a0572818P295091J0403446O135286q9990m776632o705454n535872k535058
41016f382001P8781J193719P59417o44891n99648L316129Q080660O571392j747391
$$ plain form
41072 -11797652 -19661024 -21087256 -7422195 8841464 10543542 1670028 -102673 8621262
41064 8621262 14124752 9497091 4195991 6483688 10723810 8339134 888829 -4739247
41056 -4739247 -7113669 -9762071 -14080846 -17754974 -18143188 -14524570 -8537546 -3191320
41048 -3191320 284276 3770866 7884645 8389233 1499318 -8664690 -13162159 -8379839
41040 -8379839 1338989 10101257 14645479 13714322 9266579 7388612 11711186 16675547
41032 16675547 14227934 6591900 4046370 9028087 11530249 3948980 -7335707 -10572818
41024 -10572818 -3277727 7125719 13261005 13171015 8394383 1688929 -3846943 -6382001
41016 -6382001 -6303220 -5109501 -4350084 -4994975 -5594623 -2278494 5802166 12373558 10626167
41007A0626167p173504k622505N320683N757849o25249l999948q67374K720460
40999I136579K786914K656572M704298M858149r10575r348408j2583932o366872
40991e067275N191296J2322559Q686293j024683n879265k729558K04358k765092
40983H938633m931057J341490R994875Q908121j392198q361567o207148k614056
40975E677093m564896p558759l756553N987144J3487939J3148232O834619L27627
40967B9582446l209116n805377r579720j0419490k642978R023007J1292180J281502
40959A9522454o410075n51124Q717630N751025n145870p129341J245771M895415
40951B0895885j527656o051207j600542K927668L70422k898056j269830n24144
$$ plain form
41007 10626167 3452663 830158 6150841 11908690 11283441 7283493 6416119 9136579
40999 9136579 11923493 14580065 19284363 24142512 23231937 13883529 1299597 -5067275
40991 -5067275 124021 12446580 21132873 20108190 14228925 11499367 11703725 8938633
40983 8938633 4007576 5349066 15343941 24252062 22859864 14498297 8291149 5677093
40975 5677093 1112197 -6446562 -10203115 -4215971 9271968 22420200 29254819 29582446
40967 29582446 26373330 20567953 10988233 568743 -2074235 6948772 18240952 19522454
40959 19522454 13112379 12561255 21278885 27029910 21884040 14754699 16000470 20895885
40951 20895885 19368229 13317022 11716480 14644148 15014570 12116514 10846684 10322540
40943A0322540m443482n283872J217242M823125k287586r771022n123136M801379
40935e744812M983807k460230k343296P532863J2281921L127563j0249190j4290620
40927g161994p455979K156564O832577M133903j994843l886905J133333O213266
40919c0078M672172L05855O654R17870l652546r110122m758149O468302R232742
40910D052700k25027p035382r92149P814330O300966j253303k559185K169743
40902H272693K798036k910502p173473n630325j628687J839545M475181L624151
40894C666619l334200j1156552j0433261n11827R197968J2036314J0380775P856553
40886A7702389L808716j648721n000170n461638o702872q773023n787231L492575
$$ plain form
40943 10322540 5879058 595186 1812428 6635553 4347967 -5423055 -10546191 -5744812
40935 -5744812 -761005 -3221235 -5564531 1968332 14250253 17377816 7128626 -7161994
40927 -7161994 -14617973 -12461409 -5628832 -1494929 -3489772 -7376677 -6243344 -30078
40919 -30078 4642094 4947949 4954603 5872473 2219927 -6890195 -11648344 -5180042 4052700
40910 4052700 3827673 -3207709 -4199858 3614472 9915438 8662135 6102950 8272693
40902 8272693 11070729 8160227 986754 -4643571 -6272258 -4432713 42468 3666619
40894 3666619 332419 -10824133 -21257394 -21769221 -12571253 -534939 9845836 17702389
40886 17702389 21511105 19862384 14862214 9400576 2697704 -6075319 -11862550 -8369975
40878h369975J0263008P514233R04534n4932L430791K812131l048598o410211
40870G040981l447674P34080J437024P61785J771657K806090J458500o07520q84376
40861A1070547o90940k621543n312187m495939J007938O913247P938708L846615
40853A7656446j85152p7144J496553j100292p314119r912798n415169O66207K748281
40844a437187L168349N240469M635725l142815j1335316r390684K95164N334951
40836f631344K617088J191054M163995K722532n917136r150672K065015J6140275
40828G200807J5346387K43969j2628258j2888069m705155L791556Q262957O374382
40820A0998576j580052r295933r169180j351635O943363J0213882P944971J583173
$$ plain form
40878 -8369975 1893033 9407266 10311800 10256868 13687659 16499790 13451192 7040981
40870 7040981 3593307 4327387 5764411 6526196 8297853 11103943 12562443 11954923 11070547
40861 11070547 10379607 7758064 2445877 -2050062 -1042124 5871123 13809831 17656446
40853 17656446 17471294 17394150 18890703 17790411 10476292 563494 -4851675 -4185468 -1437187
40844 -1437187 1731162 6971631 11607356 8464541 -2870775 -12261459 -11966295 -6631344
40836 -6631344 -4014256 -2823202 1340793 4063325 -1853811 -11004483 -8939468 7200807
40828 7200807 22547194 22791163 10162905 -2725164 -7430319 -3638763 4624194 10998576
40820 10998576 9418524 122591 -9046589 -10398224 -3454861 6759021 14703992 16287165
40812A6287165n834439r185441o324702j667894L29422J856452O281705J0587355
40804A2329623J0379142P687829N579843M06665j0187736j6805978r329040M498574
40796D558922O745030m317651j1211780l736080P050476P626053P79457l367234
40788D127193l568205m055108l477484J563515P166910O319742n12859o601470
40780I62234p929936m827000J659376Q733184J0878545O220295L98932j622537
40772A4473093k953711p167051q867975j749591P658131O356191n189190j1589483
40764i029586m105231P313041R391790L647812O18137K407001J537644m811494
40756F969114r604539o842012J02981M605624N582026N877954N981575M157247
$$ plain form
40812 16287165 10452726 1267285 -5057417 -6725311 -6395889 -4539437 1742268 12329623
40804 12329623 22708765 30396594 35976437 36383102 26195366 9389388 60348 4558922
40796 4558922 11303952 6986301 -4225479 -7961559 -911083 6714970 7494427 4127193
40788 4127193 558988 -3496120 -6973604 -5410089 1756821 8076563 7563704 962234
40780 962234 -6967702 -11794702 -10135326 -1402142 9476403 15696698 16095630 14473093
40772 14473093 11519382 4352331 -4515644 -6265235 1392896 7749087 2559897 -9029586
40764 -9029586 -13134817 -5821776 3570014 7217826 7835963 10242964 11780608 6969114
40756 6969114 -2635425 -9477437 -9374456 -4768832 813194 6691148 12672723 16829970
40748A6829970N25729l113391n792517o476933l428344J596792K172437l938822
40740a625079q310295k295384Q586952J0962611L625142j009405K345642L412996
40732A5693180m801046j1927725n996872O741694J0951280M714112n66503R81578
40724A5789698M026136L723856J272097j959000n587687n966591m14579N225989
40716A6109919L088306l878532o022360k623889j680908m555235l764779K531451
40708g96027O711079N108344L004129K924918K67835n249600o132669m18645L399921
40699H819285P35224j428676K112332N400497L045535m2243M99124q74925p661160
40690A0604993j0689789k193877Q255873O258934m875080q900443r64523P123400
$$ plain form
40748 16829970 17355699 14242308 8449791 1972858 -1455486 141306 2313743 -1625079
40740 -1625079 -9935374 -12230758 -3643806 7318805 10943947 9934542 12280184 15693180
40732 15693180 10892134 -1035591 -7032463 -290769 10660511 15374623 14808120 15789698
40724 15789698 19815834 23539690 24811787 22852787 17265100 11298509 10883930 16109919
40716 16109919 19198225 15319693 9297333 6673444 4992536 437301 -3327478 -796027
40708 -796027 5915052 11023396 14027525 16952443 17220278 11970678 5838009 5419364 8819285
40699 8819285 9554509 8125833 10238165 15638662 18684197 18641954 19141078 18266153 10604993
40690 10604993 -84796 -2278673 5977200 12236134 7361054 -1539389 -2503912 4619488
40682D619488N749086j113120n278061m661935j199634L500410P129712O870285
40674A5616231L000649j373221m555998o544855o027071j869339K929699L694285
40666D870380N72182j747878r83063J25530j292171m149207n255773l101256J037401
40657i923855M690448O454181O593302N294283J935956k304836l792877j927388
40649G019214k078899p190417r775661j335897J1883297J4126700K547923p959694
40641G236566o557916n49648m76790l056016K41513O516057N953582j828910p574919
40632i6481o380319k285488J46869J017946K022848L687331N299336M753058Q66225
40623I031325k644930o34784M343894L847398k850919o320645k258843J747343
$$ plain form
40682 4619488 10368574 9255454 3977393 -684542 -1884176 1616234 8745946 15616231
40674 15616231 18616880 17243659 12687661 6142806 115735 -1753604 1176095 4870380
40666 4870380 5442562 3694684 2711621 2837151 1544980 -2604227 -7860000 -10961256 -9923855
40657 -9923855 -5233407 1220774 7814076 13108359 15044315 12739479 8946602 7019214
40649 7019214 4940315 -2250102 -12025763 -13361660 -1478363 12648337 15196260 7236566
40641 7236566 678650 129002 -347788 -3403804 -3162291 3353766 9307348 7478438 -96481
40632 -96481 -6476800 -8762288 -8615419 -7597473 -5574625 -1887294 3412042 8165100 9031325
40623 9031325 6386395 5751611 10095505 13942903 11091984 4771339 2512496 4259839
40615D259839O95834R02916N581672N184902n312342j2277884k934700J1315669
40607G415906J0096941m448513j1669676m153916N165829O885328N668637M750810
40599A9711346m80659q400482q405378Q58513O171254L17608o349438l659023
40591b36259K210443Q19372m974806n167233R70860N666691N491821L971781L596857
40582A2349527K746280R5945k652246k632613J097842N504615N468626K87567
40574B2265543m048176l353714k221450n589628p922257j497834P736979O562694
40566A1932157l487638o274670L330741J0264272L225748p326940o461869K275375
40558G477176N094631N85087r39086L596317O151598K303474k177865j603924
$$ plain form
40615 4259839 4955673 5858589 11440261 16625163 11312821 -965063 -3899763 7415906
40607 7415906 17512847 13064334 1394658 -2759258 2406571 9291899 14960536 19711346
40599 19711346 19230687 10830205 2424827 3283340 9454594 9772202 3422764 -236259
40591 -236259 1974184 2793556 -2181250 -7348483 -6377623 -710932 4780889 8752670 12349527
40582 12349527 15095807 15191752 12539506 9906893 11004735 16509350 21977976 22265543
40574 22265543 18217367 14863653 12642203 7052575 -869682 -2367516 5369463 11932157
40566 11932157 8444519 2169849 5500590 15764862 18990610 11663670 5201801 7477176
40558 7477176 12571807 13156894 12217808 15814125 21965723 24269197 22091332 20487408
40550B0487408J648837K335013n06152m121319n820402m548749j285407J458874
40542I648103K147822J609996O56115j580073m654745m657986J172460Q626922
40534A2968614R191364k09332j1936553j4077025l068257J0999421J4320012N108600
40526B3296844m478364m144722K189091M538208J595957p75498j559638m522382
40518A6139496p770829m906768K505048N026438N11352k036617K144258N555185
40510A7167563J901018k984381j824286J529656j4931l231280J82247Q576971
40502B1302577J1084716K820205q626700j2732241p069188J619432M556970k01189
40494A2754582n117482k238081N079759N623511k983378r430286n126109L077221
$$ plain form
40550 20487408 22136245 24471258 23965106 19843787 14023385 9474636 8189229 9648103
40542 9648103 11795925 13405921 14062036 12481963 7827218 3169232 4341692 12968614
40534 12968614 22159978 21950646 10014093 -4062932 -7131189 3868232 18188244 23296844
40526 23296844 18818480 14673758 16862849 21401057 22997014 22221516 20661878 16139496
40518 16139496 8368667 3461899 5966947 10993385 11504737 9468120 11612378 17167563
40510 17167563 19068581 16084200 14259914 15789570 15774639 12543359 12725606 21302577
40502 21302577 32387293 35207498 26580798 13848557 6779369 8398801 12955771 12754582
40494 12754582 7637100 5399019 10478778 16102289 13118911 3688625 -1437484 1639737
40486A639737M010402j170280l052655J30629J273791k585196n684428k843128
40478h281128L719714Q160517O878757M81688o244110p252264j827961L418848
40470i45939K813185q03161j233217J347984J576150k208734o110938o647236
40462a2211906l586583J830273O812668P042225J860455k514895l46862N107328
40454C992703O323997K619042l20171l87008o91504j683514j16114K900915J324734
40445A3963080n243292q236920k308104N611407N826828j23603k583661J181433
40437H087168L403253j221644o453482l656004M436347O611412n66818p173304
40429C466928m001332M285049O445679Q10535m027340k849630P00568K604782
$$ plain form
40486 1639737 5650139 4479859 1427204 1557833 2831624 246428 -5438000 -8281128
40478 -8281128 -4561414 3599103 10477860 10959548 4715438 -2536826 -4364787 -945939
40470 -945939 1867246 1064085 -169132 1178852 2755002 546268 -5564670 -12211906
40462 -12211906 -15798489 -13968216 -7155548 -113323 1747132 -767763 -1114625 3992703
40454 3992703 10316700 12935742 12615571 12228563 11537059 9853545 9737431 12638346 13963080
40445 13963080 8719788 482868 -1825236 3786171 9612999 9489396 6905735 8087168
40437 8087168 11490421 10268777 3815295 159291 4595638 11207050 10640232 3466928
40429 3466928 -534404 3750645 10196324 11006859 6979519 4129889 4830457 7435239
40421G435239L554300L606692N67678l107032p55898O661791Q489437L84907p016793
40412A9820321m009883K561847Q68993o087134o120545J047151L675243j730574
40404A0025419n267572j386832K223418j110991n842954m328277J364336N249991
40396I26538P115553Q722392P195175N44333n568224n040872j192403j121386
40388A1581106l807817k862542J353185K339033l20447L71816O055500Q675342
40380B3385176L059297m614977o624439m752097m480673m312336J20053N461025
40372G241029M669022K804O02712O200857N581770m272034j0015436j863810R002048
40363A7148962O055109o651084j0225536k45399P162468J723045n322357o85687
$$ plain form
40421 7435239 10989539 14596231 15163909 12056877 11300979 17962770 26452207 26837114 19820321
40412 19820321 15810438 18372285 19241278 13154144 7033599 8080750 11755993 10025419
40404 10025419 4757847 3371015 5594433 4483442 -1359512 -5687789 -4323453 926538
40396 926538 8042091 16764483 23959658 24503991 18935767 13894895 12702492 11581106
40388 11581106 7773289 4910747 6263932 8602965 8282518 8654334 14709834 23385176
40380 23385176 26444473 21829496 15205057 10452960 5972287 1659951 1780004 7241029
40372 7241029 11910051 11912855 12515567 18716424 24298194 20026160 10010724 8146914 17148962
40363 17148962 23204071 16552987 6327451 6082052 13244520 14967565 9645208 8959521
40355H959521R460101J0134211Q43929n893460m911765l248917n229679n814763
40347D299178j893218P25959k564799n792109l86578J1444606J8136982J2648690
40339C6618711l1286r590867j0822235n924556O37208O099180Q471603N652552
40331C1110310j377430o500947m217234K402234M234901j800941p862632n577671
40323A0410590K662377P357441M470567n60323q56851L834623P853036O364437
40315D1535897Q32035k081458K030913R712967J4183857J4453494J5234216J8780089
40307A14682010K4241887L4821014N3466988O7046726M9980694k871695n7707595
40300B83660029p4314007n2291342k6198571j7330948j3312510L51530J3719257
$$ plain form
40355 8959521 18419622 28553833 29397762 23504302 18592537 15343620 10113941 4299178
40347 4299178 2405960 3131919 567120 -5224989 -5611567 5833039 23970021 36618711
40339 36618711 36587425 26996558 16174323 10249767 10886975 16986155 25457758 31110310
40331 31110310 29732880 23231933 19014699 21416933 25651834 23850893 15988261 10410590
40323 10410590 13072967 20430408 24900975 24340652 23483801 27318424 35171460 41535897
40315 41535897 42367932 40286474 42317387 52030354 66214211 80667705 95901921 114682010
40307 114682010 138923897 173744911 227211899 294258625 344239319 341367624 283660029
40300 283660029 209346022 157054680 130856109 113525161 100212651 100564181 114283438
40293A14283438J2094006K828207K402468R509414J2868018J7352193L6912129
40286B08249873O2387897O2330840K4156186k5581149n3169349n4087664m5434502
40279A78852132l7038513k6519735j3441106j348954R270296J6099386R354681
40272A35228187j3292871l2527859k7776993q435742k207134j2215535j2378769
40265B6393284P486420K0918953O490861j5208271j2318391Q787366J6187816
40258E8738038M603839J84977J3410097K2001824J0829321j828988L966498J5702265
40250A27607871R591629r599719j5722968j847015J0527599L979578j3057759
40243A11479216k2888416k1671224j6915126j1983626m172500N384185R857278
$$ plain form
40293 114283438 126377444 129205651 131608119 141117533 153985551 171337744 208249873
40286 208249873 270637770 332968610 357124796 331543647 278374298 224286634 178852132
40279 178852132 141813619 115293884 101852778 100503824 109774120 125873506 135228187
40272 135228187 121935316 89407457 61630464 53194722 50987588 38772053 26393284
40265 26393284 33879704 54798657 61289518 46081247 33762856 42550222 58738038
40258 58738038 63341877 63526854 76936951 98938775 109768096 107939108 111905606 127607871
40250 127607871 137199500 127599781 111876813 110029798 120557397 124536975 111479216
40243 111479216 88590800 66919576 50004450 38020824 33848324 39232509 49089787
40236D9089787O551737K123442L517302P139844L476143p755644j4770791r511908
40228C9859912J139772O217373N610328N013910K640899n902236j3520559q414501
40220C2644898N069421Q993133j482408j0378697n874865K977388L279454k637436
40212C2590888o026003o721464p285837l565049N947017J1198260M411224n740294
40204B4808742o960793k012405q41262k243778J285500P122811P022130L029395
40196C1210340K997152M431963r52264r814054j0913903m255541p3801o2209L429728
40187A5997411R544120P700384l534552j2366636j1681896o597707j687762M660895
40179B034257J0368202Q943644K165199n02449K034703J556436k227805k48197
$$ plain form
40236 49089787 55641524 57764966 61282268 68422112 71898255 64142611 49371820 39859912
40228 39859912 40999684 47217057 52827385 57841295 60482194 54579958 41059399 32644898
40220 32644898 37714319 46707452 45225044 34846347 28971482 31948870 35228324 32590888
40212 32590888 26564885 19843421 12557584 8992535 14939552 26137812 30549036 24808742
40204 24808742 17847949 15835544 14994282 12750504 14036004 21158815 28180945 31210340
40196 31210340 34207492 38639455 37687191 27873137 16959234 12703693 12629892 12567683 15997411
40187 15997411 25541531 33241915 29707363 17340727 5658831 -938876 -2626638 2034257
40179 2034257 12402459 21346103 23511302 23008853 25043556 26599992 24372187 24123990
40171B4123990O643796N531822n280017r972863j262358O131881K13060p826491
40163A8302820l272735P054143P215372j617074n710596j933480J171142N66217
40155B1775809Q35983K160434P81467k97078N766068J6701996K2184213J7206626
40147H7115518N534256p750179j8276675k0656763j4592824r071803j0438259
40140A1863271j0993174j308799J1109614J0669262j178178o650223J212718R265511
40132B3990002P034284K269106M774147Q945124N142496j755091j41430P469946
40124E7728584P227472k771327p287596K948777J6117701J7505318J3397628K1274284
40116A26140841L8292835L7697463M795679l7412433n3219104l7582397j7755723
$$ plain form
40171 24123990 30767786 36299608 31019591 21046728 19784370 25916251 26129311 18302820
40163 18302820 15030085 22084228 29299600 27682526 21971930 20038450 21209592 21775809
40155 21775809 22611792 24772226 25553693 25256615 31022683 47724679 69908892 87115518
40147 87115518 92649774 84899595 66622920 45966157 31373333 22301530 11863271
40140 11863271 870097 -438702 10670912 21340174 20161996 13511773 14724491 23990002
40132 23990002 31024286 33293392 38067539 47012663 52155159 50400068 50258638 57728584
40124 57728584 64956056 62184729 54897133 57845910 73963611 91468929 104866557 126140841
40116 126140841 164433676 202131139 206926818 169514385 116295281 78712884 60957161
40109F0957161j3804938j6510421r677931L326737P757706R55482o404461p040066
40101A9559269k991641K097913O260196O554494J934118k610009k065087O07239
40093B9346492m47794l758669l130670K073357P037037R334525Q964253L951562
40085E3370093n041432r086357p91509J2223047J5161137O581530r56360r45690
40077G0514459j88147l242468l390718M367568J2614422J2288397O390702M959845
40069A04314060J1674237K1930415L0410305L6258507M4055384O0113007Q0687605
40062C89443520Q4172969M8192208j9407005p8439915r4807225p2899413m2267438
40055B13987701k3179119j6608561j6957158j7508220r054042R568264K2376128
$$ plain form
40109 60957161 47152223 30641802 20963871 24290608 32048314 33003796 26599335 19559269
40101 19559269 16567628 18665541 24925737 31480231 33414349 30804340 28739253 29346492
40093 29346492 28898698 25140029 22009359 24082716 31119753 40454278 49418531 53370093
40085 53370093 48328661 39242304 38450795 50673842 65834979 72416509 71460149 70514459
40077 70514459 70326312 67083844 63693126 68060694 80675116 92963513 99354215 104314060
40069 104314060 115988297 137918712 168329017 204587524 248642908 308755915 389443520
40062 389443520 473616489 521808697 502401692 423961777 329154552 256255139 213987701
40055 213987701 190808582 174200021 157242863 139734643 130680601 140248865 162624993
40048A62624993J4424579l145208n307147R397286J5925609L152687o665697O461215
40040A96868317K5357286J8786128j2133074l4999470l0064879j0376493L527744
40033A56965559P530315N430711m720670k2763284l6551051l3794231j8520235
40026E3577114n308983r75241q97979j34222J029734J275278K83240k775066o648954
40017C9424921n678941L124228J2484881J2474795N090814K206248P863198J2297727
40009H9287871P417192r74157l121062j72140j01446l250766k411227L321351
40001H9995616N027206k640490j2719018j5719872j2045926q421767o702488m043000
39993C2730261j292071j938412l246762J207140Q155652N385533q306207j5751215
$$ plain form
40048 162624993 177049572 173904364 168597217 177994503 193920112 197072799 190407102 196868317
40040 196868317 222225603 241011731 228878657 193879187 163814308 153437815 156965559
40033 156965559 164495874 169926585 165205915 142442631 105891580 72097349 53577114
40026 53577114 48268131 47292890 46394911 46260689 47290423 48565701 48848941 46073875 39424921
40017 39424921 33745980 36870208 49355089 61829884 66920698 69126946 76990144 89287871
40009 89287871 96705063 95730906 92609844 92437704 92336258 89085492 86674265 89995616
40001 89995616 95022822 92382332 79663314 63943442 51897516 43475749 36773261 32730261
39993 32730261 31438190 29499778 26253016 27460156 35615808 41001341 32695134 16943919
39985A6943919m739620J1283922J1110169k180016o136991N439573J3288369M605534
39977D9614859o643690l483993P107427P520127k349206q569107p124330n854426
39969C0217661o504742l023668L031227K369392n151811q731101m458078q99800
39961F849080l207678m976680j027969L594714L341476P98613j02411o37743j805601
39952B825801m74826M065002P018150N460310J852382k021338o441234p791342
39944D492905j580095O633841N424931m078740p299420J163347Q319500L872013
39936A6948282l766453k990839K479335L203943J045460K582659M413718j41410
39928B3774695o008432k693826Q043333J3774566Q421688k531116j0794736j0672419
$$ plain form
39985 16943919 12204299 23488221 34598390 32418374 26281383 31720956 45009325 49614859
39977 49614859 42971169 39487176 46594603 54114730 51765524 43196417 36072087 30217661
39969 30217661 23712919 20689251 23720478 26089870 20938059 12206958 7748880 6849080
39961 6849080 3641402 -1335278 -2363247 1231467 4572943 5371556 5269145 4631402 2825801
39952 2825801 2350975 6415977 13434127 18894437 20746819 18725481 12284247 4492905
39944 4492905 2912810 9546651 14971582 10892842 3593422 4756769 13076269 16948282
39936 16948282 13181829 10190990 12670325 15874268 16919728 19502387 23916105 23774695
39928 23774695 17766263 15072437 23115770 36890336 45312024 42780908 31986172 21313753
39920B1313753p89551J0897320J0735723k235163j0163903o87357J2475701R301955
39912E0848478m787725p002130P866537K2364121K5352101K3690477K1606132
39905A39937991J0293017j3098855l3539569l6089952k3867633r790794j205070
39898C2639135M48695m142995q998337o159920J403183J027512r244320j4170318
39890g197365m143010Q100461O023016n493019q224481K028654J1258281Q970979
39882A1323516Q91207k117291J878064O751171P759313O398177P087611J0156553
39874E0128321R503535L27386j1632611j4728602o736401J494515J031820l788085
39866B5599878m106761K51615L357029L816241M983497P300695P433187M008913
$$ plain form
39920 21313753 20524202 31421522 42157245 39922082 29758179 29070822 41546523 50848478
39912 50848478 46060753 39058623 46925160 69289281 94641382 118331859 139937991
39905 139937991 150231008 137132153 103592584 67502632 43634999 33844205 32639135
39898 32639135 33087830 28944835 19946498 13786578 15189761 16217273 6972953 -7197365
39890 -7197365 -11340375 -3239914 2783102 -2709917 -10934398 -8905744 2352537 11323516
39882 11323516 12214723 10097432 11975496 18726667 26485980 32884157 39971768 50128321
39874 50128321 59631856 59959242 48326631 33598029 26861628 28356143 29387963 25599878
39866 25599878 21493117 21744732 25101761 28918002 33901499 41202194 48635381 52644294
39858E2644294p26063m024410m268076j297527L036483P603948J5278300K6938367
39850I5185316L1779583J5080538j8512024m1278370l3119359p369538O989389
39843D8755535K048533n737794n022563l349983q385097j2688637o486575N752720
39835A4886139J1866615Q498577K085881k290722m897503o478330o353750m947058
39827A2369849l524911j792982J047193L897684N265532N780900O420009N804694
39819C5267968K477482j373602k076330r6417j06898m652823j0264213j1317158
39811G858009o511921j64194K719407J706627O50660K373176N004545M709697
39803A8346006Q45742l663991o281673o293671k721449M941461J2625470J3017875
$$ plain form
39858 52644294 51918231 47893821 43625745 42328218 45364701 52968649 68246949 95185316
39850 95185316 126964899 142045437 123533413 82255043 49135684 41766146 48755535
39843 48755535 50804068 45066274 40043711 36693728 28308631 15619994 9133419 14886139
39835 14886139 26752754 35251331 37337212 35046490 30148987 23670657 17316907 12369849
39827 12369849 8844938 7051956 8099149 11996833 17262365 23043265 29463274 35267968
39819 35267968 37745450 36371848 34295518 34199101 34092203 29439380 19175167 7858009
39811 7858009 1346088 1181894 3901301 5607928 6258588 8631764 13636309 18346006
39803 18346006 19191748 15527757 9246084 2952413 230964 5172425 17797895 30815770
39795C0815770M473926n028518p296673m263312l252073m394331r80421P112091
39787A7186459R597212K76426j1729306j2645374k026083P663756P735259J868674
39779A7927023k204325k349179j059321m54571j444196m196166o742959n784873
39771f308567p78958M935456P816133O475112R79657o059737q391899k128967
39763c461770O716387P794491J103905k153124L255054P915387K708172o371057
39755A7507445p819252k454384l07383l554179m613035l80965L064294J413858
39747B856399j975970l356493l201278j252455M622068J1484594J1293342K178223
39739B2648430p010782q173547m215350k827047m961126n311431j352665L520954
$$ plain form
39795 30815770 35289696 30261178 22964505 18701193 15449120 11054789 10074368 17186459
39787 17186459 26783671 27060097 15330791 2685417 659334 8323090 16058349 17927023
39779 17927023 15722698 13373519 12314198 11859627 10415431 6219265 -523694 -6308567
39771 -6308567 -7087525 -2152069 5664064 12139176 13118833 7059096 -1332803 -3461770
39763 -3461770 3254617 11049108 12153013 9999889 13254943 21170330 23878502 17507445
39755 17507445 9688193 7233809 6926426 3372247 -1240788 -1621753 1442541 2856399
39747 2856399 880429 -2476064 -5677342 -6929797 -2307729 9176865 20470207 22648430
39739 22648430 15637648 7464101 3248751 421704 -4539422 -9850853 -11203518 -7682564
39731g682564N101544L102444O96543O92924K265068K293187O54939J087416L966207
39722A2177708K893891n335652j1878864o585299M966679P262043k094698q592561
39714g186753l455662L943808L182940j111125n01707J667206r60385k811815
39706g233493M128113J2068092O220035r920409j5917246l765678J0448603J0638275
39698F666292K111862r02398K234987J518496m606166p001442j880705K901340
39690A042266O27184m219188l848216P92607K046507l195104r945480j2002386
39682b8701810p653755J231717J0874372J5531847J1085165J328426l886892l94763
39674e85693M577016K884542k776157m106890o50542P03594j651976j757542K122354
$$ plain form
39731 -7682564 -2581020 521424 1217967 1910891 4175959 6469146 7124085 8211501 12177708
39722 12177708 15071599 9735947 -2142917 -8728216 -3761537 3500506 1405808 -7186753
39714 -7186753 -10642415 -6698607 -3515667 -4626792 -5128499 -3461293 -4421678 -7233493
39706 -7233493 -3105380 8962712 15182747 5262338 -10654908 -14420586 -3971983 6666292
39698 6666292 8778154 7875756 10110743 11629239 7023073 21631 -1859074 1042266
39690 1042266 1669450 -2549738 -6397954 -5605347 -3558840 -6753944 -16699424 -28701810
39682 -28701810 -36355565 -35123848 -24249476 -8717629 2367536 3695962 -190930 -585693
39674 -585693 3991323 6875865 4099708 -7182 -657724 45870 -1606106 -3363648 -1241294
39665a241294L228281k034192o724154l667805L560849O697907M664413K343342
39657F827347J399072k95937k294771j633615J318393K581269J50258l963702
39649D088314o693948o078431k085419K119257K294370q51333j434174K637103
39641f004261N423230K394810j443748K44081L819897J587274m275880m090838
39633b345435L735397R687004P047073j90640n438985p166358n707165n56188
39625i35297N330338N770679L08586l395543n95683L231530J220631m393605o636620
39616i4984m148350q85151J098841K311086J834830j152995l567229j797179K328757
39607d072374M053922K684158R02647j032803m267272n982707k214573M326771
$$ plain form
39665 -1241294 1986987 -47205 -6771359 -10439164 -6878315 -180408 4484005 6827347
39657 6827347 8226419 7930482 5635711 4002096 5320489 7901758 8052016 4088314
39649 4088314 -2605634 -8684065 -10769484 -8650227 -6355857 -7207190 -8641364 -6004261
39641 -6004261 -581031 1813779 370031 614112 4434009 6021283 1745403 -2345435
39633 -2345435 1389962 11076966 18124039 17933399 12494414 5328056 -379109 -935297
39625 -935297 4395041 10165720 10474306 7078763 6483080 9714610 10935241 6541636 -94984
39616 -94984 -4243334 -5128485 -4029644 -1718558 116272 -1036723 -4603952 -6401131 -4072374
39607 -4072374 -18452 2665706 3568353 2535550 -1731722 -7714429 -9929002 -5602231
39599e602231O828864N132802N399776P553550L337094q344837j4562861n649453
39591e907296Q614367J1214296J200810p326657o601178k281865N00342L933348
39583C346167P189392L228791p465793j2215218m055540O125828N640423j032386
39575G61664j386922M546181O599090K445276j200998k537695n420968p519142
39567c713514k496121N702073N730064k200816n385103L26261M455274J815429
39559D233547J580024Q187430R889792j420505j3409563j1313573j367578K00127
39551c420299o850565r098647k511761L994633N705770O703989P591623L582239
39543E696982l628782n471602n68526K555994k77356k751128L27049M827992M808613
$$ plain form
39599 -5602231 1226633 6359435 11759211 19312761 22649855 14305018 -257843 -5907296
39591 -5907296 2707071 13921367 15122177 7795520 1194342 -1087523 -587181 3346167
39583 3346167 10535559 13764350 6298557 -5916661 -9972201 -3846373 1794050 761664
39575 761664 -625258 3920923 10520013 12965289 11764291 9226596 3805628 -3713514
39567 -3713514 -6209635 -507562 5222502 3021686 -2363417 -2037156 2418118 4233547
39559 4233547 5813571 14001001 23890793 22470288 9060725 -2252848 -3620426 -3420299
39551 -3420299 -10270864 -19369511 -21881272 -17886639 -12180869 -5476880 2114743 5696982
39543 5696982 2068200 -3403402 -3971928 -1415934 -1693290 -4444418 -4117369 710623 5519236
39534E519236N89379l996721o071652l557412L084802P971716N295322j893052
39526F941618n310792l339158j154910J90355M588370J0032969Q244065j514334
39518A8678183q423052m732571L935079P697290M673233l02366k959270j656204
39510A6910322K517868N039996K328903k314753k997976q57149j666499m888588
39502A4072124m860152k198644k549454m174412k25245N928153L425683n480441
39494C937612n508092N493094R986331k88353q742275j121407J0469921Q479235
39486B2706066j507681l803970n32508l239569p327519n33074R767604M785409
39478B0314758j2246008j7588802l850478J0046983J0321000N286725L681001
$$ plain form
39534 5519236 6108615 2111894 -3959758 -7517170 -4432368 3539348 8834670 6941618
39526 6941618 1630826 -1708332 -2863242 -2672887 1915483 11948452 20192517 18678183
39518 18678183 10255131 5522560 9457639 17154929 21828162 21525796 18566526 16910322
39510 16910322 19428190 24468186 26797089 24482336 21484360 20627211 18960712 14072124
39502 14072124 9211972 7013328 4463874 289462 64217 5992370 9418053 3937612
39494 3937612 -1570480 3922614 13908945 13620592 4878317 3756910 14226831 22706066
39486 22706066 21198385 17394415 16861907 13622338 6294819 5761745 15529349 20314758
39478 20314758 8068750 -9520052 -13370530 -3323547 6997453 12284178 15965179
39471A5965179j09426q422931r775512M07548P426925P57196p006757j394721
39463b152499Q689415O262356m602029o072738L438172P534945j194033j0924246
39455I79343r871454j407377M365473L941510J067436K99631K375944L073122
39447D823628j779265p775615m431005Q690613J6569128Q415573n236223p289524
39439A1987310Q12966L843758j653598m046054J456471N443185K610868Q62251
39431B1317157N261279P324209m79322j0926175j2673080o163512K57696K989775
39423F908027L371887J649093r39297J35570M906495M847526m704589j3946440
39415B228272j0631394J785400R107558O600754K419050J833991P22884k900125
$$ plain form
39471 15965179 15855753 7432822 -2342690 -1935142 5491783 6248979 -757778 -2152499
39463 -2152499 6536916 12799272 8197243 2124505 5562677 13097622 11903589 979343
39455 979343 -8892111 -10299488 -5934015 -1992505 -925069 -625438 1750506 4823628
39447 4823628 3044363 -4731252 -9162257 -471644 16097484 24513057 19276834 11987310
39439 11987310 12800276 16644034 14990436 10944382 12400853 17844038 20454906 21317157
39431 21317157 26578436 33902645 33423323 22497148 9824068 3660556 3918252 6908027
39423 6908027 10279914 11929007 10989710 11125280 16031775 20879301 16174712 2228272
39415 2228272 -8403122 -6617722 2489836 9090590 11509640 13343631 14066515 11166390
39407A1166390k857781L891036R262318N168027l537279n744149l66482K964091
39399A9946171q05436m973655k772410R47703k775135j1076500j0647679K800485
39391i356456J5677952J3939485K604243k171350L198609O515374P63153n299835
39383B5871175l020967J706579o69730o848214o534703M22456M568443K274230
39375A7769269n24613m1821J11335k470741l582715O17215O719392P776252J363991
39366B7737564p472090j0053883k365062Q479489R760617j003968j0616555o773329
39358G692783M962402R504709L571157k287618j222129K361253L715018M631699
39350C2929274O305184N375745J061536k222259k761260l945432o020661m320888
$$ plain form
39407 11166390 8308609 12199645 21461963 26629990 23092711 17348562 16982080 19946171
39399 19946171 19140735 14167080 11394670 12342373 9567238 -1509262 -12156941 -9356456
39391 -9356456 6321496 20260981 22865224 20693874 23892483 30407857 31171010 25871175
39383 25871175 22850208 24556787 23887057 17038843 10504140 10926596 15495039 17769269
39375 17769269 17244656 17202835 17314170 14843429 11260714 11877929 18597321 26373573 27737564
39366 27737564 20265474 10211591 7846529 16326018 26086635 25082667 14466112 7692783
39358 7692783 12655185 22159894 25731051 23443433 22221304 24582557 28297575 32929274
39350 32929274 39234458 44610203 45671739 43449480 40688220 36742788 30722127 26401239
39342B6401239J074234L332021M82562n93642L512620O441442L947738J957956
39334D6556170N321629Q038667L593715l154224l931526j6375K216541K573725
39326F1198322M404981O265332N639828N846225R974289J3209939J0745537P812353
39318A25096806J1295291J6589563J4578657P643754O427905J3379780K1373630
39311B16385386K6191507K8384846K5391629J4987437M673617L438442N107943
39304C24560807m606796k3640155l2805711k3406553r594989o683279j1668692
39297B12154632j3645267j0711130o760486k026554L231281M321355N91165J24058
39289A87279054P033832J2344716P305315k041089m464745r10863l06675l171999
$$ plain form
39342 26401239 27475473 30807494 31290056 30696414 34209034 40650476 44598214 46556170
39334 46556170 51877799 59916466 63510181 60355957 56424431 56408056 58624597 61198322
39326 61198322 65603303 71868635 77508463 83354688 93328977 106538916 117284453 125096806
39318 125096806 136392097 152981660 167560317 175204071 181631976 195011756 216385386
39311 216385386 242576893 270961739 296353368 311340805 316014422 319452864 324560807
39304 324560807 319954011 296313856 263508145 240101592 230506603 223823324 212154632
39297 212154632 198509365 187798235 181037749 179011195 182242476 186563831 187154996 187279054
39289 187279054 194312886 206657602 213962917 211921828 207457083 206546220 206239545 203067546
39281B03067546k127486L976840Q657119R721764J1667210J5971705J8781507
39274B69716205J8823054J8463083J6119296O852019p547153j7557645j7928623
39267B86940236j3704328j1746001j2871928j4969989j7251924j8110989j4720365
39260A83564712q334174m703967n919845p273326n738373n453248r748292j3610867
39252A22782620j1069234n708967n544400r816950j0104390m714450k465190q671500
39244F4687539j5506478j2637744k183150M450172K219656k675426l622843k118233
39236C2613493k809930n459122o088638l348445N1775J002474j376716n384273
39228I200618p071958k895662N613473J1748947J0733968M966928l62814m078035
$$ plain form
39281 203067546 200940060 204916900 213574019 223295783 234962993 250934698 269716205
39274 269716205 288539259 307002342 323121638 329973657 322426504 304868859 286940236
39267 286940236 273235908 261489907 248617979 233647990 216396066 198285077 183564712
39260 183564712 175230538 170526571 164606726 157333400 151595027 146141779 136393487 122782620
39252 122782620 111713386 106004419 100460019 90643069 80538679 75824229 73359039 64687539
39244 64687539 49181061 36543317 34360167 38810339 41029995 38354569 34731726 32613493
39236 32613493 29803563 24344441 18255803 14907358 14959133 15961607 14584891 9200618
39228 9200618 2128660 -767002 4846471 16595418 27329386 32296314 31933500 27855465
39220B7855465p581857r413302o854634j793311R65227J219193L234210P286855
39212A4917846P709578J826676m870992o146701l127512j000942j275215j717091
39204F315647j402015j411792j832278j542533j11076K377112N755376Q110773
39196A6259214O448274J734446l5220M135837Q181714M376227n038136r790961
39188B6271395m874206M051197R095752Q008123K259501o214788j3131693j2670345
39180A2794936n055347J216164P8629l311382r10195M953242N382533m280k424028
39171A2720272O02032O24260o309023j0845143n212650K803702K144555k840049
39163f312044j46073Q168641Q665158J97485l024202M187159Q475342J077721
$$ plain form
39220 27855465 20273608 10860306 4005672 2212361 3177588 4396781 7630991 14917846
39212 14917846 22627424 24454100 19583108 13436407 10308895 9307953 8032738 6315647
39204 6315647 4913632 3501840 1669562 127029 15953 2393065 8148441 16259214
39196 16259214 22707488 24441934 24406714 28542551 36724265 41100492 36062356 26271395
39188 26271395 21397189 25448386 34544138 42552261 44811762 38596974 25465281 12794936
39180 12794936 7739589 8955753 9034382 5723000 4812805 9766047 15148580 15144300 12720272
39171 12720272 13322304 13946564 7637541 -3207602 -8420252 -5616550 -3471995 -6312044
39163 -6312044 -6458117 1710524 10375682 10573167 7548965 11736124 20211466 21289187
39155B1289187o264909j192097P660901N190952m532650n768801K032668M457714
39147B2872965k792175q180676n230276j267502j177490R20803P277983Q921958
39139B1345590J080268o684970n316141l6625P62197r2906L139806N713143R08422
39130B0818784m891784p46446Q891227Q524942m032705j2932285p712527K126026
39122A0045232L025935l236174n936973l489022l094612n548901l215711N016277
39114f433949Q557558J331249o141031j148240J0381792J0614458l526502j4675555
39106a040220j0046145J507173N667844L543649M065186N316440o78647j0013772
39098a678492j0632431k216132L857092M163225O062064R582949M977479o751461
$$ plain form
39155 21289187 15024278 13832181 21493082 26684034 22151384 16382583 18415251 22872965
39147 22872965 20080790 11900114 6669838 5402336 4224846 5145649 12423632 21345590
39139 21345590 22425858 15740888 10424747 10388122 11150319 11057413 14197219 19910362 20818784
39130 20818784 15927000 15180554 24071781 32596723 28564018 15631733 7919206 10045232
39122 10045232 13071167 9834993 3898020 408998 -2685614 -8234515 -11450226 -6433949
39114 -6433949 2123609 3454858 -2686173 -3834413 6547379 17161837 13635335 -1040220
39106 -1040220 -11086365 -9579192 -3911348 -367699 3697487 9013927 8335280 -1678492
39098 -1678492 -12310923 -14527055 -10669963 -6506738 -444674 9138275 14115754 7364293
39090G364293r629053K104645J1853828N539453o889664r171802m276236m864188
39082g968724q688833l494374Q795394J2813638M546468k283953J857384Q419938
39074A3996938M924216o867199j3795691p749636N136185J0757023K368411j0448289
39066a678042j2319850k290480M767999M61171m764666J02338P772348N456606
39058b492576k850494l585869K771381L361023m273855r009761n768423j101737
39050b2950311K208525Q936292J6851184J5551988M759847k586322j425348k329471
39042A9016384j0687126j4944772o335428M706917M735081k597452o023132n195765
39034a7325293n404043l459298N313026J3203405R519339r32541m510150k44653
$$ plain form
39090 7364293 -2264760 -160115 11693713 17233166 10343502 1171700 -3104536 -7968724
39082 -7968724 -16657557 -20151931 -11356537 1457101 6003569 3719616 5577000 13996938
39074 13996938 18921154 12053955 -1741736 -9491372 -4355187 6401836 8770247 -1678042
39066 -1678042 -13997892 -16288372 -11520373 -11059202 -15823868 -15721530 -7949182 -2492576
39058 -2492576 -5343070 -8928939 -6157558 -2796535 -7070390 -16080151 -21848574 -22950311
39050 -22950311 -20741786 -11805494 5045690 20597678 25357525 22771203 21345855 19016384
39042 19016384 8329258 -6615514 -12950942 -8244025 -3508944 -6106396 -12129528 -17325293
39034 -17325293 -22729336 -26188634 -20875608 -7672203 1847136 914595 -3595555 -3840208
39026c840208J433330r59207J436727Q158332O633530n793210j3580421n587560
39018a2098687P365411Q594947o45875n818618j427600M023180L388285k19155
39010C161888j305734r4495M22079j99646p95005j356874k293858l149988l507697
39001i119330l074764l20934N798229J1660705J0631931J846667o293539n930729
38993E198236n13920Q3244n860258r389279m507347K897983M184950J77098k065217
38984i794510p32335j06241j822450k993569k925485m132890n398029j427660
38976b9333169P451993J2197714O588855l308773o733005j541750N534708Q842735
38968c00692P952391L920459j934911n710787l383761L299702P976519P416779
$$ plain form
39026 -3840208 -2406878 -3366085 -1929358 6228974 12862504 7069294 -6511127 -12098687
39018 -12098687 -4733276 3861671 3215796 -2602822 -4030422 -7242 3381043 3161888
39010 3161888 1856154 1761659 2183738 1984092 1189087 -167787 -2461645 -5611633 -9119330
39001 -9119330 -12194094 -12515028 -6716799 4943906 15575837 17422504 11128965 5198236
38993 5198236 4684316 4767560 -1092698 -10481977 -14989324 -12091341 -7906391 -7729293 -9794510
38984 -9794510 -10526845 -10633086 -12455536 -15449105 -18374590 -22507480 -27905509 -29333169
38976 -29333169 -21881176 -9683462 -3094607 -6403380 -13136385 -14678135 -9143427 -300692
38968 -300692 7651699 11572158 9637247 3926460 542699 3842401 11818920 19235699
38960A9235699L712776j277796p551300j1719185p717693K851204Q115213R44715
38952F593633q725206o187795O340999J2075466M424808l552978p0706P098920
38944A7997141L971273o594551r487603j681014L296179k678313r735138n983927
38936a0895953M406716Q279720K439502l919908l350974J337644L213745N29863
38928B040355k036794L12221O080686Q476155M052143k174923m163462m249676
38920H336705p828078j1041993m902076P453313J0764300j6768j0236304o695861
38912a4166762L462534N848448L84707l209542k871914k684906q75509N150854
38904h962090P547908j190629j0656772m818308J0457196J3468997J155924n777793
$$ plain form
38960 19235699 22948475 21670679 14119379 2400194 -5317499 -2466295 5648918 6593633
38952 6593633 -2131573 -8319368 -1978369 10097097 14521905 10968927 10898221 17997141
38944 17997141 21968414 15373863 5886260 4205246 7501425 4823112 -4912026 -10895953
38936 -10895953 -6489237 1790483 4229985 310077 -3040897 -1703253 1510492 2040355
38928 2040355 3561 315782 6396468 14872623 18924766 16749843 12586381 8336705
38920 8336705 508627 -10533366 -15435442 -7982129 2782171 2765403 -7470901 -14166762
38912 -14166762 -10704228 -4855780 -4471073 -7680615 -10552529 -13237435 -14112944 -8962090
38904 -8962090 -1414182 -2604811 -13261583 -18079891 -7622695 5846302 7002226 1224433
38896A224433K205004P571683l389064j5984235j1216643L019248O212889j368462
38888a1725147k686630N294800Q406451J833619k291053K385892N712735L35009
38880G265676m964311j369030L945927L02696p533145o660592K922088Q312555
38872B221864L678822k081321N4453O939628R973400O785617J026752m294318
38864B4304897p925833q484146o492712n536449o851389n866676O63836P390655
38856h797817O977657J455041j078158M07235n24340m941090n938916j219870
38848a3660258K558928K158399L336649P969047P225671l203382j1752010o903470
38840a2270426L944005N205253l335184q170307l564205L142466O040546O523651
$$ plain form
38896 1224433 3429437 11001120 7612056 -8372179 -19588822 -16569574 -10356685 -11725147
38888 -11725147 -14411777 -9116977 -710526 1123093 -1167960 1217932 6930667 7265676
38880 7265676 2301365 932335 4878262 5180958 -2352187 -9012779 -6090691 2221864
38872 2221864 5900686 3819365 3873818 10813446 20786846 27572463 28599215 24304897
38864 24304897 16379064 7894918 1402206 -4134243 -10985632 -16852308 -16188472 -8797817
38856 -8797817 -1820160 -365119 -1443277 -1036042 -1560382 -6501472 -12440388 -13660258
38848 -13660258 -11101330 -8942931 -5606282 2362765 9588436 6385054 -5366956 -12270426
38840 -12270426 -8326421 -3121168 -6456352 -14626659 -18190864 -15048398 -9007852 -2484201
38832b484201N003352m1986m314427j448851M940306N007352j484132n636299
38824d58886n316360o375393p827467k053907P963349Q929169m62464m806236
38816a0408195L467885J1792054Q747411J242634p71819j242602o148867q542602
38808a864101j099672P477636N096082l236726m125157J596615J900706m793532
38800I51851p685758k404046K949471J812053k434795l753516n25100N056053
38792f033787Q057211L339730o529276j0206545k175763P153825N668107k075710
38784b802208k920539L377084N401902O76505q11550M751464P593588L62089j0246651
38775E381684j3765365r102524k189096K332585K450680j969378o773727n173412
$$ plain form
38832 -2484201 2519151 2477165 -1837262 -3286113 1654193 6661545 5177413 -458886
38824 -458886 -5775246 -12150639 -19978106 -22032013 -14068664 -5139495 -5601959 -10408195
38816 -10408195 -6940310 4851744 13599155 14841789 14069970 12827368 6678501 -1864101
38808 -1864101 -2963773 4513863 9609945 6373219 2248062 3844677 5745383 951851
38800 951851 -6733907 -9137953 -6188482 -4376429 -6811224 -10564740 -11089840 -6033787
38792 -6033787 2023424 5363154 -1166122 -11372667 -13548430 -6394605 -726498 -2802208
38784 -2802208 -5722747 -2345663 3056239 3732744 2921194 7672658 15266246 15628335 5381684
38775 5381684 -8383681 -17486205 -19675301 -17342716 -14892036 -16861414 -23635141 -28808553
38767b8808553M154175J3815722J5231933P203934l895587j0055400p801208q94730
38759a1049714L673951L716211L075071L439449Q83820n297795p457309p09931
38751i726247P040937N672778j430484l011561K155062M834319J262215k529446
38743D267573k564074j613707p02056L045443P701306O215758j736259p062025
38735G551959m392441N99325J170246j208827k278160k541789l949525m540714
38727i589926j789856K339121L924905K235560k63388r88654P23180K565255R07381
38718F3578l663007m783645R24267O479806L159897n473411p313577K81147O037588
38709d287357J455998o673547o084385M016933J1931065P994003l722457r570716
$$ plain form
38767 -28808553 -24654378 -10838656 4393277 11597211 7701624 -2353776 -10154984 -11049714
38759 -11049714 -7375763 -3659552 -584481 2854968 3738788 -1559007 -9016316 -9726247
38751 -9726247 -2685310 2987468 1556984 -1454577 700485 5534804 6797019 4267573
38743 4267573 1703499 89792 -612264 2433179 10134485 16350243 14613984 7551959
38735 7551959 3159518 3758843 4929089 3720262 1442102 -1099687 -5049212 -9589926
38727 -9589926 -11379782 -9040661 -5115756 -2880196 -3143584 -4132238 -3409058 -843803 63578
38718 63578 -3599429 -8383074 -7458807 -979001 2180896 -3292515 -10606092 -10324945 -4287357
38709 -4287357 -2831359 -9504906 -15589291 -11572358 358707 8352710 4630253 -4940463
38701d940463k407742Q342785P518595m848669j2102072m475542O636557O894143
38693F17592R47934K115597Q192756N616388n805948j1661567o892432k090381
38685h960061k773396j193497N345270O532700j522812n988823J702483R379463
38677B521327K751327j1298106j5343191o875438K031327M644372M421843L420459
38669a3726080j13684l487761j132087M898596O207185J173017k020337K269005
38661e932146Q812943Q643903K19118r039918j0492556k978448N343363N151557
38653b72184l177537r580700o552425K182635P390624N085463j006259m474260
38645a0404643j498682N707529R401350M312022m130838n335018J447207N224321
$$ plain form
38701 -4940463 -7348205 994580 8513175 3664506 -8437566 -12913108 -6276551 617592
38693 617592 1565526 3681123 11873879 17490267 11684319 22752 -6869680 -8960061
38685 -8960061 -11733457 -12926954 -7581684 -1048984 -2571796 -8560619 -6858136 2521327
38677 2521327 5272654 -6025452 -21368643 -28244081 -26212754 -21568382 -17146539 -13726080
38669 -13726080 -13839764 -17327525 -18459612 -13561016 -7353831 -6180814 -8201151 -5932146
38661 -5932146 2880797 11524700 11743818 2703900 -7788656 -10767104 -5423741 -272184
38653 -272184 -3449721 -13030421 -19582846 -17400211 -10009587 -4924124 -5930383 -10404643
38645 -10404643 -11903325 -6195796 3205554 7517576 3386738 -1948280 -501073 4723248
38637D723248l59784o957587l940717N736571R963779L968784n171417r033574
38629a070697o736790l214331k485580l497205j992441K876600N517140J214077
38621i389227n297804n029882J819482N477056J134325m257158k884700L532017
38613a4895891Q133995P695056L718605R4195J428695P730026J0437501J888645
38605B6230827j0992947j2988703k205368O615256L886740k570992k717294J025952
38597F283471K001709P87636k307k154284n183876l589904J718138Q77089p789734
38588g052062j1052261j344061R332148Q251273J480849M16925J727733k631806
38580h71262o817685j144151Q236040Q714753L067651L034803P476673O206824
$$ plain form
38637 4723248 4363464 -2594123 -6534840 -798269 9165510 13134294 7962877 -1070697
38629 -1070697 -7807487 -11021818 -13507398 -17004603 -18997044 -16120444 -10603304 -9389227
38621 -9389227 -14687031 -19716913 -17897431 -12420375 -11286050 -15543208 -18427908 -14895891
38613 -14895891 -6761896 933160 4651765 4745960 6174655 13904681 24342182 26230827
38605 26230827 15237880 2249177 43809 6659065 10545805 7974813 5257519 6283471
38597 6283471 8285180 9072816 9070509 6916225 1732349 -1857555 -139417 737672 -7052062
38588 -7052062 -18104323 -19448384 -10116236 -1864963 -384114 32811 1760544 -871262
38580 -871262 -7688947 -8833098 -597058 8117695 11185346 14220149 21696822 27903646
38572B7903646K06884j394568L24152j769998l564499K837824J0052255P003148
38564D1598844M120048J9263729M0539392L4711209k510289l5538555l8083034
38557F4101344k4175663j6731529j3533499l914531M667762M54234q727145p866453
38549e725480Q44045N539230N555451O192471L381977p032625j4075391n862548
38541a1182870Q182701R423135j299082p240084l823121k022287n157468l680455
38533a6799531M552454Q371444K644509l273983k320788M9123j064907n80524
38525h422203N049401Q918430N132236n39751m23625K563159J064769m254772
38517I087644p013366n452868k859227r96207L63311L47998q44335J56524M352075
$$ plain form
38572 27903646 28110530 26715962 27040114 25270116 21705617 24543441 34595696 41598844
38564 41598844 45718892 64982621 105522013 140233222 137722933 102184378 64101344
38557 64101344 39925681 23194152 9660653 5746122 10413884 10868118 2140973 -5725480
38549 -5725480 -4881435 657795 6213246 12405717 15787694 8755069 -5320322 -11182870
38541 -11182870 -3000169 6422966 5123884 -2116200 -5939321 -7961608 -13119076 -16799531
38533 -16799531 -12247077 -3875633 -1231124 -4505107 -6825895 -6776772 -7841679 -8422203
38525 -8422203 -3372802 5545628 10677864 10138113 9714488 12277647 13342416 9087644
38517 9087644 2074278 -3378590 -6237817 -7234024 -6870713 -6522715 -7367050 -7210526 -2858451
38508b858451O337298K021627l133882j208637N132067N434503k727559r592918
38500e95952p319551l29573K971054K345971L153136N675883M632637j312560
38492I221045o238962n054854l95516J357602j447963l955537j055215O025718
38484a543682J0076471N549296m255172r828072o450467L69441K966438J428445
38476a687302Q08109J765072J019125m89874J744020O596298P367908K822783
38468A9946139m24967R38100K512288K033825L240421N781409L932799J911007
38460C9871021J4593693M0102635M7705905J4488667l5768191n5889513l4804742
38453C0299475p605036l400962j0802105o777637N184133O256307m326305j0065755
$$ plain form
38508 -2858451 3478847 5500474 2366592 1157955 6290022 11724525 8996966 -595952
38500 -595952 -7915503 -8245076 -5274022 -2928051 225085 5900968 10533605 9221045
38492 9221045 2982083 -2072771 -2468287 -1110685 -2558648 -6514185 -7569400 -1543682
38484 -1543682 8532789 14082085 9826913 -1159 -6451626 -6082185 -3115747 -1687302
38476 -1687302 -879193 885879 1905004 1415130 3159150 9755448 17123356 19946139
38468 19946139 19521172 20459272 22971560 25005385 28245806 34027215 37960014 39871021
38460 39871021 54464714 94567349 142273254 156761921 120993730 65104217 30299475
38453 30299475 22694439 19293477 8491372 1713735 6897868 13154175 8827870 -1237885
38445a237885m703947J342907P34401j457090k33065P82323k381441o248706n046059
38436a8448562J450717Q206176J0081114N718576j265771n020637l255535P39936
38428a793986L156511M110114N132786N588849M310323J760633j776533o655067
38420A3833630j0472434q837139k215188L018733L366548K367635K676581J117162
38412D855528l192044l405282M538110J2171545Q712852k915529r808931o610282
38404D345967k27386K077174Q26742m2788R92990K611951J833322l410481r355382
38395c47891p626252L302074J2290805Q662621k665879q025978l977808P35592
38387B347284O84915J2162K237261M279822L425453J614764l7917l416022p744883
$$ plain form
38445 -1237885 -5941832 -4598925 -3864524 -5321614 -5554679 -4772356 -7153797 -13402503 -18448562
38436 -18448562 -16997845 -8791669 1289445 7008021 5742250 721613 -2533922 -1793986
38428 -1793986 1362525 5472639 10605425 16194274 20504597 22265230 20488697 13833630
38420 13833630 3361196 -5475943 -7691131 -4672398 -1305850 1061785 3738366 4855528
38412 4855528 1663484 -1741798 2796312 14967857 23680709 20765180 10956249 4345967
38404 4345967 4118581 6195755 7022497 6979709 7972699 10584650 12417972 9007491 -347891
38395 -347891 -7974143 -4672069 7618736 16281357 13615478 5589500 1611692 2347284
38387 2347284 3032199 3044361 5281622 9561444 12986897 14601661 14563744 11147722 3402839
38378C402839q944056o337236k797373K208700J0504578J5595213P370589j0019876
38370A0983378j8099517q825852L085514K351088m271964j315292Q683989R376165
38362A967509k055644r914071m458780M654830N340616L09357j305901L60976
38354e101108q88324m331547l362696K381203N225694P34076n924884o877103
38346a8144689n51890P761582J1378618P356241j318759q068895q995174o327556
38338a6910522l935024j674540K080977M778370K737801j037430L45760O078874
38330g535734P217211R04867l880402m92552M271706J917814k663214J76305O406894
38321F322895L261283q551127j3231400l759727P253107P193313R05806p89332
$$ plain form
38378 3402839 -5541217 -11878453 -14675826 -12467126 -1962548 13632665 21003254 10983378
38370 10983378 -7116139 -15941991 -12856477 -10505389 -14777353 -16092645 -7408656 1967509
38362 1967509 -88135 -10002206 -14460986 -9806156 -4465540 -4156183 -5462084 -5101108
38354 -5101108 -5989432 -10320979 -13683675 -11302472 -6076778 -5342702 -11267586 -18144689
38346 -18144689 -18696579 -10934997 443621 7799862 6481103 -1587792 -10582966 -16910522
38338 -16910522 -20845546 -22520086 -20439109 -15660739 -12922938 -13960368 -13614608 -7535734
38330 -7535734 -318523 586344 -3294058 -3786610 485096 2402910 -260304 -83999 6322895
38321 6322895 9584178 1033051 -12198349 -15958076 -8704969 -1511656 -605850 -1395182
38313a395182J080946p04487m167474k005355L563325L529476j604924j397880
38305c101555O970004J2549101O534682m964959j0124270o866543k540233j997443
38297c541216k662825p27839L034612N327402N403993N382719N843717M044009
38289B2104572j443076o634399o639769l027409j444815k279829n94439L578964
38281C619800L459615k400795n475171r68392K878447j867972q396565n652980
38273a4804013L174831O314030L243858L560144P732760N713095l400148p093175
38265D441382k23321N561751J433819l779539N00250P714792M933598n585339
38257A4997393j0314558n748469j544297l239737m858182j035922M078881M408344
$$ plain form
38313 -1395182 -314236 -1018723 -5186197 -7191552 -3628227 -98751 -1703675 -3101555
38305 -3101555 3868449 16417550 22952232 17987273 7863003 996460 -1543773 -3541216
38297 -3541216 -6204041 -6931880 -3897268 1430134 6834127 12216846 18060563 22104572
38289 22104572 20661496 14027097 7387328 4359919 2915104 635275 40836 3619800
38281 3619800 7079415 4678620 -796551 -1764943 1113504 -754468 -9151033 -14804013
38273 -14804013 -11629182 -5315152 -2071294 1488850 9221610 14934705 11534557 4441382
38265 4441382 4218061 9779812 11213631 7434092 7934342 15649134 20582732 14997393
38257 14997393 4682835 -1065634 -2609931 -5849668 -10707850 -11743772 -7664891 -3256547
38249c256547J050588r51190l47446L6702j617198l817193l814298q09668K496377
38240a1029873K058641k628020o738493n093880J570008P060995O331293M83056
38232g986273m726452m917866j660077j87415j941621j995216L211427Q677030
38224a1526463P081794L40046k625618O07413L471942K809449L591521P216307
38216A0966391N795014m356554j2823717q795269K147653O114238J170713k172182
38208a953713J590595O500425O087099R80854n017718q280997n199284L002192
38200b290547O649542j337444j1966516r701470M007941J0543540J311823r102703
38192a1885834n063014P098663R849384J36222q598773o601354J575550O528454
$$ plain form
38249 -3256547 -2205959 -3157149 -3504595 -3467893 -5085091 -8902284 -12716582 -13526250 -11029873
38240 -11029873 -8971232 -11599252 -18337745 -23431625 -21861617 -14800622 -8469329 -7986273
38232 -7986273 -12712725 -17630591 -19290668 -19478083 -21419704 -23414920 -20203493 -11526463
38224 -11526463 -4444669 -4104623 -6730241 -6122828 -2650886 158563 3750084 10966391
38216 10966391 16761405 12404851 -418866 -9214135 -7066482 -952244 218469 -1953713
38208 -1953713 -363118 6137307 12224406 13205260 8187542 -93455 -5292739 -2290547
38200 -2290547 4358995 3021551 -8944965 -18646435 -14638494 -4094954 -2783131 -11885834
38192 -11885834 -16948848 -9850185 -801 135421 -8463352 -15064706 -13489156 -6960702
38184f960702N178008Q39906k168408k276150j631549l124712n322037l337119
38176a8802763L321946Q200347O467362J404085j550442k078824j684697R21044
38168c801942M915365M002563l862895q920209j825129J0663362J3524726M576307
38160A9272148m220873n409518l107677j002943K700885N426967j55734j0831916
38152B671339j1405562K567639J3885012P559477n888165o341306M906113Q172406
38144A6126953l583667j5226596j3321232l320066L151851M937571O751600P605340
38136C121754L547842l420757p418053o626789l259647J261042N739106O971181
38128h4321L524085p98578k224346k872705n880134p726033k667144O513672J0234881
$$ plain form
38184 -6960702 -1782694 -942788 -3111196 -5387346 -7018895 -10143607 -15465644 -18802763
38176 -18802763 -15480817 -7280470 -813108 590977 -959465 -3038289 -4722986 -3801942
38168 -3801942 1113423 5115986 1253091 -7667118 -9492247 1171115 14695841 19272148
38160 19272148 15051275 9641757 6534080 5531137 8232022 13658989 13503255 2671339
38152 2671339 -8734223 -6166584 7718428 15277905 9389740 3048434 7954547 16126953
38144 16126953 12543286 -2683310 -16004542 -19324608 -16172757 -11235186 -4483586 3121754
38136 3121754 6669596 3248839 -4169214 -10796003 -14055650 -12794608 -7055502 -84321
38128 -84321 3439764 2641186 416840 -2455865 -8335999 -16062032 -18729176 -12215504 -1980623
38119a980623N583964M17366J082623L158895j54330n877687n351129J482417
38111a638504M457995k125331j0362097r311043p6448O345500M379543k98897
38103h629282r75429J292662K355895K253948K696192K112048n65257j044226
38095e03449L937958Q155873K898158q215798j1443754k141968P811902O475386
38087F974308k494909o941655k580896M649839P886801M385569m627343j2760632
38079e508918j1314065k07276Q311364M861177k705394n00774R172411J0190868
38071A2299393k168238j2689269q468759K729203N700270J59455k144763K120897
38063b461811L471575l561526j0424566o667132M786063J1387723P413631R3175
$$ plain form
38119 -1980623 3603341 4020707 5103330 8262225 8107895 2230208 -3120921 -1638504
38111 -1638504 2819491 694160 -9667937 -18978980 -19055428 -12709928 -8330385 -8629282
38103 -8629282 -9604711 -8312049 -5956154 -3702206 -1006014 1106034 540777 -503449
38095 -503449 3434509 11590382 14488540 6272742 -5171012 -7312980 498922 6974308
38087 6974308 4479399 -2462256 -5043152 -393313 7493488 11879057 7251714 -5508918
38079 -5508918 -16822983 -17030259 -8718895 -3857718 -6563112 -7063886 2108525 12299393
38071 12299393 10131155 -2558114 -11026873 -8297670 -2597400 -2437945 -4582708 -2461811
38063 -2461811 1009764 -2551762 -12976328 -19643460 -14857397 -3469674 3943957 4037132
38055D037132j529865J563643J685862l203963o436197k799447L811172O431330
38047C559667M469097K246272J301696R6665p20287M60568P96960l697543r482481
38038i69386q459049r27379L468509P30562j273462L091948O751397J980272n477283
38029a083871n365212R2426Q33740l009142j839237N000798O299723j950075q242463
38020i263313l337689N111281N062701j693787m700454j958629j07579j031516
38012a1918985l44045J771833J16579l915124k003938O118060Q618956p92352
38004b349016j0777930p323777N997025J3516773R273911J853486j267790k274806
37996F647876l949443l223364J208893L778014Q11877k735385j899217l41950
$$ plain form
38055 4037132 2507267 4070910 5756772 2552809 -3883388 -6682835 -2871663 3559667
38047 3559667 8028764 10275036 11576732 11673397 10953110 11413678 12210638 8513095 -969386
38038 -969386 -9428435 -10355814 -6887305 -6156743 -7430205 -4338257 2413140 4393412 -1083871
38029 -1083871 -6449083 -6356657 -5522917 -8532059 -10371296 -5370498 929225 -1020850 -9263313
38020 -9263313 -12601002 -7489721 -2427020 -4120807 -8821261 -10779890 -10887469 -11918985
38012 -11918985 -12263030 -10491197 -10374618 -14289742 -16293680 -10175620 -1556664 -2349016
38004 -2349016 -13126946 -20450723 -14453698 -936925 8336986 10190472 8922682 6647876
37996 6647876 2698433 -524931 683962 4461976 5273853 2538468 639251 297301
37988B97301k636888m237410Q94430P346842N003697l256227m064071M679749
37980D027423Q419679j800010j4074952j2499050k83625O230881J770376k873944
37972a1083222K85134M916522K001605n859212q486520k291366N763680P669662
37964g083717L668936O93273L030474O672624M624233k930231p474045l039900
37956a838353N370272Q035250K597179m725574q171886p314637l825052O46596
37948i226205K931397N43223l227560k023686L859483O261270P25773o269356
37940f425661o066123P19530O614088P616137N490637K261140j488125l782536
37932D939087k400303J011209K577358J949485J842870J898824j480044p808914
$$ plain form
37988 297301 -2339587 -6576997 -5682567 1664275 6667972 3411745 -652326 4027423
37980 4027423 12447102 10647092 -3427860 -15926910 -16210535 -9979654 -8209278 -11083222
37972 -11083222 -10798088 -5881566 -3879961 -9739173 -18225693 -20517059 -14753379 -7083717
37964 -7083717 -3414781 -2721508 308966 6981590 11605823 8675592 1201547 -1838353
37956 -1838353 3531919 11567169 14164348 9438774 1266888 -6047749 -9872801 -9226205
37948 -9226205 -6294808 -5751585 -8979145 -11002831 -7143348 -882078 -156305 -6425661
37940 -6425661 -12491784 -11772254 -5158166 2457971 7948608 10209748 8721623 4939087
37932 4939087 2538784 3549993 6127351 8076836 9919706 11818530 10338486 2529572
37924B529572j0507418n338801L157468P305884N471578J819036q43858l337232
37916B56229n664191m873804O73773P356685R162168M280673k711021n849738
37908B630774m148883j762535j912554k707107o88396K995618L214341j963941
37900d342683p736747q012112k575163L118736M261040J041023k714195l605608
37892b0565709j316480J824341L596186M074839M650415N377785M755948K261050
37884D658375m14277j128266O28988L050600K267648m875132j5103659j7813577
37876b8729300o070435J1316959J6538185M931304p383770m303836Q608276J2504268
37868G411651J079398j2913510j6152406q963338P43039P742470R629338N085440
$$ plain form
37924 2529572 -7977846 -13316647 -10159179 -2853295 2618283 4437319 3593461 256229
37916 256229 -5407962 -10281766 -9607993 -2251308 6910860 11191533 8480512 2630774
37908 2630774 -1518109 -3280644 -5193198 -7900305 -8588701 -5593083 -2378742 -4342683
37900 -4342683 -12079430 -20091542 -22666705 -19547969 -15286929 -14245906 -16960101 -20565709
37892 -20565709 -21882189 -20057848 -16461662 -12386823 -7736408 -2358623 2397325 4658375
37884 4658375 4244098 3115832 3744820 6795420 9063068 4187936 -10915723 -28729300
37876 -28729300 -34799735 -23482776 -6944591 -2013287 -9397057 -13700893 -5092617 7411651
37868 7411651 8491049 -4422461 -20574867 -29538205 -28795166 -21052696 -11423358 -6337918
37860f337918k368943m892409J37949N832245N399374J108647r13940J67429J214834
37851f52732J180406M34593k011768n351843n182096l39332L009492L17406l286483
37842a1882357j454122J993741j48886m496349j874605N830263P079688m2293
37834d994920l846553J541460O281487J750664m618939j912928N957227O828073
37826F985571m30607n730311m191766q25482O43606K232173L581722J70105o809670
37817d374659q360950r60646N931649K669652o043231p670154J32756O696732
37809a1978851L863863l180701l852947L679080J0666536Q795195l17348p436299
37801B38528o154702L82252L742832K17436n547523p213367m028198O66250N064046
$$ plain form
37860 -6337918 -8706861 -13599270 -13461321 -7629076 -2229702 -1121055 -2034995 -1867566 -652732
37851 -652732 527674 962267 -1049501 -6401344 -11583440 -11922772 -8913280 -8595874 -11882357
37842 -11882357 -13336479 -11342738 -11491624 -15987973 -17862578 -12032315 -4952627 -4994920
37834 -4994920 -8841473 -7300013 -1018526 732138 -3886801 -5799729 157498 6985571
37826 6985571 6554964 824653 -3367113 -4192595 -3548989 -1316816 2264906 2435011 -4374659
37817 -4374659 -12735609 -13696255 -7764606 -5094954 -11138185 -18808339 -18675583 -11978851
37809 -11978851 -8114988 -11295689 -15148636 -11469556 -803020 7992175 7674827 238528
37801 238528 -5916174 -5533922 -1791090 -1573654 -7121177 -14334544 -18362742 -17696492 -12632446
37792a2632446Q653959Q329382J168685q169347r664453j040699P217150N300867
37784h36902k312100l952680J721589M531737q25226o681694m457184K630601
37776a0181859M836104m66779o379958n990834K52083O211601O393715R67804
37768d358123m445225m988075k175517p06736r08001N73345L103203K341322p19696
37759a2283503L02439N088901M337940m526060r523051j238997J1127746J2713382
37751E998797M970261P95291K537244Q39580n923366p710701r22815M707542K417984
37742G709817j545867l44561K810484L285421L354688M286070N52761r004620
37734A1104193j3658970n154666P636841R727884P28713o467076m495583J583271
$$ plain form
37792 -12632446 -3978487 4350895 5519580 -2649767 -12314220 -13354919 -6137769 -836902
37784 -836902 -3149002 -7101682 -5380093 -848356 -1673582 -8355276 -12812460 -10181859
37776 -10181859 -5345755 -5812534 -12192492 -18183326 -17931243 -11719642 -5325927 -4358123
37768 -4358123 -8803348 -13791423 -15966940 -16673676 -17581677 -17008332 -13905129 -11563807 -12283503
37759 -12283503 -11981064 -6892163 -2554223 -7080283 -16603334 -17842331 -6714585 5998797
37751 5998797 10969058 11764349 14301593 15141173 9217807 1507106 584291 5291833 7709817
37742 7709817 6163950 5819389 8629873 11915294 15269982 19556052 20108813 11104193
37734 11104193 -2554777 -7709443 -72602 9655282 10383995 3916919 -578664 1004607
37726A004607M746062L676592j13011m730297o615201l184429K443321M379946
37718A607590J785526o66414J41020K455253L281767J800293p49103k254527j606413
37709E794992p02788k428736n688746o090106k699822Q02216L014809O198339
37701a799842Q679912M646108m173537o598916J093107O548961k39439r544780
37693a388426o505648M506859O790682j415987n040169J764165O076384j515439
37685C272421j0920201q399462K903790R095371N323494n96873j047662L003068
37677B633946N826365M118886o3191k009924m25554L94117k837461n999839l205253
37668a567908L028602M681441Q34192j120800J983152M205684J105728l047853
$$ plain form
37726 1004607 5750669 9427261 9314250 4583953 -2031248 -5215677 -2772356 1607590
37718 1607590 3393116 2726702 2867722 5322975 8604742 10405035 9655932 7401405 5794992
37709 5794992 5092204 2663468 -3025278 -9115384 -11815206 -11012990 -7998181 -1799842
37701 -1799842 6880070 11526178 7352641 753725 1846832 8395793 8156354 -1388426
37693 -1388426 -7894074 -3387215 3403467 1987480 -3052689 -1288524 4787860 3272421
37685 3272421 -7647780 -16047242 -13143452 -4048081 1275413 678540 -369122 2633946
37677 2633946 8460311 12579197 12516006 10506082 10080528 10474645 7637184 1637345 -1567908
37668 -1567908 1460694 6142135 6976327 5855527 7838679 12044363 13150091 10102238
37660A0102238l021976o37430k41676j757095k737312k766727k172220n44228
37652c776426R46945L35273n73153J760251M923366K621050l619982m181438L179645
37643A615531P506196P84876r218250j0655866m407398L55050J071276J720121
37635a1228464K423385K18066k303735M5476M354147K336125n497318q281028
37627a7933346l27109R766921R860710q85290j1659403j1689254j80102J3380677
37619i666196J7928609J1243488J153639m597043o440856q058876q043840k987645
$$ plain form
37660 10102238 7080262 6442832 6201156 4444061 1706749 -1059978 -3232198 -3776426
37652 -3776426 -2829481 -2494208 -3067361 -1307110 3616256 6237306 2617324 -1564114 1615531
37643 1615531 9121727 9906603 688353 -9967513 -14374911 -14019861 -12948585 -11228464
37635 -11228464 -8805079 -8587013 -10890748 -10845272 -6491125 -4155000 -9652318 -17933346
37627 -17933346 -18260455 -8493534 1367176 481886 -11177517 -22866771 -23046873 -9666196
37619 -9666196 8262413 19505901 20659540 16062497 9621641 1562765 -6481075 -9468720
$$ [...]
##END NTUPLES=NMR SPECTRUM
##END=
