##TITLE=31Pdec_SR160_oilEtAc2
 , 24 sc
 20.1.2023
##JCAMPDX= 6.0         $$ Bruker NMR JCAMP-DX V2.0
##DATA TYPE= NMR SPECTRUM
##DATA CLASS= NTUPLES
##ORIGIN= UXNMR, Bruker Analytische Messtechnik GmbH
##OWNER= root
$$ XWIN-NMR		Version 3.5
$$ Fri Jan 20 16:24:26 2023 Russian Standard Time (UT+4h)  she@DPX200
##.OBSERVE FREQUENCY= 81.013821
##.OBSERVE NUCLEUS= ^31P
##.ACQUISITION MODE= SIMULTANEOUS
##.ACQUISITION SCHEME= undefined
##.AVERAGES= 24
##.DIGITISER RES= 16
##SPECTROMETER/DATA SYSTEM= spect
##.PULSE SEQUENCE= zgpg30
##.SOLVENT NAME= DMSO
##.SHIFT REFERENCE= (INTERNAL, DMSO, 0, 248.564)
##AUDIT TRAIL= $$ (NUMBER, WHEN, WHO, WHERE, WHAT)
$$ ##TITLE= Audit trail, XWIN-NMR		Version 3.5
$$ ##JCAMPDX= 5.01
$$ ##ORIGIN= Bruker BioSpin GmbH
$$ ##OWNER= she
$$ F:/spectra/data/she/nmr/P31/1/pdata/1/auditp.txt
$$ ##AUDIT TRAIL=  $$ (NUMBER, WHEN, WHO, WHERE, WHAT)
(   1,<2023-01-20 16:23:30.00 +0400>,<she>,<DPX200>,
      <created by zg, POWCHK disabled, PULCHK disabled
       configuration hash MD5:
       00 E9 B6 7A A2 85 ED C7 34 08 36 98 17 FE 4E 26
       data hash MD5: 32K
       3D 56 A8 9D D1 E1 14 57 19 24 DA A2 AE 2E 23 F9>)
(   2,<2023-01-20 16:23:32.53 +0400>,<she>,<DPX200>,
      <Start of raw data processing
       efp BC_mod = 2 LB = 1 FT_mod = 6 PKNL = 1 PHC0 = -11036.38 PHC1 = 195.6578 SI = 64K 
       data hash MD5: 64K
       E8 78 D2 3B 83 21 03 EE B5 F4 7B 92 2B F7 25 4A>)
(   3,<2023-01-20 16:23:45.56 +0400>,<she>,<DPX200>,
      <pk PHC0 = 13.48166 PHC1 = 0 
       data hash MD5: 64K
       BF 2F C8 57 79 E4 60 48 88 68 AF 9F EB EC EE EA>)
(   4,<2023-01-20 16:23:48.90 +0400>,<she>,<DPX200>,
      <abs ABSG = 5 
       data hash MD5: 64K
       24 82 76 34 54 4A 36 E3 AA 9A AE 28 D4 69 D6 07>)
$$ ##END=
$$ 
$$ hash MD5
$$ 9D AE 16 3A BF 1B 21 59 74 6B AC 36 DE 6B 5B 0E
##$RELAX= 
##$RELAX= 
##$RELAX= 
##$RELAX= 
##$RELAX= 
##$RELAX= 
##$RELAX= 
##$RELAX= 
##$RELAX= 
$$ Bruker specific parameters
$$ --------------------------
##$DU= <F:/spectra>
##$EXPNO= 1
##$NAME= <P31>
##$PROCNO= 1
##$TYPE= <nmr>
##$USER= <she>
##$AMP= (0..31)
100 100 100 100 100 100 100 100 100 100 100 100 100 100 100 100 100 100 
100 100 100 100 100 100 100 100 100 100 100 100 100 100 
##$AQSEQ= 0
##$AQ_mod= 1
##$AUNM= <au_zg>
##$AUTOPOS= <>
##$BF1= 81.014009
##$BF2= 200.13
##$BF3= 200.13
##$BF4= 200.13
##$BF5= 200.13
##$BF6= 200.13
##$BF7= 200.13
##$BF8= 200.13
##$BYTORDA= 1
##$CFDGTYP= 0
##$CFRGTYP= 5
##$CHEMSTR= <none>
##$CNST= (0..31)
1 1 145 1 1 1 1 1 1 1 1 1 1 1 1 1 1 1 1 1 1 1 1 1 1 1 1 1 1 1 1 1 
##$CPDPRG= <waltz16>
##$CPDPRG1= <>
##$CPDPRG2= <waltz16>
##$CPDPRG3= <>
##$CPDPRG4= <mlev>
##$CPDPRG5= <mlev>
##$CPDPRG6= <mlev>
##$CPDPRG7= <mlev>
##$CPDPRG8= <mlev>
##$CPDPRGB= <>
##$CPDPRGT= <>
##$D= (0..31)
0 1 0 0 0 0 0 0 0 0 0 0.03 2e-05 3e-06 0 0 0 0 0 0 0 0 0 0 0 0 0 0 0 0 
0 0 
##$DATE= 1674217409
##$DBL= (0..7)
120 120 120 11 120 120 24 19 
##$DBP= (0..7)
150 150 150 150 150 150 150 150 
##$DBP07= 0
##$DBPNAM0= <>
##$DBPNAM1= <>
$$ [...]
##$SUBNAM3= <"">
##$SUBNAM4= <"">
##$SUBNAM5= <"">
##$SUBNAM6= <"">
##$SUBNAM7= <"">
##$SUBNAM8= <"">
##$SUBNAM9= <"">
##$SW= 501.771253377433
##$SWIBOX= (0..15)
0 1 3 0 0 0 0 0 0 0 0 0 0 0 0 0 
##$SW_h= 40650.406504065
##$TD= 32768
##$TD0= 1
##$TE= 0
##$TE2= 300
##$TE3= 300
##$TEG= 300
##$TL= (0..7)
0 120 53 12 22 120 120 120 
##$TP= (0..7)
150 150 150 150 150 150 150 150 
##$TP07= 0
##$TPNAME0= <>
##$TPNAME1= <>
##$TPNAME2= <>
##$TPNAME3= <>
##$TPNAME4= <>
##$TPNAME5= <>
##$TPNAME6= <>
##$TPNAME7= <>
##$TPOAL= (0..7)
0.5 0.5 0.5 0.5 0.5 0.5 0.5 0.5 
##$TPOFFS= (0..7)
0 0 0 0 0 0 0 0 
##$TUNHIN= 0
##$TUNHOUT= 0
##$TUNXOUT= 0
##$USERA1= <user>
##$USERA2= <user>
##$USERA3= <user>
##$USERA4= <user>
##$USERA5= <user>
##$V9= 5
##$VALIST= <valist>
##$VCLIST= <CCCCCCCCCCCCCCC>
##$VD= 0
##$VDLIST= <DDDDDDDDDDDDDDD>
##$VPLIST= <PPPPPPPPPPPPPPP>
##$VTLIST= <TTTTTTTTTTTTTTT>
##$WBST= 1024
##$WBSW= 4
##$XGAIN= (0..3)
0 0 0 0 
##$XL= 0
##$YL= 0
##$YMAX_a= 3670
##$YMIN_a= -4051
##$ZGOPTNS= <>
##$ZL1= 120
##$ZL2= 120
##$ZL3= 120
##$ZL4= 120
##$ABSF1= 248.5645
##$ABSF2= -253.2056
##$ABSG= 5
##$ABSL= 3
##$ALPHA= 0
##$AQORDER= 0
##$ASSFAC= 0
##$ASSFACI= 0
##$ASSFACX= 0
##$ASSWID= 0
##$AUNMP= <proc_1d>
##$AZFE= 0.1
##$AZFW= 0.5
##$BCFW= 0
##$BC_mod= 2
##$BYTORDP= 0
##$COROFFS= 0
##$CY= -3
##$DATMOD= 1
##$DC= 0
##$DFILT= <>
##$DTYPP= 0
##$F1P= 0
##$F2P= 0
##$FCOR= 1
##$FTSIZE= 65536
##$FT_mod= 6
##$GAMMA= 0
##$GB= 0
##$INTBC= 1
##$INTSCL= 6.047779e-11
##$ISEN= 30
##$LB= 1
##$LEV0= 0
##$LPBIN= 0
##$MAXI= 10000
##$MC2= 0
##$MEAN= 0
##$ME_mod= 0
##$MI= 50
##$NCOEF= 0
##$NC_proc= -9
##$NLEV= 6
##$NOISF1= 182.463
##$NOISF2= 159.3651
##$NSP= 0
##$NTH_PI= 0
##$NZP= 0
##$OFFSET= 248.5645
##$PC= 4
##$PHC0= -11022.9
##$PHC1= 195.6578
##$PH_mod= 1
##$PKNL= yes
##$PPARMOD= 0
##$PSCAL= 0
##$PSIGN= 0
##$REVERSE= no
##$SF= 81.0140089999694
##$SI= 65536
##$SIGF1= 159.3651
##$SIGF2= -187.1042
##$SINO= 113.3802
##$SIOLD= 16384
##$SREGLST= <1H.CDCl3>
##$SSB= 0
##$STSI= 65536
##$STSR= 0
##$SW_p= 40650.406504065
##$SYMM= 0
##$S_DEV= 0
##$TDeff= 32768
##$TDoff= 0
##$TI= <>
##$TILT= no
##$TM1= 0
##$TM2= 0
##$TOPLEV= 0
##$USERP1= <user>
##$USERP2= <user>
##$USERP3= <user>
##$USERP4= <user>
##$USERP5= <user>
##$WDW= 1
##$XDIM= 65536
##$YMAX_p= 413230780
##$YMIN_p= -97805705
$$ End of Bruker specific parameters
$$ ---------------------------------
##NTUPLES= NMR SPECTRUM
##VAR_NAME=  FREQUENCY,     SPECTRUM/REAL,   SPECTRUM/IMAG
##SYMBOL=    X,             R,               I
##VAR_TYPE=  INDEPENDENT,   DEPENDENT,       DEPENDENT
##VAR_FORM=  AFFN,          ASDF,            ASDF
##VAR_DIM=   65536,         65536,           65536
##UNITS=     HZ,            ARBITRARY UNITS, ARBITRARY UNITS
##FACTOR=    0.620285442955139, 1,           1
##FIRST=     20137.2065510682, 0,            0
##LAST=      -20513.1999529968, 0,           0
##MIN=       -20513.1999529968, -97805705,   0
##MAX=       20137.2065510682, 413230780,    0
$$ Real data points
##PAGE= N=1
##DATA TABLE= (X++(R..R)), XYDATA
$$ [...]
42281B104931K968586J994444l906607q701144n492869J667336M272473L886427
42273a206423P241600J0309228L173706r933265j2687809j622491P338076K930857
42265E543479n537718m401772M083166P371040J123264o720607p154623m2576
42257e736347O136788L667169m082325n260406L924539J1736951P279567l012841
42249A4653095o014158k154647j269912l645614j314132M631888M810288j074329
42241H622479l728539j188826n88799l081382l055163k228818p308397j3259888
42233b5817333p564321P061406J3469554O711670L21148J895699K770244j957200
42225c109133l543652K161323N774173K461616O80983M167929L761488l606029
$$ plain form
42281 2104931 5073517 7067961 3161354 -5539790 -11032659 -9365323 -5092850 -1206423
42273 -1206423 6035177 16344405 19518111 9584846 -3102963 -4725454 2612622 5543479
42265 5543479 5761 -4396011 -312845 7058195 8181459 1460852 -5693771 -5736347
42257 -5736347 400441 4067610 -14715 -5275121 -1350582 10386369 17665936 14653095
42249 14653095 8638937 6484290 5214378 1568764 254632 4886520 9696808 8622479
42241 8622479 4893940 3705114 3116315 34933 -3020230 -5249048 -12557445 -25817333
42233 -25817333 -33381654 -26320248 -12850694 -6139024 -5817876 -3922177 -1151933 -3109133
42225 -3109133 -6652785 -4491462 1282711 3744327 4425310 8593239 12354727 8748698
42217H748698o797296j375628Q81975n559883q240795j27745N977667J446077
42209e046930p44670R320564J6475637M830593j2859264j3858946k69508Q304706
42201F152182O067748J859517k141674r170132j2288428k981097R474693Q769235
42193E742044k222365o611766j259009J530501k263202l848709n21911N69913
42185h884504j442467P09772O792236Q365166M985823M791919P504278L347099
42177B6169322q269397j4636132q651082J470635N708215M061934J141573j148049
42169E847019k238048j850508j548344j414115K127446Q221790P428261l985448
42161A2588053j2702576n353434R210049J1418817P08719n007578J541925P889795
$$ plain form
42217 8748698 1951402 575774 1457749 -4102134 -12342929 -12470674 -6493007 -5046930
42209 -5046930 -5791600 3528964 20004601 24835194 11975930 -1883016 -2152524 6152182
42201 6152182 12219930 14079447 11937773 2767641 -9520787 -12501884 -3027191 5742044
42193 5742044 3519679 -3092087 -4351096 -2820595 -5083797 -8932506 -9454417 -8884504
42185 -8884504 -10326971 -9617199 -2824963 5540203 10526026 15317945 22822223 26169322
42177 26169322 17899925 3263793 -5387289 -3916654 1791561 5853495 6995068 5847019
42169 5847019 3608971 1758463 210119 -1203996 923450 9145240 16573501 12588053
42161 12588053 -114523 -5467957 3742092 15160909 15869628 10862050 12403975 20293770
42153B0293770M289093k869647n171282m275017l992008k939183m45388N08972
42145E399310m42271j088264l276889q981008j1301549k599425R781312J1144363
42137a364421K315127j711099L579639P080730L586444J011240J892529k168180
42129A4222009j0847260j0231868K686853J0188872J081567j0072505o154069
42122i126401N482621O634485k771249p796509l428852J064796k90150k716036
42114a2947295m54092N998518J1912922J1507720K354719q491837q758746K778715
42106C900624J1473885N538693p598578j2209772n259981K771531L493800j610694
42098D99508n961395l866778N142473J3469239J1651388R55846o941166o266208
$$ plain form
42153 20293770 24582863 21713216 16541934 12266917 8274909 5335726 4890338 5399310
42145 5399310 4957039 3868775 591886 -8389122 -19690671 -22290096 -12508784 -1364421
42137 -1364421 950706 -760393 2819246 9899976 13486420 14497660 16390189 14222009
42129 14222009 3374749 -6857119 -4170266 6018606 7100173 -2972332 -9126401
42122 -9126401 -3643780 2990705 219456 -7577053 -11005905 -9941109 -10231259 -12947295
42114 -12947295 -13401387 -7402869 4510053 16017773 18372492 9880655 1121909 3900624
42106 3900624 15374509 20913202 13314624 1104852 -4155129 -1383598 2110202 499508
42098 499508 -5461887 -9328665 -4186192 9283047 20934435 21890281 14949115 8682907
42090H682907l883540m964874l507161M636771J0652069N894353l266522n950567
42082H293436m032347n882797r801909p767885p57170L553141M568244O702828
42074e124459P104848J8075q749085p075163L547164Q242823J167080o242706
42066g111423l497855M872555Q991241P051262K959777j246805m604201m917987
42058B496564k272965k50321l80406P1060K590172M677259M536236L486021K151724
42049A7105344n94359l718026m553092m162092o137173r280850q490633m131269
42041b3962150k325965l420386N85545J1898414J8932666J0751976o089146j4312457
42033g941503p180072N179708J0238124O497517Q96601j413363j217633j762724
$$ plain form
42090 8682907 4799367 -165507 -3672668 964103 11616172 17510525 14244003 8293436
42082 8293436 4261089 -1621708 -11423617 -19191502 -19948672 -16395531 -11827287 -5124459
42074 -5124459 1980389 1998464 -6750621 -13825784 -10278620 -2035797 -868717 -7111423
42066 -7111423 -10609278 -5736723 3254518 10305780 13265557 12018752 7414551 2496564
42058 2496564 223599 -26722 -407128 -336068 2254104 6931363 11467599 14953620 17105344
42049 17105344 16510985 12792959 8239867 4077775 -2059398 -11340248 -19830881 -23962150
42041 -23962150 -26288115 -29708501 -29122956 -17224542 1708124 12460100 6370954 -7941503
42033 -7941503 -15121575 -9941867 296257 6793774 7690375 6277012 5059379 3296655
42025C296655m212762o470368n444872m08413N684335Q325663N332196p41050
42017E361384m220962j851687K876175L270439j438811l962511Q44618P273039
42009H151684O031863j903205o225326k332125K517449P29547n188823q066530
42001f285466n879489j070720M434124P688301L596285p113960j3212539n566975
41993b3410439Q213065J2215177M480547j186189K359725M867853k628408j0791658
41985e880327n970283O726044R455821j619140j0659418n583192O074150J0588396
41977C132051O690350K562117J624898O10453k047028m252152n080382n032202
41969a791895k666627L244248R077901R237138L411671l294585o760566o395309
$$ plain form
42025 3296655 -916107 -7386475 -12831347 -13239760 -7555425 770238 6102434 5361384
42017 5361384 1140422 -711265 2164910 5435349 3996538 34027 878645 8151684
42009 8151684 14183547 12280342 6055016 3722891 6240340 6969887 1781064 -6285466
42001 -6285466 -12164955 -13235675 -8801551 -1113250 2483035 -4630925 -17843464 -23410439
41993 -23410439 -15197374 -2982197 1498350 312161 2671886 7539739 4911331 -5880327
41985 -5880327 -11850610 -5124566 4331255 2712115 -7947303 -13530495 -7456345 3132051
41977 3132051 9822401 12384518 14009416 14619869 12572841 8320689 3240307 -1791895
41969 -1791895 -4458522 -1214274 7863627 17100765 20512436 17217851 10457285 4061976
41961D061976k716082K761560N934149L333623k848616o792039n912764k391802
41953d569995J004056K669272R97671l909913q011866p118184k377261J756957
41945a9559263L620258M351111M003643K637684K939186N973522O841492J365051
41937A2172684n404636n441474m30542J206052j290314n18670M627622N768009
41929A0688731o56656o858391o062752j678635P92241J788541K456914N51289
41921A021282k697821p39570O779034R643111J645550q924923j1310054o600796
41913a1184187j657891K678594P352205P286992k49008n969050j59289J0667269
41905H765635J1871436K419217m784189k989446J043298M43932k894458m892739
$$ plain form
41961 4061976 1345894 4107454 10041603 13375226 10526610 3734571 -2178193 -4569995
41953 -4569995 -3565939 -896667 101004 -3808909 -11820775 -18938959 -21316220 -19559263
41945 -19559263 -15939005 -11587894 -7584251 -4946567 -2007381 3966141 10807633 12172684
41937 12172684 6768048 1326574 896032 2102084 811770 293100 4920722 10688731
41929 10688731 10032075 3173684 -2889068 -4567703 -3775462 -1986921 469993 1021282
41921 1021282 -1676539 -2416109 4362925 14006036 15651586 6726663 -4583391 -11184187
41913 -11184187 -12842078 -10163484 -2811279 4475713 4226705 -1742345 -1901634 8765635
41905 8765635 20637071 23056288 18272099 15282653 16325951 16769883 13875425 8982686
41897H982686m865277k571379J940954M673161J898055k233935j017939K936420
41889I742746J493646m106537m411220J185142K001279n622073j0781626n021732
41881a5520375M816373Q403024O307212M028035Q97547n056758q466366l658184
41873h249492M444003O624565L187450J759612L770389L201104j567347m199659
41865H970625o96797M205953M126147n08728m360709m527344k997793k652953
41857A558401k810519r7164N701808Q858274M443836l270995n038612J00024L084348
41848A2529401r11266m929966k667336p9257n300327j3235392j1905078j200339
41840b7699560O807665N937016K453553J916899J089967k829212n078703j463872
$$ plain form
41897 8982686 4117409 1546030 3486984 8160145 10058200 7824265 6806326 9742746
41889 9742746 11236392 7129855 2718635 3903777 5905056 282983 -10498643 -15520375
41881 -15520375 -10704002 -2300978 4006234 8034269 8931816 3875058 -4591308 -8249492
41873 -8249492 -3805489 2819076 6006526 7766138 11536527 14737631 13170284 8970625
41865 8970625 8273828 12479781 16605928 16097200 11736491 7209147 4211354 1558401
41857 1558401 -1252118 -1349282 4352526 13210800 17654636 14383641 9345029 9445053 12529401
41848 12529401 11618135 6688169 4020833 3941576 -1358751 -14594143 -26499221 -27699560
41840 -27699560 -20891895 -14954879 -12501326 -10584427 -9494460 -12323672 -17402375 -18866247
41832a8866247M094208N994594M587662K377354q43011l977931k727979K484426
41824f876924L804586k171004p104405l360551L624759M726225J587241O69732
41816e100341O8834m196384n268493M355838J4200273P470063r522269j2203897
41808a0196376L943403J3781452J267261j5148729j1934098M252716J1018598
41801c015773M883299j093649l294917p260167q754431K20840J0372355N014061
41793b928382r905153j1106821M471950J3568454M441457n098693R83118J1194222
41785E620152Q117694l364912p537693l002271J454639M513507Q566497Q054146
41777B2421759j368612r960849o775230J404585M43380p798054r573189k453073
$$ plain form
41832 -18866247 -14772039 -8777445 -4189783 -1812429 -2655440 -6633371 -9361350 -6876924
41824 -6876924 -3072338 -5243342 -12347747 -15708298 -12083539 -7357314 -5770073 -5100341
41816 -5100341 -5031507 -9227891 -14496384 -10140546 4059727 11529790 2007521 -10196376
41808 -10196376 -6252973 7528479 8795740 -6352989 -18287087 -14034371 -3015773
41801 -3015773 1867526 773877 -2521040 -9781207 -18535638 -18314798 -7942443 -2928382
41793 -2928382 -12833535 -23940356 -19468406 -5899952 -1458495 -6557188 -5574070 5620152
41785 5620152 13737846 10372934 2835241 -167030 1287609 5801116 14367613 22421759
41777 22421759 21053147 11092298 4317068 5721653 6165033 -1633021 -11206210 -13659283
41769a3659283K941952K391825K482464N519937N522159R39976k117831j444832
41761B576367j648723l706032k615826K664202O769719O696657M216459j44170
41753A4808653o135641p996329m39155J0112239J1437918K655032n546958p373269
41745A1522490o754016n919486k277528K052195P98907m033099l144344L931522
41737c823359O692402J044024m358948l369786q05679o53228J012553N326612
41729A064591N692631K63494l087410j159939j701620p370496p446463L808778
41721i936434J3733131R327840k359702o253883k390571j499183m419209k515008
41713f313019M766904Q369935M996993O55592j354677m020599p365748o655970
$$ plain form
41769 -13659283 -10717331 -8325506 -5843042 -323105 5199054 6139030 4021199 2576367
41761 2576367 927644 -2778388 -5394214 -2730012 4039707 10736364 14952823 14808653
41753 14808653 8673012 676683 237528 10349767 21787685 24442717 18895759 11522490
41745 11522490 4768474 -1151012 -3428540 -1376345 -577438 -4610537 -7754881 -3823359
41737 -3823359 2869043 3913067 -445881 -3815667 -4621346 -5274574 -4262021 1064591
41729 1064591 6757222 7020716 3933306 2773367 1071747 -6298749 -13745212 -9936434
41721 -9936434 3796697 13124537 10764835 4510952 2120381 621198 -3798011 -6313019
41713 -6313019 -1546115 6823820 11820813 12476405 11121728 7101129 -264619 -6920589
41705f920589j667519J629387N18057j454455k195637l718324n450377k882106
41697b2141563M293395R419590P570384J819574k082012k792950k231257j190792
41689g335631M55263J478410M76599j377617j211497J495521L433189J715612
41681h70151j138064K94504N800232P829491J882726n826281o964529l352458
41673b344530k641147m979831m233941o49457j97290j454477L081806J0761831
41665b657036R283025k016409p776276j154909M226710j918702p806279m66264
41657a0286140R743837N871835n384296l458271J1586497J8145821O564782q379628
41649B4404437j2181059q510067o172906m607420p07992K265630Q68891j952441
$$ plain form
41705 -6920589 -8588108 -6958721 -6440664 -7895119 -10090756 -13809080 -19259457 -22141563
41697 -22141563 -17848168 -8428578 -858194 961380 -1120632 -3913582 -6144839 -7335631
41689 -7335631 -6880368 -5401958 -4925359 -6302976 -7514473 -6018952 -2585763 -870151
41681 -870151 -2008215 -1713711 4086521 11916012 13798738 7972457 1007928 -2344530
41673 -2344530 -4985677 -9965508 -14199449 -14848906 -15046196 -16500673 -13418867 -2657036
41665 -2657036 6625989 4609580 -3166696 -4321605 -94895 -2013597 -9819876 -10286140
41657 -10286140 -542303 5329532 -54764 -3513035 8073462 26219283 32784065 24404437
41649 24404437 12223378 3713311 -2459595 -7067015 -7775007 -5509377 -4640486 -6592927
41641f592927k223937N0140M047189Q621920Q561856j08794r938470q269891L927013
41632a925901J1015626M263628o867974r840441m627908J532859M916485M396975
41624B863349j239492q403790q960135j473545N192573M856614K495818L993347
41616f75261O018071L387797j016150j567138R33350K626303L531477M286860
41608A7525309J495995o576272j4237642j4597805p472264L388515J4876995K1497604
41600A5900435J5759944r03876j4582427j4631392o956741l316634m138529k224959
41592a5094179K361075L451756J579805L200000P982411Q336863K223715l748962
41584A0292484n182944m540024l665255q37286K743052K346033j653872k708086
$$ plain form
41641 -6592927 -8816864 -8766724 -4719535 3902385 12464241 12355447 2416977 -5852914 -1925901
41632 -1925901 9089725 13353353 6485379 -3355062 -7982970 -6450111 -1533626 2863349
41624 2863349 1623857 -6779933 -15740068 -17213613 -12021040 -7164426 -4668608 -675261
41616 -675261 5342810 8730607 7714457 6147319 7080669 9706972 13238449 17525309
41608 17525309 19021304 12445032 -1792610 -16390415 -23862679 -20474164 -5597169 15900435
41600 15900435 31660379 30756503 16174076 1542684 -5414057 -8730691 -12869220 -15094179
41592 -15094179 -12733104 -9281348 -7701543 -4501543 3480868 11817731 14041446 10292484
41584 10292484 5109540 569516 -3095739 -3933025 -1189973 1156060 -497812 -3205898
41576c205898J202586L697231O65065k816971j225672K454650K480188k22098
41568C029081o72555J951261M695138O316575O625169L272838m305216r877026
41560A1035265o759634J310958L434631k940654p581253k323211O573582P195813
41552I945497j512315r426109r254511l381400K948004P779396J0143274Q304183
41544A5546019L531076N48525J014138R21380k590419o433262o764769m291180
41536A481508r96643L289538P187303O384356Q35802k588991k51030J972642q61820
41527A6452665l618356j204356J78791o164899j2409126o849288N286617Q511083
41519A83131K037870m30062M118676L436486n345773p527850L748957J3020895
$$ plain form
41576 -3205898 -2003312 1693919 2358984 -457987 -1683659 770991 3251179 3029081
41568 3029081 2356526 4307787 9002925 15319500 21944669 25217507 20912291 11035265
41560 11035265 4275631 5586589 9021220 6080566 -1500687 -3823898 2749684 9945497
41552 9945497 8433182 -992927 -10247438 -13628838 -10680834 -2901438 7241836 15546019
41544 15546019 19077095 19625620 20639758 21561138 18970719 12537457 5772688 1481508
41536 1481508 484865 3774403 10961706 17346062 18181864 15592873 15341843 17314485 16452665
41527 16452665 12834309 11629953 11808744 5643845 -6765281 -13614569 -8327952 183131
41519 183131 2221001 1790939 5909615 9346101 4000328 -3527522 221435 13242330
41511A3242330O122193p579199j0968447m194882J269102K789593M873603N559389
41503A1113682M32143n413717m017531J323125J821289j472427j205266J847531
41495D428829J304358j651029j087152R20305k066379p079947n300762K538532
41487g993245P659288Q250776R301150R319108K201091q075199r981004k933470
41479G748495J353787k031525n084081k570372K02283r87773k805775l175216
41471g350177m444759m998873j73391O450095O267452J698152L373105R449681
41463A0271285O351908n848893j0036079j614406J477259r311904j4702926L98917
41455b3014839J7792092J3132184m691905r467238r18737m81931r575111o249762
$$ plain form
41511 13242330 19364523 11785324 816877 -3378005 -2108903 680690 5554293 11113682
41503 11113682 11545825 6132108 2114577 3437702 5258991 3786564 2581298 4428829
41495 4428829 5733187 4082158 2995006 3915311 1848932 -5231015 -10531777 -7993245
41487 -7993245 -333957 7916819 17217969 26537077 28738168 20662969 10681965 7748495
41479 7748495 9102282 7070757 1986676 -583696 -381413 -1369186 -4174961 -7350177
41471 -7350177 -11794936 -16793809 -16967200 -10517105 -4249653 -2551501 821604 10271285
41463 10271285 16623193 10774300 738221 -876185 601074 -8710830 -23413756 -23014839
41455 -23014839 -5222747 7909437 3217532 -6249706 -7168443 -7650374 -17225485 -23475247
41447b3475247J3412051K3427074Q848547r513997q302294L153803K047662r878353
41439b80754j1863131O07084J0023363N566833k936926l864459o7633Q95344L22105
41430a598174L044608O761198O041509K226227P65105J379953r74496o234479
41422A1411451q074970l584635K664586O102440P393693P464287L836124l427606
41414B3785370p834526m760165O64840Q94036k331474j711207K547496K861186
41406A4115556k603824o565217m482464r29774o09691j004088J305813L766302
41398B992613K606800q86768l715451n907123p447318n567746N2904M248535L575757
41389a0047797J884549L560459O075567N011236J815781K72854l74612k098010
$$ plain form
41447 -23475247 -10063196 13363878 22212425 12698428 4396134 7549937 9597599 -280754
41439 -280754 -12143885 -11536801 -1513438 4053395 1116469 -2747990 -2815623 -1920279 -1598174
41430 -1598174 1446434 8207632 14249141 16475368 17240473 18620426 17645930 11411451
41422 11411451 3336481 -248154 2416432 8518872 15912565 23376852 27212976 23785370
41414 23785370 15950844 11190679 11855519 12749555 10418081 8706874 11254370 14115556
41406 14115556 11511732 4946515 464051 -465723 -1075414 -2079502 -773689 2992613
41398 2992613 5599413 4712645 997194 -4909929 -12357247 -17924993 -17872089 -13623554 -10047797
41389 -10047797 -8163248 -4602789 1472778 6484014 8299795 8572649 8198037 6100027
41381F100027k255308J364489L696714o17719o309508l366544P090773J2738360
41373A8441284O998394k953983p659595o737855m800665k770084J076720N236726
41365F830942N790143K269513j061040n61787J914004J150587l998178p285256
41357E048928k405020P083473J0448224L855526m273373n378477j812780j34881
41349A2431620M19633M234669Q198001M594851n589056j1890132q551426j577305
41341B270855R53226r78273k199807l77138K487809L827453L117028J743853R64663
41332A1809669k48526l464053o071716k619687O105717J0565605M436270n669587
41324A4843692r183192n776701k575096j566838K74394J578101j272061m207149
$$ plain form
41381 6100027 3844719 5209208 8905922 8288203 1978695 -1387849 5702924 18441284
41373 18441284 25439678 22485695 14826100 8088245 3287580 517496 1594216 6830942
41365 6830942 12621085 14890598 13829558 13267771 15181775 16332362 12334184 5048928
41357 5048928 2643908 9727381 20175605 24031131 19757758 14379281 12566501 12431620
41349 12431620 12851253 17085922 25283923 29878774 24289718 12399586 3848160 2270855
41341 2270855 3224081 2245808 46001 -331137 2156672 5984125 9101153 10845006 11809669
41332 11809669 11561143 8097090 2025374 -594313 5511404 16077009 20513279 14843692
41324 14843692 5660500 -116201 -2691297 -4258135 -3983741 -2405640 -3677701 -7884850
41316g884850J22381Q182900Q591691O03758l898834o5557K238747l760424r574874
41307e445062n650863L276359O634372L074019k071155o397920q462553m132666
41299a9175469N230569Q438392p01664j0837327p500390N188081J0587707M144015
41291d626086k123495N27159O568524P527131L229253j821473m682989l703081
41283H94943N20103K251749l323822r994059o120000P111027J3944925O033827
41275A1318693m437180k375575Q043254J0559603J367241o764766m889544J41348
41267A2963074j350966o782820p039588j387284K589939J964099K031447N321975
41259H309876N650678j638009r759572q482166R90910P364031N032926L51514
$$ plain form
41316 -7884850 -7762469 420431 9012122 9615880 5717046 5651489 7890236 4129812 -5445062
41307 -5445062 -11095925 -7819566 -1185194 1888825 -182330 -6580250 -15042803 -19175469
41299 -19175469 -13944900 -5506508 -6208172 -17045499 -24545889 -19357808 -8770101 -4626086
41291 -4626086 -6749581 -6222422 346102 7873233 11102486 9281013 4598024 894943
41283 894943 1415046 3666795 342973 -9651086 -15771086 -8660059 5284866 11318693
41275 11318693 6881513 4505938 12549192 23108795 24476036 17711270 12821726 12963074
41267 12963074 11612108 4829288 -2210300 -3597584 -1007645 956454 2987901 8309876
41259 8309876 13960554 12322545 2562973 -5919193 -4928283 2435748 7468674 7820188
41251G820188L77705L152951L284987J000257K25486J669864K791323J912736
41243B2235497j163553n354724o443186k57274Q687223Q747281k540993j1374350
41235A2535921o164058M091438K919767p239855q619514K452870Q726227K27392
41227H930188r064740m304656N769104L842796o976578q624287J860692P873750
41219f93731O32367p322735k881853Q035051J1379390M921693l111289p676387
41211C282506q725707n157055K276554O023706O30133o153203k767721P022459
41203c568328P705320l456429r652103J001186J6319305J6165583m615j3770856
41195A0739063j2508115k216143M179890J769047n020840q968320n527304L487225
$$ plain form
41251 7820188 8197893 11350844 14635831 15636088 15861574 17531438 20322761 22235497
41243 22235497 21071944 15717220 9274034 9016760 17703983 26451264 23910271 12535921
41235 12535921 6371863 10463301 13383068 6143213 -2476301 -23431 8702796 8930188
41227 8930188 -134552 -4439208 1329896 5172692 -1803886 -10428173 -8567481 -693731
41219 -693731 -61364 -7384099 -10265952 -2230901 9148489 14070182 10958893 3282506
41211 3282506 -5443201 -10600256 -8323702 -2299996 -1669863 -7823066 -10590787 -3568328
41203 -3568328 4136992 680563 -8971540 -7970354 8348951 24514534 24509919 10739063
41195 10739063 -1769052 -3985195 194695 1963742 -3057098 -12025418 -17552722 -14065497
41187a4065497J0383690R564966M616403K785706L700816M69225p836351j2759506
41179c140548q152395J564612Q379907R876433P422193J210012p089834j1090015
41171a019635n904463M022046Q863806M776206k832820o970926o088012k997602
41163h151400k2592K863318N720915O067045Q44561p706147j0903796k785374
41155a4073470J0506158J5962953R064152j619159o594507n976405m825366m293540
41147a849184k689193r25427j085994k002300r68860J946666M684184N894164
41139C004056M322575o60913n063350k219509O746841J0485555K139329r165805
41131I588779j0315706l027277L67077k624919j707329P081307J2690269N948093
$$ plain form
41187 -14065497 -3681807 5883159 10499562 13285268 16986084 17455309 9618958 -3140548
41179 -3140548 -11292943 -9728331 -1348424 8528009 15950202 17160214 10070380 -1019635
41171 -1019635 -6924098 -2902052 5961754 10737960 7905140 934214 -5153798 -8151400
41163 -8151400 -8173992 -5310674 410241 6477286 7321847 -384300 -11288096 -14073470
41155 -14073470 -3567312 12395641 21459793 19840634 13246127 7269722 2444356 -1849184
41147 -1849184 -4538377 -5463804 -6549798 -8552098 -9520958 -7574292 -2890108 3004056
41139 3004056 7326631 6665718 1602368 -617141 6129700 16615255 18754584 9588779
41131 9588779 -726927 -3754204 -3387127 -6012046 -7719375 -638068 12052201 18000294
41123A8000294n385867p800533j460278K180134r14823k289862L822834J0069920
41115A6221819O692728l245006p540301k315840K690296r57928p688577o909205
41107c052014Q2340J979340m216845p457447M91192J1428640J1751548J535669
41099A2542423o438653m549688J484412K950735o85841l996146m193594l246074
41091f132426k733705m57434N483111J0473491O235065o763507j4713142o207487
41083a4816034R989015J3914692J755553q944700n938842M20754l506842j1446847
41075a8573251q662272K634364P484369L292982J834218O422542N841875m616449
41067d341622j2690237p619029L672525P912745L825432M38665L309390R657026
$$ plain form
41123 18000294 12614427 4813894 3353616 5533750 4618927 2329065 6151899 16221819
41115 16221819 22914547 19669541 12129240 9813400 12503696 11545768 3857191 -3052014
41107 -3052014 -2969674 -990334 -5207179 -12664626 -12173434 -744794 11006754 12542423
41099 12542423 6103770 1554082 3038494 5989229 5303388 1307242 -2886352 -6132426
41091 -6132426 -8866131 -9323565 -3840454 6633037 12868102 6104595 -8608547 -14816034
41083 -14816034 -4827019 9087673 10843226 1898526 -4040316 -3619562 -7126404 -18573251
41075 -18573251 -27235523 -24601159 -17116790 -13823808 -11989590 -5567048 274827 -4341622
41067 -4341622 -17031859 -24650888 -20978363 -13065618 -9240186 -8801521 -5492131 4164895
41059D164895J3040228Q293832l864772j4339113j3220540k177939O897408P345988
41051F139987M114815K558900M47350m243708o747611l333979J509682K296024
41043B741460P16211M28404j90763l399144n537225k109759M409499P775087N809041
41034A0642811P46971m346813o004631k157374L161705K841344k440165l997436
41026a553588L70398J520583m802975p622723K647170J5958716J4775069l60816
41018B0931834j1644245r053399j093899J124534j457957j819517J138182K708840
41010H34373L88153l009298l305021m1113K745532J513265j575815j413284K197104
41001a666104M301748L082567J886147J372016k101623p042061n609447K520673
$$ plain form
41059 4164895 17205123 25498955 21634183 7295070 -5925470 -8103409 -1206001 6139987
41051 6139987 10254802 12813702 13261052 9017344 2269733 -1064246 445436 2741460
41043 2741460 3457671 3886075 3695312 296168 -5241057 -7350816 -2941317 4833770 10642811
41034 10642811 11389782 7042969 1038338 -1119036 2042669 4884013 2443848 -1553588
41026 -1553588 -1183190 337393 -4465582 -12088305 -9441135 6517581 21292650 20931834
41018 20931834 9287589 234190 -859709 264825 -1193132 -3012649 -1874467 834373
41010 834373 1222526 -1786772 -5091793 -5132906 -2387374 -874109 -2449924 -3863208 -1666104
41001 -1666104 2635644 5718211 7604358 8976374 6874751 -167310 -5776757 -3256084
40993c256084N680526j976954q756720k950229P479595P145337k154900n617714
40985d407143J18699M255317K244285J199888L334323J320987n340669n602992
40977b877305M192899J0833081L273117r853685j2272673j987351Q668187R784883
40969I761153K232435p066515j0864227n048946P256604J5914405J2493348j056295
40961B3621962j3903058j5766147n373120Q007549J2305523M879065m699937p225955
40953A845882n042533m987565n714710j756944L918425L815219L67046K629399
40945d925781Q692771O850130l322752p598938l21068N569129L70704o336055
40937a021860l290678K960906Q86044n045722k799645N605087P999397L066468
$$ plain form
40993 -3256084 2424442 447488 -8309232 -11259461 -3779866 3365471 1210571 -4407143
40985 -4407143 -4288444 -33127 2211158 3411046 6745369 8066356 2725687 -2877305
40977 -2877305 1315594 12148675 15421792 5568107 -6704566 -8691917 -23730 9761153
40969 9761153 11993588 4927073 -5937154 -10986100 -3729496 12184909 24678257 23621962
40961 23621962 9718904 -6047243 -11420363 -3412814 8892709 13771774 9071837 1845882
40953 1845882 -3196651 -8184216 -13898926 -15655870 -11737445 -7922226 -7555180 -4925781
40945 -4925781 3766990 10617120 7294368 -304570 -625638 4943491 5314195 -1021860
40937 -1021860 -4312538 -1351632 -465588 -5511310 -8310955 -2705868 5293529 8359997
40929H359997Q84643M269852N088754k03127n116887n348153m636115n627296
40921b328332n103567j572577R76092J57381r53976M09714L086919N658520P880066
40912H210240P494460J702032o995467j1877234r795692l356366L791541Q446914
40904b379572O722231j147226o498492j761814O345480L719880r643376j6692969
40896b1335858o649834R233320J2993784L277806n872999n033282J254191M204591
40888g928281J909208j353687k100568o36273J497728M026131O253081M638842
40880F306181l411454j2320277j1155204J500176J1573870O756286m981064n684998
40872a1416484N910772J2410975M633202m988730l253296L624341K661835l874223
$$ plain form
40929 8359997 9244640 13514492 18603246 18400119 13283232 7935079 3298964 -2328332
40921 -2328332 -7431899 -9004476 -8028384 -7871003 -8824979 -8415265 -5328346 330174 8210240
40912 8210240 15704700 17406732 10411265 -1465969 -11261661 -14618027 -10826486 -2379572
40904 -2379572 4342659 3195433 -3303059 -5064873 1280607 5000487 -4642889 -21335858
40896 -21335858 -27985692 -18752372 -5758588 -2480782 -8353781 -13387063 -12132872 -7928281
40888 -7928281 -6019073 -7372760 -9473328 -10109601 -8611873 -4585742 1667339 6306181
40880 6306181 2894727 -9425550 -20580754 -19080578 -7506708 -750422 -5731486 -11416484
40872 -11416484 -5505712 6905263 11538465 6549735 3296439 6920780 9582615 5708392
40864E708392m438425P3393k328258j2321221j4537924O675J9198190K4721028
40856A6081850J3447582k817951j2539888j2353555m611782N015633R200070M895799
40848A6317758k224900l930833N9082K199241j888890p337800p026282q64008
40840d696632N180514O995605N455109K678587m57368k346958n81676L459836
40832A5687017L598101l094069r610292o617287L380266O841685k631375j3715321
40824f161275j1518942K039523J0596707N065448n923748r371616l557882M290915
40816a4540870R233479J0593510P082574j734230j0262902j0892004m084448J964110
40808a2640781L023088L460988O585644P451515Q01387q857147j1938432o122245
$$ plain form
40864 5708392 1269967 1343360 -984898 -13306119 -27844043 -27837368 -8639178 16081850
40856 16081850 29529432 26711481 14171593 1818038 -2793744 2221889 11421959 16317758
40848 16317758 14092858 10162025 10221107 12420348 10531458 3193658 -3832624 -4696632
40840 -4696632 483882 7479487 12934596 15613183 15155815 12808857 12227181 15687017
40832 15687017 19285118 16191049 6580757 -36530 3343736 10185421 7554046 -6161275
40824 -6161275 -17680217 -15640694 -5043987 21461 -5902287 -15273903 -18831785 -14540870
40816 -14540870 -5307391 5286119 12368693 10634463 371561 -10520443 -14604891 -12640781
40808 -12640781 -9617693 -6156705 428939 7880454 8681841 -175306 -12113738 -18235983
40800a8235983K137022O937686P677688N166759m89063o828702r056088n212607
40792a7903288J867364Q373002J1903490J0484256M067549k761310m899404m026787
40784G104872n762162q947302n818408M318976J0399585M526419n722474p554037
40776g454531n1874P231680Q621852O473128L612461M68334j324414l39868L19328
40767A7556096k742328o005643l748006J634507K888500L36819Q31397M338416
40759A5089758L162142l482135o376645k028582Q15313k975288m563224L650331
40751C291670J2769700R662423k764377j0654555r662071o611662l689399L724038
40743c934233J2462143J0158691n595784j8781137j4384912J734516J1644175
$$ plain form
40800 -18235983 -16098961 -9161275 -1483587 3683172 3194109 -3634593 -12690681 -17903288
40792 -17903288 -16035924 -7662922 4240568 14724824 18792373 16031063 11131659 7104872
40784 7104872 1342710 -7604592 -13423000 -9104024 1295561 5821980 99506 -7454531
40776 -7454531 -7506405 -274725 8347127 14820255 18432716 18901050 17576636 17236768 17556096
40767 17556096 14813768 8808125 5060119 6694626 9583126 9919945 10751342 15089758
40759 15089758 18251900 14769765 8393120 6364538 7179851 4204563 -358661 3291670
40751 3291670 16061370 25723793 22959416 12304861 2642790 -3968872 -7658271 -3934233
40743 -3934233 8527910 18686601 13090817 -5690320 -20075232 -18340716 -6696541
40736f696541Q716733K369800J568223L760630K647511r36643j703412M22102
40728A0148403J23118l969736o129735k494013K189566J888085q03442N97331
40720A549577M392961L021490k599463k500796N101215Q208485K03522p047212
40712A0329779j041099R824399Q054140n104459j1207847l233287M966566J423433
40704A4011625p634067j0850022p650914k931650K773296Q778951R434553L093902
40696I025674k094960r3607L173988O91850l309797k185630J23370k826082n915737
40687c410931n70877Q158394P977493L3703k794303K153160L522479l547468r132900
40678B388750n863519q5455J162119J335285M428461N493939M63986m450869k878595
$$ plain form
40736 -6696541 2020192 4389992 5958215 9718845 12366356 11429713 9726301 10148403
40728 10148403 10271521 6301785 172050 -2321963 -132397 1755688 952246 1549577
40720 1549577 5942538 8964028 6364565 3863769 8964984 17173469 17376991 10329779
40712 10329779 9288680 19113079 27167219 22062760 10854913 7621626 12588192 14011625
40704 14011625 6377558 -4472464 -12123378 -15055028 -12281732 -3502781 5931772 9025674
40696 9025674 6930714 6837107 10011095 10702945 7393148 5207518 5330888 2504806 -3410931
40687 -3410931 -3981808 4176586 12154079 12187782 9393479 11546639 15069118 11521650 2388750
40678 2388750 -3474769 -3560224 -2398105 -1062820 3365641 8859580 9323566 4872697 1994102
40669A994102Q63315O25273m80810J642011J392397o125805j1424355k755646
40661a4269518J2388783J4641456J220866r401870m562085N876747O496527k151093
40653A0239813p907941m713477K997973Q793071R659441N723033R7294k893224
40645B1995983k769737l590540p156423r315245o003712P75661O028731P257655
40637G222373M473588q47683m190330p72757O402397P123535k240989j1304579
40629E865555q960358P58425M784581q9739m317219j188438M594053O315321M566852
40620A2329033K736214M2419n005296q747635o553430q31949J301506j661665
40612f390803l072443K312629J0334880J2240977N353281m492026j0261227r823483
$$ plain form
40669 1994102 2857417 3482690 3001880 4643891 6036288 -89517 -11513872 -14269518
40661 -14269518 -1880735 12760721 13981587 4579717 17632 5894379 12390906 10239813
40653 10239813 2331872 -2381605 616368 9409439 19068880 24791913 24889207 21995983
40645 21995983 19226246 15635706 8479283 -835962 -6839674 -6064013 -35282 7222373
40637 7222373 11695961 10848278 6657948 5885191 12287588 19411123 17170134 5865555
40629 5865555 -3094803 -2336378 2448203 2358464 -1958755 -3147193 1446860 7762181 12329033
40620 12329033 15065247 15107666 10102370 1354735 -5198695 -6030644 -4729138 -6390803
40612 -6390803 -9463246 -7150617 3184263 15425240 20778521 16286495 6025268 -3798215
40604c798215m715844K672560Q481249Q004629J044793n807617o514264l136116
40596c768825j385390j215711J385233M747236K478716m804463p820209k255986
40588a2639399M146026L142734k494119m713988j320695M246860Q535325Q428860
40580G331604K406489l677685m99917R083286R156169n379235j6429665q138224
40572f147178P065037O866140n519382p948331K966189P501281j978472q752790
40564e947506k407295M243835J214778j69586Q517436J2846647J215175r235658
40556A0277826J348084J8452177J2363466j3579180k5642672j0169879Q981275
40549B031097R556374J14612j659916K583869J145050n189048o329120k95561
$$ plain form
40604 -3798215 -8514059 -5841499 2639750 10644379 11689172 5881555 -632709 -3768825
40596 -3768825 -5154215 -6369926 -4984693 -237457 2241259 -2563204 -10383413 -12639399
40588 -12639399 -8493373 -5350639 -7844758 -12558746 -13879441 -9632581 -1097256 7331604
40580 7331604 9738093 6060408 5560491 14643777 23799946 18420711 1991046 -6147178
40572 -6147178 917859 7783999 2264617 -5683714 -2717525 4783756 2805284 -5947506
40564 -5947506 -8354801 -4110966 -2896188 -3065774 5451662 18298309 19513484 10277826
40556 10277826 11625910 30078087 42441553 28862373 3219701 -6950178 2031097
40549 2031097 11587471 11702083 10042167 12626036 13771086 8582038 2252918 1957357
40541A957357N569116O070314K064706l052305n176496k386023J002033n36515
40533E512187l631847l68523O262007M418543n507259p528777M371754J3314228
40525A6842313M636747j0190531j1030713M17063O445584K822885J959603Q264209
40517B0167160J0300014J261397r116058r583325k256801L890503N031299K310036
40509B2004225k528909o203595m892405l6549K581965J727238J701515K678087
40501A7031572r38839q928873j1793929m895438K961863K801937r65302N8446
40493d668563K621158j822160r456073p454315M836463J2477904O885184j878459
40485A541139k216104J176858k061239p983246l815334R673765J6807991J0013830
$$ plain form
40541 1957357 7526473 13596787 15661493 12609188 7432692 5046669 6048702 5512187
40533 5512187 1880340 1511817 7773824 12192367 6685108 -843669 3528085 16842313
40525 16842313 21479060 11288529 257816 674879 7120463 9943348 11902951 20167160
40517 20167160 30467174 31728571 22612513 13029188 10772387 14662890 19694189 22004225
40509 22004225 19475316 13271721 8379316 8342767 10924732 12651970 14353485 17031572
40501 17031572 16092733 7163860 -4630069 -9525507 -6563644 -3761707 -4727009 -4668563
40493 -4668563 -2047405 -3869565 -13325638 -20779953 -15943490 -3465586 3419598 1541139
40485 1541139 -674965 501893 -1559346 -9542592 -13357926 -3684161 13123830 23137660
40477B3137660j6322k630951k505163p345928j1537346n422518N958686Q448999
40469H087117O31041m592686q55229L473982J225156k897131l383037l509890
40461a820677o026796m905499L874092J1822686R101992Q6323l215134R28021
40453I845008L546050J51464m015501l698648k16759K161100N57184n028099r989298
40444f687499p845321L57143M351318j018408o068100k74576J0165582J1244326
40436D224465L251066p91555K660647K976690m901969j1318523q089164r43379
40428a2931722J420168L40663J533908M460609M880510K399084n14843k760720
40420a172343l924917l363614j828426L33914N820592J4582041J7800524Q014563
$$ plain form
40477 23137660 23121338 20490387 17985224 10639296 -898050 -6320568 -361882 8087117
40469 8087117 8718158 4125472 3270243 6744225 7969381 5072250 1689213 -1820677
40461 -1820677 -7847473 -12752972 -8878880 2943806 12045798 12132121 8916987 9845008
40453 9845008 13391058 13542522 9527021 5828373 5611614 7772714 8329898 3301799 -6687499
40444 -6687499 -14532820 -14175677 -9824359 -10842767 -16910867 -17185443 -7019861 4224465
40436 4224465 7475531 6683976 9344623 12321313 7419344 -3899179 -11988343 -12931722
40428 -12931722 -11511554 -11170891 -9636983 -5176374 -295864 2103220 1588377 -1172343
40420 -1172343 -5097260 -8460874 -10289300 -9955386 -4134794 10447247 28247771 36262334
40412C6262334o355805r771280k668143j80112o202771p430582J214976N542192
40404A0410809k920653j0318222l673814O590120N189695j967145p13806M819988
40396G416972J446299o396538l792060N961983M992052p871324j3942886n244926
40388a7430428M789061O133897N973775J0074564J0196318M29952j0019638j0894849
40380g47348m723470J851692P545868R527674J446301j2258874j4573989m2693
40372a1974839J2765050O560330q659986j0668501K763667J3705641J1319463
40365A5810825K885796j447214r86634J36913k25574k249344m593378m486781
40357D844609j608557L82737J11960J575102N966919O734377j53052p363190o280157
$$ plain form
40412 36262334 29906529 20135249 17467106 17286994 11084223 3653641 4868617 10410809
40404 10410809 7490156 -2828066 -6501880 88240 5277935 3310790 2596984 7416972
40396 7416972 8863271 2466733 -1325327 4636656 9628708 1757384 -12185502 -17430428
40388 -17430428 -12641367 -6507470 -533695 9540869 19737187 20167139 10147501 -747348
40380 -747348 -5470818 -3619126 3926742 13454416 14900717 2641843 -11932146 -11974839
40372 -11974839 790211 7350541 -1309445 -11977946 -9214279 4491362 15810825
40365 15810825 18696621 17249407 16262773 16399686 16174112 13924768 9331390 4844609
40357 4844609 3236052 3618789 3730749 5305851 11272770 18007147 17854095 10490905 4210748
40348D210748j77864K217446R42887J869111M112023K140017k603790m049366
40340H661212l292090n989781r446574n073066N964274J1906896O957684k185987
40332G502568p787195q539553m660527L153269Q377368L974531m890910n396807
40324h267256L522154R344478O334576K902934L769717J129477p910825j1249530
40316d24275j549516P984797K909873q402495p174350O682611J5444901R815421
40308B5286967k022312j0127013j2769995j0665657m409306J419947K519018K853628
40300g914723P958269J2458546O844124m964866r132488l135583J290569j920745
40292A483103n390004l805712k289823m143350m142516J7553K532875J398315
$$ plain form
40348 4210748 4032884 6250330 7193217 9062328 13174351 15314368 12710578 8661212
40340 8661212 5369122 -620659 -10067233 -15140299 -9176025 2730871 9688555 7502568
40332 7502568 -284627 -8824180 -13484707 -10331438 -1954070 2020461 -2870449 -8267256
40324 -8267256 -4745102 4599376 10933952 13836886 17606603 18736080 10825255 -424275
40316 -424275 -1973791 6011006 8920879 518384 -6655966 26645 15471546 25286967
40308 25286967 23264655 13137642 367647 -10298010 -14707316 -13287369 -10768351 -7914723
40300 -7914723 43546 12502092 19346216 14381350 5248862 2113279 3403848 1483103
40292 1483103 -3906901 -7712613 -10002436 -14145786 -18288302 -18270749 -15737874 -14339559
40284a4339559K412821N970648M412171j425025L20814J0282240J1544243k434987
40276A6743366j2502210k918422J1712435R203851n244712j0405897l924020j70468
40268B493923j080714L735470J1618029Q850081k340522n044719K477727M179475
40260B4888750l492695n492966K102192L663818n961121j0142975r52145N648016
40252A0260874k63572l625658O342875J2971069P48473j4827028j1578078L133721
40244C162676P327519Q56647n87858L819316L168555l44269K959942P152929K71840
40235B7787297r685699o091985M984021M156691n514766m165511O117324L342126
40227B0929498j1846792j2938059N546174J5227115J443823j2065944m873554
$$ plain form
40284 -14339559 -11926738 -5956090 -1543919 -2968944 -2648130 7634110 19178353 16743366
40276 16743366 4241156 1322734 13035169 22239020 16994308 6588411 2664391 2493923
40268 2493923 1413209 5148679 16766708 25616789 23276267 18231548 20709275 24888750
40260 24888750 21396055 15903089 18005281 21669099 15707978 5565003 4612858 10260874
40252 10260874 9997302 6371644 12714519 25685588 26434061 11607033 28955 3162676
40244 3162676 10490195 11346842 10758984 14578300 17746855 17402586 20362528 27515457 27787297
40235 27787297 18101598 12009613 16993634 21150325 15635559 11470048 17587372 20929498
40227 20929498 9082706 -3855353 1690821 16917936 18361759 6295815 1422261
40220A422261O932703L062213m971224J508026J1998158O413645p321971p471569
40212A1572242K709019K440000q437124j0139907J495000R378054N644588J292337
40204A5954209K267341P1709q033044j0575622j452813Q881443R424269K415782
40196A8953274m699028q900672q384257j337646P512582R593172N077008K341932
40188B0156365K710249j826580j1945635j5446457n441515P107988P930648j513430
40180A731633q402408o423094o40334K783128M094466O460952R341594Q060885
40172A7006822M75135p529427p267781Q69919O337425K672425l651481m265045
40164D647992j568134j724854j765102M530826J2282463J0432668m47203q199622
$$ plain form
40220 1422261 8354964 11417177 6445953 7953979 19952137 26365782 19043811 11572242
40212 11572242 14281261 16721261 8284137 -1855770 -360770 9017284 14661872 15954209
40204 15954209 18221550 18293259 10260215 -315407 -1768220 7113223 16537492 18953274
40196 18953274 14254246 5353574 -3030683 -4368329 3144253 12737425 17814433 20156365
40188 20156365 22866614 21040034 9094399 -6352058 -11793573 -4685585 3245063 1731633
40180 1731633 -6670775 -13093869 -13734203 -10951075 -6856609 -395657 8945937 17006822
40172 17006822 17481957 9952530 2684749 3554668 9892093 12564518 8913037 4647992
40164 4647992 3079858 1355004 -410098 4120728 16403191 26835859 26388656 18189034
40156A8189034p036310l215427k056378j512044l65656j040375k142401L93374
40148A213817L136610j352875r009492o665336O106751J3085624O136410j821660
40140A0829849J309810O863029J413542r379586j0292325k277838J26226n592438
40132f999731n913615M447486J1783964N150242m767200j170949J2330642J5735860
40124C0596699K149773j1504873q935206K575746M970206k870362o043270o4431
40116A0874282K128484n467526q901577K620962J5949360J2874051j468181q240162
40108B0369693m999859m575896q134628l233066J0107145J4982706N159424m217225
40100B5458294j776770L681775J863634k320943k359603l207556p578902n543354
$$ plain form
40156 18189034 11152724 7937297 5880919 4368875 4003219 2962844 820443 1213817
40148 1213817 4350427 2997552 -6011940 -12677276 -6570525 6515099 12651509 10829849
40140 10829849 12139659 19002688 20416230 11036644 744319 -1533519 -1407293 -6999731
40132 -6999731 -12913346 -8465860 3318104 8468346 3701146 2530197 14860839 30596699
40124 30596699 32746472 21241599 12306393 14882139 19852345 16981983 10938713 10874282
40116 10874282 13002766 7535240 -1366337 1254625 17203985 30078036 28609855 20369693
40108 20369693 15369834 10793938 2659310 -573756 9533389 24516095 29675519 25458294
40100 25458294 23681524 27363299 29226933 26905990 24546387 21338831 13759929 8216575
40092H216575P018815J4736369M987281r206549p765533N431349J0682874M129538
40084C8230719j16674M213030Q218209O005279K013207j036586n703423j0068197
40076D1755564q796236m728877n486681q454420m076941N494231P532103O48439
40068B3887182j900024M394398O430957l468368j2241934o238168O404937Q420417
40060B5689397j12270l555732M786096J4470519J4850069Q581119M594752N367460
40052G4671410O169715L402078o75724j411816K093791N652553M909878R9128
40044I4911013n435069r679105j2292487j2142273q482384m104910l067020m797846
40036C4909919m332824O46231O396920P933222M621978M4717j621207J370321
$$ plain form
40092 8216575 15235390 29971759 34959040 25752491 17986958 23418307 34101181 38230719
40084 38230719 38114045 42327075 50545284 56550563 58563770 57527184 51823761 41755564
40076 41755564 32959328 28230451 22743770 14289350 10212409 15706640 23238743 23887182
40068 23887182 21987158 26381556 32812513 29344145 17102211 10864043 17268980 25689397
40060 25689397 25577127 22021395 26807491 41278010 56128079 64709198 69303950 74671410
40052 74671410 80841125 84243203 83567479 82155663 84249454 89902007 94811885 94911013
40044 94911013 89475944 79796839 67504352 55362079 46879695 42774785 39707765 34909919
40036 34909919 30577095 31223326 37620246 45553468 50175446 50220163 48598956 49969277
40028D9969277P029781J1026871J0456426N758989j206792q477201j2808642j1510309
40020E0238400p353207o448983q468956n794772K861052O319611l079627j4793299
40012A3480219j3155793k91356P423878L466391k541105k899011j545926k362904
40004A574393j374560L487456O188295K907186q53623k4391J660524m40854l461821
39995I662605l034354m29884K506413P972714J5022574J5494580N210977p245348
39987D5160277j1118531p094769k618680j6614J841780K87223o278173j1140970
39979I021543p852369j910292k236606m934060L76253R901810Q031331o851382
39971C546228j5614701n374164J0919873J3477751L495762k327128J498397M229705
$$ plain form
40028 49969277 56999058 68025929 78482355 84241344 83034552 74557351 61748709 50238400
40020 50238400 42885193 36436210 27967254 22172482 25033534 31353145 28273518 13480219
40012 13480219 324426 33070 7456948 10923339 8382234 5483223 3937297 1574393
40004 1574393 199833 3687289 9875584 12782770 11929147 11904756 13565280 13124426 9662605
39995 9662605 6628251 6198367 8704780 16677494 31700068 47194648 52405625 45160277
39987 45160277 34041746 26946977 24328297 24311683 26153463 26440686 20162513 9021543
39979 9021543 1169174 -741118 -2977724 -7911784 -7535531 2366279 10397610 3546228
39971 3546228 -12068473 -17442637 -6522764 6954987 10450749 8123621 9622018 13851723
39963A3851723n49407n143922k620476J660057P90672j475950J433139O320536
39955A4266372O062391K713237K811349L045113n122210j6650002j4975075K172515
39947e676310J4890869Q726127m044358m437411M094481M733472k667761k497950
39939A3121159P626226J1380050J360947q551482o803650j639711l318379n062542
39931H112618L002203J3109543J0458546k557550r553151m329434L164773M076500
39923B5484048N23975k549349m073483l591252k51086L419864L842138K560425
39915B5365280L338817M400399J399351l268950l082653J175912J878753l080713
39907B8126196p445958p184161n015878k884142J091853N865595O454581K662764
$$ plain form
39963 13851723 13302316 8158394 5537918 7197975 7988647 6512697 7945836 14266372
39955 14266372 20328763 23042000 25853349 28898462 23776252 7126250 -7848825 -5676310
39947 -5676310 9214559 17940686 13896328 9458917 13553398 18286870 15619109 13121159
39939 13121159 20747385 32127435 33488382 24936900 18133250 16493539 13175160 8112618
39931 8112618 11114821 24224364 34682910 32125360 22572209 18242775 21407548 25484048
39923 25484048 26008023 23458674 19385191 15793939 15542853 18962717 22804855 25365280
39915 25365280 28704097 33104496 34503847 31234897 28152244 29328156 31206909 28126196
39907 28126196 20680238 13496077 8480199 5596057 6687910 12553505 19008086 21670850
39899B1670850N09116J762924N61442n465147r180296m577018L850839Q369962
39891A7502672Q255428O526118K489213m860580j0241297p000852K913020J0380709
39883B5964431J0027576M881558N94412q14972j126085k410681l904222k278087
39875C0933930L610375R054865Q174309K064334k397832k057577R989J975400
39867E1367793N728971J0129224J0670411R422315J5210420K7987974L4420457
39860A64937565K9064379K8536044M8150583P1014470O1203889J0323850m6865712
39853C66365068p0959959n8817227l7100353k6630175k6285273k6317072k2818810
39846I7436199j6696044q010458K867264J1778206J2956826N380676m487365q086822
$$ plain form
39899 21670850 22179966 23942890 24504332 19039185 9858889 5281871 9132710 17502672
39891 17502672 25758100 32284218 34773431 29912851 19671554 12670702 15583722 25964431
39883 25964431 35992007 40873565 41467977 40653005 39526920 37116239 33212017 30933930
39875 30933930 34544305 43599170 51773479 53837813 51439981 49382404 49392393 51367793
39867 51367793 57096764 67225988 77896399 87318714 102529134 130517108 164937565
39860 164937565 194001944 222537988 270688571 341703041 402906930 413230780 366365068
39853 366365068 295405109 236587882 199487529 172857354 146572081 120255009 97436199
39846 97436199 80740155 72729697 75596961 87375167 100331993 105712669 101225304 93138482
39838I3138482l860569N91466k244649r760095j2038411m236208P931946J5283856
39830H4805818J3591204M662259o122564j2349832j1516392q602599r757549j2147047
39822D2563298p403528L376204P871674P00198o778838l370408M380848L670717
39814D5010165k394145J24647J1096782J4063859K397810q627126m405881P510655
39806F4776766J0203380K372395k960006K83014M848432L832839j456911q343222
39798G3556687j6329313k0974219j4740574N67128J0749522N840872o170195r894884
39790B2605024k511380N227601N628840K525115K335745M915409O642653O502813
39782E3871820M804691K79762o818567j1756509j0222743m257418J054865M798979
$$ plain form
39838 93138482 89277913 89869379 87624730 77864635 65826224 61590016 69521962 84805818
39830 84805818 98397022 103059281 96936717 84586885 73070493 64467894 54710345 42563298
39822 42563298 35159770 38535974 46407648 47107846 40329008 36958600 41339448 45010165
39814 45010165 42616020 42740667 53837449 67901308 70299118 61671992 57266111 64776766
39806 64776766 74980146 77352541 74392535 74675549 79523981 83356820 81899909 73556687
39798 73556687 57227374 36253155 21512581 22079709 32829231 38670103 32499908 22605024
39790 22605024 20093644 25321245 30950085 33475200 35810945 40726354 47369007 53871820
39782 53871820 58676511 58956273 52137706 40381197 30158454 25901036 26955901 31754880
39774C1754880Q944934J1422854P337786k184567r295219j0153295r777314j2089071
39766A5960988j1906443l920984N548294N455334l245626q094671l252231L240511
39758b14828L860525K905273O328872R114356L365905o288228p599921L77403
39750A1849357N418766R50228m892538l797967j95807j599780m529349j024968
39742B177942N649128M263547n917902j1808984m828462P312571J2443405R374322
39734A8665567M449749o52403q055486j3890015j0167686K174454J0955256P502991
39726A0982427k418364p113898l793995O45415R35189o96384j5847K901021M743284
39717F168848L495041O5927k931775k719170J728406P555036R037610L385357
$$ plain form
39774 31754880 40699814 52122668 59460454 57275887 47980668 37827373 28050059 15960988
39766 15960988 4054545 133561 5681855 11137189 7891563 -203108 -3455339 -214828
39758 -214828 3645697 6550970 12879842 21994198 25360103 19071875 11471954 11849357
39750 11849357 17268123 18218351 13325813 9527846 9332039 7732259 3202910 2177942
39742 2177942 7827070 12090617 6172715 -5636269 -10464731 -3152160 9291245 18665567
39734 18665567 23115316 22462913 14407427 517412 -9650274 -7475820 3479436 10982427
39726 10982427 8564063 1450165 -2343830 -1698415 -763226 -1459610 -1475457 1425564 6168848
39717 6168848 9663889 9729816 6798041 4078871 5807277 13362313 22399923 25785280
39709B5785280m295253m887784L697706J1952543R702626N94078j229426Q631519
39701D9951289J5948145O816472j0603832j5426167l575671O364657P93684r845909
39693D0422668r404863j430249j306803r815338j2030723k165916P107465M696776
39685A6073017l385816n921001k944174j134933q56818J831845N020607L122625
39677A1805352k431719l643331K285604Q536384P806198J104991m542156m260775
39669A6660548L90087L866850K566614j525254l698596k604043j091924q15466
39661A3748816L17606L675464O497124N599620J836386j451105k081159L33807
39653B8476559M306058N907645K574641j134978K685592J3129866J8768791J2615398
$$ plain form
39709 25785280 21490027 16602243 20299949 32252492 41955118 42549196 41319770 49951289
39701 49951289 65899434 72715906 62112074 46685907 43110236 49474893 50268577 40422668
39693 40422668 31017805 29587556 28280753 18465415 6434692 4268776 11376241 16073017
39685 16073017 12687201 6766200 3822026 2687093 1830275 3662120 8682727 11805352
39677 11805352 9373633 5730302 8015906 16552290 24358488 25463479 20921323 16660548
39669 16660548 17050635 20917485 23484099 21958845 18260249 15656206 14564282 13748816
39661 13748816 14066422 17741886 24239010 29838630 31675016 30223911 28142752 28476559
39653 28476559 32782617 38690262 41264903 40129925 42815517 55945383 74714174 87329572
39645H7329572K090265k221046j385850l483878r343086j2795298j2129408j1036016
39637C7025255r542906m426509J323230J94230o691125q481647o98782O910932
39629A5612678M532545l378583n378699N12128N734844M316980l89929k471927
39621A9090037j177203L95041R81452K323290N035303N886238J353950o545795
39613B7342313j0846540p515010m52684L502547K497101l1719j076837q91795
39605A2527376j111576k585588m162019k371281M999503J3464779J4458670O623533
39597D1843397o67882j1291L209492k77036q659887j2064076p766065k632920
39589A2973732j237335j017739K85300J201683J664210L555763N104484K491474
$$ plain form
39645 87329572 89419837 87198791 85812941 82329063 72985977 60190679 48061271 37025255
39637 37025255 27482349 23055840 24379070 24573300 17882175 9400528 8701746 15612678
39629 15612678 20145223 16766640 11387941 11900069 17634913 21951893 21561964 19090037
39621 19090037 17912834 18307875 19289327 21612617 26647920 32534158 33888108 27342313
39613 27342313 16495773 8980763 8528079 12030626 14527727 14496008 13419171 12527376
39605 12527376 11415800 8830212 4668193 2296912 7296415 20761194 35219864 41843397
39597 41843397 41175515 41164224 44373716 44096680 35436793 23372717 15606652 12973732
39589 12973732 11736397 10718658 11003958 12205641 13869851 17425614 22530098 25021572
39581B5021572k210921k818697M83516J077735k554320m371102j617702J179979
39573A4190060J366567J885969L261951J688849j811278q42642L865012K797851
39565B6402339n910095j0136375k006875Q094316O065193n312011j1194905n013369
39557I88218N746695J0880689O969487j722477o448806j639717O996756P616312
39549B9387157j439932q609036o482841j998628k930436n250911k882396M25843
39541B18820m06538r74461L492622P359535N058830K810938O280612O607176m647035
39532B5800499j5779595j0078874N759534J0283238J044350l624993L138167O920097
39524B3462423n84987p449911l943971J060118k239914p504543n686723j279813
$$ plain form
39581 25021572 22810651 19991954 20475470 21553205 18998885 14627783 13010081 14190060
39573 14190060 15556627 17442596 20704547 22393396 20582118 19739476 23604488 26402339
39565 26402339 20492244 10355869 8348994 16443310 22508503 17196492 6001587 988218
39557 988218 6734913 17615602 24585089 22862612 16413806 14774089 21770845 29387157
39549 29387157 27947225 19338189 12855348 10856720 7926284 2675373 -207023 218820
39541 218820 -187718 -1162179 2330443 9689978 14748808 17559746 23840358 30447534 25800499
39532 25800499 10020904 -57970 5701564 15984802 17029152 13404159 16542326 23462423
39524 23462423 22877436 15427525 11483554 12543672 10303758 2799215 -2887508 -4167321
39516d167321j874500l536482m6758L560975L90318m000211o39956O196054N434940
39507A317059k170900n406262l48756N310289M994118K21059m711975o500575
39499g295943k268898O687224J1884411O564157l518674o594705j291901K539230
39491F704901l50918l767632j772174J785182P41621k880677k459601K559494
39483E60196N955591L874249o07822k993838l209439l401136k887700M77136M818008
39474B585245N154503J047278j759897j70906J185280j563748l591959P23004
39466C608800O723099O053206J044526P15543L908329M88300r193234j1707628
39458A640941k746754L891414j324715p400228k039685O220909K326973q559331
$$ plain form
39516 -4167321 -6041821 -9578303 -9625061 -6064086 -5673768 -9673979 -10313935 -4117881 1317059
39507 1317059 -853841 -6260103 -6608859 -1298570 3695548 3916607 -795368 -7295943
39499 -7295943 -9564841 -2877617 9006794 15570951 12052277 5457572 4165671 6704901
39491 6704901 6353983 2586351 814177 2599359 3340980 460303 -1999298 560196
39483 560196 6515787 10390036 9782214 6788376 3578937 177801 -2709899 -2232763 2585245
39474 2585245 7739748 8787026 7027129 6856223 8041503 6477755 2885796 3608800
39466 3608800 10331899 16385105 17429631 18145174 22053503 22541803 13348569 1640941
39458 1640941 -1105813 2785601 1460886 -5939342 -7979027 -1758118 568855 -7990476
39450g990476q660634L033319R825937N177950Q48109L716258M441764k876259
39442G515968p580471p65399P593321M073277n898727o684854K740713Q214442
39434I208270K699698n021059n375350j1914M474428N669884M254233Q42642k187069
39425A4553763j254770K652235L704099k27278l809045k636236l71741k582892
39417A0028135p284952p427865r39776O878359J0092026P034447l69523p617057
39409A0393794q780409j765933P235023R297355L681622j273604M95797N047442
39401B4331087M397261l344165j2316022j4898487p931308M163120J1613818Q498713
39393A4514017N35334j338747L803685N320080k098589q661428l864195O670059
$$ plain form
39450 -7990476 -16651110 -13617791 -3791854 1386096 2234205 5950463 10392227 7515968
39442 7515968 -64503 -829902 6763419 10836696 4937969 -1746885 993828 9208270
39434 9208270 11907968 6886909 1511559 1499645 5974073 11643957 15898190 16740832 14553763
39425 14553763 13298993 15951228 19655327 19428049 15619004 12982768 12611027 10028135
39417 10028135 2743183 -4684682 -5624458 1253901 11345927 18380374 18010851 10393794
39409 10393794 1613385 -152548 7082475 16379830 20061452 18787848 19283645 24331087
39401 24331087 28728348 25384183 13068161 -1830326 -9761634 -5598514 6015304 14514017
39393 14514017 15049351 13710604 17514289 22834369 20735780 12074352 8210157 14880216
39385A4880216R040362J352286n477118n687539n237642q509908r763346l092933
39377a2495622P177480J2071147Q921379K185614k750436l231398m70105P09904
39369A2117963k799810o377760k777861N549863P258793j162168q038521k586662
39361A183837Q771616J1118720J712482p711698p928522k501391K32745j605995
39353C271794l388468j346174K881287M244756L78660m379775l301618L410633
39345A771095P439852L445504k773196k331617L536075N234428o39860n590354
39337A0091927q75881R926167J4540988O900882n459183j0443605n800360r00024
39329A7980911l254204p851529n003135M000935P359616P7456p753408m895107
$$ plain form
39385 14880216 23920578 25272864 19795746 14108207 8870565 360657 -9402689 -12495622
39377 -12495622 -5318142 6753005 15674384 17859998 15109562 11878164 11408059 12117963
39369 12117963 9318153 2940393 162532 5712395 12971188 11809020 3770499 1183837
39361 1183837 9955453 21074173 22786655 15074957 7146435 4645044 4877789 3271794
39353 3271794 -116674 -1462848 1418439 5663195 6041855 1662080 -1639538 1771095
39345 1771095 9210947 12656451 9883255 7551638 11087713 16322141 15682281 10091927
39337 10091927 9216046 19142213 33683201 40584083 35124900 24681295 18880935 17980911
39329 17980911 14726707 6875178 1872043 5872978 13232594 13310050 5556642 661535
39321F61535N454233J0910520O613275p00176l640109k491100k122200m925705
39313I760273p738228m428171O846113J8074678J7473578L984361r331562j0832434
39305B3808608m079437k36377j983185l242636j308466M12084O99976K375955
39297A6446522N261002N352118K187594j63355m73607j558083l119428j212553
39289B2720210L200355L222635l004049p617839l873685M353691Q692338O857457
39281C4551113K341881k045957n259669n933704l992798k143176k255804k686021
39273A2575865j967521j764993k814417j755858L462434Q260264O979474J801187
39265B4776435J99035L714561N017544j704474j1346882j2760820k653585Q687623
$$ plain form
39321 661535 6115768 17026288 23639563 22939387 19299278 16808178 14685978 9760273
39313 9760273 2022045 -2406126 4439987 22514665 39988243 43972604 34641042 23808608
39305 23808608 19729171 19492794 17509609 14266973 12958507 13370591 14070567 16446522
39297 16446522 21707524 27059642 29247236 29083881 28610274 27052191 23932763 22720210
39289 22720210 25920565 29143200 26139151 18521312 14647627 19001318 27693656 34551113
39281 34551113 36892994 34847037 29587368 23653664 19660866 17517690 15261886 12575865
39273 12575865 10608344 8843351 6028934 4273076 7735510 15995774 22975248 24776435
39265 24776435 24975470 28690031 33707575 32003101 20656219 7895399 5241814 13929437
39257A3929437Q570753j896125p834461L402J1224557R025395n419955j3245021
39249A4357982m532456P707764P414891j453385l460136L767250Q028565L513191
39241C5343666j433767r420K581572Q0624l924464l701574j982326m107801p109907
39232A5736603m007170L840654P596150L601579k310616l634312j30101M671061
39224B5363848P284801M886063k373715q578117o969637Q65517N965219L694404
39216C0138383j179887l085742k675835j687239K138375Q824432J0784149K156884
39208D5413520r730895j1436419j504850P025309L981245n208023p554864J418899
39200B2403922J3234858J5956758O433442n844708q028502R82098P918520K282695
$$ plain form
39257 13929437 22500190 20604065 12769604 12773006 23997563 33022958 27603003 14357982
39249 14357982 9825526 17533290 24948181 23494796 20034660 23801910 31830475 35343666
39241 35343666 33909899 33900479 36482051 36562675 32638211 28936637 26954311 22846510 15736603
39232 15736603 11729433 15570087 23166237 26767816 24457200 20822888 20692787 25363848
39224 25363848 32648649 37534712 35160997 26582880 19613243 20478760 26443979 30138383
39216 30138383 28958496 25872754 23196919 21509680 23648055 32472487 43256636 45413520
39208 45413520 35682625 24246206 22741356 29766665 33747910 28539887 20985023 22403922
39200 22403922 35638780 51595538 58028980 52184272 44155770 45137868 53056388 55339083
39192E5339083q076884p323938M722062J1526310M430724m884957l313286M195094
39184E6614208M998017j82770m27133N504195P112219K45208o050386m366459
39176F3447099L73759O19539k176379k527004j018379j660455l089258l46903
39168E3622019N947167R326992O886397L045341K298878L341836L346318L775165
39160I1590113P130481J0201554O633337l018728r463618o211164J318244L189636
39152A01369855j273012l582375M84873M776996K761908k360792k507066L682578
39144A03352965R311605Q265661J732937m262274n050151q86199L874756N159699
39136A21498999L575647L664990Q075551J3735895J4806798Q643083j271212p322625
$$ plain form
39192 55339083 47262199 39938261 44660323 56186633 60617357 55732400 52419114 56614208
39184 56614208 61612225 61429455 61002322 66506517 73618736 73863944 67813558 63447099
39176 63447099 63820858 64440397 62264018 59737014 58718635 57058180 53968922 53622019
39168 53622019 59569186 68896178 75782575 78827916 81126794 84468630 87814948 91590113
39160 91590113 98720594 108922148 115555485 112536757 103073139 96861975 98180219 101369855
39152 101369855 100096843 96514468 96999341 101776337 104538245 102177453 99670387 103352965
39144 103352965 112664570 120930231 122663168 118400894 113350743 112464544 116339300 121498999
39136 121498999 125074646 128739636 136815187 150551082 165357880 174000963 172729751 165407126
39128A65407126l917329N937666J1893057Q058748J551274L034767J0272170J0572139
39120B12809618J068215m802845K866695J4513363J4923383N461603J95618L772325
39112B50807975O533003K047502k880310n6507P341653R986294N238181q29950
39104B78187841j971860J723979N405987N436407L216538K674875M194059L625517
39096C02493343j075697n404693l933368J779946M904946K040214l163486m838918
39088B92802287j325421K880038J371937o077375j0851966n701065L500295M429296
39080B81028026k487648k984539Q083555J5406987N097302j2721443j7241760
39073B74180480o141548L858507K346773m059655o217469l962782j111623L3322
$$ plain form
39128 165407126 161489797 167427463 179320520 187379268 188930542 191965309 202237479 212809618
39120 212809618 213877833 209074988 211941683 226455046 241378429 246840032 247035650 250807975
39112 250807975 257340978 259388480 256508170 256451663 263793316 273779610 279017791 278187841
39104 278187841 276215981 277939960 283345947 288782354 291998892 294673767 298867826 302493343
39096 302493343 301417646 296012953 292079585 293859531 298764477 300804691 297641205 292802287
39088 292802287 291476866 294356904 295728841 289651466 278799500 273098435 276598730 281028026
39080 281028026 278540378 275555839 283639394 299046381 304143683 291422240 274180480
39073 274180480 268038932 271897439 274244212 270184557 263967088 260004306 258892683 258926005
39065B58926005k596622q471780j0848915m850175K375982N20160o857706p458643
39057B20738306j322359j010010r065407j2252794l753208M780820J757672p242295
39049A92630725j0661185q242713o943741q264465r274414r458697q499163l721768
39041A27564579L327194M800507k089194q831062p723769k903734j870428l304377
39033A08969716j814611J233041M39941m200419p990191q385693n834682j658589
39025H0758513R32187j219094n135651m151977R02401J644346l540319n921084
39017F4269322j996078k84978n286582p563090O9640Q540479O842809l26523k386057
39008F1878942n14732j305346j914311K801465O225499J9346q125458m771351
$$ plain form
39065 258926005 256329383 247857603 237008688 232158513 234534495 235054655 228196949 220738306
39057 220738306 219415947 218405937 209340530 197087736 193334528 198115348 199873020 192630725
39049 192630725 181969540 173726827 166783086 158518621 149244207 139785510 131286347 127564579
39041 127564579 130891773 135692280 133603086 124772024 117048255 114144521 112274093 108969716
39033 108969716 107155105 108388146 108828087 104627668 96637477 88251784 82417102 80758513
39025 80758513 81690700 80471606 75335955 71183978 72086379 73730725 70190406 64269322
39017 64269322 62273244 61988266 56701684 49138594 49208234 57748713 64591522 64264999 61878942
39008 61878942 61364210 60058864 58144553 60946018 67171517 67190863 59065405 54294054
39000E4294054N792591P230758k110061p511546k941048J474273m09162j670214
38992E4149645J592044K155390l282914n920439J9819O693178N775235J173141
38984F2355099j99706o07238m925152r593856p908948j372151K735464J929647
38976D2413159o0023q5089J404527K330493O10536m002934p750167n849734N87601
38967B9598369M587683K182769k805998m753290k773208Q25266M439028O867622
38959C8168241O343430K435554k794527o447232o265276j778893L349645K562431
38951C5573373n428821j1943545p792146L902140J0932824P570773J14458l352475
38943B9576581j892669R07066K458602K174950J305775K516950N856457O122819
$$ plain form
39000 54294054 60086645 67317403 65207342 57695796 54754748 56229021 55819859 54149645
38992 54149645 55741689 57897079 54614165 48693726 48713545 55406723 61181958 62355099
38984 62355099 62155393 61548155 56623003 47029147 39120199 37748048 40483512 42413159
38976 42413159 42353136 42268047 43672574 46003067 46613603 42610669 34860502 29010768 29598369
38967 29598369 34186052 36368821 33562823 28809533 26036325 26861591 31300619 38168241
38959 38168241 44511671 46947225 44152698 37705466 31440190 29661297 33010942 35573373
38951 35573373 30144552 18201007 10408861 14311001 25243825 32814598 32929056 29576581
38943 29576581 27683912 28590978 31049580 33224530 34530305 37047255 42903712 49026531
38935D9026531p96165j0189679j2939395o951396J370879N987668N931294K786878
38927C4226615n32613m78620J683436j436422j1854913j8048528q696524Q792525
38919C654956J5861413P704456k230808l086197J129390K558462N75454k172280
38911B3994846m693680n018048j318163K386347N05127l784718k765701J749757
38903A1055767J111812l573804k419983M365808N184674k061377n498491j045187
38895G119219K22430n527547m992146P686425J5571103M465998j2379439j3907504
38887a741461k693001L313797M61766l92676L124495K999531q54139k22415L714959
38878G710856N57692r693093j3691345n058620O261177R253146M980455M12362
$$ plain form
38935 49026531 48230366 38040687 25101292 18149896 19520775 25508443 31439737 34226615
38927 34226615 33694002 33215382 34898818 33462396 21607483 3558955 -5137569 3654956
38919 3654956 19516369 27220825 24990017 21903820 23033210 25591672 26167126 23994846
38911 23994846 19301166 14283118 12964955 15351302 15856429 12071711 9306010 11055767
38903 11055767 12167579 8593775 6173792 10539600 15724274 13662897 8164406 7119219
38895 7119219 7341649 1814102 -3178044 4508381 20079484 24545482 12166043 -1741461
38887 -1741461 -4434462 -1120665 -658899 -1051575 2072920 5072451 4218312 3995897 7710856
38878 7710856 8268548 -1424545 -15115890 -20174510 -13913333 -4660187 320268 732630
38870G32630j287212n70992Q75938J12046l275128l762777K567367R043304O364511
38861A0799687j970032l509323L496845O489511k005085j2458159j1843179j115009
38853a2114744P476431O001776j633404n728849j197010P345203J0489045M785228
38845A5423676l407912o427996l756612R89723N955732Q694181M068924p554017
38837A3985699j5111707r374295K917748P382494J579730m300176m103693j468094
38829h492294L88852K747754M309040J285109l648110l154752K004255K880562
38821a679584k309469m112606K387545Q506948N087977m079807q957787o664266
38813a1821049j704118J848967K688915J107911q9005K386669O320876N257797
$$ plain form
38870 732630 -554582 -1125574 -249636 -137590 -3412718 -7175495 -4608128 4435176 10799687
38861 10799687 8829655 5320332 8817177 15306688 13301603 843444 -10999735 -12114744
38853 -12114744 -4638313 1363463 -269941 -5998790 -7195800 149403 10638448 15423676
38845 15423676 12015764 5587768 1831156 2820879 8776611 17470792 21539716 13985699
38837 13985699 -1126008 -10500303 -7582555 -200061 1379669 -2920507 -7024200 -8492294
38829 -8492294 -8103442 -5355688 -1046648 238461 -3409649 -6564401 -4560146 -1679584
38821 -1679584 -3989053 -8101659 -5714114 2792834 7880811 3801004 -5156783 -11821049
38813 -11821049 -13525167 -11676200 -8987285 -7879374 -7968379 -5581710 739166 5996963
38805E996963j274522n111202j128703M816948N001211J131184m0880J958777
38797A1349776J837743j737838m133919k652709n42162j184736k439414j14784
38789C81957M718435O029464J544310k751517q37805L419114J365482o054666
38781G814774p951673n0369P910390O577190n04979n767478r224740j1854410
38773a3051295p629924M911327J2271124L292920j0126812q146240N938104J0716555
38765a824241J237095m626746K359768Q399128K233419o074230m234279K020265
38757e09821J889147j487792L43898M547427L164376k386265n216763m301017
38749c956810j929584K439535O999248N269427k433463n502956P8671L399193
$$ plain form
38805 5996963 4722441 -388761 -1517464 3299484 8300695 9431879 9390999 11349776
38797 11349776 13187519 11449681 7315762 4663053 4120891 2936155 496741 381957
38789 381957 5100392 11129856 12674166 9922649 9084844 12503958 13869440 7814774
38781 7814774 -136899 -187268 7723122 14300312 13795333 8027855 -1196885 -13051295
38773 -13051295 -20681219 -15769892 -3498768 -205848 -10332660 -18478900 -12540796 -1824241
38765 -1824241 -587146 -5213892 -2854124 5545004 7778423 1704193 -2530086 -509821
38757 -509821 1379326 -108466 235432 4782859 7947235 5560970 344207 -3956810
38749 -3956810 -5886394 -3446859 3552389 8821816 6388353 885397 964068 4363261
38741D363261k578672p581577k409854L577554j91443m396059L757822J4550074
38733I091106R613591o016635j0772017j558883L572786k604951p282562l642082
38725i599647j595585n797792n675192L099042P819509J156206m083835L544031
38717a1133263J3557199J0241548k067308o957608j413139K564012j926438q502192
38709e637189q826418k373691N417469Q668750N286390q52911l941398l774505
38701f033503m548509n527876r45240Q382684J2860561Q024220J160207j307707
38693A2064837k792565o159502n602538J485718N140023k327464j0871038o400770
38685a5463299O518509J1298383M853459o2274K553535L780436k436983q448752
$$ plain form
38741 4363261 1784589 -5796988 -8206842 -4629288 -4820731 -9216790 -5458968 9091106
38733 9091106 18704697 12688062 1916045 357162 3929948 1324997 -5957565 -9599647
38725 -9599647 -11195232 -16993024 -22668216 -19569174 -11749665 -10593459 -14677294 -11133263
38717 -11133263 2423936 12665484 10598176 3640568 2227429 4791441 2865003 -5637189
38709 -5637189 -14463607 -16837298 -11419829 -2751079 2535311 1682400 -2258998 -6033503
38701 -6033503 -10582012 -16109888 -17055128 -8672444 4188117 12212337 13372544 12064837
38693 12064837 9272272 3112770 -2489768 -1004050 4135973 1808509 -9062529 -15463299
38685 -15463299 -8944790 2353593 7207052 7144778 9698313 13478749 11041766 2593014
38677B593014o568967j585595j232516l136797n07403N140625O467693K728707
38669C898761Q99495M159092O463814J507184p462407j1249281o761089p42539
38661i286970N3515j773585R70339Q526161J3514624J1375244M908867k189310
38653B6098885q841944j2028971p714521J6021N86383o617001q250755K161785
38645a4590118J1312724O659554j745573J933657R726907R71961j9851901k3839062
38637b9421851k085461J7105721R284960j0296565j1711319N227986J5180410
38630f716119O927632n204349p597733l533412k15223K730950O117135N995767
38622a495352J728800q55584O69852J117633k532425n668981m551838k199901
$$ plain form
38677 2593014 -3975953 -5561548 -6794064 -9930861 -10438264 -5297639 1170054 3898761
38669 3898761 4798256 8957348 15421162 16928346 9465939 -1783342 -8544431 -9286970
38661 -9286970 -9233455 -11007040 -10036701 -1510540 12004084 23379328 28288195 26098885
38653 26098885 17256941 5227970 -2486551 -2470530 -1884147 -8501148 -16751903 -14590118
38645 -14590118 -3277394 3382160 1636587 3570244 13297151 14269112 -5582789 -29421851
38637 -29421851 -31507312 -14401591 -5116631 -15413196 -27124515 -21896529 -6716119
38630 -6716119 211513 -4992836 -12590569 -16123981 -16339204 -13608254 -7491119 -1495352
38622 -1495352 233448 -622136 47716 1165349 -1367076 -7036057 -11587895 -13787796
38614a3787796j518071l47566K134029J848563k132283l403487J804783P180074
38606h221754N718607P22405l28398J664243l46870o899179r921122l869249O895447
38597a4585870J3210634J0240582J006474p067938r151796p100838n206388k965545
38589b1620685L106450J0449569J0723672K160595n874124n698590j537156o12731
38581h903000j377027Q03432K737887r38944n562785j960466P500833J0295720
38573B595650J833484q333446j0036555l266191N755054J0671691O629157m927109
38565I21735j2570027o169795P350617J0959952J757165n009796N3780O968020
38557D261651M298609k995263m305055r81798r58786l825492l499682m228K581163
$$ plain form
38614 -13787796 -15305867 -15653433 -13519404 -11670841 -13803124 -17206611 -15401828 -8221754
38606 -8221754 -2503147 -1780742 -2109140 -444897 -791767 -7690946 -17612068 -21481317 -14585870
38597 -14585870 -1375236 8865346 9871820 2803882 -6347914 -13448752 -18655140 -21620685
38589 -21620685 -18514235 -8064666 2659006 4819601 -1054523 -6753113 -8290269 -8903000
38581 -8903000 -10280027 -9476595 -6738708 -7677652 -13240437 -15200903 -7700070 2595650
38573 2595650 4429134 -3904312 -13940867 -17207058 -11452004 -780313 5848844 921735
38565 921735 -11648292 -17818087 -10467470 492482 2249647 -2760149 -2706369 4261651
38557 4261651 8560260 5564997 1259942 278144 -680642 -4506134 -8005816 -8010044 -5428881
38548e428881M867398Q347739P946374o63807j0596213j1536621m475130J522056
38540a0017085L228626L483317K034626k278056m349169P2452M316764P62625
38532b745900m038984N59538Q687278N718939n858813r039636j110207K584844
38524e242941k650979k486195P824816J0961848k371835j3470098m751998J0070523
38516b116859P772452o740396r933668J985306J0225632N704159n91947q48543
38508E456136j611693o851881q920544l372724K466569K573600R66492J404756
38500g889289M87489k926440k914732K277435M600362j251755q721792r549231
38492b5887953m985173o39113K258222M438926M535001L000408L477147N812188
$$ plain form
38548 -5428881 -561483 7786256 15732630 15068823 4472610 -7064011 -11539141 -10017085
38540 -10017085 -6788459 -3305142 -1270516 -3548572 -7897741 -7825289 -3508525 -2745900
38532 -2745900 -6784884 -6225346 2461932 8180871 2322058 -6717578 -7827785 -5242941
38524 -5242941 -7893920 -10380115 -2555299 8406549 6034714 -7435384 -12187382 -2116859
38516 -2116859 5655593 -1084803 -11018471 -9033165 1192467 6896626 6304679 5456136
38508 5456136 3844443 -3007438 -11927982 -15300706 -12834137 -10260537 -9294045 -7889289
38500 -7889289 -7401800 -10328240 -13242972 -10965537 -6365175 -7616930 -16338722 -25887953
38492 -25887953 -30873126 -31512239 -29254017 -24815091 -20280090 -17279682 -13802535 -7990347
38484g990347N127449J680012K355028P439497O712487l964546j3011873r775693
38476a1427986q97353J508123q51220J214903N598530K442011o638617r058139
38468a8109748j556675M730340K531432j209142J717073Q064836R533837M241499
38460I943452l629729r653138j0344120m219159M294417P176862K687847k048905
38452e792473j537240P12221n20902l168906k079658J770304K846752K4916k074972
38443i819958o23213J576643J057258j009703n97444L664049Q669778J0344965
38435A3262375P612645K338790l305748p627557q484722m768224Q29356M043176
38427C900091M836258O530184P866425K519159r472577j6914962j1272631M99550
$$ plain form
38484 -7990347 -2862898 -1182886 1172142 8611639 15324126 11359580 -1652293 -11427986
38476 -11427986 -12325339 -10817216 -11668436 -10453533 -4855003 -2412992 -9051609 -18109748
38468 -18109748 -19666423 -14936083 -12404651 -13613793 -11896720 -3831884 5701953 9943452
38460 9943452 6313723 -3339415 -13683535 -17902694 -13608277 -6431415 -3743568 -5792473
38452 -5792473 -7329713 -6617492 -7138394 -10307300 -12386958 -10616654 -7769902 -7744986 -9819958
38443 -9819958 -10443171 -8866528 -7809270 -8818973 -9416417 -5752368 2917410 13262375
38435 13262375 20875020 23213810 19908062 12280505 3795783 -972441 -143085 3900091
38427 3900091 8736349 15266533 23132958 25652117 16179540 -735422 -12008053 -11508503
38419a1508503N770116L888890L119611L795841j472695j1000508j2544039k718686
38411b2669973N770589L070910l555027k894909L065896N234123K601370O76198
38403h700823O25810K51851J071207M535196N540359p6467n609360k385628M438497
38394c09358J928529r264204j3264389j973157J2394484J3911140K962375p427962
38386a042542q739553l059095L660971P051885M674770k772833r911837j0333402
38378b0471636l355665M478327N743350k10226o296789m919903L759385J1910000
38370i363157J2773616P376408J493918j309803j264608K28611J197562j020833
38362A0111714o425399r943171o500517J741070O874788M237793k828604p126447
$$ plain form
38419 -11508503 -5738387 -1849497 1270114 5065955 3593260 -7407248 -19951287 -22669973
38411 -22669973 -16899384 -13828474 -17383501 -20278410 -17212514 -11978391 -9377021 -8700823
38403 -8700823 -8075013 -7823162 -6751955 -2216759 3323600 3247133 -2362227 -4747855 -309358
38394 -309358 1619171 -7645033 -20909422 -22882579 -10488095 3423045 6385420 -1042542
38386 -1042542 -9782095 -12841190 -9180219 -2128334 2546436 -226397 -10138234 -20471636
38378 -20471636 -23827301 -19348974 -13605624 -13815850 -20112639 -25032542 -21273157 -9363157
38370 -9363157 3410459 10786867 12280785 10970982 9706374 9934985 11132547 10111714
38362 10111714 3686315 -6256856 -12757373 -11016303 -4141515 96278 -2732326 -9858773
38354i858773m236477M295201J1969018J2292119M994222l535084p499091p293830
38346A127305o138160m596726j866508O25505J189971J153148K324367L716706
38338b464392M393358N992674P989295M912498n362564j4500567j2832312l220004
38330a5092014K514889j29931m058776k683138J931824M781824M992582M573148
38322c169592M657742M917310M116901J372545j284608k51427L234919K820743
38314A6414533k879541o346260l165165k73793l766503o706653o38956Q202706
38306H40368Q189540J610346j047207q23487o246935j3213966r184699L402640
38298a6473400Q947254M841928L740336P256712J940963j2306700j5560502o57681
$$ plain form
38354 -9858773 -14095250 -9800049 2168969 14461088 19455310 15920226 8421135 1127305
38346 1127305 -5010855 -9607581 -11474089 -10848584 -9658613 -8505465 -6181098 -2464392
38338 -2464392 1928966 7921640 15910935 20823433 15460869 960302 -11872010 -15092014
38330 -15092014 -12577125 -12707056 -16765832 -19448970 -17517146 -12735322 -7742740 -3169592
38322 -3169592 1488150 6405460 10522361 11894906 10610298 10358871 13593790 16414533
38314 16414533 13534992 7188732 4023567 3749774 -16729 -6723382 -7362338 840368
38306 840368 9029908 10640254 9593047 8769560 2522625 -10691341 -19876040 -16473400
38298 -16473400 -7526146 -2684218 1056118 8312830 10253793 -2052907 -17613409 -18271090
38290a8271090J1820295N955970m828572k810494N413404N494780J824403N029893
38282I628589Q687719K115891o522157l850585L080098p28581r772621p833049
38274e194696J473233J181571o845644m701159P660893J0007641l143353j2076188
38266a1637702l975838Q257711R240345L116868J246547L993448N609356M851525
38258B0702260K005254m220436j0479466r314073l29527Q569004J2897507J3860310
38250C3690833R278479l729905j6564076j5666505l411178L819240Q50073q56395
38242G410566L497337L431456n089308r437740k313359M435306N47379m822501
38234b340864n66225N699311J018040r816967j1654494k600095N295199N155698
$$ plain form
38290 -18271090 -6450795 -494825 -5323397 -8133891 -2720487 2774293 4598696 9628589
38282 9628589 18316308 20432199 13910042 10059457 13139555 12410974 2638353 -5194696
38274 -5194696 -3721463 -2539892 -9385536 -14086695 -6425802 3581839 438486 -11637702
38266 -11637702 -15613540 -7355829 1884516 5001384 6247931 10241379 15850735 20702260
38258 20702260 22707514 18487078 8007612 -1306461 -1635988 6933016 19830523 33690833
38250 33690833 42969312 39239407 22675331 7008826 3597648 7416888 8266961 7410566
38242 7410566 10907903 14339359 9250051 -187689 -2501048 1934258 2481637 -2340864
38234 -2340864 -2907089 2792222 3810262 -6006705 -17661199 -20261294 -14966095 -9810397
38226i810397K003283J981425M756643O293785L464138k816277o833280m236969
38218e197649R18705J811281K00812K317571N284628J411267m834587j518304
38210C93724P905963O948779m529171o610512O447226J3262452P62154j1968276
38202A2612339n121100Q392660N484496q594322j1717692k448214K338665k90599
38194F56233K100223R481339P268049o323776j4592307q238792K711217P193781
38186B55967O209877L566590j006764n103068l267623K709268M296364n10245
38178G150366m497604k927360J495668N146597O069347J932617n541565p669210
38170A158856j88167P418154N099392j473448j033729L379090M22547q716058
$$ plain form
38226 -9810397 -7807114 -5825689 -1069046 5224739 8688877 5872600 -960680 -5197649
38218 -5197649 -4278944 -2467663 -2266851 50720 5335348 6746615 1912028 393724
38210 393724 8299687 15248466 10719295 4108783 10556009 23818461 24580615 12612339
38202 12612339 7491239 15883899 21368395 12774073 1056381 -1391833 946832 656233
38194 656233 2756456 12237795 19505844 13182068 -1410239 -9649031 -6937814 255967
38186 255967 6465844 10032434 9025670 3922602 654979 3364247 7660611 7150366
38178 7150366 2652762 -274598 1221070 6367667 12437014 14369631 8828066 1158856
38170 1158856 970689 8388843 13488235 12014787 10981058 14360148 14782695 6066637
38162F066637j2374597p846133k331029J984515P115594P778128j100372r408860
38154a0116117m018202P797322Q300449r01125k839081L329363J885922p509920
38146d071389o776902O266195J0298596k759072j2124324l352378P665364L628659
38138a225251n282304k338771O015553M247004l828095l692607L617185N309588
38130B822302n46005m967315n025418m790261m279863j241229J063767l98771
38122a7362793q78134L516333O952580L756925j274613k361661k736433m933520
38114a5321316k656764N813216Q693849p08419r142963l519914O363372M217619
38106f261320m436457k233155R284376J2088177J556955q085880p785350l238920
$$ plain form
38162 6066637 -6307960 -14154093 -16485122 -14500607 -7385013 393115 -707257 -10116117
38154 -10116117 -14134319 -6336997 1963452 1062327 -1776754 1552609 3438531 -4071389
38146 -4071389 -10848291 -4582096 5716500 2957428 -9166896 -12519274 -4853910 -1225251
38138 -1225251 -6507555 -8846326 -2830773 1416231 -2411864 -6104471 -2487286 2822302
38130 2822302 2276297 -2691018 -7716436 -12506697 -16786560 -18027789 -16964022 -17362793
38122 -17362793 -18240927 -14724594 -7772014 -4015089 -5289702 -7651363 -10387796 -15321316
38114 -15321316 -17978080 -12164864 -3471015 -4179434 -13322397 -16842311 -10478939 -6261320
38106 -6261320 -10697777 -12930932 -3646556 8441621 9998576 1912696 -5872654 -9111574
38098i111574J28987L400186M284839j632478q447404n401739M054443N575624
38090g149116k297367n578787R50352N426864M10094m892673k021220K603161
38082a2548692O09238m118176m241472j512321q30644m71606K647094N265288
38074a5201291L799871J818959L729156O445338M688971M2068k135167j269588
38066A918317r18657k105398k479616o64166K030034L189040J251821k340404
38058a19029l219814N14974M133162K290133k209885k304640J497289J589892
38050B172082l464036n360418P48136P712576O376000j890228q047408o690563
38042h443859j32226N565196N421739n43806o024410m369835K805317P065241
$$ plain form
38098 -9111574 -8982587 -5582401 -1297562 -2930040 -11377444 -16779183 -12724740 -7149116
38090 -7149116 -9446483 -15025270 -14074918 -8648054 -8237960 -13130633 -15151853 -12548692
38082 -12548692 -11939454 -16057630 -20299102 -21811423 -22642067 -23113673 -20466579 -15201291
38074 -15201291 -11401420 -9582461 -5853305 592033 5281004 5323072 3187905 1918317
38066 1918317 999660 -1105738 -3585354 -4249520 -2219486 969554 2221375 -119029
38058 -119029 -3338843 -2823869 1309293 3599426 1389541 -915099 582190 2172082
38050 2172082 -1291954 -6652372 -5904236 1808340 8184340 6294112 -1753296 -8443859
38042 -8443859 -8576085 -3010889 2410850 1867044 -4157366 -8527201 -5721884 1343357
38034A343357M309690n96277j909717J8871K333707M330237M941160J057932o902076
38025H926884j1999409q542884j18120M946020M227039K565140L548682M541431
38017H094783J852940k482475k879472J035368K234419l638301r433302m861650
38009a0077690O951594J0909981J281743q758228o327201K154791K526139m224342
38001e563213n478952N59494K643407k757694m910227K387762R878732P849827
37993D609136L03785l898625m196254m013394j623982N125117J0752477Q034350
37985A5092610j243980q520628q852661l827411K611509O346895M435692j243855
37977D798171m735812l490133r52717O39794L641217P563387O008727k901117
$$ plain form
38034 1343357 5653047 5056770 3147053 3165924 5499631 9829868 14771028 15828960 8926884
38025 8926884 -3072525 -11615409 -11733529 -6787509 -2560470 4670 3553352 8094783
38017 8094783 9947723 7465248 4585776 5621144 7855563 4217262 -5216040 -10077690
38009 -10077690 -3126096 7783885 9065628 307400 -6019801 -3865010 -1338871 -5563213
38001 -5563213 -11042165 -10482671 -7839264 -10596958 -15507185 -13119423 -3240691 4609136
37993 4609136 4912921 1014296 -3181958 -7195352 -8819334 -3694217 7058260 15092610
37985 15092610 13848630 5328002 -3524659 -7352070 -4740561 1606334 6042026 4798171
37977 4798171 62359 -3427774 -4380491 -3740697 -99480 7463907 13472634 10571517
37969A0571517j0128426p368399P56736M255808K241442R15669J618316R34489
37961C797152j82771K228546O016952N212097R51232m0960J766851j559828j0495433
37952G693838j4009152n843849M699559N803247k38676k217282K835523P132961
37944E856169N096965M1625k910969l393953l084844j951320O0559J523695J909256
37935C147183K052103R45383l340773p731378n227503M078814R504799M008510
37927G437138l783036j324058P948670Q764868k325224j1035388o823606K661672
37919A521036N623546K951393J270784q92887p592404j3044073q365245K906644
37911a5621206Q909056O939361M360943L539015n45830o935197o781717J549732
$$ plain form
37969 10571517 443091 -6925308 -6168572 -1912764 328678 1244347 2862663 3797152
37961 3797152 3614381 5842927 11859879 17071976 18023208 17982248 19749099 18189271 7693838
37952 7693838 -6315314 -12159163 -7459604 -1656357 -1895033 -4112315 -1276792 5856169
37944 5856169 10953134 10994759 8083790 4689837 1604993 -346327 -285768 1237927 3147183
37935 3147183 5199286 6144669 2803896 -4927482 -10154985 -6076171 3428628 7437138
37927 7437138 3654102 2330044 10278714 19043582 16718358 5682970 -1140636 1521036
37919 1521036 7144582 10095975 11366759 10473872 2881468 -10162605 -18527850 -15621206
37911 -15621206 -6712150 227211 4588154 8127169 7581339 646142 -6135575 -4585843
37903d585843P541496L723722m350906q387701q087509o063591j080338O850510
37895a4440160J1971653J0288816N880822L812590K267253k399205p831648r010871
37887E39250n674737j310168J995307L654688K969188Q43573k25644q4471p19017
37878A987969j001821K287509O709983N203704k234132o335488k293763K896368
37870G220329K245826q46883q61736k81081l049356n509052l336167r67159l882702
37861i267981p173581l021556M781156N821653l5199l048469j05217J536148j622389
37852a2135435l218997J145076N906580M700367K226k090936j200338j064023
37844g955480k204939j568693K061190O249160Q028063O428807K356552k248929
$$ plain form
37903 -4585843 2955653 6679375 2328469 -6059232 -14146741 -20210332 -21290670 -14440160
37895 -14440160 -2468507 7820309 13701131 17513721 19780974 17381769 9550121 539250
37887 539250 -5135487 -6445655 -4450348 -795660 2173528 3017101 2791457 2706986 1987969
37878 1987969 986148 3273657 9983640 15187344 12953212 6617724 4323961 7220329
37870 7220329 9466155 8619272 7757536 7476455 4427099 -1081953 -4418120 -5385279 -9267981
37861 -9267981 -16441562 -19463118 -14681962 -8860309 -8895508 -11943977 -12049194 -10513046 -12135435
37852 -12135435 -15354432 -14209356 -8302776 -3602409 -3600183 -5691119 -6891457 -7955480
37844 -7955480 -10160419 -11729112 -9667922 -3418762 4609301 11038108 13394660 11145731
37836A1145731n183544n101152k438879P56219K273449J629872L77740j56115
37828C303321p23834k329761l613843k604657l61069L63614k50227N59548L225004
37819b431904N186227N123779L688416L49251n363818r551822o932820J001517
37811h931174O710820O399436L168614J02801k758064m124608k145127o0608k366530
37802d004440m960120J16669R198531R495203j03156n703906j103398K618862
37794E554245j640109l727267L509380Q006388p34833j0034994l762765Q668043
37786E838088O589946p102863j1021757j172857M671901p08004l341859M502816
37778a744589J0110789L415641n804713n807760j435580j873402l396220J838322
$$ plain form
37836 11145731 5962187 861035 -1577844 -821625 1451824 3081696 3459436 3303321
37828 3303321 2579487 249726 -3364117 -5968774 -6329843 -5966229 -6216456 -5656908 -2431904
37819 -2431904 2754323 7878102 11566518 11915769 6551951 -2999871 -9932691 -8931174
37811 -8931174 -2220354 4179082 7347696 7450497 4692433 567825 -1577302 -1637910 -4004440
37802 -4004440 -8964560 -8847891 350640 9845843 9742687 4038781 2935383 5554245
37794 5554245 3914136 186869 3696249 11702637 10967804 932810 -2829955 5838088
37786 5838088 12428034 5325171 -5696586 -6869443 -2197542 -2905546 -6247405 -1744589
37778 -1744589 8366200 11781841 5977128 169368 -1266212 -3139614 -6535834 -4697512
37770d697512R606903R720580K249390l640745l271419k19280O77511k054039
37762H371389o234124o859979j110274N664645M837256l083869q360413o021432
37754a2796801j173144J691650M199918N669643J152033o623525n891833N416455
37746h355604J1692088J411993j3407761j2876997K763262J4785236J1707100
37739G719317K15765q053079q790993l778455K836433N821848L450948N85920
37731G704J342694J553130l610008q047608j976170J0222670J2280261o95351
37723A1077322j3203915j0216639K538653Q206701K181481m850192m583811q02673
37715i653073J87400n95866N17395J879181j40500l448156k712580J998407N593066
$$ plain form
37770 -4697512 4909391 14629971 16879361 13238616 9967197 9747917 10425428 8371389
37762 8371389 2137265 -4722714 -5832988 -168343 4668913 1585044 -6775369 -12796801
37754 -12796801 -13969945 -12278295 -8078377 -2408734 -1256701 -7880226 -13772059 -8355604
37746 -8355604 3336484 4748477 -8659284 -21536281 -18773019 -3987783 7719317
37739 7719317 7935082 -117997 -8908990 -12687445 -9851012 -4029164 -578216 7704
37731 7704 1350398 2903528 -706480 -8754088 -10730258 -507588 11772673 11077322
37723 11077322 -2126593 -12343232 -9804579 -1597878 583603 -4266589 -8850400 -9653073
37715 -9653073 -9465673 -10061539 -9544144 -7664963 -7805463 -11253619 -13966199 -11967792 -6374726
37706f374726O266437O518622N928388J253191m519281k793570O359255J0174809
37698B2813125J026004j0348358r600199K27784M751043M86755k966788j165184
37690E224182n33798m207894n736587j171812L745189L336433l16018l508623
37682c168928n951061o157376j045828O165378P298853K478881J695938Q147060
37674I462917J1178353L028724p874228r393217k768140K283722K183857m15501
37666G686487m625818r355101q706876L82351R780603R202175P99476m306295
37658H57002j819038K095330J696899j685949l833841k652938Q12935K883299
37650a646301O63349k794258j292413L996678L997736l738713q641115k735131
$$ plain form
37706 -6374726 -108289 6410333 12338721 13591912 9072631 6279061 12638316 22813125
37698 22813125 23839129 13490771 3890572 4118356 8869399 9356154 6389366 5224182
37690 5224182 4690384 482490 -5254097 -6425909 -2680720 655713 339695 -3168928
37682 -3168928 -9119989 -15277365 -16323193 -10157815 -2858962 -380081 1315857 9462917
37674 9462917 20641270 23669994 15795766 6402549 3634409 5918131 8101988 7686487
37666 7686487 3060669 -6294432 -15001308 -14618957 -4838354 4363821 5163297 857002
37658 857002 -962036 1133294 2830193 1144244 -2689597 -5342535 -4529600 -1646301
37650 -1646301 -982952 -3777210 -5069623 -1072945 2924791 -813922 -9455037 -12190168
37642a2190168N722388M263701m970324r901884o918935k442802M23164M159181
37634b1855679P242932M668994j448289k771784K272398N820572K491878m180309
37626g759287q506454q569068m717136J195028N022962M667416L630938M393391
37618a0642210K426544m855199q542625J97387J2810055J2562387J76046n981048
37610a848663K327600J1640226Q761810q69163n416045m495688m453391n577965
37602F8721m586065k720452k010047M56742O142105Q928459L694268m457076p547170
37593b030515n889933l993532j249548M119202P195148K856087l722937l608673
37585f324701J763265L816987J903855L160723P820273P469900K50819m502102
$$ plain form
37642 -12190168 -6467780 -2204079 -7174403 -17076287 -23995222 -26438024 -26014860 -21855679
37634 -21855679 -14612747 -9943753 -11392042 -14163826 -11891428 -6070856 -3578978 -7759287
37626 -7759287 -16265741 -24834809 -29551945 -28356917 -23333955 -18666539 -15035601 -10642210
37618 -10642210 -8215666 -13070865 -21613490 -21416103 -8606048 3956339 4132385 -1848663
37610 -1848663 478937 12119163 20880973 20011810 14595765 10100077 5646686 68721
37602 68721 -4517344 -7237796 -9247843 -8791101 -2648996 6279463 9973731 5516655 -2030515
37593 -2030515 -7920448 -11913980 -13163528 -9044326 -1849178 1006909 -2716028 -6324701
37585 -6324701 -4561436 -744449 1159406 4320129 12140402 19610302 19861121 15359019
37577A5359019j600938J056156m150673j1484163j0940582l738988R98198R81780
37569a3520191K182632O887951R732069O778088Q59936m256594q362035j0531932
37561a0230076o618737M157641J4217636J4580498N190118n496451r820888o798850
37553h19109o23543L252743K080052j090747l01235M456879N176975k340583r228146
37544E63286m719400O312881Q476978j069717p709044k031287N686394K671084
37536H181175n954380o854433o70745R21385l284601k077778P369380J2499776
37528A0129779M862436o315433q281804k543892J115073R87217K674873N873287
37520H501536L589426m892218j0134022n580379K195743K029881o188348j0835702
$$ plain form
37577 15359019 13758081 14814237 10663564 -820599 -11761181 -15500169 -14501971 -13520191
37569 -13520191 -11337559 -4449608 5282461 12060549 12920485 8663891 301856 -10230076
37561 -10230076 -16848813 -12691172 1526464 16106962 21297080 15800629 5979741 -819109
37553 -819109 -1442652 1810091 3890143 2799396 2498161 6955040 12132015 9791432 563286
37544 563286 -4156114 2156767 10633745 9564028 1854984 -176303 5510091 8181175
37536 8181175 2226795 -4627638 -5298383 -4376998 -7661599 -9739377 -2369997 10129779
37528 10129779 14992215 8676782 394978 -2148914 -1033841 -46624 2628249 8501536
37520 8501536 12090962 7198744 -2935278 -8515657 -6319914 -4290033 -10478381 -21314083
37512b1314083m295071O264483Q486234K052906j436925L246180O230752j397939
37504b163463j1066544q062160M846955J0204896L124811q02016Q326336J6526998
37496B0935813P244518j0877033j5319031l139885O012052M60836q457388p277693
37488a0417811r1568K154229m86277j413810q69528k599149l305138K021577Q092068
37479f915407N326248l831000p153827j396473L637145J979282J94225M408859
37471c750948R474976P844711R39281n046700p647501o316011N70573J0009643
37463F078024J2656916M473861o065239r743939q604085p922179m418519N941029
37455g604131J5059924J1552552j123066q923708p267386l514907j595018J427128
$$ plain form
37512 -21314083 -25609154 -19344671 -10858437 -8805531 -10242456 -6996276 -765524 -2163463
37504 -2163463 -13230007 -21292167 -16445212 -6240316 -3115505 -3917521 4408815 20935813
37496 20935813 28180331 17303298 1984267 -1155618 4856434 5317270 -3140118 -10417811
37488 -10417811 -10509379 -8355150 -8841427 -10255237 -11124765 -13723914 -17029052 -15007475 -6915407
37479 -6915407 -1589159 -5420159 -12573986 -13970459 -10333314 -8354032 -8159807 -3750948
37471 -3750948 5724028 13568739 14508020 9461320 1813819 -4502192 -3931619 6078024
37463 6078024 18734940 23208801 17143562 7399623 -1204462 -9126641 -13545160 -7604131
37455 -7604131 7455793 19008345 17885279 8961571 1694185 -1820722 -3415740 -1988612
37447a988612M435868K878939O3436K368860L707343o966549k1623513j8390732
37439c5514960L703729J8096845R039480n895169o182546O30776j700559o770300
37431b4592704R51043J4202737J2416903l129628j0577863k481997N494405K777098
37423d940006k475443k709408k817294n451359l071841O422283J1744587N438307
37415B139826l748224m683936Q79730M970734N306267K920531k769457r116615
37407d101144q945718r22599O635131P875447O614634O196064K645462m932419
$$ plain form
37447 -1988612 2447256 5326195 5389631 7758491 11465834 4499285 -17124228 -35514960
37439 -35514960 -31811231 -13714386 -4674906 -10570075 -16752621 -16121845 -17822404 -24592704
37431 -24592704 -23641661 -9438924 2977979 -151649 -10729512 -13211509 -7717104 -4940006
37423 -4940006 -7415449 -10124857 -12942151 -18393510 -21465351 -15043068 -3298481 2139826
37415 2139826 -1608398 -6292334 -5412604 -441870 4864397 7784928 5015471 -4101144
37407 -4101144 -13046862 -13969461 -7334330 541117 7155751 13351815 15997277 11064858
$$ [...]
##END NTUPLES=NMR SPECTRUM
##END=
