##TITLE=31Pdec_SR160_oil
 , 64 sc
 18.1.2023
##JCAMPDX= 6.0         $$ Bruker NMR JCAMP-DX V2.0
##DATA TYPE= NMR SPECTRUM
##DATA CLASS= NTUPLES
##ORIGIN= UXNMR, Bruker Analytische Messtechnik GmbH
##OWNER= root
$$ XWIN-NMR		Version 3.5
$$ Wed Jan 18 13:59:46 2023 Russian Standard Time (UT+4h)  she@DPX200
##.OBSERVE FREQUENCY= 81.013821
##.OBSERVE NUCLEUS= ^31P
##.ACQUISITION MODE= SIMULTANEOUS
##.ACQUISITION SCHEME= undefined
##.AVERAGES= 64
##.DIGITISER RES= 16
##SPECTROMETER/DATA SYSTEM= spect
##.PULSE SEQUENCE= zgpg30
##.SOLVENT NAME= CDCl3
##.SHIFT REFERENCE= (INTERNAL, CDCl3, 0, 248.564)
##AUDIT TRAIL= $$ (NUMBER, WHEN, WHO, WHERE, WHAT)
$$ ##TITLE= Audit trail, XWIN-NMR		Version 3.5
$$ ##JCAMPDX= 5.01
$$ ##ORIGIN= Bruker BioSpin GmbH
$$ ##OWNER= she
$$ F:/spectra/data/she/nmr/P31/1/pdata/1/auditp.txt
$$ ##AUDIT TRAIL=  $$ (NUMBER, WHEN, WHO, WHERE, WHAT)
(   1,<2023-01-18 13:58:40.04 +0400>,<she>,<DPX200>,
      <continue with go, POWCHK disabled, PULCHK disabled
       configuration hash MD5:
       00 E9 B6 7A A2 85 ED C7 34 08 36 98 17 FE 4E 26
       data hash MD5: 32K
       17 40 5A 69 EE FD F1 56 AD A2 D3 B8 1E 19 A5 A9>)
(   2,<2023-01-18 13:58:53.73 +0400>,<she>,<DPX200>,
      <Start of raw data processing
       efp BC_mod = 2 LB = 1 FT_mod = 6 PKNL = 1 PHC0 = -11041.95 PHC1 = 251.8578 SI = 64K 
       data hash MD5: 64K
       A7 0C 25 A2 24 E6 48 25 A1 A0 B2 DF FE AA D6 99>)
(   3,<2023-01-18 13:59:14.98 +0400>,<she>,<DPX200>,
      <pk PHC0 = 45.45579 PHC1 = -114.8 
       data hash MD5: 64K
       C8 AD 18 DB 83 38 61 CE E3 09 D2 24 FC 00 49 CC>)
(   4,<2023-01-18 13:59:20.40 +0400>,<she>,<DPX200>,
      <abs ABSG = 5 
       data hash MD5: 64K
       B4 2E 5A 75 C3 79 73 D2 81 1E D6 16 25 1E 0E 60>)
$$ ##END=
$$ 
$$ hash MD5
$$ B7 02 3F C4 FA E0 53 06 CB 30 2A F3 19 69 3F 54
##$RELAX= 
##$RELAX= 
##$RELAX= 
##$RELAX= 
##$RELAX= 
##$RELAX= 
##$RELAX= 
##$RELAX= 
##$RELAX= 
$$ Bruker specific parameters
$$ --------------------------
##$DU= <F:/spectra>
##$EXPNO= 1
##$NAME= <P31>
##$PROCNO= 1
##$TYPE= <nmr>
##$USER= <she>
##$AMP= (0..31)
100 100 100 100 100 100 100 100 100 100 100 100 100 100 100 100 100 100 
100 100 100 100 100 100 100 100 100 100 100 100 100 100 
##$AQSEQ= 0
##$AQ_mod= 1
##$AUNM= <au_zg>
##$AUTOPOS= <>
##$BF1= 81.014009
##$BF2= 200.13
##$BF3= 200.13
##$BF4= 200.13
##$BF5= 200.13
##$BF6= 200.13
##$BF7= 200.13
##$BF8= 200.13
##$BYTORDA= 1
##$CFDGTYP= 0
##$CFRGTYP= 5
##$CHEMSTR= <none>
##$CNST= (0..31)
1 1 145 1 1 1 1 1 1 1 1 1 1 1 1 1 1 1 1 1 1 1 1 1 1 1 1 1 1 1 1 1 
##$CPDPRG= <waltz16>
##$CPDPRG1= <>
##$CPDPRG2= <waltz16>
##$CPDPRG3= <>
##$CPDPRG4= <mlev>
##$CPDPRG5= <mlev>
##$CPDPRG6= <mlev>
##$CPDPRG7= <mlev>
##$CPDPRG8= <mlev>
##$CPDPRGB= <>
##$CPDPRGT= <>
##$D= (0..31)
0 1 0 0 0 0 0 0 0 0 0 0.03 2e-05 3e-06 0 0 0 0 0 0 0 0 0 0 0 0 0 0 0 0 
0 0 
##$DATE= 1674035840
##$DBL= (0..7)
120 120 120 11 120 120 24 19 
##$DBP= (0..7)
150 150 150 150 150 150 150 150 
##$DBP07= 0
##$DBPNAM0= <>
##$DBPNAM1= <>
$$ [...]
##$SUBNAM3= <"">
##$SUBNAM4= <"">
##$SUBNAM5= <"">
##$SUBNAM6= <"">
##$SUBNAM7= <"">
##$SUBNAM8= <"">
##$SUBNAM9= <"">
##$SW= 501.771253377433
##$SWIBOX= (0..15)
0 1 3 0 0 0 0 0 0 0 0 0 0 0 0 0 
##$SW_h= 40650.406504065
##$TD= 32768
##$TD0= 1
##$TE= 0
##$TE2= 300
##$TE3= 300
##$TEG= 300
##$TL= (0..7)
0 120 53 12 22 120 120 120 
##$TP= (0..7)
150 150 150 150 150 150 150 150 
##$TP07= 0
##$TPNAME0= <>
##$TPNAME1= <>
##$TPNAME2= <>
##$TPNAME3= <>
##$TPNAME4= <>
##$TPNAME5= <>
##$TPNAME6= <>
##$TPNAME7= <>
##$TPOAL= (0..7)
0.5 0.5 0.5 0.5 0.5 0.5 0.5 0.5 
##$TPOFFS= (0..7)
0 0 0 0 0 0 0 0 
##$TUNHIN= 0
##$TUNHOUT= 0
##$TUNXOUT= 0
##$USERA1= <user>
##$USERA2= <user>
##$USERA3= <user>
##$USERA4= <user>
##$USERA5= <user>
##$V9= 5
##$VALIST= <valist>
##$VCLIST= <CCCCCCCCCCCCCCC>
##$VD= 0
##$VDLIST= <DDDDDDDDDDDDDDD>
##$VPLIST= <PPPPPPPPPPPPPPP>
##$VTLIST= <TTTTTTTTTTTTTTT>
##$WBST= 1024
##$WBSW= 4
##$XGAIN= (0..3)
0 0 0 0 
##$XL= 0
##$YL= 0
##$YMAX_a= 23862
##$YMIN_a= -30026
##$ZGOPTNS= <>
##$ZL1= 120
##$ZL2= 120
##$ZL3= 120
##$ZL4= 120
##$ABSF1= 248.5645
##$ABSF2= -253.2056
##$ABSG= 5
##$ABSL= 3
##$ALPHA= 0
##$AQORDER= 0
##$ASSFAC= 0
##$ASSFACI= 0
##$ASSFACX= 0
##$ASSWID= 0
##$AUNMP= <proc_1d>
##$AZFE= 0.1
##$AZFW= 0.5
##$BCFW= 0
##$BC_mod= 2
##$BYTORDP= 0
##$COROFFS= 0
##$CY= -3
##$DATMOD= 1
##$DC= 0
##$DFILT= <>
##$DTYPP= 0
##$F1P= 0
##$F2P= 0
##$FCOR= 1
##$FTSIZE= 65536
##$FT_mod= 6
##$GAMMA= 0
##$GB= 0
##$INTBC= 1
##$INTSCL= 6.047779e-11
##$ISEN= 30
##$LB= 1
##$LEV0= 0
##$LPBIN= 0
##$MAXI= 10000
##$MC2= 0
##$MEAN= 0
##$ME_mod= 0
##$MI= 50
##$NCOEF= 0
##$NC_proc= -6
##$NLEV= 6
##$NOISF1= 182.463
##$NOISF2= 159.3651
##$NSP= 0
##$NTH_PI= 0
##$NZP= 0
##$OFFSET= 248.5645
##$PC= 4
##$PHC0= -10996.49
##$PHC1= 137.0578
##$PH_mod= 1
##$PKNL= yes
##$PPARMOD= 0
##$PSCAL= 0
##$PSIGN= 0
##$REVERSE= no
##$SF= 81.0140089999694
##$SI= 65536
##$SIGF1= 159.3651
##$SIGF2= -187.1042
##$SINO= 113.3802
##$SIOLD= 16384
##$SREGLST= <1H.CDCl3>
##$SSB= 0
##$STSI= 65536
##$STSR= 0
##$SW_p= 40650.406504065
##$SYMM= 0
##$S_DEV= 0
##$TDeff= 32768
##$TDoff= 0
##$TI= <>
##$TILT= no
##$TM1= 0
##$TM2= 0
##$TOPLEV= 0
##$USERP1= <user>
##$USERP2= <user>
##$USERP3= <user>
##$USERP4= <user>
##$USERP5= <user>
##$WDW= 1
##$XDIM= 65536
##$YMAX_p= 512570750
##$YMIN_p= -23708675
$$ End of Bruker specific parameters
$$ ---------------------------------
##NTUPLES= NMR SPECTRUM
##VAR_NAME=  FREQUENCY,     SPECTRUM/REAL,   SPECTRUM/IMAG
##SYMBOL=    X,             R,               I
##VAR_TYPE=  INDEPENDENT,   DEPENDENT,       DEPENDENT
##VAR_FORM=  AFFN,          ASDF,            ASDF
##VAR_DIM=   65536,         65536,           65536
##UNITS=     HZ,            ARBITRARY UNITS, ARBITRARY UNITS
##FACTOR=    0.620285442955139, 1,           1
##FIRST=     20137.2065510682, 0,            0
##LAST=      -20513.1999529968, 0,           0
##MIN=       -20513.1999529968, -23708675,   0
##MAX=       20137.2065510682, 512570750,    0
$$ Real data points
##PAGE= N=1
##DATA TABLE= (X++(R..R)), XYDATA
$$ [...]
44581 4723468 4211753 2536508 1226689 1631861 2733185 2350524 303993 -1252725 -940346
44572 -940346 -48812 -443462 -1780492 -2236183 -1447279 -1012120 -1822041 -2505986 -1487676
44563 -1487676 624787 2085525 2600546 3110556 3398710 2096554 -549784 -2100761 -1208903
44554 -1208903 360543 483124 -180862 246771 1416428 1301049 -345935 -1507074 -928550
44545 -928550 487078 1572464 2216986 2404243 1827878 1045090 1239806 2181776 2160630
44536 2160630 680784 -583289 -422746 196862 256073 609383 2136863 3600723 3343401
44527 3343401 1938527 1121778 1033630 652535 225535 904976 2242495 2404037 1062280
44518 1062280 -75327 -46671 97043 -508761 -1028302 -710334 -515092 -1475127 -2607320
44509 -2607320 -2149026 -315857 808988 169246 -822808 -253009 1699979 2867548 1596438
44500 1596438 -1422930 -4018016 -4838935 -4301789 -3345720 -2055739 2028 2662623 5107025
44491 5107025 6617669 6753113 5195556 2335379 -281390 -1222633 -906561 -979558 -1860858
44482 -1860858 -2177060 -1076763 199773 4380 -1375597 -2183928 -1569798 -501599 -421870
44473 -421870 -1658980 -3104070 -3112419 -1067557 1596591 2511276 1050716 -810455 -1123371
44464 -1123371 -628820 -1407956 -3340726 -3794230 -1246388 2442309 4337765 3789574 2327347
44455 2327347 1212820 638349 845011 2228563 4052738 4550303 3033053 866183 -425979
44446 -425979 -1092560 -2171853 -3314840 -3047185 -1161361 511136 266211 -1406008 -2605097
44437 -2605097 -2354002 -1437104 -1105382 -1597169 -2095034 -1795870 -731513 485207 1517033
44428 1517033 2569018 3726416 4513797 4581863 4453788 4833858 5336745 4847490 3277299
44419 3277299 1960278 1859508 2298203 2164878 1599965 1566615 2240576 2785598 2507137
44410 2507137 1428807 -91784 -1561999 -2320949 -2059147 -1320129 -890916 -864842 -889495
44401 -889495 -971447 -1204040 -1054958 -22504 1153156 1160116 80543 -560605 -4209 731324
44391 731324 566071 -103215 -347620 -158153 16217 389055 1370065 2383821 2199031
44382 2199031 421872 -1935242 -3293212 -2639920 -289331 2071026 2657058 1474416
44374 1474416 385514 743963 1695699 1632575 541134 -292652 -377762 -393475 -642008 -564595
44364 -564595 21946 492946 590123 895582 1635797 2008604 1334332 117074 -636020 -532749
44354 -532749 246286 1426376 2499158 2702268 1792832 482550 -324908 -321825 406422
44345 406422 1613380 2479130 1900070 38884 -1194008 -324664 1523866 1899223 254849
44336 254849 -1333230 -834560 1385987 3186363 2838905 391638 -2420805 -3428566 -1935876
44327 -1935876 368836 1088429 -132608 -1346292 -1009846 95368 286896 -618335 -1359164
44318 -1359164 -1195404 -720037 -724445 -1122741 -1310939 -1140026 -1155183 -1848007 -2796928 -2889411
44308 -2889411 -1750449 -616428 -977381 -2416890 -2917111 -1653619 -253467 -457999 -1667336
44299 -1667336 -2050031 -1242414 -412112 -117336 218567 774960 936282 680515 789800
44290 789800 1141733 300699 -2250189 -4660783 -4697513 -2513275 -385340 -83597 -1357062
44281 -1357062 -2725331 -2967648 -1948218 -574356 72153 -174001 -540114 -477421 -295089
44272 -295089 -369495 -409234 -35454 464083 553853 220762 -127469 -89430 734155 2488214
44262 2488214 4339298 4785026 3335038 1178901 -384607 -1235542 -1476390 -545279 1408156
44253 1408156 2555996 1718900 750574 2269455 5415577 6497107 4156846 1261384
44245 1261384 659890 1462235 1172723 -368829 -1288704 -793890 162966 889814 1706702
44236 1706702 2621288 2783330 1679401 -55647 -1310886 -1390420 -247960 1492413 2722949
44227 2722949 2685019 1750574 1026319 1218418 2101095 2796632 2306938 313849 -2052981
44218 -2052981 -2866217 -1541788 245889 643299 -15618 -76531 741604 1082857 284746
44209 284746 -711221 -1137882 -1478547 -2037755 -1958762 -850684 -159932 -1308279 -3154831
44200 -3154831 -3106996 -708345 1551433 1468496 -225656 -1268481 -824047 148104 831870
44191 831870 1397914 1887602 1673743 729398 400742 1781052 3817230 4349733 3043221
44182 3043221 1927538 2523492 3739936 3702913 2644219 2355960 3236068 3776436 3187375
44173 3187375 2578637 2667832 2161515 18452 -2106037 -1914096 -251922 -271408 -2715181
44164 -2715181 -4718300 -4253443 -3162194 -3830032 -4988283 -3730581 -607114 663475
44156 663475 -1272699 -3339580 -2650244 -494355 184437 -752046 -1118004 -136540 857598
44147 857598 1031363 1054053 1420560 1787229 2254803 3442542 4818603 4767407 3063111
44138 3063111 1625871 1872758 2814983 2882922 2201376 1670393 1058306 -263286 -1529983
44129 -1529983 -1338928 225123 1806372 2733649 3162531 2727271 1075553 -334714 700063
44120 700063 3657440 5078106 3005968 -232214 -1244896 -5296 906135 374422 -288827
44111 -288827 -112997 136433 -262441 -708508 -554223 -247195 -367951 -625721 -549179 -182475
44101 -182475 520222 1799240 2817371 1740430 -1557497 -4181766 -3540138 -1139704 -775342
44092 -775342 -3176250 -4956675 -3419730 -67247 1859071 1446941 194053 -537046 -415508
44083 -415508 533198 1766339 1967734 499530 -1332876 -1867199 -1394980 -1327954 -1590140
44074 -1590140 -802131 1009587 1946748 977137 -582026 -1039302 -416221 147818 -82992
44065 -82992 -1114541 -2322297 -2419920 -586492 1840498 2189080 -269641 -3202494 -4228149
44056 -4228149 -3662884 -3186275 -3169165 -2804251 -1866687 -810474 188279 982816 1016261 396309
44046 396309 470114 1834552 2776662 1572632 -542955 -1036187 -179845 -714475 -3185953
44037 -3185953 -4580206 -2865046 -380209 -605387 -3138988 -4311119 -2227901 1034713
44029 1034713 2536985 2025625 1519510 2363989 3797474 4269997 3351078 1977873 1165609
44020 1165609 975001 836644 512960 372631 743130 1269145 1167081 270403 -332636
44011 -332636 713961 3109751 4686549 3939327 2108680 1432490 1838529 1315734 -441095
44002 -441095 -1205931 135491 1605249 1382402 739123 1503992 2579804 1832967 16855
43993 16855 -386857 653907 1095888 916236 2165814 4757244 5980645 5092370 4703414
43984 4703414 6110023 6778520 4654626 1811491 1010583 1210696 -243354 -2795385 -3536824
43975 -3536824 -1950347 -483096 -583643 -1048240 -598932 280179 701256 827613 1323474
43966 1323474 2419511 3794116 4662806 4238035 2844632 1937527 2100178 2001710 631948
43957 631948 -551044 472458 3091579 4852341 4864477 4254692 3625411 2469302 1136327
43948 1136327 967308 1971856 2439012 1462410 68283 -639475 -669205 -76156 1334417
43939 1334417 2683532 2441054 948392 476161 1790553 2741876 1562597 -433174 -1068660
43930 -1068660 -433721 76736 303568 767643 765938 -639622 -2386677 -2399223 -564903
43921 -564903 1216249 1808567 1797811 1674049 935148 -602573 -2108650 -2842443 -2854302
43912 -2854302 -2378182 -1615524 -1169017 -1453569 -1630037 -524499 1242999 1612372 -40782
43903 -40782 -1975891 -2659910 -2674769 -3145149 -3769343 -3638552 -2797945 -1721545 -333878
43894 -333878 1128179 1405995 -78197 -1840397 -2388996 -2617253 -4005153 -5373070 -4256540
43885 -4256540 -1250914 155500 -1400263 -3390506 -3697907 -3530269 -4270088 -4502559 -2893276
43876 -2893276 -1479868 -2702762 -4959588 -4851128 -2687003 -1743502 -2594493 -2514189 -791864
43867 -791864 -177533 -1811252 -2943470 -1706871 -294950 -775015 -1256925 487293 2576725
43858 2576725 2039815 -493 -334055 730113 200922 -1924632 -2325947 161026 2822712
43849 2822712 3493788 3030723 2492584 1413309 133048 447548 2225972 2445065 -370107
43840 -370107 -3444135 -3758013 -2373860 -2175700 -3213867 -3178713 -1346336 721322 1910491
43831 1910491 2611740 3116715 2827479 1271233 -1187168 -3519555 -4287054 -2557241 483547
43822 483547 1875699 166891 -2495728 -2906895 -667579 1849553 2633155 1678799 154764
43813 154764 -601277 265459 2171655 3281466 2723865 1812827 1917051 2331191 1900693
43804 1900693 1475263 2475439 3909602 3439618 1087120 -727522 -877379 -708203 -1219252
43795 -1219252 -1623947 -1406524 -1350926 -1470701 -245744 2558515 4281526 2517182 -1395069
43786 -1395069 -3926902 -3651284 -2237591 -1572752 -1618130 -1394455 -834235 -843199 -1816005 -2745501
43776 -2745501 -2288017 -646072 414930 -59780 -742251 -51612 1144983 650155 -1490191
43767 -1490191 -2609268 -1048956 1754340 3634157 4368733 4779940 4664672 3264581 1002262
43758 1002262 -723393 -1155187 -612671 302052 1109442 1469394 1520766 1830131 2471253
43749 2471253 2697987 2074004 1292028 1235220 1794496 2220415 2118755 1598772 1015722 971517
43739 971517 1859048 3018443 3180678 2133914 980520 400902 -37376 -321624 592926
43730 592926 2733425 4060708 3023988 941575 154154 811887 1289589 960492 568315
43721 568315 316760 -411575 -1512912 -2072402 -1885712 -1645233 -1635445 -1536102 -1346322 -1204623
43711 -1204623 -607425 791054 2047502 2225496 2301837 3726530 5374866 4406225 516674
43702 516674 -3017505 -3333801 -1012841 1694117 3619770 4521900 4058418 2488826 1158302
43693 1158302 923357 1027880 520487 -310708 -877181 -1459384 -2346700 -2940069 -2851634 -2838984
43683 -2838984 -3495314 -4036490 -3558852 -2502959 -1704970 -1032147 -156092 446912 572055
43674 572055 1108735 2232049 2094419 -661548 -4152566 -5355219 -4280302 -3575355 -4300443
43665 -4300443 -4764027 -3792155 -2577005 -2482241 -3148538 -3715154 -4049476 -3786478 -2003298
43656 -2003298 855085 2362826 1046349 -1246226 -1606504 105349 1470585 1185255
43648 1185255 646427 1446331 2761496 2388994 -91047 -2360351 -2030276 375999 2051849
43639 2051849 1471032 160823 353420 2037255 3512151 3950217 3777997 3049732 1353428
43630 1353428 -707845 -1834038 -2061306 -2620468 -3423530 -2792449 -458671 1345236 1104259
43621 1104259 376187 1223166 2950371 3448717 2535952 1707932 1345598 497289 -806535
43612 -806535 -1190137 -102233 1367925 2158286 2345001 2354759 2281007 2169635 1944611 1070632
43602 1070632 -616276 -1914173 -1439634 220369 992606 118363 -991133 -1044635 -547314
43593 -547314 -533403 -872317 -722484 143506 1247283 2097617 2388800 1890990 587104
43584 587104 -1177865 -2679288 -2908890 -1343961 872836 1467795 -172292 -1688305 -798026
43575 -798026 1197020 1095328 -1470465 -3509589 -2989532 -1067088 551354 1848435 3077429
43566 3077429 3594136 3451541 3878611 4740412 3916778 960006 -1147525 -218235 1528578
43557 1528578 971491 -891283 -965672 419680 146805 -2092919 -3100316 -1541419 -54699
43548 -54699 -722847 -1926580 -1602374 -743269 -1265821 -2472872 -2199882 -248639 1653904
43539 1653904 2631772 3304446 3883498 3464291 1600859 -540558 -1169440 289858 2501085
43530 2501085 3368146 2069829 -185822 -1779035 -2577771 -3358853 -3858796 -2965621 -888328
43521 -888328 584193 521115 -8790 58044 184540 -344180 -809455 -206870 965334 1363790
43511 1363790 631684 -409866 -818597 -72970 1664638 3221785 3378666 2756351 3354042
43502 3354042 5371141 6259346 4390415 1902760 1785669 3509389 4079071 2538190 649716
43493 649716 -531825 -1821450 -3298798 -3304649 -1085616 1617665 2722093 1967683 145575
43484 145575 -2145669 -4036590 -4341575 -3177710 -2283929 -2599014 -2834104 -1637461 174010
43475 174010 994706 856578 824257 915552 462928 -54754 544077 2049128 2922058 2437110
43465 2437110 1188101 -472211 -2660123 -4356038 -3595735 -268175 2862933 3263325
43457 3263325 1653838 575162 806074 810380 -623215 -2770980 -4134341 -4003512 -2637072
43448 -2637072 -884466 146944 -13462 -420111 214473 1497899 1672080 413201 -176047
43439 -176047 1538338 4127192 4968674 3791509 2446450 1660443 310308 -1826309 -2894846
43430 -2894846 -1631832 487248 1139286 15669 -1528898 -2662212 -3392261 -3416109 -2328815
43421 -2328815 -800248 -111039 -429672 -654200 -26371 1068658 1925659 2207445 1816027
43412 1816027 1010822 649475 1336437 2292474 2084502 591665 -795203 -1122372 -930725
43403 -930725 -1022425 -1244823 -1063682 -488933 130169 519500 278844 -895371 -2303605
43394 -2303605 -2482021 -1036367 587344 938445 372344 102512 198861 -217439 -1170277
43385 -1170277 -1590383 -1011419 -402654 -874832 -2229523 -3221054 -2912995 -1531962 -178435
43376 -178435 263423 91846 490681 1980406 3483143 3487205 1919294 150723 -748527
43367 -748527 -901959 -725874 -229237 273486 -199883 -1892819 -3173950 -2152963 659150
43358 659150 2658704 2450412 1509142 1741163 2627094 2268722 583919 -443870 165021
43349 165021 902101 190002 -1182667 -1371950 -301263 357133 -324313 -1502434 -2111949
43340 -2111949 -2188848 -2229009 -2152529 -1531658 -398242 682480 1240551 1407008 1754784 2484211
43330 2484211 2803771 1698620 -418456 -1645787 -906402 460892 520792 -510610 -841005
43321 -841005 -101709 47924 -1381407 -3082272 -3257291 -1754566 359762 2160871 2950978
43312 2950978 2181133 418134 -553010 173956 1180160 691076 -657484 -675102 949627
43303 949627 1910171 566637 -1548364 -1744264 136151 1580268 950047 -357620 -154048
43294 -154048 1235528 1497037 -110688 -1576025 -1141384 178773 348571 -743823 -1755197
43285 -1755197 -2296624 -2864520 -3004504 -1852188 -346243 -472860 -2010297 -2465520 -940540
43276 -940540 357474 -444712 -2228385 -3074583 -2965500 -2584448 -1432832 736543 2252740
43267 2252740 1633876 159538 61334 1161445 1628032 1205528 1207488 1825707 1928024 1342028
43257 1342028 1059244 1240141 1136884 891938 1279375 1785449 1228782 249859 683395
43248 683395 2223809 2369863 355328 -1452724 -1156771 12112 11304 -1032221 -1689340
43239 -1689340 -1491120 -862128 -83728 416814 -73124 -1346149 -2153972 -2158909 -2522343 -3644655
43229 -3644655 -4135651 -3281648 -2577473 -3108885 -3348718 -1766208 86367 -193644 -1803261
43220 -1803261 -1972930 -559205 -94514 -1268530 -1754864 -349322 890451 178141 -1052295
43211 -1052295 -859902 -291938 -1484589 -3603247 -3643560 -972121 1669657 2122204 1412548
43202 1412548 1481343 2326722 2850544 3020664 3358682 3167627 1249807 -1831960 -3977297
43193 -3977297 -4145196 -3174210 -1867020 -43934 1924465 2506722 1150199 -423241 -524214
43184 -524214 47794 -515098 -1991108 -2437183 -1105411 730138 1723651 1623770 555021
43175 555021 -1240931 -2781992 -2930276 -1891172 -959058 -711254 -658630 -545298 -493231
43166 -493231 72608 1874544 3954707 4228660 2375199 508304 369905 1386344 2055379
43157 2055379 1683467 189182 -2151535 -4110459 -4329343 -3385597 -3268254 -4168187 -3897191
43148 -3897191 -1457335 1065087 1560373 735809 278016 204234 -93030 -71145 585003
43139 585003 508801 -1215298 -3028958 -3275635 -2988004 -3749076 -4350110 -2668969 217394
43130 217394 1133831 -466206 -2047775 -2070335 -1412793 -691566 677242 2238245 2275087
43121 2275087 675050 -540996 -389799 -182940 -717326 -695533 767759 2248809 2156089
43112 2156089 1084524 588326 930004 1270878 962232 -309122 -2502361 -4520635 -4731803
43103 -4731803 -3008036 -1136729 -557798 -878736 -1165304 -1310395 -1451663 -1397378 -1323494
43094 -1323494 -1745460 -2283551 -1947663 -1119152 -1426813 -2943997 -3533619 -2086795 -436999
43085 -436999 -609144 -1940548 -2579525 -2290218 -2008280 -1929857 -1815932 -2071049 -2839607 -3121589
43075 -3121589 -2421213 -2076598 -3139100 -4140213 -3100178 -798819 271590 -408809 -1079748
43066 -1079748 -711796 11528 637410 1566362 2489284 2321243 1149568 349929 264185
43057 264185 -358679 -1933625 -2934085 -2282332 -1258383 -1669585 -3248353 -4288084 -4135766
43048 -4135766 -3638010 -3409061 -2939821 -1598403 310725 1753328 1804214 261725 -2036363
43039 -2036363 -3381421 -2343983 625704 3053268 2756757 457176 -820335 531669
43031 531669 2569089 2478173 527560 -475880 579207 1676184 1086624 -27044 81328
43022 81328 614508 -465464 -2975201 -4549494 -3871359 -1961731 -218200 1094214 2053108
43013 2053108 2284623 1632559 660014 -81973 -645567 -1209697 -1585279 -1478740 -858156
43004 -858156 41490 777416 910805 545604 397373 871928 1416532 1307218 664901 80461
42994 80461 -304860 -636050 -749140 -554555 -554411 -1084808 -1473809 -933231 67580 351102
42984 351102 -271366 -807178 -423379 805716 2200044 2803619 1915981 106207 -932938
42975 -932938 -424117 433560 466130 405672 1205793 1721815 370301 -1681727 -1708296 345621
42965 345621 1604363 579146 -1011678 -1553185 -1959492 -3359804 -4668462 -4344785 -2939276
42956 -2939276 -2029171 -1811791 -1466869 -965880 -895184 -1155276 -1249283 -1311888 -1660224 -1919052
42946 -1919052 -1690832 -1415256 -1455311 -1135981 -27438 594764 -709751 -2919341 -3365636
42937 -3365636 -1418301 400688 -161067 -1881061 -1685499 1035710 3350107 2562356 -145311
42928 -145311 -1247421 376961 2114283 1598395 48039 -23349 1112028 1124483 -268155
42919 -268155 -834179 325047 1319988 768918 -82986 60177 257107 -508461 -967039
42910 -967039 305552 1963081 1666353 -206709 -1222058 -748442 -584300 -1696340 -2690576
42901 -2690576 -2110666 -461413 780038 907074 213032 -474743 -139034 1524680 3182055
42892 3182055 2777424 -152019 -3722140 -5574860 -5008926 -3141861 -1537559 -891456 -724587
42883 -724587 -216744 691578 1357676 1558348 1719639 1744496 747000 -1277490 -2656241
42874 -2656241 -2100982 -642062 -116726 -510254 -428773 330450 542593 -198344 -753001
42865 -753001 -223275 969994 2086770 2849071 2920623 1879399 208822 -694126 -24934
42856 -24934 1585771 2961601 3436992 2945949 1799467 504853 -697644 -1917581 -2723655
42847 -2723655 -1873411 957081 3754442 3979527 1624270 -958469 -2153563 -2475767 -2806868
42838 -2806868 -2873432 -2000303 -245884 1612090 2476777 1519045 -631639 -1801601 -802745
42829 -802745 580908 24565 -1594330 -1505798 190752 426933 -1508297 -2138345 831338
42820 831338 4407942 4308261 880157 -1947089 -2201654 -1359011 -1074952 -1331867 -1752381
42811 -1752381 -2316039 -2501123 -1606576 -148253 664159 884544 1630816 2858799 3086528
42802 3086528 1734490 148610 -354412 -142637 -198847 -464519 -214520 510996 793188
42793 793188 129585 -710514 -461406 966667 1947865 898310 -1485790 -2735401 -1714068
42784 -1714068 -78396 157212 -633029 -659934 421128 1212008 741035 -561047 -1867549
42775 -1867549 -2576418 -2114630 -539947 783194 583180 -329226 -105463 1106303 1153825
42766 1153825 -628604 -2030706 -1187252 634504 1062007 64968 -492066 120783 915184
42757 915184 1294002 1762022 2344529 2115040 941712 157805 507279 716638 -501406
42748 -501406 -1925737 -1114493 1953756 4373253 4019053 2233999 1762883 3158179 4643421
42739 4643421 4855259 4121108 3180407 2176743 1192577 563554 295107 119408 261169
42730 261169 1039632 1665616 915482 -693267 -1100438 261444 1421359 898185 -60142
42721 -60142 228710 1098141 1073155 711833 1349709 1979386 389802 -2704710 -3725962
42712 -3725962 -1234324 1691108 1487305 -1353953 -3463346 -3129697 -1892206 -1932085 -3274425
42703 -3274425 -3985004 -2640163 -122326 1346680 864902 -215360 -364872 177088 494244
42694 494244 927126 2269781 3700818 3448015 1349022 -1029856 -2695268 -3781491 -3955992
42685 -3955992 -2528048 -422795 265051 -689452 -1267582 -601796 -338001 -1477874 -2341100
42676 -2341100 -1438740 -249013 -928688 -2807573 -3467182 -2335736 -1103594 -1143049 -2233033
42667 -2233033 -3353596 -3385772 -1689276 804026 1964909 1117468 131189 522739 984594
42658 984594 -290475 -2247078 -2399875 -761259 214920 -737753 -2394707 -3163927 -2513827
42649 -2513827 -589508 1666072 2464483 1209227 -113204 236922 569170 -1644531 -4850786
42640 -4850786 -4886895 -1365495 1488993 1227097 333568 1373707 2869019 2511835 1221554
42631 1221554 988916 1230776 445263 -525020 -110629 677146 -197203 -2090994 -2735030
42622 -2735030 -2107475 -2022649 -2451572 -1643941 199019 793213 -249117 -549650 1007241
42613 1007241 2361734 1773812 636902 1051308 2649497 3720654 3887823 3737513 3026937
42604 3026937 1298305 -422581 -459336 1154731 2629893 2725150 1936067 1350630 1335603
42595 1335603 1566831 1658405 1509177 1350046 1471480 1736756 1610321 903564 148858 -60046
42585 -60046 265900 775609 1245846 1463156 1177252 580557 237953 25524 -1144112 -3676433
42575 -3676433 -5923442 -5641920 -2814730 -9390 380249 -1415562 -3129312 -2942841 -1022707
42566 -1022707 1075278 2096558 2131338 2091121 2359553 2357851 1579775 511219 -21565 -45918
42556 -45918 -234216 -658101 -632788 61571 698877 790387 958123 1873917 2871957 2636322
42546 2636322 1169949 43635 345567 1210817 1007277 -564624 -2262496 -2811688 -1852610
42537 -1852610 291078 2741935 4029043 3198632 1365517 909926 2388094 3480238
42529 3480238 2156845 -291915 -1076571 120797 1190212 1265229 1742326 3119380 3439855
42520 3439855 1343896 -1387113 -2213739 -1263878 -407713 -158828 267953 671106 76671
42511 76671 -1111226 -1530609 -1347157 -1942953 -2985375 -2399521 58260 1754011 921161
42502 921161 -838335 -1367326 -1168587 -1798591 -2813324 -2771429 -2116147 -2442706 -3484825
42493 -3484825 -3411499 -1976770 -842155 -515270 474719 2495514 3262119 946637 -2748776
42484 -2748776 -4391257 -2871534 -213397 1122340 440283 -1367636 -2967307 -3439076
42476 -3439076 -2760542 -1609760 -449748 883267 2377250 3261013 2927346 1969032 1437860
42467 1437860 1354640 874161 -167757 -843769 -485168 335993 576513 8058 -631647
42458 -631647 -557070 180864 642094 -66134 -1604860 -2463796 -1666578 -96839 580248
42449 580248 49267 -608791 -916133 -1654283 -3039680 -3705226 -2693195 -1384898 -1788149
42440 -1788149 -3411995 -3694478 -1625076 869854 1732532 1277668 855794 507820 -462912
42431 -462912 -1557043 -1593524 -805279 -603060 -1182637 -1120476 176172 1217934 494202
42422 494202 -1440584 -2902593 -3133363 -2465803 -1319336 -108673 527879 497109 709243
42413 709243 1765861 2800192 2743632 2092403 2019918 2272703 1662179 425258 150778
42404 150778 1072932 1338680 -280239 -2573260 -3756054 -3743097 -3445720 -3068949 -2445298
42395 -2445298 -2044795 -2167904 -1894836 -417417 1113023 794364 -1118686 -2240738 -1252416
42386 -1252416 483307 1068139 479016 -22503 165863 722915 1461561 2514613 3605563
42377 3605563 4026837 3452287 2199362 654570 -979199 -2272030 -2611604 -2133537 -2104981
42368 -2104981 -3586110 -5752472 -6372527 -4382160 -1438489 -264855 -1652288 -3702182
42360 -3702182 -4013144 -2120718 236728 851014 -884913 -3175984 -3277808 -392224 3082480
42351 3082480 4062772 2423414 1000178 1870147 4041724 5365869 5229646 4253402 2595900
42342 2595900 161059 -2186334 -3226298 -3022596 -2687322 -2674015 -2491064 -1949887 -1441819
42333 -1441819 -969599 -94030 1035087 1643042 1416496 673635 -467538 -1980286 -3114418
42324 -3114418 -3061228 -2468867 -2755748 -3688789 -3410475 -1501006 -149900 -1062941 -2807132
42315 -2807132 -2928658 -1589241 -1100187 -2313302 -3490144 -2983860 -1367915 -181817 262463
42306 262463 802285 1701414 2092290 1356523 371716 647821 2222316 3188656 1893785
42297 1893785 -912582 -2959409 -3150443 -2332658 -1559558 -956698 -532268 -656651 -1099773
42288 -1099773 -901250 -16823 164884 -1049084 -2259895 -1981255 -876325 -418909 -338672
42279 -338672 607267 1891498 1511233 -814380 -2742685 -2250980 -10385 1853932 2201455
42270 2201455 1431815 559648 354848 771647 951027 386531 -68381 610193 1604515
42261 1604515 960348 -1459392 -3355846 -2946621 -1022811 715244 1801671 2378917 1948848
42252 1948848 324410 -1243805 -1553997 -1321739 -1944731 -3010526 -2792587 -959855 902824
42243 902824 1483463 987083 200473 -244005 320587 1964588 3233026 2518328 647836
42234 647836 290731 2201748 3972023 3534089 2004205 1470217 1615778 692746 -1212775
42225 -1212775 -2320450 -2201860 -2298749 -3153826 -3307985 -1735243 376428 1282441 753783
42216 753783 -507293 -2229408 -4080414 -4858183 -3732874 -1776966 -765856 -659339 266471
42207 266471 2652212 4817859 4886989 3152082 1519819 1159714 1505012 1385850 430425
42198 430425 -820481 -1731846 -2113969 -2021988 -1430379 -436156 363361 193754 -995024
42189 -995024 -2280839 -2695658 -2214342 -1637216 -1668039 -2210387 -2379855 -1292587 742482
42180 742482 2017580 1265191 -334365 -285625 1662581 2696046 844230 -1792211 -1681430
42171 -1681430 1168210 3233425 2328152 73071 -998682 -707171 -562631 -1376698 -2673875
42162 -2673875 -3492800 -2984431 -1116370 747255 1085137 381640 585152 1973664 2464772
42153 2464772 956104 -709191 -577978 551618 989437 1082960 1922606 2577122 1426577
42144 1426577 -611526 -1097299 68979 673832 43315 -61403 1165250 2118627 1626039
42135 1626039 728863 481765 227153 -632664 -1199472 -882435 -812879 -1894084 -3055254
42126 -3055254 -3062737 -2579547 -2695549 -2762803 -1608425 160006 1032257 1031104 1397709 2372476
42116 2372476 3009070 2780890 1844738 250308 -1537482 -1989271 -243914 2004757 2371411
42107 2371411 1205739 952983 2187332 2797327 1624241 383411 755698 1697481 1326214
42098 1326214 -94793 -963976 -1095799 -1616924 -2473281 -2021386 442171 3106879 3454143
42089 3454143 1102437 -1786214 -2800455 -1543446 483561 1866481 2568545 3173217
42081 3173217 3641021 3528678 2916278 2136477 903817 -1093490 -2877971 -2952247 -1634776
42072 -1634776 -992592 -1738230 -1888003 164690 2715816 2859088 707199 -729950 206902
42063 206902 1885305 2213295 1415006 843356 624384 167473 112957 1813968 4861408
42054 4861408 6760150 5706654 2693314 193944 -506245 38379 817551 1382342 1625081
42045 1625081 1527626 1425767 1855153 2725876 3125325 2401596 1101457 318313 317934 385593
42035 385593 22965 -282569 224399 1363059 1900241 766430 -1663074 -3706485 -4029873
42026 -4029873 -3027127 -2105047 -1697992 -871111 767548 1863804 1090362 -633469 -1184349
42017 -1184349 -223410 526718 159093 -92953 788629 1612139 756826 -1236501 -2507926
42008 -2507926 -2527049 -2123344 -1387721 358505 2420881 2733351 822052 -1018829 -720063
41999 -720063 802959 1316713 555749 66034 414638 527205 -191884 -884429 -831131 -519285
41989 -519285 -488911 -447714 -313444 -828814 -2047181 -2404848 -823491 1103032 867875
41980 867875 -1302362 -2486486 -987272 1628418 3105541 3422440 3881436 4499851 3954590
41971 3954590 1783108 -620729 -1275029 674809 4146438 6538451 5724409 2487653
41963 2487653 206060 1037262 3224450 3591820 1867819 468777 368011 -216246 -2387013
41954 -2387013 -4223359 -3323464 -86202 3021723 4257303 3322583 597687 -2617027
41946 -2617027 -4029931 -2450851 442729 2055733 2176789 2615118 3892393 4412699 3248997
41937 3248997 1785745 1663590 2477793 2583047 1340824 -328562 -1132009 -554134 796411
41928 796411 1700353 1569613 1138933 1325687 1702182 1191969 99804 -72953 949061
41919 949061 1649818 1176473 631821 886486 783927 -879218 -2845510 -2774906 -468837
41910 -468837 2030702 3132630 2820120 1441234 -742520 -2677994 -2896252 -1256798 871445
41901 871445 2392954 3240859 3305664 2231349 750317 586677 2112095 3423815 2805368
41892 2805368 966711 -298233 -588171 -603597 -271291 1036280 2718942 3213706 2288526
41883 2288526 1492591 1754289 1948102 812264 -835719 -1173716 -105237 617918 97462
41874 97462 -317142 920369 3109192 4076260 3020192 1372976 716989 985598 1269458
41865 1269458 1413659 1815286 2210007 1878609 979062 505107 652843 325721 -1082649
41856 -1082649 -2295073 -1579357 790558 2589100 2285061 744251 -137638 218379 875588
41847 875588 1145486 1434733 2037581 2118848 853043 -950426 -1547707 -512242 922465
41838 922465 1936228 3101458 4609029 5013824 3203554 660992 -24590 1420447 2714519
41829 2714519 2219878 762533 -72967 11654 313361 322292 -2616 -304434 187575 1803321
41819 1803321 3328506 2984331 938827 -493983 177499 1779778 2422450 1929148 1226420
41810 1226420 587665 -101110 -313125 334333 902840 174486 -1562362 -2963908 -3345876
41801 -3345876 -2823382 -1471800 285676 1161949 478706 -372353 382684 2187915 2942277
41792 2942277 2166447 1353542 1215324 786346 -329603 -950693 -347512 558755 951168
41783 951168 1381642 2227301 2496758 1526532 540289 969249 2142970 2207772 788460
41774 788460 -711129 -1207402 -1050828 -991335 -1020350 -553024 703340 2309108 3508936
41765 3508936 4102357 4549096 4781349 3567538 274838 -3142853 -3784145 -1684876 -28361
41756 -28361 -664428 -1570482 -308525 1990741 2441409 866614 -313098 -123242 -101907
41747 -101907 -1045299 -1409808 -120221 1135707 158401 -2392665 -3645729 -2189509 301289
41738 301289 1276507 205273 -1203776 -1245068 -75759 846230 754794 293957 176717
41729 176717 53770 -597054 -1179885 -672676 676332 1451306 862799 -527646 -1863509
41720 -1863509 -2698314 -2555552 -1072487 922077 1679099 712874 -251021 475597 2132400
41711 2132400 2615716 1542032 739849 1586933 3198776 3820007 3022016 1769797 987903
41702 987903 864309 1123848 1183854 353738 -1282967 -2412574 -1861596 -350763 160839
41693 160839 -1001766 -2471601 -2880989 -2403035 -1687665 -660965 529621 637529 -1026948
41684 -1026948 -2859638 -2593815 -251234 2123327 3248739 3376586 2686408 1113107 -182954
41675 -182954 447417 2374664 2944382 1362416 22742 703605 1781873 1155330 -67654
41666 -67654 667113 3126193 4461107 3187607 728546 -969069 -1472110 -1389749 -1402003
41657 -1402003 -1967638 -2902727 -3284051 -2658732 -1930786 -2015347 -2229941 -1326936 433717
41648 433717 1673731 1872817 1494338 663173 -626671 -1390425 -528372 1344691 2607213
41639 2607213 2946124 3234657 3383758 2379845 521403 -487167 -79659 421033 86766
41630 86766 -354789 -134045 305620 324013 -1505 -458564 -951148 -958028 -68404 970485
41620 970485 1276091 1610656 3109417 4543850 3572630 874565 -122672 1540306 2712711
41611 2712711 1228575 -603711 98083 2231321 2928262 2142244 1871732 2375271 2384369
41602 2384369 2095009 2788159 3957140 3777453 2338072 1691357 2522643 3267523 2929593
41593 2929593 2440974 2500948 2092869 248979 -2070736 -2938127 -1628757 749028 2390599
41584 2390599 2410407 1603636 1316300 1387185 267305 -2133476 -3270532 -1288383 1730472
41575 1730472 2139264 -275980 -2179541 -1517665 84126 378824 -303659 -144071 1384042
41566 1384042 3119094 3845570 3453887 2848181 2994784 3699739 3588015 2012601 454638
41557 454638 802657 2652624 3842948 3454346 2576435 2133340 1843672 1613913 2010214
41548 2010214 2728032 2466024 1230430 1023301 2999428 5364534 5569926 3653893 1955129
41539 1955129 1980040 2776757 2373981 139160 -2360317 -2769508 -472565 2526934 3842408
41530 3842408 3330290 2400112 1347220 -673010 -3071460 -3633397 -1750398 274678 434246
41521 434246 -324949 -212110 331041 -272895 -1677968 -1909627 -356884 1459475 2162540
41512 2162540 2062605 2195621 2879116 3470409 3026211 1354999 -255973 -74811 1722061
41503 1722061 2755436 1536151 -229218 26523 1934091 2723763 1272913 -510494
41495 -510494 -698135 195342 615883 311877 76813 110216 -111859 -727873 -1262459 -1410530
41485 -1410530 -1293433 -877339 240094 2125197 3865012 4097781 2412228 19593 -1353983
41476 -1353983 -1244746 -678731 -537723 -372249 636671 2060075 2457128 1247470 -375967
41467 -375967 -754528 375556 1732507 2142722 1934992 2303874 3413339 3867240 2548324
41458 2548324 380112 -641081 114133 1452937 2207261 2303708 1853406 588846 -1156956
41449 -1156956 -2109523 -1574342 -416485 287606 717868 1550255 2521266 2746731 1923709
41440 1923709 401022 -1362771 -2677199 -2675204 -1346613 93528 575988 197909 -653165
41431 -653165 -1995940 -3247769 -2996423 -1105891 374501 53620 -490752 675321 2331231
41422 2331231 1985834 355727 640080 3355925 5250037 4161380 1968079 1335500 2057057
41413 2057057 2334734 1724681 999225 511904 325520 833789 1887948 2387996 1958162
41404 1958162 1850082 2900622 3818343 3021908 1154260 94236 161254 -47243 -1375462
41395 -1375462 -3077585 -3937801 -3390749 -1714540 103114 1013016 1045721 1300981 2291975
41386 2291975 3132081 3025247 2549029 2556640 2800260 2655282 2223386 1664843 531066 -1037730
41376 -1037730 -1637863 -567383 698144 631735 72559 565613 1396961 700268 -1145459
41367 -1145459 -1809339 -536620 1025235 1568314 1404006 906518 35515 -313156 1104282
41358 1104282 3403693 4021358 2318588 424670 -292220 -1082628 -2958002 -4494080 -4263312
41349 -4263312 -3375860 -3551539 -4260796 -3852418 -2316296 -972136 -341101 -44212 56537
41340 56537 147076 895508 2108386 2169768 533678 -571150 913620 3409379 3754412
41331 3754412 1920864 785553 1424492 1681933 -16382 -2171203 -2707153 -1871332 -1275269
41322 -1275269 -1508550 -1944998 -1906691 -1074438 461615 1933662 2426192 1983108 1333920
41313 1333920 537121 -805965 -1973451 -1526105 264780 1245452 456666 -420585 174275
41304 174275 1200525 793924 -915490 -2438457 -3181494 -3282793 -2263214 64858 2009381
41295 2009381 1572758 -508066 -1374960 106971 2036122 2410638 1511626 601078 -48664
41286 -48664 -653690 -759582 -8586 729069 421224 -315132 129429 1842996 2825191 1504041
41276 1504041 -1043991 -2262328 -1180846 592241 1086720 323756 -192051 266729 990668
41267 990668 1319525 1469996 1440363 464842 -1359406 -2076703 -212704 2538707 3062063
41258 3062063 1248495 377781 2311928 4593566 4033748 1381570 -60121 472012 406517
41249 406517 -1686269 -3627391 -2924038 -444882 1064709 879639 667872 1493435 2421116
41240 2421116 2279795 1268291 313143 -93379 45034 472391 600712 -57105 -1065303
41231 -1065303 -1414649 -900796 -263741 269369 1401023 3159180 4111413 3181802 1293614
41222 1293614 51235 -443460 -1192344 -2337739 -3038859 -3016873 -2820172 -2616763 -2028232
41213 -2028232 -1218383 -901350 -1105538 -1106255 -827522 -1179577 -2623394 -4328898 -5101881 -4424436
41203 -4424436 -2550294 -455304 442093 -295272 -1056366 42390 2327511 3249526 2091957
41194 2091957 910128 1096328 1301413 131282 -1247588 -1193063 -539324 -1028454 -1998902
41185 -1998902 -1404805 367138 573771 -1653582 -3696320 -3074851 -780053 340186 -721113
41176 -721113 -2426776 -3075052 -2621137 -2075916 -1888181 -1444456 -166898 1347624 1919238
41167 1919238 1476935 1263441 2016932 2947532 3160784 3030694 3193218 3216075 2533899 1771134
41157 1771134 1647004 1421126 180056 -1062086 -613244 1009961 1729239 1279798 1454445
41148 1454445 2743723 3378125 2503861 1713567 2068973 1969937 -118943 -2682077 -3072716
41139 -3072716 -1174179 931045 1989369 2204089 1608211 110711 -1058167 -190832 2273596
41130 2273596 3837859 3242274 2076216 2294123 3481372 3732944 2394334 686895 -71148
41121 -71148 232175 1024303 1932214 2714200 2936635 2412680 1750216 1739335 2129250 1772659
41111 1772659 335821 -896410 -610423 738856 1617989 1465703 971845 547813 -216557
41102 -216557 -1433679 -2395858 -2491274 -1744203 -300702 1582942 2889281 2449401 643298
41093 643298 -679981 -454764 609592 1682022 2898787 4039260 3860211 2147718 971132
41084 971132 2108375 4288423 4956042 4016860 3626341 4555403 5124478 4128017 2660633
41075 2660633 2080755 1886527 960083 -271009 -481693 313052 712158 125836 -334010
41066 -334010 356048 1544762 2056043 2211243 3277106 4920471 4885869 2139137 -1005664
41057 -1005664 -1508649 363066 1492929 207147 -1899168 -2741892 -2317972 -1616784 -764809
41048 -764809 426375 1381809 1571170 1389794 1126773 198317 -1385354 -2066058 -827066
41039 -827066 827039 748663 -787493 -1708028 -1228063 -445957 -187788 -57256 424610
41030 424610 1191883 1986836 2113094 415475 -2973406 -5553002 -5009423 -2341231 -422715
41021 -422715 27616 656589 1982804 2542161 1871293 1548368 2376023 3007545 2466953
41012 2466953 1754403 1706657 1401307 94880 -1182931 -1405854 -1123793 -910713 -172381
41003 -172381 1014300 982961 -731269 -1781149 -494527 980886 -196907 -2940222 -3987301
40994 -3987301 -3114334 -2888232 -3639448 -2706605 600935 3042006 2173100 88030 175265
40985 175265 2260940 3507597 2868485 2032883 2258843 2579646 1734861 324345 -41555
40976 -41555 850990 1344113 144830 -1638673 -1643871 573063 2717417 2736715 1353636
40967 1353636 395392 -127765 -1233664 -2150354 -1110210 1025481 1046254 -1703501 -3657246
40958 -3657246 -2066189 921761 1727133 717341 913611 2674545 3305191 1701494 -84502
40949 -84502 -434030 -221957 -298068 282665 2009595 3212917 2388966 476404 -830080
40940 -830080 -1400010 -1631435 -810062 1396217 3219456 2956439 1831538 2196476 3628414
40931 3628414 3588478 1685295 366276 1026738 2190877 2334742 1936916 1591677 525500
40922 525500 -1409662 -2349741 -956860 1230640 1929431 1289904 952440 1071714 552657
40913 552657 -433642 -531250 326952 646294 -183811 -934638 -422418 1071272 2597027
40904 2597027 3513971 3431226 2370723 1204776 815855 742949 -127541 -1545834 -2065953
40895 -2065953 -1361152 -668516 -505456 190880 1747846 2373406 548072 -2460746 -4049435
40886 -4049435 -3417590 -1812846 -344562 877858 1784368 2036898 1692850 1065236 68198
40877 68198 -1191951 -1488098 323697 3067680 3877109 1744831 -912208 -1207870 782049
40868 782049 2735065 3363637 3416393 3727948 3994417 3869821 3806920 3961272 3381939 1428237
40858 1428237 -773110 -1584209 -1117369 -843498 -1171204 -1048202 -137288 435841 257984
40849 257984 779092 2909904 4884383 4354482 1750731 -388253 -919608 -850760 -774021
40840 -774021 125472 1973473 3211574 2718000 1327629 239476 -561912 -1167582 -637730
40831 -637730 1326247 2866526 2109758 103698 -381281 1358290 3333890 3961851 3761761
40822 3761761 3638026 3466668 3179459 3456894 4206117 3937632 2146829 989126 2679087
40813 2679087 6047410 7801016 6908974 5557231 5586447 6264001 6380811 6364791 6815420
40804 6815420 6710830 5079287 3290162 3475894 5287805 6424641 6137827 5967112 6873421
40795 6873421 7889067 8106423 7845860 7119771 5152101 2540137 1698591 3529264 5551385
40786 5551385 5262481 3681466 3304025 3948320 3349345 1157263 -441689 -95595 1094258
40777 1094258 1658656 1568886 1606615 2423047 4297923 6419648 6676247 3911436 179665
40768 179665 -1173056 433047 2679936 4073203 5292131 6595390 6651231 4965051 3155530
40759 3155530 2570677 2516803 1969371 1252151 930108 746095 656686 1181663 1847584 1305752
40749 1305752 -579 387774 3104578 5282168 4545400 2403664 1498519 1675817 1425855
40740 1425855 1269082 2539238 4118054 3699506 1618312 285002 194253 -399639 -1870300
40731 -1870300 -2378051 -1113376 388448 945718 1320696 2196499 2727689 2226098 1546792
40722 1546792 1690671 2389016 2938599 3187144 3006781 2094100 960052 783163 1549227
40713 1549227 1668380 309526 -1114216 -806407 1030662 2644332 2799211 1578641 -129299
40704 -129299 -1127449 -564970 1069513 2125701 1673343 692157 682304 1615705 2145934 1589038
40694 1589038 814632 1088867 2646688 4607553 5897554 5985914 4977880 3454811 2326387
40685 2326387 2345681 3253415 3698686 2766393 1448533 1565700 3103407 3920805 2687360
40676 2687360 773754 203310 940485 1624544 2013258 2905031 4099868 4291344 3090517
40667 3090517 1696181 1287418 1810400 2470801 2546172 1809928 976151 1337292 2984529
40658 2984529 4019048 2881665 827104 325200 1441157 1936967 974179 378706 1542268
40649 1542268 3145710 3163431 1654040 298258 130576 798060 1434184 1489355 1131179
40640 1131179 1186723 2183808 3425626 3795638 3369429 3137972 3220140 2755616 1707772
40631 1707772 1187460 1508367 1460568 280110 -1011873 -1171692 -535859 -254543 -519884
40622 -519884 -546605 82417 778145 598119 -611264 -1685694 -1255567 224101 566605
40613 566605 -1021749 -2206415 -739477 1807798 2200659 668877 502684 2499851 3612170
40604 3612170 2189790 838210 2000178 3915788 3702464 1958329 1293392 2077792 2650985
40595 2650985 2505614 2418389 2295544 1522352 792053 1162917 1913240 1688052 1162987 2093993
40585 2093993 4154431 5261376 4858397 4339778 4191192 3312059 1602105 732787 1466316
40576 1466316 2268862 1658216 330158 -75964 906630 2498696 3627481 3354581 1505966
40567 1505966 -513524 -685339 1159777 2919899 2959511 2118067 2000198 2317232 1460820
40558 1460820 -608937 -1692728 -231786 2157668 2305627 -395680 -2826256 -1964054
40550 -1964054 1136916 2832982 1927250 967399 1998497 3496909 3243459 2247331 3159194
40541 3159194 5736468 6804386 4876554 2283625 1848224 3356242 4533437 4229544
40533 4229544 3261555 2683853 2483811 2134734 1678305 1647771 1981397 1752041 589889
40524 589889 -281124 337975 1408686 936051 -578245 -523543 1244755 1297912 -1941168
40515 -1941168 -4679126 -2898799 1261050 2383051 -260183 -2188502 -938707 952056
40507 952056 1147726 1179970 2777124 4212163 3159843 636924 -725383 -524373 -162168
40498 -162168 -86596 88520 -77420 -970686 -1285579 379858 2886251 3738684 2579508
40489 2579508 1433613 1625372 2447293 3000076 3446172 3924863 3774696 2621709 1256522
40480 1256522 737016 1191446 1933916 2335408 2306219 2206751 2391873 2680468 2445191 1503424
40470 1503424 651559 898608 2330750 4062804 5114946 5060044 4093739 2832213 1878901
40461 1878901 1367138 1095064 1124763 1826800 3201945 4568116 5079058 4334634 2696527
40452 2696527 1422295 1962100 4210189 5956667 5398391 3782766 3749820 5186488 5097329
40443 5097329 2184994 -954677 -1571708 -427025 187767 134228 693921 1588756 1529010
40434 1529010 1003131 1716686 3406012 3881529 2563005 1516112 2240320 3551892 3667629
40425 3667629 2632943 1528306 694797 3423 -175306 473841 1351589 1662320 1511326
40416 1511326 1498133 1700593 1803152 1834270 2113685 2776978 3848391 5386298 7042085
40407 7042085 7881411 7234094 5474737 3527119 1943721 966577 1079241 2687429 5241998
40398 5241998 7328599 7902342 7169969 6137909 5553536 5477157 5696723 6157543 6749273
40389 6749273 6904308 5990284 4370134 3594019 4901942 7616027 9592340 9374860 7486112
40380 7486112 5539594 4596418 4615703 5050236 5542793 6152594 7117030 8325863 9048860
40371 9048860 8507350 6861184 5338186 5163280 6499038 8453823 9775339 9485863 7497478
40362 7497478 5111972 4390765 6170338 8834725 9964165 9341367 9340518 11822310 15621219
40353 15621219 18153724 18848531 19495484 21306386 23365984 24677535 26226738 29681776
40345 29681776 34978268 40731764 46576481 53446039 61504127 69425150 76419113 83895142
40337 83895142 94107832 107197601 119730148 126248824 123223849 112660954 101424222
40330 101424222 95628134 95806713 98721283 102819715 108868605 114941936 114754862 103947597
40322 103947597 86167178 69947868 60333820 55960217 53411072 51170736 48973660 46362478
40314 46362478 43546886 41990282 42524814 43664540 42958535 39685650 35517064 32666060
40306 32666060 31653350 30807649 28179183 24192807 21712746 22701553 25653388 27737349
40298 27737349 28833684 31440342 36573552 41891143 44569129 44295007 42608910 41018845
40290 41018845 40939564 43903232 50070794 57221132 62500521 64600781 63332909 58282615
40282 58282615 49706313 40229214 33588860 31130390 30664401 29228777 26167494 23128074
40274 23128074 21738262 21847106 21838130 20343726 17572991 14919048 13431922 13110317 13604549
40265 13604549 14712372 15754654 15416857 13207052 10575908 9520186 10217259 10963474
40257 10963474 10409131 8938488 7699025 7125192 6838765 6465130 6070682 5957811 6270829
40248 6270829 6797890 7205508 7513713 8092222 9019200 9816027 10149047 10363835 10786857
40239 10786857 10899317 9996030 8505163 7777982 8412878 9495962 9799382 9249925 8963567
40230 8963567 10175690 13218179 17094314 19956436 20549784 19461340 18543241 18914066 20014674
40221 20014674 20862432 21566202 22999853 25436759 28271927 30867007 32822346 33443467
40213 33443467 31971664 28793893 25527338 23099327 20481685 16567803 12877798 12550304
40205 12550304 16057662 19609974 19251189 15503984 12251283 11677105 12434744 12784957 13088476
40196 13088476 14137426 15043807 14590717 13509645 13552165 14924881 16402225 17613214 19357455
40187 19357455 21593409 22947263 22807286 22434598 23183210 24795750 26445661 28574439
40179 28574439 32460380 38161835 43700284 46328809 44419871 38617274 31655225 26607608
40171 26607608 24571594 24068556 23003057 20894765 18822492 17739618 17713689 18606146 20421675
40162 20421675 22653683 24164001 24459355 24696357 26657435 30774157 35761399 40169178
40154 40169178 43512682 45671380 46247831 45475077 44979583 46041724 47116717 44869393
40146 44869393 38508241 31618728 28295805 28467045 28748195 27289508 25653636 25803554
40138 25803554 27446030 29366377 31689250 35233712 39472122 42621664 43523174 42427911
40130 42427911 40214179 37778757 35948662 34960200 34028839 32306917 30286511 29365380
40122 29365380 29866534 30379953 29495910 27530944 26016854 25929690 26957582 28218682 29109631
40113 29109631 29504399 29671136 30215235 31786132 34510602 37741165 40510363 42168197
40105 42168197 42476711 41405075 39407239 37836279 38148220 40117439 41624854 41229718
40097 41229718 40404467 41796452 45467267 48761609 50486897 53156576 59453395 68070169
40089 68070169 75540816 81465825 88937573 99431075 110490514 120290718 131658289 148012998
40081 148012998 166403606 178806778 181476858 179521909 179636598 180758509 175724419 161463561
40073 161463561 143408592 128682292 118507632 109885746 102050120 97321718 96287934
40066 96287934 95954429 93545754 89425170 85183106 81239527 77724082 75441149 73924101
40058 73924101 70307873 62647921 53355592 46805901 44030467 42316624 39906917 38184748
40050 38184748 38383580 38850167 37459339 34973750 33743930 33923125 33252657 30583257 27579018
40041 27579018 26274217 26544998 27154053 28205865 31027441 36017807 42163217 48677985
40033 48677985 55357502 60678965 61510477 56515651 48741718 42739776 39668070 37379476
40025 37379476 34821295 33369570 33390292 32717764 30104175 27443114 26550179 26223696 24915930
40016 24915930 23856486 24359251 24197323 20712040 16160143 15326602 18128764 19384729
40008 19384729 16617194 13395192 13315865 15052115 15817041 15872187 16470123 16504301 14795233
39999 14795233 13344745 14617183 17248996 18029764 16858663 16144693 16239418 15275021 13245244
39990 13245244 12472446 13551472 14154385 12790561 10974134 10569279 11336931 12247281 13159927
39981 13159927 13979454 13891728 12730983 11793850 12193695 13469539 14674012 15755158 16968427
39972 16968427 17835049 17642083 16540567 15582506 15854008 17515472 19334210 19686511 18773532
39963 18773532 19049623 22221778 26723134 29918567 31934226 34899400 39018332 42573493
39955 42573493 45995277 52199980 61225558 67650213 66051065 57345945 47372982 40391957
39947 40391957 36179077 32628826 28837336 25506613 23775906 23934412 24818528 24916253 24346635
39938 24346635 24693714 26420210 27962829 28345738 29064058 31832625 35715730 38226588
39930 38226588 38437437 37411732 36307788 35683810 36140626 38071833 40998592 44285328
39922 44285328 48114127 52788122 57680397 61789743 64564553 65388833 63491632 59463181
39914 59463181 55472479 52720196 50345087 48335601 49160040 53807713 58293128 57833993
39906 57833993 53345125 49716499 48203314 45171388 38956625 33147463 31033218 30869328
39898 30869328 29513761 27516468 27191385 28001900 27621788 26229188 25998973 26785702 25903450
39889 25903450 22671867 20077962 20681543 23201968 24795599 25105868 26156503 29025410
39881 29025410 32573815 35562665 38360808 41676980 44670570 45732228 44917307 44221651
39873 44221651 45170545 47477372 50630102 55062439 60234526 63046167 60685837 54682657
39865 54682657 49664833 47917384 47543091 46436638 45298889 45278009 45034280 42439860 37868414
39856 37868414 33666703 31116237 29690942 28652920 27629754 26069794 23801494 21888622
39848 21888622 21468225 22008270 22151907 21985628 22837237 24864750 26531047 26834751 26635986
39839 26635986 27205880 28598388 30095304 31359586 32404992 32961445 32597854 31465674
39831 31465674 30659420 31633474 34842937 38769549 40902483 40251583 38412083 37573867 38135897
39822 38135897 39106045 40091466 41563470 43506622 45212937 46430414 47549100 48662689
39814 48662689 49603665 50862266 53174813 56154366 58777996 61475577 66132384 73385845
39806 73385845 81499049 89050724 97504290 109551466 125370052 141859317 155637073
39799 155637073 166032090 175207551 186109580 200466596 218234082 238382222 259817880
39792 259817880 281604811 303315117 326417698 354906233 392276844 436152289 476509709
39785 476509709 501034366 503360600 486607924 459743942 431221475 405436375 383277824
39778 383277824 364154976 347023618 330699885 315038673 302504556 297631966 304046807
39771 304046807 322531362 352299994 392155227 437944364 479889566 506387829 512570750
39764 512570750 503728884 489185578 474251228 458856457 441132743 419229545 390877352
39757 390877352 354873336 313906869 273741451 238525233 208127702 180553826 155347116
39750 155347116 133503268 115227885 99410266 85219804 73072056 63572072 56083740
39743 56083740 49096202 42150788 36717821 34327988 34058862 33070345 29991941 26576388
39735 26576388 25189574 25719698 26076950 24876569 22333832 19244783 16580898 15550586
39727 15550586 16411514 17505540 17076916 15758851 15475063 16160263 15856336 14284600 13777133
39718 13777133 15647169 17893747 18052444 16553387 15523157 15684867 16328177 17230831 18512906
39709 18512906 19207135 18079794 15792863 14439577 14735828 15221140 14611865 13559113 13408297
39700 13408297 14244457 15043094 15268945 15491062 16334459 17326907 17316474 16143291 15267635
39691 15267635 16003382 17560976 18058541 17360531 17275107 18526437 19428919 18712776 17901546
39682 17901546 19064360 21484363 22741978 22401095 22323279 23457030 24524543 24358062 23803456
39673 23803456 24548689 27094224 30344720 32569225 32867691 32416635 33740964 37718253
39665 37718253 42103191 44506496 45897166 49009665 54010728 58526899 61792070 65546681
39657 65546681 70156284 73065034 72617625 70694758 69727092 69496808 68932720 68762451 69818739
39648 69818739 70559761 69184483 67039535 67070450 69611833 72416982 74328407 76103866
39640 76103866 77771864 78128818 77409312 77829256 80370776 82968222 83041351 80411007 76787290
39631 76787290 73696596 71867153 71467720 71781325 71318598 69199697 66058081 63033336
39623 63033336 60339634 57363021 53838132 50457133 48321231 47770974 47671587 46293872
39615 46293872 43354409 40626422 39758651 40066974 39606293 37979105 36596132 36175873 35538848
39606 35538848 33353147 29850510 26165577 22851090 19693249 16486920 13566486 11758821
39598 11758821 11645214 12465459 12304217 10241977 7768522 6868281 7234287 6936834 5468193
39589 5468193 4168886 3617447 2759257 1188698 265604 990552 2431877 3275826 3474128
39580 3474128 3420044 3008909 2549922 3069939 4527863 5255999 4510369 3993908 5166717
39571 5166717 6506331 5558577 2746086 931590 1661868 3825732 5753027 6749341 6626642
39562 6626642 5501249 4254827 3777956 3644879 2776755 1328216 564589 937757 1702195
39553 1702195 2431762 3415693 4391094 4388002 3242368 2019047 1565320 1738893 2238507
39544 2238507 2946943 3262217 2518079 1464782 1888871 4158841 6471872 7186560 6592658
39535 6592658 5679307 4616198 3463404 2971009 3325487 3267006 1956980 725564 1247702
39526 1247702 2770996 3153002 2244930 2032529 3296299 4409807 4186609 3767482 4326269
39517 4326269 4752898 3607026 2116444 2774708 5369512 6941835 6053865 4680370 4801751
39508 4801751 5317061 4182982 2026849 1279322 2494515 3947490 4696254 5609462 6967390
39499 6967390 7392598 6175714 4729375 4451806 4747896 4530809 4146737 4148291 3552733
39490 3552733 1420262 -776511 -682580 1447530 3086008 3234697 3543987 5110726 6378108
39481 6378108 5442118 2906562 1050654 1042279 2154225 3195833 3725468 4069580 4777909
39472 4777909 5961736 6995940 7227946 6996310 7321282 8521624 9896285 10873790 11571308
39463 11571308 12034017 11986385 11709566 12008385 12675207 12152064 9717854 7100530 6685765
39454 6685765 8598235 10672669 11066377 9931466 8654433 8346869 9105748 10073944 10208696
39445 10208696 9477561 9111012 10108345 11766947 12454509 11681722 10522642 9947608 9718389
39436 9718389 9293175 8908726 9011680 9193274 8640487 7483865 6743340 6763819 6646489
39427 6646489 5787586 5137886 5926840 7649200 8632091 8481407 8422546 8862935 8340080
39418 8340080 5940355 3236475 2211714 2404753 2089537 1495804 2436346 4840138 6179342
39409 6179342 4983736 2746047 1365674 670658 -233031 -904328 -526297 335581 612365
39400 612365 447154 486835 361715 -424214 -839281 485417 2767680 3773179 3031058
39391 3031058 2396857 3003540 3560112 2644934 1138563 942760 2164546 3108799 2837415
39382 2837415 2347928 2872669 4034259 4422726 3477817 1956308 688429 -202784 -639724
39373 -639724 -157824 1143213 2010643 1471788 373595 291692 1206783 1618301 838665
39364 838665 -324825 -1180908 -1727502 -1435124 456054 2753243 2705634 -63714 -2130341
39355 -2130341 -683574 2389924 3139603 919390 -1464890 -2102386 -1699434 -1240894 -641804
39346 -641804 -22994 -14012 -300674 126384 833181 50602 -2462266 -4536361 -4352170 -2466385
39336 -2466385 -430071 930056 1138421 -165418 -1976844 -2092156 105238 2338207
39328 2338207 2302327 690107 -149162 371009 709238 -187414 -1545666 -2154899 -1873601
39319 -1873601 -1355093 -976610 -495473 395546 1414013 1809309 1267640 354463 -325302
39310 -325302 -935180 -1717993 -2106561 -1619599 -1133762 -1787040 -2884994 -2614609 -829917
39301 -829917 744311 1289998 1814885 2787085 3069573 2190595 1545864 2000260 2253961
39292 2253961 1199664 105897 571068 1833739 2183952 1846784 2346780 3880927 5291727
39283 5291727 5908498 5643550 4184701 2021839 1287697 3309533 6075590 6551827 4943932
39274 4943932 4020562 4514322 4198132 1972926 5113 586222 3000522 4873082 5099620
39265 5099620 4202571 2923818 1605858 356858 -807566 -1609715 -1417563 -295997 313237
39256 313237 -681199 -2012975 -1549403 396598 1338414 375240 -564445 156266 1703017
39247 1703017 2669444 3139311 3604362 3563705 2633416 1704916 1648559 1938138 1680396 992103
39237 992103 441506 206023 500975 1496303 2121330 702836 -2198986 -3538550 -1821370
39228 -1821370 506368 535096 -1046731 -1660712 -1085663 -1187435 -2195587 -2154116 -169602
39219 -169602 2133514 2828782 1707741 -113190 -1235109 -689504 1078743 2180189 1488771
39210 1488771 323291 476854 1427833 1490703 911894 1213593 1850693 595227 -2348472
39201 -2348472 -3677928 -1607341 1457509 2385945 1285530 303822 331925 792862 1277463
39192 1277463 1482780 586983 -1530183 -3275400 -3145711 -1751130 -544698 513850 2242260
39183 2242260 3992322 4233099 3086905 2262334 2400806 2329277 1207937 -285313 -1333407
39174 -1333407 -1973157 -2187543 -1527406 -360877 -73996 -1066960 -1799714 -1009535 141183
39165 141183 -456896 -2834325 -4807307 -4645578 -2648325 -168195 1668396 2105210 883833
39156 883833 -1145893 -2363873 -1998475 -907770 -258891 -6015 644403 1692402 2151076
39147 2151076 1374748 -132691 -1427693 -2142112 -2513823 -2723825 -2557948 -1747145 -519809
39138 -519809 336054 176778 -692283 -1220553 -823142 -101844 -70419 -917781 -1858859 -1971564
39128 -1971564 -928394 682110 1426423 93594 -2608471 -4095523 -2661497 374764
39120 374764 2482838 3204364 3837527 4330586 3119959 562181 -327865 1774043 3773547
39111 3773547 2178208 -1798295 -3903921 -2628174 -371872 780648 1343448 2046357
39103 2046357 2123570 1226961 679920 1179682 1054883 -1330244 -4681157 -6166491 -4971889
39094 -4971889 -2760374 -1090513 -105961 337530 -17805 -902510 -1169270 -160827 1258873
39085 1258873 1749362 1185672 627787 721794 871626 367060 -208379 443457 2310425
39076 2310425 3559212 2626418 137658 -2008546 -2841172 -2623301 -1611683 -18246 1016299
39067 1016299 223352 -1592001 -1825940 554033 3273956 3516845 1360067 -804239 -1474895
39058 -1474895 -1258817 -1285429 -1774478 -2252923 -2253050 -1652653 -891418 -778301 -1592002 -2582507
39048 -2582507 -2846305 -2357408 -1591754 -623101 579795 1319159 692786 -986622 -2174531
39039 -2174531 -1788257 -370474 661806 500725 -542177 -1679690 -2459505 -2896534 -3001896
39030 -3001896 -2604466 -1936264 -1959067 -3335810 -5190867 -5774778 -4435608 -2076802 264228
39021 264228 2039735 2383063 541534 -2161814 -2753300 -401996 1911839 1325364 -871744
39012 -871744 -1474042 -376475 -338057 -2161008 -3389414 -2432494 -1045627 -1338359 -2608029
39003 -2608029 -2868878 -1914472 -1106976 -1115015 -1314950 -814956 846946 3238368 4617972
38994 4617972 3198782 -308935 -2775650 -2370967 -760882 -230264 -233368 1144293 3558626
38985 3558626 4791808 4173579 3070835 2159474 831634 -455195 8775 2114470 3168048
38976 3168048 1626139 -478996 -571077 754687 1082091 -61773 -1061765 -1106009 -970087
38967 -970087 -1143331 -1223720 -1221515 -1552377 -1518264 270250 3389020 5302949 4446150 2114161
38957 2114161 391407 -299909 -440716 251572 1979475 3354144 2717062 638129 -679461
38948 -679461 -438403 -22862 -552057 -1324430 -1331003 -927316 -1020989 -1492117 -1433548 -512409
38938 -512409 701951 1520146 1658896 1160126 238577 -836981 -1876095 -2629088 -2572222
38929 -2572222 -1328827 555417 1808966 1726135 860085 180777 19775 191828 658142
38920 658142 1459805 2158846 1920907 388585 -1656757 -2748887 -2136994 -732603 -156877
38911 -156877 -618993 -529598 1055424 2475834 1392065 -1708707 -3733545 -2994560 -1245521
38902 -1245521 -922992 -1936845 -2490264 -1933316 -1197250 -890489 -469952 579922 1717850
38893 1717850 1815988 350904 -1882712 -3261656 -2943025 -1911386 -1693708 -2173881 -1928269
38884 -1928269 -817455 -507535 -1741295 -2942395 -2767278 -2282701 -2886712 -3640289 -2873010
38875 -2873010 -1253055 -716371 -1076146 -484907 919542 763832 -1622286 -3698715 -3285609
38866 -3285609 -1482806 -649685 -1212904 -2020970 -2541024 -3031187 -3310129 -2900162 -2120249
38857 -2120249 -1908207 -2622169 -3691281 -4284712 -3885149 -2550484 -1075795 -575749 -1448413
38848 -1448413 -2898477 -3698343 -3282587 -2142534 -1413935 -1862373 -2891666 -2984311 -1722612
38839 -1722612 -719590 -1525074 -3277677 -3899411 -3102890 -2330495 -1940294 -764939 1173462
38830 1173462 1956249 796187 -427266 -69180 813876 609248 -42875 264184 832373
38821 832373 19085 -1511512 -1356868 852271 2642981 2138652 360710 -605660 -156095
38812 -156095 967956 2085526 2843435 2889935 2224186 1485729 1251131 1280300 888216 -106812
38802 -106812 -1082874 -1183859 -149372 1306946 2086511 1889872 1561625 1924304 2618333
38793 2618333 2624788 1607766 57922 -1590144 -3071048 -3669256 -2658422 -676538 419264
38784 419264 -217275 -1121214 -374776 1684113 2696304 1256661 -1321300 -2650204 -1976097
38775 -1976097 -566903 189498 181407 10350 -134795 -530576 -1253866 -1979601 -2326049 -2124796
38765 -2124796 -1504146 -873731 -558936 -329531 264437 947674 828709 -169569 -865987
38756 -865987 -513540 -39646 -562029 -1492234 -1483960 -630709 -90095 70995 796052 1918695
38746 1918695 2158336 1512641 1581685 2838511 3581779 2638199 1269882 1050757 1422277
38737 1422277 922934 -386121 -1328858 -1502257 -1237767 -467744 885012 1996793 1980718
38728 1980718 1129078 185843 -944169 -2573359 -4057973 -4539255 -4173894 -3359298 -1570186
38719 -1570186 1478778 4218395 4569642 2624946 445031 -559570 -602840 -214600 486202
38710 486202 1305060 2033352 2812822 3466816 3188452 2095832 1967725 3674961 5097355
38701 5097355 3968143 1745431 1698123 3788295 4887552 3993976 3461766 4455065 5168408
38692 5168408 4997386 6537566 11148424 16191812 19762111 24814474 34301894 44289740
38684 44289740 46769926 39081132 26655912 16276573 10152618 7149638 6150890 6312207
38676 6312207 6312046 5367442 4034189 3045244 2342807 1780072 1583182 1627857 1441429 1282596
38666 1282596 1942352 3177787 3784877 3597348 3889226 5361029 7331541 9347544 11673506
38657 11673506 13488950 12789277 9379212 6021902 5064216 5677846 6077541 6596683 8494783
38648 8494783 11429639 14487641 18113179 22245495 24050134 21006671 15472729 12488610
38640 12488610 13281611 14730661 15311123 17121700 20832030 23042119 21088236 16958679
38632 16958679 13729252 11181997 7946822 5201366 4757098 5592753 5778038 6016858 7717641
38623 7717641 9288659 8350641 6274113 6183584 7377244 6427306 3487859 2498120 4643111
38614 4643111 6640156 6746110 7551836 10866086 14478458 16547758 18862728 22801092
38606 22801092 26453654 29590515 37105326 51854367 66679809 69922005 58686101 41642510
38598 41642510 28414717 20831957 15573476 10818505 7501994 6448020 6941164 7564822
38590 7564822 7320544 6334658 5722897 6216459 7235243 8105871 9471408 12332736 16546350
38581 16546350 21568390 27378263 32729450 33962523 28580462 19464411 12452491 9673761
38573 9673761 8169353 5325107 2452283 1893047 3323075 4597345 4508695 3372887 2183522
38564 2183522 2072055 3414396 4972873 5150177 4188787 3621937 3754878 3730204 3868934
38555 3868934 5301521 7180611 7392606 6659469 8433312 13286834 16904607 15901806
38547 15901806 12513725 10710922 10508675 9691370 8962944 10982073 15012311 16746965
38539 16746965 14023625 9496463 6712865 6097081 5932571 5247537 4299069 3447198 2845484
38530 2845484 2747003 3351719 4468437 5446056 5340147 3629602 1224316 27387 664167
38521 664167 1430341 656650 -648366 -121508 2385804 4365140 3906367 1771529 -198428
38512 -198428 -1298824 -1871863 -2121031 -1942017 -1422556 -876159 -595369 -746303 -1142561
38503 -1142561 -1099261 -51436 1573514 2594454 2307221 1120691 26538 -178061 620700
38494 620700 1563520 1282264 -587175 -2556455 -2844188 -1655756 -819099 -1100364 -1221890
38485 -1221890 -71690 1442361 1840245 1418322 1650256 2577585 2437816 315021 -2185483
38476 -2185483 -2865845 -1696742 -484602 -243165 -306215 -122103 -403464 -1712544 -3096947
38467 -3096947 -3328093 -2725461 -2412992 -2305984 -1439130 -117018 96402 -1067958 -1802237
38458 -1802237 -897716 308338 -46342 -1547864 -2290321 -1696549 -830310 -246651 593997
38449 593997 1544138 1235824 -739242 -2462280 -1860310 432777 1801369 1072380 -176660
38440 -176660 -86208 967707 1244079 200896 -1052649 -1555985 -1425183 -860105 453333
38431 453333 2368521 3794963 4016001 3682775 3693778 3898001 3826598 3824406 4194173 3949513
38421 3949513 2006696 -725341 -2098343 -1580498 -818464 -1132936 -1915972 -1954735 -1060672
38412 -1060672 179312 1210009 1535337 880696 -164708 -475288 216299 932612 677559
38403 677559 -645839 -2520327 -4097656 -4301472 -2853743 -1210431 -1098156 -1986288 -1578877
38394 -1578877 818684 3124775 3388228 2237295 1360602 947546 35731 -1461485 -2439164
38385 -2439164 -2023384 -486009 1060994 1539361 873209 196908 545438 1496127 1953190
38376 1953190 1917259 2173660 2538224 2109224 1140227 726015 635077 -278237 -1323642 -372026
38366 -372026 2258145 3236879 992775 -1661131 -1600130 294250 1131895 318654 -564489
38357 -564489 -600165 124525 1698291 3645267 4193854 2470453 342074 44212 1143639
38348 1143639 1838446 1864676 1887925 1526607 604161 983518 4166387 8102121 9508903
38339 9508903 8587344 8135604 8499871 7058940 3006557 -765987 -1485885 441418 2963973
38330 2963973 4609300 4525940 2633367 542240 332265 1774682 2604629 1848639 764188
38321 764188 178523 -654591 -1876755 -2144008 -942623 364057 845211 1278396 1985808
38312 1985808 1518869 -942350 -3605761 -4211255 -2960463 -1760558 -1461920 -1286838 -464699
38303 -464699 712541 1270028 470702 -1311283 -2577810 -2252976 -1125575 -746596 -1107830
38294 -1107830 -848374 272974 854829 152604 -798976 -979979 -790808 -963412 -1397407
38285 -1397407 -1752351 -2018639 -1993891 -1402652 -906185 -1589617 -2999514 -3211803 -1493633
38276 -1493633 532236 1078403 209452 -1010181 -2049559 -2817472 -3200710 -3430634 -3971295
38267 -3971295 -4627089 -4768195 -4578302 -4779124 -5033979 -4204753 -2372731 -885873 -213589
38258 -213589 302384 365851 -1207328 -3728295 -4529091 -2781726 -998384 -1233456 -2083873
38249 -2083873 -1325421 482174 1201201 443282 -446235 -721600 -745349 -960518 -1701616
38240 -1701616 -3052938 -3833040 -2180210 1572240 4298070 3951326 2301752 1938029 2392038
38231 2392038 1689763 182000 -142660 724966 878354 -166730 -994201 -1117224 -1605518
38222 -1605518 -2587044 -2671848 -1572068 -1046984 -2179745 -3481430 -2924995 -659666 1398739
38213 1398739 1896657 1111886 225869 139837 732567 1083833 693716 250950 594092 1259800
38203 1259800 1088637 216374 272417 2147429 4422191 4710715 2287211 -1035426 -2603572
38194 -2603572 -1417107 1006307 2276499 1557617 65897 -703272 -488232 205497 1131921
38185 1131921 2078835 2203692 624121 -2272393 -4709156 -4959795 -2884775 -134165 1254245
38176 1254245 733419 -396419 -779399 -646704 -971186 -1633652 -1753609 -1509786 -1967426
38167 -1967426 -3004966 -3151652 -1932007 -731567 -705607 -1347314 -1765477 -1824612 -1354204
38158 -1354204 63360 1669989 1664218 -198091 -1843748 -1805941 -1086059 -891044 -581206
38149 -581206 471614 1023902 82310 -866683 -115317 1260715 1191580 138600 45148
38140 45148 676539 10904 -2042930 -3224303 -2419061 -1048789 -507331 -392620 73705
38131 73705 648230 780530 467905 11831 -116744 716775 2363778 3374361 2756242
38122 2756242 1700558 1929792 2872864 2464372 483193 -1046325 -872582 120046 880012
38113 880012 1556167 2297756 2364592 1212893 -676598 -2500258 -3679240 -3668131 -2427081
38104 -2427081 -1076893 -780579 -1038244 -517399 558050 588987 -687725 -1471004 -383918
38095 -383918 1814413 3521953 3967826 3161957 1514958 66019 -54035 1041529 2019276
38086 2019276 1944551 1095083 183661 -303697 -105899 507283 658865 49657 -318798 230406
38076 230406 541016 -596929 -1985659 -1498949 497701 1605014 1026863 211874 -107698
38067 -107698 -765687 -1733743 -1712706 -904681 -1383755 -3540774 -4773227 -3213793 -492465
38058 -492465 828779 596102 231603 324270 621067 906130 595573 -968296 -2768942
38049 -2768942 -2623709 -589429 496368 -593992 -1230345 696180 2861379 2167130 150180
38040 150180 784832 4034050 5784181 4134311 1784418 1378974 2019720 1906939 1493209
38031 1493209 1919773 2400603 1451108 -475081 -1634192 -1623876 -1562183 -1916435 -1810221
38022 -1810221 -685820 658712 1191702 890855 272708 -612230 -1887007 -2920456 -2734025
38013 -2734025 -1534875 -932396 -1984042 -3598219 -3711209 -1827570 396685 1072439 -80167
38004 -80167 -1789459 -2511191 -1650767 -51108 824658 658598 795626 2227065 3686677
37995 3686677 3161282 1017014 -161376 852917 2292829 2133401 876409 347950 842780
37986 842780 951792 -237293 -2015719 -3079506 -2890726 -1957295 -1117529 -555855 358686
37977 358686 1884895 2905237 2040607 -333882 -2321739 -2829664 -2433900 -1816908 -869132
37968 -869132 230189 684235 604615 1291191 2998266 3980418 3050269 1639226 1706280
37959 1706280 2772384 2868981 1647524 650046 853432 1690755 2452688 3157871 3892161
37950 3892161 4447619 4747432 4758571 4075140 2455110 615637 -355423 -213540 531583
37941 531583 1503194 2374134 2395542 1178670 -307803 -678859 61165 744773 907921
37932 907921 1186970 1837529 2193957 1962782 1864094 2365482 2722936 2105477 1077390 1005458
37922 1005458 2063632 2642560 1200249 -1635999 -3512151 -3116547 -1822442 -1796644 -2940527
37913 -2940527 -3019977 -958002 1453744 1872960 255660 -1631668 -2577256 -2530330 -1544880
37904 -1544880 341870 2274060 2922147 1940830 324155 -769588 -954838 -562870 -383646
37895 -383646 -1270313 -3154468 -4566624 -4052831 -2085883 -622923 -593135 -811613 133847
37886 133847 1764303 2298379 963857 -1142942 -2529935 -2868968 -2689379 -2139042 -927063
37877 -927063 621915 1508395 1471078 1543601 2506097 3649611 4043155 4146671 4804016 5426614
37867 5426614 5016080 4466167 5516482 7415331 7308129 4728746 3025721 4721672 7711985
37858 7711985 8233586 5985079 3942877 4142872 5985110 8149064 9982121 11145833
37850 11145833 11776546 13054899 16128771 20517939 24861825 28933834 33467328 38273653
37842 38273653 42111767 44310769 45007029 43891209 40360825 34996328 29294893 23784288
37834 23784288 18035957 12787645 10116689 10584213 11764273 10912608 8160336 5855909
37826 5855909 5399577 6006548 6372326 6288039 6206062 6066324 5390058 4346463 3874596 4414173
37816 4414173 5192611 5373876 5264350 5434096 5289800 4027484 2666410 3152672 5229601
37807 5229601 6407631 5819151 5802600 8262433 11645861 13512890 14213388 15552696 17264641
37798 17264641 17618600 16659050 15985819 15714077 14423534 12044954 10065617 8635526 6183598
37789 6183598 2588498 242035 864886 3229422 5124315 5888179 5945365 5398550 4312331
37780 4312331 3253384 2480191 1485348 163781 -446903 578358 2689813 4386906 4669589
37771 4669589 3704853 2550090 2272197 2817169 2950207 1910906 568313 9971 -249327
37762 -249327 -1262843 -2558744 -2813659 -2166997 -1954388 -2389665 -2455846 -1906518 -1367143
37753 -1367143 -691340 552209 1217930 -157635 -2265046 -2157858 160812 1451210 310589
37744 310589 -805525 -3399 902169 -284453 -2469507 -3279258 -2475329 -1125902 527406
37735 527406 2152596 2332745 784916 -401893 -8384 51065 -1700784 -2887407 -811353
37726 -811353 2632222 3558276 2237362 2316845 4519227 5630780 4129099 2544113 2974502
37717 2974502 3897643 3225446 1659443 1015029 1308370 1362896 804650 -36840 -990759
37708 -990759 -1669357 -1378430 -301975 332469 -69873 -795682 -1227634 -1481632 -1304962
37699 -1304962 -166758 996384 259899 -2063711 -2914631 -763943 1677637 1155553 -1397836
37690 -1397836 -2439580 -1137009 -250891 -1741514 -4076600 -4689305 -3261994 -1479019
37682 -1479019 -627846 -502101 -230531 521950 1156436 823909 -401574 -1315509 -965128
37673 -965128 70553 394482 -449260 -1628800 -2262891 -2214027 -1698175 -950394 -419003
37664 -419003 -529900 -1000203 -1005021 -271549 549529 812383 605523 339570 213406 349843
37654 349843 804725 1096038 452454 -943214 -1685923 -862917 606049 1261791 1144527
37645 1144527 1297010 1623870 939906 -591919 -869444 1215884 3596712 3401659 885348
37636 885348 -766838 353433 2466658 2660400 773524 -454331 1131717 4473429
37628 4473429 6520848 5577190 2844559 696289 111158 331982 517627 612847 496261
37619 496261 -472742 -2291694 -3616116 -3281613 -2003227 -1503556 -2269780 -3205698 -3308071
37610 -3308071 -2669745 -1913779 -1590762 -2078890 -3192364 -4010237 -3966330 -3805598 -4389523
37601 -4389523 -4971717 -4141150 -2274564 -1307817 -1927007 -2765889 -2764017 -2492602 -2523692 -2327413
37591 -2327413 -1665920 -1311110 -1343024 -526427 1347775 2292622 905758 -1275210 -1989845
37582 -1989845 -1373654 -911052 -686512 2903 434098 -531497 -1932918 -1861086 -714474
37573 -714474 -597976 -1637542 -1764822 -419960 467643 -80039 -522618 147650 480253
37564 480253 -661209 -1805214 -1425523 -791378 -1833114 -3626035 -3674767 -1881878 -547268
37555 -547268 -632258 -607893 595051 1800583 1674476 773235 263253 -87219 -1191538
37546 -1191538 -2704174 -3312460 -2774185 -2318531 -2762796 -3330195 -2954551 -1974838 -1627440
37537 -1627440 -2194709 -2654284 -2269852 -1617083 -1538244 -1722888 -1048760 884206 3120489
37528 3120489 4207354 3409986 1280475 -707812 -1383200 -1029836 -977438 -1795979 -2490815
37519 -2490815 -1942053 -444447 888058 1566408 1675204 1083582 -42288 -426216 1091104
37510 1091104 3545124 4495354 2926256 341720 -1209133 -1037006 384328 2154666
37502 2154666 3073716 2307674 551703 -459179 -71857 621787 584409 140246 18338
37493 18338 288040 857257 1920961 3298622 4367179 5099516 5930616 6229142 4625288
37484 4625288 1637971 81656 1548130 4157043 5287583 4893654 4393737 4015622 3489894
37475 3489894 3830161 5629656 6646860 4246427 -127548 -2094688 -171826 2531958
37467 2531958 3059424 2148444 1933709 2696021 3410649 3515804 2702147 714486 -1360133
37458 -1360133 -1489613 208728 770305 -1427793 -3723293 -2734704 686958 2773366 2088336
37449 2088336 556931 -316037 -1186882 -2395468 -2505721 -571470 2004256 3222159 2954013
37440 2954013 2610401 3183857 4432122 5346647 4868098 2769623 215090 -1226337 -1326135
37431 -1326135 -1115402 -963972 -36015 1789479 2798217 1382650 -1640973 -3734830 -3306978
37422 -3306978 -972112 1419315 2386214 1909243 1458736 2408296 4030162 3971217 1380592
37413 1380592 -1536529 -2194295 -860427 240856 239704 179989 679050 1133395 1423387
37404 1423387 2347196 3713123 3893561 2324373 835259 1172600 2495518 2792788 1720010
37395 1720010 413856 -662663 -1830331 -2595401 -1900093 -71346 1177942 1050539 535191
37386 535191 585857 817186 567678 -11045 -601140 -1307081 -1883087 -1499188 -124331 921992
37376 921992 778015 409089 1056084 2231182 2563126 1889975 1085392 408093 -406966
37367 -406966 -846580 -145889 1040504 1309927 985120 2040180 5019388 7755052 8007564
37358 8007564 5975850 3359293 1343841 502935 1243048 2940383 3707679 2512188 793277
37349 793277 632372 1997702 3134362 3008645 1944507 486049 -786921 -862687 522210
37340 522210 1696785 969869 -485570 143861 3001952 4819114 3314673 251709 -1185769
37331 -1185769 -362598 1007894 1755365 2197131 2801282 3380751 3494560 2843661 1545406
37322 1545406 418359 306178 784077 630029 12217 604280 2574543 3313214 901457
37313 901457 -2687733 -4070981 -3002838 -1938589 -1858536 -1462687 -363407 82619 -201086
37304 -201086 842680 3804750 5875909 4462744 889548 -1561604 -1872556 -1384107 -800242
37295 -800242 359720 1659476 1600835 108247 -730001 682981 3275696 4685313 4015987
37286 4015987 2384123 1193605 714094 386964 -5415 125861 1375070 3272775 4456363
37277 4456363 4093399 2776312 1733476 1512153 1765854 1926754 1620856 789315 -50055
37268 -50055 11470 1195361 2400781 2348677 1208390 349207 516559 1030354 950093 350767
37258 350767 91574 705013 1794402 2374725 1799278 540231 -112119 561633 1848974
37249 1848974 2520167 2256188 1589695 855047 131877 -22718 973416 2372230 2425920
37240 2425920 624876 -1392832 -1865901 -1031309 -455429 -914621 -1791217 -2144950 -1623211
37231 -1623211 -579595 213244 381515 803130 2774781 5711228 6861465 4613650 1118843
37222 1118843 -159057 1046250 1840507 651926 -694432 -141016 1525085 2230660 1700799
37213 1700799 1206907 1142372 664922 -502222 -1395514 -1063740 430074 2290294 3645405
37204 3645405 4073430 3918238 3702024 2972056 726417 -2365988 -3522567 -1037297 3076015
37195 3076015 5275620 4553737 2565228 575472 -1347364 -2484995 -1578427 754063
37187 754063 2119129 1611802 831896 917956 870040 -130154 -1044136 -1029598 -1014027 -1612411
37177 -1612411 -1588901 -284674 495225 -684584 -2044722 -1236967 759098 1379843 870187
37168 870187 1574526 3513166 4192864 2846137 1516809 1450212 1505558 919608 709078
37159 709078 1261870 1234350 104156 -631711 -92789 547118 614771 1416994 3455341 4663852
37149 4663852 3666763 2610830 4093786 6969131 8091583 7027522 6004164 5871751
37141 5871751 5250571 3686778 2703053 3057059 3407767 2714223 2015820 2618235 3899101
37132 3899101 4131766 2670359 450231 -1055454 -810353 1147039 3464441 4482944
37124 4482944 4005210 3521180 4226348 5434162 5606348 4516556 3561008 3919532 5091771
37115 5091771 5634560 5024723 4217069 4222986 4678000 4401567 3138386 1960322 1839434
37106 1839434 2567243 3342191 3684744 3402181 2454461 1465001 1656466 3507256 5995364
37097 5995364 7915505 9395974 11236500 13282424 14637018 15272609 16131527 17407685
37089 17407685 17939235 17017873 16010079 17174550 20987795 25483938 28612130 30750828
37081 30750828 34201343 40187274 47050381 51849828 53333830 52913605 53188066 56084436
37073 56084436 61876646 69041403 75230959 79151542 81329650 82698456 83533841 84860022
37065 84860022 89453521 99379803 113786165 131950535 157069641 191936484 229899662
37058 229899662 255506669 257993215 241440727 218620717 197839800 179517939 162262855
37051 162262855 145887194 128790562 108369208 85872720 66772334 54373033 46250997
37044 46250997 38734141 31717521 26782607 23394725 19987225 17015183 15811396 15299796
37036 15299796 12843809 8382689 5171433 5600416 8018259 8868308 7059600 4969784
37028 4969784 5210694 7448113 9095710 8675251 7356262 6883552 7132434 6699584 5177162
37019 5177162 3607273 3013572 3596130 5076893 6682878 7083037 5642170 3565184 2503933
37010 2503933 2292609 1618423 729282 1450679 4098736 6322867 5977778 3713306 1741089
37001 1741089 1195292 1639757 2154760 1920843 491792 -1591080 -2926552 -2620055 -1165523
36992 -1165523 276795 932538 664126 -51623 -267725 509399 1479794 1489959 749039
36983 749039 566626 1440361 2572103 3229541 3317097 2708677 1496474 810589 1676713
36974 1676713 3048114 2870779 1197140 102390 300928 358258 -184507 252099 2066602
36965 2066602 3045298 1897982 605530 1088261 1950565 1129206 -343754 -263978 695406
36956 695406 222262 -1320273 -1283837 793138 2335150 1701123 222853 -367329 -172593
36947 -172593 -5130 -25422 -339439 -1271507 -2250816 -1887546 73400 2073501 2599451
36938 2599451 1640820 -33544 -1760309 -2720403 -2182859 -709587 52015 -490453 -1001373
36929 -1001373 -270185 850788 569155 -1410151 -3549455 -4314385 -3613680 -2541437 -2250539
36920 -2250539 -3063883 -4289516 -4790304 -3912652 -2051081 -409531 -71519 -977820 -1847121
36911 -1847121 -1551122 -539732 -197154 -706801 -623329 922451 2728666 3177577 2428089
36902 2428089 1759718 1534779 1287173 1292227 2289953 3653351 3535495 1371596 -1035810
36893 -1035810 -1632885 -461513 756756 767133 -142334 -896829 -863358 -224713 571370
36884 571370 1314860 1757846 1292469 -320740 -2083992 -2670418 -2229304 -1993683 -1916434
36875 -1916434 -480335 2376522 4109378 2831646 79711 -1496563 -1712752 -1967834
36867 -1967834 -2164990 -1255034 -44545 -456786 -2133158 -2665486 -1487107 -750075 -1696744
36858 -1696744 -2787944 -2405084 -1064017 140296 1089372 1472806 257224 -2232290 -3711370
36849 -3711370 -3052902 -2166725 -2953229 -4117999 -3265752 -906454 121956 -1276094 -3171875
36840 -3171875 -3391904 -1883372 -186503 196970 -1102836 -2860857 -3054335 -1018956 1516572
36831 1516572 2393550 1461858 84368 -1016392 -1987245 -2468963 -1707308 -5981 1414225
36822 1414225 2086557 2468740 2427594 1168590 -923487 -1984318 -1111801 94463 -468552
36813 -468552 -2638627 -4295146 -4001347 -2361211 -899756 -424342 -602723 -638848 -167935
36804 -167935 399323 502112 370951 795613 1621643 1217262 -1565149 -5180862 -6421223
36795 -6421223 -4010085 -119462 2312825 2741395 2502157 2169044 1192330 -104712 -222564
36786 -222564 1170117 2255158 1512738 -125550 -825489 -488519 -368227 -848814 -1253372
36777 -1253372 -1391437 -1601888 -1480542 -313003 1168137 1184979 -584998 -2466939 -3181750
36768 -3181750 -3255770 -3453838 -3333649 -2300767 -934016 -272689 -547807 -1234605 -1561220
36759 -1561220 -659946 1595218 3519592 2902589 56660 -2030602 -1546332 -126103 41648
36750 41648 -436187 318394 2039276 2890214 2663533 2869161 3840791 4157576 3210053 2216094
36740 2216094 2104567 2153902 1445109 248004 -708202 -1154022 -924413 189648 1712956
36731 1712956 2617154 2601676 2321571 2175486 2025946 2229504 3400596 4743282 4344900
36722 4344900 1984564 26274 334355 1742427 2032162 1179286 858068 1521426 1861765
36713 1861765 943837 -680312 -1930955 -2071990 -882837 795248 1061717 -982189 -3405939
36704 -3405939 -3392138 -998676 904570 724050 449 300589 480489 -1143768 -3506103
36695 -3506103 -4016858 -2356631 -716426 -338222 -65157 1111274 2072624 1370685 -336427
36686 -336427 -1128588 -481480 259058 -89961 -1125889 -1630742 -1014083 285406 1379955
36677 1379955 1638079 1021782 -64054 -1165517 -1885858 -1705837 -263522 1840813 3039237
36668 3039237 2312414 557110 -268700 573453 1809176 1814136 462403 -1045517 -1707932
36659 -1707932 -1526437 -991067 -316473 659944 2018451 3310048 3653749 2536980 629021
36650 629021 -568199 -276522 561700 364584 -1064456 -2243582 -1968406 -878752 -454837
36641 -454837 -923508 -1118926 -397028 368484 186967 -518026 -650018 -200949 -182744 -873274
36631 -873274 -1249314 -560450 441678 579707 4056 -50377 810305 1335481 237371
36622 237371 -1805844 -2488798 -509112 2565090 3723014 1865079 -960382 -2070286
36614 -2070286 -1219691 -363102 -799072 -1704619 -1606941 -278964 1278998 2067328 1877821
36605 1877821 1336512 1408265 2400278 3390547 3266584 2325748 1955483 2602522 3145196 2647261
36595 2647261 1595463 814111 293680 -118564 7188 693287 855444 -175923 -1256666
36586 -1256666 -902599 437238 962555 -9307 -1456358 -2241533 -2055220 -1046107 219665
36577 219665 610533 -500737 -2083667 -2498502 -1583237 -584485 -225261 -131681 -87307 -481416
36567 -481416 -1356128 -2162735 -2555463 -2401849 -1227942 974459 2556841 1582868 -1298835
36558 -1298835 -3013909 -1730599 1038669 2735180 2875105 2907788 3835111 4982761 4893103
36549 4893103 2987096 418484 -919653 -568883 -58177 -593175 -1224799 -688149 52692
36540 52692 -713926 -2115453 -1551315 1173909 3386814 3615384 3271951 3499027 3278955
36531 3278955 1997651 1123452 1623974 2147600 1545430 842743 871054 456860 -883627
36522 -883627 -1097046 852838 2126702 35489 -3233628 -3730959 -1893231 -1308757 -2393740
36513 -2393740 -1983756 827026 3052886 2864889 2115112 2415837 2414815 853757 -816145
36504 -816145 -999886 -558554 -761882 -916619 -152919 446876 -297805 -1412140 -1545015
36495 -1545015 -1426082 -2244049 -2935669 -1634523 1031652 2561927 2060849 891191 171179
36486 171179 -207216 -159665 816463 2134578 2246695 773127 -1009221 -2171980 -3075773
36477 -3075773 -3857165 -3666405 -2302915 -1130355 -1132707 -1208902 100801 1925632 1855011
36468 1855011 -598183 -2923948 -2644401 -339917 1268204 671730 -1021495 -1947182 -1747516
36459 -1747516 -1512012 -2063411 -3037254 -3600911 -3483321 -3018624 -2485932 -1819712 -1012612
36450 -1012612 -476622 -660463 -1337690 -1702561 -1437049 -1283528 -2005611 -3046486 -3057320
36441 -3057320 -1804156 -593345 -415170 -613316 -132556 715449 773695 -150528 -1119971
36432 -1119971 -1525664 -1629126 -1630954 -1236568 -418925 199537 85637 -589000 -1210550 -1148555
36422 -1148555 -45876 1602352 2258641 689064 -2305824 -4349093 -3933555 -1694374
36414 -1694374 801270 2488109 2813556 1658574 24952 -310614 1098841 2388434
36406 2388434 1601562 -742185 -2478891 -2644504 -2054657 -1355016 -259132 958585 968465
36397 968465 -602800 -1966536 -1339407 507181 1349245 636872 -207118 -483359 -1152041
36388 -1152041 -2448198 -2646606 -768883 1053397 132405 -2663541 -3802791 -2014842
36380 -2014842 141388 190008 -1120588 -1747697 -1419888 -1174283 -1334865 -1635227 -2164999
36371 -2164999 -2548295 -1359124 1753477 4374678 3923575 1279689 -406893 -53192 613424
36362 613424 462359 446403 1213464 1702085 1117509 374262 523262 1304351 2118141 2909946
36352 2909946 3309371 2518856 957348 391409 1411013 2358749 1872604 879708 768836
36343 768836 1152176 971514 442942 263034 96087 -479625 -662947 171942 832376 -38339
36333 -38339 -1577450 -1978830 -1387439 -1374881 -2054671 -1971937 -703913 551205 1027216 1113647
36323 1113647 998580 501462 328457 1503319 3320525 3851632 2829675 2017151 2257291
36314 2257291 2292165 1220665 -30409 -681437 -1413965 -2426962 -2286898 -455477 894154
36305 894154 -263477 -2531944 -3006205 -1465032 -166638 4448 541480 2284808 3786569
36296 3786569 3513448 1917542 395576 -476237 -794365 -541525 111857 518151 386924
36287 386924 306852 800359 1479274 1751032 1722507 1731952 1614634 1227609 1159318 1997147
36277 1997147 3272388 4105419 4623653 5626510 6905222 7155034 5898828 4331896 3600548
36268 3600548 3271888 2475837 1721769 2221825 3766228 4744992 4414063 3772194 3750620
36259 3750620 3870984 3510617 3233647 3551767 3319624 1165087 -1796524 -2637445 -427476
36250 -427476 2316587 2824870 1295660 -187430 -657166 -544142 194612 2120781 4416267
36241 4416267 4875553 2614858 -513940 -2154654 -2119791 -1825754 -1876443 -1555540 -472011
36232 -472011 590812 736994 -36696 -1269333 -2758826 -4316485 -5205506 -4461708 -1928509
36223 -1928509 1155260 2775801 1726823 -1103008 -3294077 -3268249 -1933825 -1346410 -1957579
36214 -1957579 -2259505 -1323052 -357533 -889042 -2451854 -3391369 -3300055 -3093514 -2910291
36205 -2910291 -1757333 300834 1303517 -112639 -2516057 -3367556 -2288396 -1204816
36197 -1204816 -1425344 -2042625 -1625988 -353369 322349 -433756 -1993453 -3140910 -3327525
36188 -3327525 -3040069 -3079233 -3463296 -3178430 -1340364 1453536 3418664 3362058 1756087
36179 1756087 -40985 -1054276 -964218 143290 1657989 2552678 2364335 1848398 1995151
36170 1995151 2624093 2729645 2068170 1428174 1204713 760596 -289198 -1076059 -613172
36161 -613172 609628 1096305 223922 -1132180 -1799169 -1448173 -548427 123154 -160637
36152 -160637 -1487701 -2803847 -2663383 -941467 719710 760212 -365780 -836970 69970
36143 69970 1014331 427240 -1372388 -2626948 -2414859 -1557679 -1075419 -686984 393673
36134 393673 1813639 2391510 1921131 1418014 1352289 981726 83721 -62554 1304417
36125 1304417 2561375 1660149 -624459 -1465778 -12552 1461155 987252 -559851 -1464626
36116 -1464626 -1845655 -2597592 -3021450 -1722928 647358 1715772 592018 -1071131 -1669233
36107 -1669233 -1614780 -1844292 -1793739 -318796 2029052 3184297 2147508 243776 -687978
36098 -687978 -533010 -493241 -884542 -546383 1224263 3217689 3720705 2743881 1676518
36089 1676518 1084919 302490 -790008 -1283831 -1077941 -1458738 -2789814 -3282627 -1693064
36080 -1693064 162016 -224875 -2044811 -2131748 217506 2115868 1477622 30088 442725
36071 442725 2319054 2998078 1317677 -1291558 -2986351 -3137496 -1983545 -238858 779955
36062 779955 42451 -1637985 -2009117 -86960 2309858 2629148 720051 -1168294 -1452461
36053 -1452461 -1057199 -1608120 -2814193 -2909874 -1349482 368333 824091 339159 -94410
36044 -94410 -357113 -694827 -641366 252243 1186353 945078 -320846 -1345007 -1515785 -1151505
36034 -1151505 -284839 1287405 2672188 2201659 -388350 -3350213 -5042011 -5560630 -5742317
36025 -5742317 -5655498 -4855014 -3361023 -1722850 -614351 -611225 -1654778 -2617892 -2361668
36016 -2361668 -1376492 -1228043 -2143442 -2521182 -1328146 446996 1457954 1712239 1694887
36007 1694887 1162109 41103 -593664 168185 1534117 1999112 1281010 279820 -228027
35998 -228027 48172 1092349 2228033 2399902 1625045 1176837 1557392 1658559 934407
35989 934407 640833 1349547 1150958 -1307333 -3622213 -2534532 918342 2529114 981047
35980 981047 -670437 -48506 1407081 1608405 1143642 1549768 2508918 2824519 2601298
35971 2601298 2521998 2163790 868769 -571634 -754460 398649 1865038 3056689 3874881
35962 3874881 3830812 2462764 402039 -991094 -948487 240176 1571522 1730320 34953
35953 34953 -2407757 -3475619 -2614286 -1442932 -1021321 -175010 2062780 4073483 3888804
35944 3888804 2502745 2294480 2926900 1893002 -886894 -2317090 -933939 569296
35936 569296 -522283 -2672271 -2450531 303280 2412588 1994474 626090 528843 1632938
35927 1632938 2390194 2152162 1536185 1059962 565751 11321 -10215 968435 2288550
35918 2288550 2523304 1086853 -886753 -1739110 -1149607 -213063 171663 92224 -297416
35909 -297416 -1341390 -2893050 -3777615 -3276749 -2443087 -2712018 -3636890 -3375582 -1329911
35900 -1329911 1084567 2463688 2818359 2540171 1443327 -201246 -871024 546880 2837467
35891 2837467 3582905 2155467 442915 361096 1569692 2176805 1197480 -295839 -482017
35882 -482017 1066929 2845955 3113349 1781189 144806 -945290 -1661437 -1937742 -1045573
35873 -1045573 784123 1567977 -220582 -3369773 -5290512 -5151829 -4116961 -2870660
35865 -2870660 -893688 1621063 3165511 3059191 2559005 2779251 2905298 1766239 66429
35856 66429 -469778 453742 1524365 1756026 1364430 870351 428388 56996 -304373 -943199
35846 -943199 -1895810 -2458914 -1864888 -340336 1066210 1527221 889758 -443144 -1545155
35837 -1545155 -1520039 -734884 -735388 -2010948 -2781978 -1365621 1151544 2411023 2227901
35828 2227901 2235416 2452457 1111929 -1582885 -2619202 -616800 1631757 1339968 158127
35819 158127 1417805 4497990 5521912 3212756 443524 -492725 -669356 -1301521 -1021947
35810 -1021947 1266020 3314107 2393004 -168853 -574605 1736066 3167445 1268734
35802 1268734 -1858027 -2741757 -1019820 913126 1288044 270104 -1205936 -2226966
35794 -2226966 -1957115 -361683 1243130 1481181 633857 109189 419639 731591 291467
35785 291467 -776518 -2088873 -3381447 -4179717 -4061399 -3413104 -3087788 -3232379 -3294381
35776 -3294381 -3135434 -3082806 -2877921 -1868717 -491853 -161898 -1119679 -1734485 -784567
35767 -784567 775617 1379498 1142614 1305463 2088561 2488645 1936018 942354 111904
35758 111904 -533201 -1142744 -1671435 -2055105 -2295008 -2318959 -2036425 -1478668 -801948 -396608
35748 -396608 -879253 -2323700 -3553617 -3245894 -1956968 -1751798 -3238042 -4428924 -3624587
35739 -3624587 -2016420 -1842619 -3051579 -3752950 -3343419 -3025870 -3298289 -3050683 -1677787
35730 -1677787 -346283 -296010 -1086596 -1392425 -752471 147632 423611 -148849 -796807
35721 -796807 -284290 1536068 2854097 1651372 -1574191 -4012548 -3863166 -2326135 -1642405
35712 -1642405 -2177044 -2442772 -1421487 244661 1347905 1570756 1486464 1473915 1200032
35703 1200032 428400 -124886 390604 1280292 672566 -1758934 -3679952 -3023427 -1063800
35694 -1063800 -713759 -2240000 -2940913 -1380304 359271 -183782 -2247659 -3098875 -1864757
35685 -1864757 -278408 106297 -259859 -261636 -8364 -477675 -1809638 -2927652 -2967378
35676 -2967378 -2333838 -1847980 -1405620 -354549 1049586 1717818 1424710 1228905 1727781
35667 1727781 2102214 1604236 766832 241396 -252374 -710059 -96751 1609198 2175830
35658 2175830 82305 -2562518 -2669423 -786561 -75106 -1188388 -1548875 69726 1653936
35649 1653936 1530107 711786 373968 -189252 -1482687 -2182722 -1372632 -300905 -229277
35640 -229277 -498219 -312843 -389436 -1138441 -1324996 -393305 16394 -1095033 -1963356 -1142409
35630 -1142409 -450409 -1956085 -4060515 -3978247 -2537906 -2735092 -4483595 -4788623 -2906178
35621 -2906178 -1472140 -2096253 -3304292 -3590064 -3371058 -2994603 -1725012 146775 828812
35612 828812 -74481 -552953 648856 2073138 2076910 1223160 714760 395907 -126705 -133984
35602 -133984 777413 1422372 792074 -251642 -546286 -506570 -863624 -987940 -346629 -289411
35592 -289411 -2091551 -4136106 -3629833 -894486 600113 -1021719 -3430790 -3292041 -556414
35583 -556414 1816026 1669951 -165837 -1500451 -1511174 -1182551 -1435799 -1847512 -1674467
35574 -1674467 -1283877 -1460235 -1724355 -826374 995131 1857247 932074 -240071 -152434
35565 -152434 348170 -404520 -2063481 -2702501 -1620497 -74149 695275 701157 315956
35556 315956 -574013 -2019424 -3381345 -3695926 -2428605 -14767 2001828 1900417 -354351
35547 -354351 -2577469 -2615915 -849349 490429 139160 -1207574 -2430511 -3079462 -2882793
35538 -2882793 -1677863 -289226 -160817 -1432586 -2444975 -1868053 -374725 574837 727766
35529 727766 872603 1344007 1729631 1733099 1421106 764378 -303082 -1402439 -1901732 -1647907
35519 -1647907 -1111777 -773565 -597425 -95728 1117054 2613516 3075087 1509867 -1279076
35510 -1279076 -3095545 -2612230 -711819 767819 989203 350608 -526664 -1280529 -1681808
35501 -1681808 -1721043 -1611084 -1328450 -593976 361206 729453 332861 61727 453148 805164
35491 805164 573480 506274 1132106 1304781 17163 -1340646 -786284 805838 690149
35482 690149 -1360272 -2468938 -1090989 707281 660470 -450818 -731310 -357163 -705673
35473 -705673 -1641371 -1804064 -868524 249585 909696 1031032 436931 -784046 -1831133
35464 -1831133 -2192391 -2329677 -2403366 -1549889 213936 780106 -1388782 -4444983 -5217988
35455 -5217988 -3417850 -1551005 -1094121 -1075608 -393382 644205 1323724 1300739 294846
35446 294846 -1368344 -2105358 -741707 1445651 2271703 1822283 1826984 2250059 1320179
35437 1320179 -933332 -2187684 -1541971 -855632 -1372993 -1773354 -931130 -65977 -516842
35428 -516842 -1575598 -2170693 -2674806 -3402087 -3284673 -1799266 -396808 -257572 -365593
35419 -365593 406897 1050369 203688 -1368188 -2037525 -1674862 -968386 131482 1497848
35410 1497848 1944773 1127921 663739 1441689 1755510 328862 -973443 -259065 728939
35401 728939 -427260 -2014301 -561523 3018692 4245394 1941118 -215195 257394
35393 257394 1287500 506424 -815743 -318966 1606342 2770444 2210429 488106 -1635202
35384 -1635202 -3415903 -4198784 -4284114 -4630715 -5165951 -4791534 -3428978 -2283443 -1607151
35375 -1607151 -251711 1816418 2752101 1735860 593816 1044682 2075521 1716994 91540
35366 91540 -942767 -265243 1703392 3867734 5097630 4808130 3708722 3137540 3166874
35357 3166874 2543197 909779 -504761 -1024931 -1504868 -2255582 -2005901 -283963 1098275
35348 1098275 678593 -225277 314572 1664828 1757342 250922 -1600766 -3278616 -4870352
35339 -4870352 -5289104 -3127930 766042 3734429 4468506 3867467 2699062 498897 -2632646
35330 -2632646 -4973238 -4949490 -2899870 -369134 1448675 2026182 1246766 -326401 -1426704
35321 -1426704 -1048873 613286 2386111 3118614 2472023 992967 -525774 -1771899 -2761341
35312 -2761341 -3053189 -1967507 -20746 842314 -510674 -2574211 -2913769 -1416407 -424014
35303 -424014 -1475237 -3267041 -3489801 -1718608 375192 1150977 443117 -986106 -2578576
35294 -2578576 -4137056 -5247858 -5234094 -3945898 -2223805 -1122363 -796549 -590856 -135478
35285 -135478 207272 59023 -366714 -606156 -524415 -367020 -473003 -958178 -1466854 -1410154
35275 -1410154 -717888 33601 597509 1421911 2344755 1990037 -127245 -1881638 -1053983
35266 -1053983 985108 797362 -1804782 -3004871 -555501 2871783 3727273 2328412
35258 2328412 1089218 212679 -1651690 -3731809 -3610065 -1278282 283858 -816802
35250 -816802 -2996947 -3648174 -2272245 -398505 405685 -180311 -1144635 -1107925 59306
35241 59306 913004 461409 -285453 -39370 426706 -448935 -2036879 -2141153 -540383
35232 -540383 482250 -447785 -2120472 -3156790 -3826579 -4331057 -3417091 -446294 2663199
35223 2663199 3475513 2164940 915988 749378 576530 -689143 -2454284 -3206922 -2223430
35214 -2223430 -273122 1079613 908922 -207051 -997869 -1122205 -1303206 -1753510 -1526116
35205 -1526116 -100656 1259847 782734 -1517099 -3668906 -3781853 -1719845 1024717
35197 1024717 2600483 2189351 709391 1336 861411 2072416 1868366 155377 -1344336
35188 -1344336 -1175582 177792 925908 -36561 -2027610 -3372540 -3120324 -1907286 -1172630
35179 -1172630 -1659531 -2767038 -3246636 -2397662 -684881 705260 1063781 939877 1327216
35170 1327216 1972220 1305296 -1252080 -3652220 -3173459 157658 3437222 4409163 3789286
35161 3789286 3438793 3492129 2573860 256033 -2112440 -3135617 -2914198 -2466646 -2259071
35152 -2259071 -1860512 -826393 565307 1562993 1691636 1098170 290150 -231670 -149710
35143 -149710 491229 1175581 1361030 1220628 1517215 2439757 3070781 2540045 1277107
35134 1277107 437913 414317 687445 901730 1151718 1269777 823094 -14260 -473296 -305476
35124 -305476 -40219 128226 764729 2014535 2873337 2367065 878832 -411482 -988169
35115 -988169 -1221710 -1429881 -1391830 -753745 476219 1774269 2278811 1420697 -393480
35106 -393480 -2051367 -2869362 -3013213 -2631554 -1349515 784958 2537898 2637609 1434874
35097 1434874 503755 617005 999955 788742 369409 675549 1648012 2164837 1517239
35088 1517239 341230 -277995 -283188 -644334 -1871394 -3178412 -3528611 -2985950 -2359404
35079 -2359404 -1873077 -1125802 -294192 -262102 -1181092 -1882638 -1377611 -169008 719566
35070 719566 1389229 2734037 4743648 6106185 5570248 3129939 3494 -1978811 -1335024
35061 -1335024 1676962 4590132 4688050 1832642 -1374620 -2556859 -1930823 -1318903 -1632464
35052 -1632464 -2124388 -1700269 -205757 1434258 1854817 287068 -2506645 -4577842 -4644525
35043 -4644525 -3403761 -2454230 -2226717 -1783911 -518611 922653 1588822 1267389 311597
35034 311597 -803877 -1423569 -983699 181231 961653 845053 451683 234833 -405804
35025 -405804 -1852888 -2971770 -2326753 -275013 1338495 1359033 187335 -1159106 -1681851
35016 -1681851 -558043 1772173 2937264 1012056 -2247455 -2742055 602528 4018294
35008 4018294 3889210 1488287 503339 1423280 1420086 -652479 -2386689 -1734194 -55856
34999 -55856 417295 223035 1539174 4391273 6342016 5942691 4417311 3295603 2198418
34990 2198418 288235 -1418046 -1137611 725766 1792108 1186700 804034 2076332 3302745
34981 3302745 2010043 -1202740 -3355360 -3123377 -2017107 -1629367 -1938494 -2681535 -4174262
34972 -4174262 -5927395 -6411130 -5236116 -3813449 -2842684 -1131593 1697693 3426195
34964 3426195 2240581 -143719 -786718 243505 530939 -593138 -1388201 -911658 -191838
34955 -191838 82714 603312 1531631 1653591 319296 -1402781 -2276047 -2207137 -1464160
34946 -1464160 -85562 1279155 1399235 136337 -1140221 -1496115 -1540111 -1904123 -1987998
34937 -1987998 -1215436 -385731 -606159 -1656791 -2460167 -2582186 -2329233 -1812589 -813853
$$ [...]
##END NTUPLES=NMR SPECTRUM
##END=
