##TITLE=31Pdec_SR159_oil_k
 CDCl3, 64 sc
 16.1.2023
##JCAMPDX= 6.0         $$ Bruker NMR JCAMP-DX V2.0
##DATA TYPE= NMR SPECTRUM
##DATA CLASS= NTUPLES
##ORIGIN= UXNMR, Bruker Analytische Messtechnik GmbH
##OWNER= root
$$ XWIN-NMR		Version 3.5
$$ Mon Jan 16 15:41:59 2023 Russian Standard Time (UT+4h)  she@DPX200
##.OBSERVE FREQUENCY= 81.013821
##.OBSERVE NUCLEUS= ^31P
##.ACQUISITION MODE= SIMULTANEOUS
##.ACQUISITION SCHEME= undefined
##.AVERAGES= 64
##.DIGITISER RES= 16
##SPECTROMETER/DATA SYSTEM= spect
##.PULSE SEQUENCE= zgpg30
##.SOLVENT NAME= DMSO
##.SHIFT REFERENCE= (INTERNAL, DMSO, 0, 248.564)
##AUDIT TRAIL= $$ (NUMBER, WHEN, WHO, WHERE, WHAT)
$$ ##TITLE= Audit trail, XWIN-NMR		Version 3.5
$$ ##JCAMPDX= 5.01
$$ ##ORIGIN= Bruker BioSpin GmbH
$$ ##OWNER= she
$$ F:/spectra/data/she/nmr/P31/1/pdata/1/auditp.txt
$$ ##AUDIT TRAIL=  $$ (NUMBER, WHEN, WHO, WHERE, WHAT)
(   1,<2023-01-16 15:40:21.85 +0400>,<she>,<DPX200>,
      <continue with go, POWCHK disabled, PULCHK disabled
       configuration hash MD5:
       00 E9 B6 7A A2 85 ED C7 34 08 36 98 17 FE 4E 26
       data hash MD5: 32K
       3C 65 05 AF 5A 30 E8 C7 01 3F 8D FF 4A 2D 5A DD>)
(   2,<2023-01-16 15:40:23.81 +0400>,<she>,<DPX200>,
      <Start of raw data processing
       efp BC_mod = 2 LB = 1 FT_mod = 6 PKNL = 1 PHC0 = -10920.52 PHC1 = 910.0563 SI = 64K 
       data hash MD5: 64K
       F0 38 B0 3F 57 4C C2 DC CC B7 EB A9 32 17 FD 14>)
(   3,<2023-01-16 15:40:33.46 +0400>,<she>,<DPX200>,
      <pk PHC0 = -3.231528 PHC1 = 0 
       data hash MD5: 64K
       8B F5 75 6B 6A 27 CC 58 6A 61 FC BE 4C 1D E6 7C>)
(   4,<2023-01-16 15:40:36.81 +0400>,<she>,<DPX200>,
      <abs ABSG = 5 
       data hash MD5: 64K
       85 D0 2E B3 54 DA E1 12 CF 6E 2E 60 A6 92 FB 68>)
$$ ##END=
$$ 
$$ hash MD5
$$ DA 2C 89 FB 98 42 7E CC 46 99 5A F8 C1 5C 98 AD
##$RELAX= 
##$RELAX= 
##$RELAX= 
##$RELAX= 
##$RELAX= 
##$RELAX= 
##$RELAX= 
##$RELAX= 
##$RELAX= 
$$ Bruker specific parameters
$$ --------------------------
##$DU= <F:/spectra>
##$EXPNO= 1
##$NAME= <P31>
##$PROCNO= 1
##$TYPE= <nmr>
##$USER= <she>
##$AMP= (0..31)
100 100 100 100 100 100 100 100 100 100 100 100 100 100 100 100 100 100 
100 100 100 100 100 100 100 100 100 100 100 100 100 100 
##$AQSEQ= 0
##$AQ_mod= 1
##$AUNM= <au_zg>
##$AUTOPOS= <>
##$BF1= 81.014009
##$BF2= 200.13
##$BF3= 200.13
##$BF4= 200.13
##$BF5= 200.13
##$BF6= 200.13
##$BF7= 200.13
##$BF8= 200.13
##$BYTORDA= 1
##$CFDGTYP= 0
##$CFRGTYP= 5
##$CHEMSTR= <none>
##$CNST= (0..31)
1 1 145 1 1 1 1 1 1 1 1 1 1 1 1 1 1 1 1 1 1 1 1 1 1 1 1 1 1 1 1 1 
##$CPDPRG= <waltz16>
##$CPDPRG1= <>
##$CPDPRG2= <waltz16>
##$CPDPRG3= <>
##$CPDPRG4= <mlev>
##$CPDPRG5= <mlev>
##$CPDPRG6= <mlev>
##$CPDPRG7= <mlev>
##$CPDPRG8= <mlev>
##$CPDPRGB= <>
##$CPDPRGT= <>
##$D= (0..31)
0 1 0 0 0 0 0 0 0 0 0 0.03 2e-05 3e-06 0 0 0 0 0 0 0 0 0 0 0 0 0 0 0 0 
0 0 
##$DATE= 1673869135
##$DBL= (0..7)
120 120 120 11 120 120 24 19 
##$DBP= (0..7)
150 150 150 150 150 150 150 150 
##$DBP07= 0
##$DBPNAM0= <>
##$DBPNAM1= <>
$$ [...]
##$SUBNAM3= <"">
##$SUBNAM4= <"">
##$SUBNAM5= <"">
##$SUBNAM6= <"">
##$SUBNAM7= <"">
##$SUBNAM8= <"">
##$SUBNAM9= <"">
##$SW= 501.771253377433
##$SWIBOX= (0..15)
0 1 3 0 0 0 0 0 0 0 0 0 0 0 0 0 
##$SW_h= 40650.406504065
##$TD= 32768
##$TD0= 1
##$TE= 0
##$TE2= 300
##$TE3= 300
##$TEG= 300
##$TL= (0..7)
0 120 53 12 22 120 120 120 
##$TP= (0..7)
150 150 150 150 150 150 150 150 
##$TP07= 0
##$TPNAME0= <>
##$TPNAME1= <>
##$TPNAME2= <>
##$TPNAME3= <>
##$TPNAME4= <>
##$TPNAME5= <>
##$TPNAME6= <>
##$TPNAME7= <>
##$TPOAL= (0..7)
0.5 0.5 0.5 0.5 0.5 0.5 0.5 0.5 
##$TPOFFS= (0..7)
0 0 0 0 0 0 0 0 
##$TUNHIN= 0
##$TUNHOUT= 0
##$TUNXOUT= 0
##$USERA1= <user>
##$USERA2= <user>
##$USERA3= <user>
##$USERA4= <user>
##$USERA5= <user>
##$V9= 5
##$VALIST= <valist>
##$VCLIST= <CCCCCCCCCCCCCCC>
##$VD= 0
##$VDLIST= <DDDDDDDDDDDDDDD>
##$VPLIST= <PPPPPPPPPPPPPPP>
##$VTLIST= <TTTTTTTTTTTTTTT>
##$WBST= 1024
##$WBSW= 4
##$XGAIN= (0..3)
0 0 0 0 
##$XL= 0
##$YL= 0
##$YMAX_a= 5007
##$YMIN_a= -6206
##$ZGOPTNS= <>
##$ZL1= 120
##$ZL2= 120
##$ZL3= 120
##$ZL4= 120
##$ABSF1= 248.5645
##$ABSF2= -253.2056
##$ABSG= 5
##$ABSL= 3
##$ALPHA= 0
##$AQORDER= 0
##$ASSFAC= 0
##$ASSFACI= 0
##$ASSFACX= 0
##$ASSWID= 0
##$AUNMP= <proc_1d>
##$AZFE= 0.1
##$AZFW= 0.5
##$BCFW= 0
##$BC_mod= 2
##$BYTORDP= 0
##$COROFFS= 0
##$CY= -3
##$DATMOD= 1
##$DC= 0
##$DFILT= <>
##$DTYPP= 0
##$F1P= 0
##$F2P= 0
##$FCOR= 1
##$FTSIZE= 65536
##$FT_mod= 6
##$GAMMA= 0
##$GB= 0
##$INTBC= 1
##$INTSCL= 6.047779e-11
##$ISEN= 30
##$LB= 1
##$LEV0= 0
##$LPBIN= 0
##$MAXI= 10000
##$MC2= 0
##$MEAN= 0
##$ME_mod= 0
##$MI= 50
##$NCOEF= 0
##$NC_proc= -8
##$NLEV= 6
##$NOISF1= 182.463
##$NOISF2= 159.3651
##$NSP= 0
##$NTH_PI= 0
##$NZP= 0
##$OFFSET= 248.5645
##$PC= 4
##$PHC0= -10923.75
##$PHC1= 910.0563
##$PH_mod= 1
##$PKNL= yes
##$PPARMOD= 0
##$PSCAL= 0
##$PSIGN= 0
##$REVERSE= no
##$SF= 81.0140089999694
##$SI= 65536
##$SIGF1= 159.3651
##$SIGF2= -187.1042
##$SINO= 113.3802
##$SIOLD= 16384
##$SREGLST= <1H.CDCl3>
##$SSB= 0
##$STSI= 65536
##$STSR= 0
##$SW_p= 40650.406504065
##$SYMM= 0
##$S_DEV= 0
##$TDeff= 32768
##$TDoff= 0
##$TI= <>
##$TILT= no
##$TM1= 0
##$TM2= 0
##$TOPLEV= 0
##$USERP1= <user>
##$USERP2= <user>
##$USERP3= <user>
##$USERP4= <user>
##$USERP5= <user>
##$WDW= 1
##$XDIM= 65536
##$YMAX_p= 392359140
##$YMIN_p= -256029935
$$ End of Bruker specific parameters
$$ ---------------------------------
##NTUPLES= NMR SPECTRUM
##VAR_NAME=  FREQUENCY,     SPECTRUM/REAL,   SPECTRUM/IMAG
##SYMBOL=    X,             R,               I
##VAR_TYPE=  INDEPENDENT,   DEPENDENT,       DEPENDENT
##VAR_FORM=  AFFN,          ASDF,            ASDF
##VAR_DIM=   65536,         65536,           65536
##UNITS=     HZ,            ARBITRARY UNITS, ARBITRARY UNITS
##FACTOR=    0.620285442955139, 1,           1
##FIRST=     20137.2065510682, 0,            0
##LAST=      -20513.1999529968, 0,           0
##MIN=       -20513.1999529968, -256029935,  0
##MAX=       20137.2065510682, 392359140,    0
$$ Real data points
##PAGE= N=1
##DATA TABLE= (X++(R..R)), XYDATA
$$ [...]
$$ plain form
42844 -10954026 -13650228 -10545936 -6833561 -6857481 -8450672 -7625105 -4488787 -1302553
42836 -1302553 1557477 3817343 2851975 -2048174 -5282126 -619432 9324431 14971276
42828 14971276 11854770 5513806 2569930 2103575 -487643 -4973871 -6802050 -4680299
42820 -4680299 -2471399 -2654934 -2149276 2634403 9060530 10285046 3813223 -5039190
42812 -5039190 -9241379 -7234928 -2552386 1443199 3808599 4352875 2871991 88981
42804 88981 -2822518 -5449314 -7067595 -5654395 -974456 2687501 1256489 -2262054
42796 -2262054 -1043145 4973530 8155434 5075380 2642399 7855672 17145487 21952766
42788 21952766 20627969 17886876 15402397 10662721 4220484 544285 777083 976356
$$ packed form
42844a0954026k696202L104292L712375k3920j593191Q25567L136318L186234
42836a302553K860030K259866r65368m900149l233952M662694R943863N646845
42828A4971276l116506o340964k943876m66355k591218m486228j828179K121751
42820d680299K208900j83535N05658M783679O426127J224516o471823q852413
42812e039190m202189K006451M682542L995585K365400N44276j480884k783010
42804H8981k911499k626796j618281J413200M679939L661957j431012l518543
42796b262054J218909O016675L181904l080054k432981N213273R289815M807279
42788B1952766j324797k741093k484479m739676o442237l676199K32798J99273
$$ plain form
42780 976356 -867869 -1586569 1254020 4830482 5063484 1842370 -1844569 -3447171 -2338291
42771 -2338291 -420661 -1773246 -8336629 -15403149 -15434198 -7429425 1785343 6824060
42763 6824060 8980673 9816336 5832494 -4958677 -15703690 -17157748 -9722947 -2400951
42755 -2400951 -405838 -661275 -187076 -1409560 -5855238 -9078824 -7267411 -4327990
42747 -4327990 -6046164 -10194509 -9785885 -5069121 -4177959 -10272787 -15709616 -13075994
42739 -13075994 -5987562 -3443283 -7605865 -13001997 -15182833 -14577153 -13334219 -13097509
42731 -13097509 -14438960 -14740128 -9587894 -575444 2992380 -3157723 -8997596 -3352687
42723 -3352687 7954123 9822529 1523859 -2939403 562969 -1029159 -14066713 -24120643
$$ packed form
42780I76356j844225p18700K840589L576462K33002l221114l686939j602602J108880
42771b338291J917630j352585o563383p066520l1049Q004773R214768N038717
42763F824060K156613Q35663l983842j0791171j0745013j454058P434801P321996
42755b400951J995113k55437M74199j222484m445678l223586J811413K939421
42747d327990j718174m148345M08624M716764Q91162o094828n436829K633622
42739a3075994P088432K544279m162582n396132k180836O05680J242934K36710
42731a3097509j341451l01168N152234R012450L567824o150103n839873N644909
42723c352687J1306810J868406q298670m463262L502372j592128j3037554j0053930
$$ plain form
42715 -24120643 -17648408 -3749038 474297 -4451384 -5825306 -1960364 -1707912 -4835679
42707 -4835679 -1547191 8212964 12173371 5571854 -1438789 -865777 1980585 373850
42699 373850 -2426215 -870889 2892761 3938887 2623409 1748434 1520790 2049774 4909121
42690 4909121 7974135 5076476 -4452910 -11797495 -9148765 810247 10100509 14968858
42682 14968858 16083751 14450991 11771536 10629413 10387150 6875131 -787556 -7589917
42674 -7589917 -9615707 -8665765 -7350882 -5322156 -3347193 -4886829 -9844287 -12626069
42666 -12626069 -10192007 -6261516 -4234797 -2561171 -641283 -1748249 -5739286 -6971074
42658 -6971074 -4555256 -5767278 -12837971 -16081529 -8993876 -847682 -2920940 -10018430
$$ packed form
42715b4120643O472235J3899370M223335m925681j373922L864942K52452l127767
42707d835679L288488R760155L960407o601517p010643N73012K846362j606735
42699C73850k800065J555326L763650J046126j315478q74975k27644N28984K859347
42690D909121L065014k897659r529386p344585K648730R959012R290262M868349
42682A4968858J114893j632760k679455j142123k42263l512019p662687o802361
42674g589917k025790R49942J314883K028726J974963j539636m957458k781782
42666a2626069K434062L930491K026719J673626J919888j106966l991037j231788
42658f971074K415818j212022p070693l243558P087653Q146194k073258p097490
$$ plain form
42650 -10018430 -9115288 -975769 1585548 -5179528 -11062312 -8833704 -3009705 973740
42642 973740 4847042 10324559 12882784 8075350 -1496856 -9167159 -10428447 -5345971
42634 -5345971 857810 322035 -8557881 -15905708 -11405265 181170 3614215 -5700988
42626 -5700988 -15105771 -12795172 -3269635 1447422 -1120325 -3485438 -1092044 2125981
42618 2125981 892816 -4089939 -7640136 -6545603 -2802758 -470191 -432603 -143916 1472543
42609 1472543 2187929 1028454 615934 1922275 1054373 -4213048 -9033508 -8485146 -5867918
42600 -5867918 -6874074 -9356429 -7772861 -4833081 -8005933 -15375370 -16507196 -8710477
42592 -8710477 -1088181 508277 1156117 4597521 4434247 -4460211 -14269095 -13472573 -2845291
$$ packed form
42650a0018430R03142Q139519K561317o765076n882784K228608N823999L983445
42642I73740L873302N477517K558225m807434r572206p670303j261288N082476
42634e345971O203781n35775q879916p347827M500443J1586435L433045r315203
42626e700988r404783K310599R525537M717057k567747k365113K393394L218025
42618B125981j233165m982755l550197J094533L742845K332567L7588K88687J616459
42609A472543P15386j159475m12520J306341q67902n267421m820460N48362K617228
42600e867918j006156k482355J583568K939780l172852p369437j131826P796719
42592h710477P622296J596458O47840L441404j63274q894458r808884P96522J0627282
$$ plain form
42583 -2845291 6197077 6309060 329159 -5197270 -6523834 -3682006 625445 3532959
42575 3532959 5393436 8780659 13253847 15003981 13031186 10679250 9210868 5953755
42567 5953755 1576454 2026133 8541215 12723203 7843697 -1116741 -5908029 -7586962
42559 -7586962 -11684502 -15370290 -10409074 2217246 11185988 10041705 4904522 3975414
42551 3975414 6442969 6194805 1776089 -2193653 -1632592 2372288 5203558 3558013
42543 3558013 -1111339 -3825300 -1298028 4531314 8903961 9137877 6012985 1607247
42535 1607247 -2504727 -5625748 -7936530 -9814631 -10857262 -10601656 -9953437 -9966643 -9624211
42526 -9624211 -7519497 -5068263 -4343344 -3589922 -104588 3028297 192394 -6108571
$$ packed form
42583b845291R042368J11983n979901n526429j326564K841828M307451K907514
42575C532959J860477L387223M473188J750134j972795k351936j468382l257113
42567E953755m377301M49679O515082M181988m879506q960438m791288j678933
42559g586962m097540l685788M961216J2626320Q968742j144283n137183r29108
42551C975414K467555k48164m418716l969742N61061M004880K831270j645545
42543C558013m669352k713961K527272N829342M372647K33916l124892m405738
42535A607247m111974l121021k310782j878101j042631K55606O48219j3206L42432
42526i624211K104714K451234P24919P53422L485334L132885k835903o300965
$$ plain form
42518 -6108571 -6513588 612676 5334542 1739243 -2477245 602176 5696846 4404616
42510 4404616 427703 2241556 6762406 4529397 -2612676 -4245349 -322216 -1286246
42502 -1286246 -8052222 -8673127 237430 5107085 -3003950 -12769226 -10141902 4804
42494 4804 3500299 -233754 -231726 5524620 7380752 1617467 -3557260 -2756700 -1908599
42485 -1908599 -6515690 -11428368 -9740133 -4514351 -3008522 -3952735 -195986 7635119
42477 7635119 10181085 4170704 -804263 4014535 12754834 13171573 5168414 852039
42469 852039 5638177 10002254 4935783 -3567450 -3763009 4604740 12439158 16542005
42461 16542005 20990781 24651472 20412271 9417088 3484421 7559174 11009277 4662783
$$ packed form
42518f108571m05017P126264M721866l595299m216488L079421N094670j292230
42510D404616l976913J813853M520850k233009p142073j632673L923133r64030
42502a286246o765976o20905Q910557M869655q111035r765276K627324J0146706
42494D804L495495l734053K028N756346J856132n763285n174727Q00560Q48101
42485a908599m607091m912678J688235N225782J505829r44213L756749P831105
42477G635119K545966o010381m974967M818798Q740299M16739q003159m316375
42469H52039M786138M364077n066471q503233j95559Q367749P834418M102847
42461A6542005M448776L660691m239201j0995183n932667M074753L450103o346494
$$ plain form
42453 4662783 -3526976 -1122437 7900882 8594530 -1881863 -10524315 -8164441 -77896
42445 -77896 5642345 8177728 7608224 -32295 -13267861 -19814332 -10856855 5002311
42437 5002311 12153394 8297634 3786367 3446774 1643680 -3680172 -5019463 1323463
42429 1323463 6674538 2991870 -3546697 -1797810 6806059 10999441 7641926 5298730
42421 5298730 8707846 10729594 4644438 -4057224 -5276949 1271418 6321537 3564232
42413 3564232 -3913642 -9078143 -8537219 -4555823 -2042812 -3427096 -5716681 -4445097
42405 -4445097 -879961 -1102580 -5936301 -7306200 470135 10327795 10449206 436172
42397 436172 -7958233 -6223177 1596759 6407799 5040934 1096569 -996359 138662
$$ packed form
42453D662783q189759K404539R023319O93648j0476393q642452K359874Q086545
42445g7896N720241K535383n69504p640519j3235566o546471Q957477J5859166
42437E002311P151083l855760m511267l39593j803094n323852j339291O342926
42429A323463N351075l682668o538567J748887Q603869M193382l357515k343196
42421E298730L409116K021748o085156q701662j219725O548367N050119k757305
42413C564232p477874n164501N40924L981396K513011j384284k289585J271584
42405d445097L565136k22619m833721j369899P776335R857660J21411j0013034
42397D36172q394405J735056P819936M811040j366865l944365k092928J135021
$$ plain form
42389 138662 2583320 2934602 -234330 -4370862 -6025021 -5310594 -5067261 -6711437 -9708412
42380 -9708412 -13552299 -16665723 -15262077 -8078235 -612970 996615 -971431 526001
42372 526001 5481761 6727169 2294783 -988010 869874 2266735 -2360171 -9184407
42364 -9184407 -10791316 -5798285 2320232 10593103 15689452 13416156 5044014 -1045555
42356 -1045555 -284209 773160 -4871674 -12120259 -11033810 -2712425 2416542 405687
42348 405687 -2651267 -2933942 -4182371 -8204661 -9563812 -4282546 3106773 5819754
42340 5819754 2921456 -2460421 -7815740 -10311831 -6314178 3254785 10839208 10366469
42332 10366469 4665759 502867 -830310 -2791673 -5523620 -4686422 1234645 7592544
$$ packed form
42389A38662K444658L51282l168932m136532j654159P14427K43333j644176k996975
42380i708412l843887l113424J403646P183842P465265J609585j968046J497432
42372E26001M955760J245408m432386l282793J857884J396861m626906o824236
42364i184407j606909M993031Q118517Q272871N096349k273296q372142o089569
42356a045555P61346J057369n644834p248585J086449Q321385N128967k010855
42348D05687l056954k82675j248429m022290j359151N281266P389319K712981
42340E819754k898298n381877n355319k496091L997653R568963P584423m72739
42332A0366469n700710m162892j333177j961363k731947Q37198N921067O357899
$$ plain form
42324 7592544 9472868 7426253 5060906 3545573 1527236 -737681 -769578 1707736
42316 1707736 2539986 -2061561 -9564730 -12907951 -8643562 -872169 3786100 2853766
42308 2853766 -1454407 -5724982 -7402069 -5517987 -1719445 1021718 2524867 5911700
42300 5911700 11794976 15089596 11363940 3733287 -1228504 -2338844 -3058359 -3437891
42292 -3437891 223889 7118959 10386690 6640817 1399436 1233526 4821781 6105316
42284 6105316 3311192 265766 128852 1902642 3267161 4054237 5805900 8718628
42276 8718628 9954258 6192885 -1422117 -6839013 -6128947 -3331318 -5401418 -12239832
42268 -12239832 -16674907 -14538513 -9208722 -4721797 -263794 5470516 9915946 11055459
$$ packed form
42324G592544J880324k046615k365347j515333k018337k264917l1897K477314
42316A707736Q32250m601547p503169l343221M264389P771393M658269r32334
42308B853766m308173m270575j677087J884082L798542K741163J503149L386833
42300E911700N883276L294620l725656p630653m961791j110340p19515l79532
42292c437891L661780O895070L267731l745873n241381j65910L588255J283535
42284F105316k794124l045426j36914J773790J364519P87076J751663K912728
42276H718628J235630l761373p615002n416896P10066K797629k070100o838414
42268a2239832m435075K136394N329791M486925M458003N734310M445430J139513
$$ plain form
42260 11055459 11752124 14396803 14640926 6712708 -6470826 -14651704 -12273050 -4441560
42252 -4441560 588078 1291608 2766066 8269096 13619683 11741138 2518217 -4971751
42244 -4971751 -3117864 3739935 5156560 106329 -1417207 5265561 10600177 4868876
42236 4868876 -6031601 -8460977 -595504 6459234 5863965 2611976 2408303 3170506
42228 3170506 1960772 2038259 6551461 10706704 7361801 -2003424 -8091648 -5286022
42220 -5286022 2127559 6054203 4111208 1511847 3983426 9952379 11574756 4611998
42212 4611998 -4999276 -7588008 -1292249 6979371 11213154 11546653 9556831 4619291
42204 4619291 -2465761 -7686338 -9348093 -10992441 -14914613 -16952162 -12455668 -4037186
$$ packed form
42260A1055459O96665K644679K44123p928218j3183534q180878K378654P831490
42252d441560N029638P03530J474458N503030N350587j878545r222921p489968
42244d971751J853887O857799J416625n050231j523536O682768N334616n731301
42236D868876j0900477k429376P865473P054738n95269l251989k03673P62203
42228C170506j209734P7487M513202M155243l344903r365225o088224K805626
42220e286022P413581L926644j942995k599361K471579N968953J622377o962758
42212D611998r611274k588732O295759Q271620M233783L33499j989822m937540
42204D619291p085052n220577j661755j644348l922172k037549M496494Q418482
$$ plain form
42196 -4037186 1926220 4064177 5820528 8195457 8501199 5941525 2976470 628906
42188 628906 -2664094 -6466077 -7227597 -3757325 -112248 -467082 -3627742 -5225655 -3753263
42179 -3753263 -1793928 -1621319 -1745429 1104293 7162357 12266493 12407087 8708710 5689127
42170 5689127 4882028 3487527 132955 -2157033 -1174321 325991 -539402 -1460651 578277
42161 578277 2605501 -203832 -5536237 -6252731 -1447695 2047103 217827 -3236030
42153 -3236030 -4649495 -5809909 -7897240 -6496394 2011885 13591986 21277176 23331081
42145 23331081 22041811 17849428 10103849 1402415 -4104179 -5648518 -5164906 -3389987
42137 -3389987 -605736 758080 -1125247 -3578778 -2805374 151482 1544589 1769401
$$ packed form
42196d037186N963406K137957J756351K374929L05742k559674k965055k347564
42188F28906l293000l801983p61520L470272L645077l54834l160660j597913J472392
42179c753263J959335J72609j24110K849722O058064N104136J40594l698377l019583
42170E689127q07099j394501l354572k289988R82712J500312q65393r21249K038928
42161E78277K027224k809333n332405p16494M805036L494798j829276l453857
42153c236030j413465j160414k087331J400846Q508279J1580101P685190K053905
42145B3331081j289270m192383p745579q701434n506594j544339M83612J774919
42137c389987K784251J363816j883327k453531P73404K956856J393107K24812
$$ plain form
42129 1769401 4560702 9494933 10965527 6102953 -761906 -3653121 -1900325 449351
42121 449351 281880 -1159370 -145300 4398203 8186841 6297340 697831 -1206001
42113 -1206001 2833949 6463390 5453858 4954298 9336123 11704230 4015486 -7036516
42105 -7036516 -7310881 3092779 9495203 5389074 805097 3250264 5099341 -1072086
42097 -1072086 -7335759 -2826863 7815834 11718751 7310767 3036274 651879 -5565823
42089 -5565823 -13712021 -13105006 -1762212 7257842 3188705 -7794739 -12438873 -8526229
42081 -8526229 -5038118 -7279214 -9887440 -5696482 3977882 11331122 12099323 9519264
42073 9519264 7756593 5799840 1790168 94206 6916643 19090111 25368141 21332568
$$ packed form
42129A769401K791301M934231J470594m862574o864859k891215J752796K349676
42121D49351j67471j441250J014070M543503L788638j889501n599509j903832
42113a206001M039950L629441j009532m99560M381825K368107p688744j1052002
42105g036516k74365J0403660O402424m106129m583977K445167J849077o171427
42097a072086o263673M508896J0642697L902917m407984m274493k384395o217702
42089e565823q146198O07015J1342794R020054m069137j0983444m644134L912644
42081h526229L488111k241096k608226M190958R674364P353240P68201k580059
42073I519264j762671j956753m009672j695962O822437J2173468O278030m035573
$$ plain form
42065 21332568 14965884 13326856 12405266 7001026 2322172 5834676 13526825 15439917
42057 15439917 11172004 8661570 10018074 10132872 8130115 8319398 9724471 6549374
42049 6549374 44194 -2135890 -124091 -2560245 -9896182 -10581664 98113 10181141
42041 10181141 8308341 -193849 -3988602 -2885131 -3618809 -6164487 -5722649 -3124093
42033 -3124093 -2364998 -1461798 4108225 11555526 13827553 10632378 7903179 7929036 7979523
42024 7979523 7138434 6769107 5629322 1997616 -790697 1679540 6890435 8761529
42016 8761529 7318987 7072160 7417167 3637629 -3142690 -6304748 -4438308 -2541491
42008 -2541491 -1677222 2668900 9553694 10088700 733259 -9558643 -11256636 -6119791
$$ packed form
42065B1332568o366684j639028r21590n404240m678854L512504P692149J913092
42057A5439917m267913k510434J356504J14798k002757J89283J405073l175097
42049F549374o505180k180084K011799k436154p335937o85482J0679777J0083028
42041A0181141j872800q502190l794753J103471p33678k545678M41838K598556
42033c124093P59095R03200N570023P447301K272027l195175k729199K5857N0487
42024G979523q41089l69327j139785l631706k788313K470237N210895J871094
42016H761529j442542k46827L45007l779538o780319l162058J866440J896817
42008b541491Q64269M346122O884794N35006r355441j0291902j697993N136845
$$ plain form
42000 -6119791 -1108832 2758713 7922558 11819822 9564893 2612728 -3153196 -6731533
41992 -6731533 -11608330 -16121204 -12850887 -889192 8556081 4996958 -6986181 -13164252
41984 -13164252 -7720120 1494138 6045148 6793615 7027045 4198568 -3546347 -8688451
41976 -8688451 -3025617 7712173 9958656 2874469 -449559 4802872 6305826 -4545736
41968 -4545736 -16407070 -14480648 -2939676 3078676 439723 -2239125 -2792937 -6764436
41960 -6764436 -11949499 -8611750 2534162 7818013 771253 -8468819 -9698937 -6536985
41952 -6536985 -6531831 -7908346 -5108346 -14231 1313606 -1497945 -3758029 -3005956 -381689
41943 -381689 2449352 4087773 4169488 5374084 10469777 16247374 16250270 10743904 6745225
$$ packed form
42000f119791N010959L867545N163845L897264k254929o952165n765924l578337
41992f731533m876797m512874L270317J1961695R445273l559123j1983139o178071
41984a3164252N444132R214258M551010P48467K33430k828477p744915n142104
41976h688451N662834J0737790K246483p084187l324028N252431J502954j0851562
41968d545736j1861334J926422J1540972O018352k638953k678848n53812l971499
41960f764436n185063L337749J1145912N283851p046760r240072j230118L161952
41952f536985N154j376515K800000N094115J327837k811551k260084P52073K624267
41943c81689K831041J638421Q1715J204596N095693N777597K896n506366l998679
$$ plain form
41934 6745225 6505765 4680280 -234243 -1568968 3549848 7777220 5620998 2564937
41926 2564937 4369238 6365765 2971772 -230784 4687317 13033369 13488165 5739788
41918 5739788 596083 3829462 10023741 12187772 8946473 2425940 -3641626 -4390296
41910 -4390296 1025231 6281100 6111946 4661500 8187605 13120253 11071696 3415033
41902 3415033 -52351 3233367 5154081 802601 -4205579 -3639186 404730 2412282
41894 2412282 1017582 -1701166 -3464037 -2038235 3149737 8216683 8103254 3279987
41886 3279987 -1344886 -3800698 -5906081 -7482855 -6163502 -2739827 -185745 2157075
41878 2157075 6427508 9400494 6429282 1679880 4227406 12938011 16247068 9811970
$$ packed form
41934F745225k39460j825485m914523j334725N118816M227372k156222l056061
41926B564937J804301J996527l393993l202556M918101Q346052M54796p748377
41918E739788n143705L233379O194279K164031l241299o520533o067566p48670
41910d390296N415527N255869j69154j450446L526105M932648k048557p656663
41902C415033l467384L285718J920714m351480n008180N66393M043916K007552
41894B412282j394700k718748j762871J425802N187972N066946j13429m823267
41886C279987m624873k455812k105383j576774J319353L423675K554082K342820
41878B157075M270433K972986k971212m749402K547526Q710605L309057o435098
$$ plain form
41870 9811970 3206606 4431399 8681293 8961742 7695672 9432064 10477594 5257166
41862 5257166 -3171118 -7969939 -8856934 -9132982 -7302909 -893996 5075232 3062273
41854 3062273 -5421260 -11759004 -12443473 -11350372 -10925317 -9338063 -6493572 -5218427
41846 -5218427 -5450906 -3826611 -216999 1201695 -1396279 -5108856 -7649316 -9894385
41838 -9894385 -11947828 -11808892 -9608555 -8490503 -9415564 -9355993 -6622850 -3954309 -3990283
41829 -3990283 -5205904 -4856295 -3020463 -1254494 162626 1026303 -556281 -5784046
41821 -5784046 -12200505 -15685700 -14907968 -11857806 -8436787 -4638348 -474920 2117646
41813 2117646 941227 -2983989 -5022747 -1384411 6081830 10930772 8777926 2203282
$$ packed form
41870I811970o605364J224793M249894K80449j266070J736392J045530n220428
41862E257166q428284m798821q86995k76048J830073O408913N969228k012959
41854C062273q483533o337744o84469J093101M25055J587254K844491J275145
41846e218427k32479J624295L609612J418694k597974l712577k540460k245069
41838i894385k053443J38936K200337J118052r25061N9571K733143K668541l5974
41829c990283j215621L49609J835832J765969J417120Q63677j582584n227765
41821e784046o416459l485195P77732L050162L421019L798439M163428K592566
41813B117646j176419l925216k038758L638336P466241M848942k152846o574644
$$ plain form
41805 2203282 -1750141 1412957 9484930 15798782 15291067 8937949 2399189 -2710
41797 -2710 847291 1890215 2923563 5573664 8307564 7048325 1683210 -2484520 -1941695
41788 -1941695 337820 291666 -829308 529473 3413476 3140824 -1999670 -8527094 -12062905
41779 -12062905 -11334342 -8293127 -6045902 -5949187 -5848358 -3007712 770547 691809 -2954223
41770 -2954223 -3504562 1841965 6164794 2976732 -2730583 -1451193 6141526 10610776
41762 10610776 8600165 6612694 9092932 12154287 11989332 10955151 11051475 8844689
41754 8844689 2151290 -4482118 -6650792 -6985526 -9049147 -9331667 -2806214 6738289
41746 6738289 9806147 3549184 -5785925 -12203977 -15120802 -15022178 -10883326 -3985249
$$ packed form
41805B203282l953423L163098Q071973O313852n07715o353118o538760k401899
41797b710Q50001J042924J033348K650101K733900j259239n365115m167730N42825
41788a941695K279515m6154j120974J358781K884003k72652n140494o527424l535811
41779a2062905P28563L041215K247225R6715J00829K840646L778259p8738l646032
41770b954223n50339N346527M322829l188062n707315J279390P592719M469250
41762A0610776k010611j987471K480238L061355j64955j034181R6324k206786
41754H844689o693399o633408k168674l34734k063621k82520O525453R544503
41746F738289L067858o256963r335109o418052k916825R8624M138852O898077
$$ plain form
41738 -3985249 1201995 2553795 2371022 1719345 -2547377 -11622986 -19717992 -20097212 -14074568
41729 -14074568 -9267122 -9658825 -11745971 -10775368 -6840870 -3463843 -3050134 -5344787
41721 -5344787 -8228345 -8638334 -4784163 958704 3400261 708849 -2801316 -2532709
41713 -2532709 -194059 -967578 -5525037 -9438187 -10239990 -9764941 -8301267 -2313473 8441853
41704 8441853 16511853 14882063 6475146 -179372 -2554251 -4763111 -7549741 -5648571
41696 -5648571 2704743 10728973 11893436 8448437 6040575 4188999 -1196278 -8156496
41688 -8156496 -9173084 -2008059 6336269 8662025 5345447 384792 -4862961 -9157495
41680 -9157495 -7043068 5407645 21382745 27434041 18939950 5502912 -2114566 -4475403
$$ packed form
41738c985249N187244J351800j82773o51677m266722r075609q095006l79220O022644
41729a4074568M807446l91703k087146R70603L934498L377027M13709k294653
41721e344787k883558m09989L854171N742867K441557k691412l510165K68607
41713b532709K338650p73519m557459l913150q01803M75049J463674N987794J0755326
41704H441853Q070000j629790q406917o654518k374879k208860k786630J901170
41696e648571Q353314Q024230J164463l444999k407862j851576n385277o960218
41688h156496j016588P165025Q344328K325756l316578m960655n247753m294534
41680i157495K114427J2450713J5975100O051296q494091j3437038p617478k360837
$$ plain form
41672 -4475403 -7891508 -11963318 -11041707 -5785445 -3748305 -7207762 -9061888 -4278973
41664 -4278973 2231948 4178958 3420279 4251352 4033562 -1708931 -8447751 -6811692 3148674
41655 3148674 11190274 11277535 7919307 6141035 4272660 848053 107104 4213428 6908187
41646 6908187 2803120 -2125309 1524986 10929517 13244307 3867896 -6601290 -6710183
41638 -6710183 1820198 9045507 10340480 8952598 7867777 5706004 1224178 -2998220
41630 -2998220 -3697039 -1252338 1193008 1410445 -939481 -5484087 -10583638 -12336605
41622 -12336605 -7770500 -9647 3196169 -1548777 -8540600 -10139474 -5970571 -1013873
41614 -1013873 2715475 6473960 8158706 3396120 -5065922 -7029038 1683328 11955030
$$ packed form
41672d475403l416105m071810R21611N256262K037140l459457j854126M782915
41664d278973O510921J947010p58679Q31073k17790n742493o738820J636059R960366
41655C148674Q041600Q7261l358228j778272j868375l424607p40949M106324K694759
41646F908187m105067m928429L650295R404531K314790r376411j0469186j08893
41638f710183Q530381P225309J294973j387882j084821k161773m481826m222398
41630b998220o98819K444701K445346K17437k349926m544606n099551j752967
41622a2336605M566105P760853L205816m744946o991823j598874M168903M956698
41614a013873L729348L758485J684746m762586q462042j963116Q712366J0271702
$$ plain form
41606 11955030 13217671 6842735 777962 -3857991 -11109097 -17888771 -15024607 -2339033
41598 -2339033 7725367 6220626 -854247 -3132564 -680057 -223756 -1920948 -252763
41590 -252763 3315769 -422811 -13099440 -21479207 -12695171 7404760 18922393 10914017
41582 10914017 -6296789 -13937676 -5665684 7853450 12916633 7020291 -1168162 -2652608
41574 -2652608 3241558 9850512 10809603 6258421 1860633 2078672 5330280 6604896
41566 6604896 3724321 -1125470 -5473544 -8832816 -10147856 -6937284 130958 4846205
41558 4846205 1936629 -5386664 -8747637 -5114051 540390 3589557 5642745 9518107
41550 9518107 12732827 10614983 3919938 -1370628 -1732200 406303 1637538 2283157
$$ packed form
41606A1955030J262641o374936o064773m635953p251106o779674K864164J2685574
41598b339033J0064400j504741p074873k278317K452507M56301j697192J668185
41590b52763L568532l738580j2676629q379767Q784036K0099931J1517633q008376
41582A0914017j7210806p640887Q271992J3519134N063183n896342q188453j484446
41574b652608N894166O608954R59091m551182m397788K18039L251608J274616
41566F604896k880575m849791m348074l359272j315040L210572P068242M715247
41558D846205k909576p323293l360973L633586N654441L049167K053188L875362
41550I518107L214720k117844o695045n290566l61572K138503J231235O45619
$$ plain form
41542 2283157 3900068 4947272 2567666 -2235226 -4990313 -4056259 -3168886 -5733518
41534 -5733518 -9405263 -9566106 -6334473 -3945975 -3672659 -1907048 3817539 11098817
41526 11098817 16473211 18815635 17065224 9500965 -1255327 -7412252 -5384057 -2032571
41518 -2032571 -5325414 -12093962 -12781904 -6351803 -1418574 -2391191 -3904733 -1401554
41510 -1401554 1817975 2402903 3561704 7919078 10747242 7493244 2540042 2585087 5568636
41501 5568636 4863114 1697664 3902050 12553905 18803295 15906993 7347035 511537
41493 511537 -1792159 -788198 2088952 4966071 5048205 1630090 -2423359 -4120648 -3505081
41484 -3505081 -2408794 -1915295 -1444876 1263302 8182129 16481784 18412154 10565939
$$ packed form
41542B283157J616911J047204k379606m802892k755087R34054Q87373k564632
41534e733518l671745j60843L231633K388498K73316J765611N724587P281278
41526A1098817N374394K342424j750411p564259j0756292o156925K028195L351486
41518b032571l292843o768548o87942O430101M933229r72617j513542K503179
41510a401554L219529N84928J158801M357374K828164l253998m953202M5045K983549
41501E568636p05522l165450K204386Q651855O249390k896302q559958o835498
41493E11537k303696J003961K877150K877119Q2134l418115m053449j697289O15567
41484c505081J096287M93499M70419K708178O918827Q299655J930370p846215
$$ plain form
41476 10565939 1115001 734036 7109519 7350382 -2760238 -11965725 -10528734 -4184406
41468 -4184406 -3142549 -5188171 -693155 10000718 16219947 13414442 9056573 10053921
41460 10053921 13601006 14346714 12965589 12484514 11840584 8868571 5915658 6691194 9582149
41451 9582149 9527778 5972693 4088241 7137467 11357536 10626670 4388260 -1440762 -1494204
41442 -1494204 2634190 4212744 -587530 -8057683 -11596924 -9833821 -7547700 -8145387
41434 -8145387 -8187744 -2107497 8734508 15282419 10690109 -1146691 -9750281 -9992876
41426 -9992876 -6234811 -3762761 -915636 5940585 13057055 12320681 3970212 -1259552
41418 -1259552 3676246 11785522 11278556 1009931 -9494614 -12949670 -10823289 -7923065
$$ packed form
41476A0565939r450938l80965O375483K40863j0110620r205487J436991O344328
41468d184406J041857k045622M495016J0693873O219229k805505m357869R97348
41460A0053921L547085P45708j381125m81075o43930k972013k952913P75536K890955
41451I582149n4371l555085j884452L049226M220069p30866o238410n829022n3442
41442a494204M128394J578554m800274p470153l539241J763103K286121n97687
41434h145387m2357O080247J0842005O547911m592310j1836800q603590k42595
41426i992876L758065K472050K847125O856221P116470p36374q350469n229764
41418a259552M935798Q109276n06966j0268625j0504545l455056K126381K900224
$$ plain form
41410 -7923065 -6678090 -7347438 -8978945 -9367280 -7826883 -7681990 -11715169 -16026107 -14180251
41401 -14180251 -7501132 -4591997 -8964404 -13636877 -11148474 -3372207 2480409 3036643
41393 3036643 -114304 -4617368 -8404880 -9293063 -7118205 -4113727 -971417 4112954
41385 4112954 10280570 12559955 9050748 4778073 3891795 2837398 -2850614 -9265810
41377 -9265810 -9091628 -3288911 85757 -1972088 -3913423 -959693 4659853 8535733
41369 8535733 9980262 11002850 12706086 13842740 11105183 2347662 -7792474 -9341495
41361 -9341495 187616 8288653 1679292 -13901027 -18990193 -6415541 9493945 13547527
41353 13547527 8456416 6284104 10635191 16176000 18980587 18081378 11744766 1303325
$$ packed form
41410g923065J244975o69348j631507l88335J540397J44893m033179m310938J845856
41401a4180251O679119K909135m372407m672473K488403P776267N852616N56234
41393C036643l150947m503064l787512q88183K174858L004478L142310N084371
41385D112954O167616K279385l509207m272675q86278j054397n688012o415196
41377i265810J74182N802717L374668k057845j941335K953730N619546L875880
41369H535733J444529J022588J703236J136654k737557q757521j0140136j549021
41361i341495R529111Q101037o609361j5580319n089166J2574652J5909486M053582
41353A3547527n091111k172312M351087N540809K804587q99209o336612j0441441
$$ plain form
41345 1303325 -5194243 -2035301 4829513 6422339 5080375 9505402 17873736 18501003
41337 18501003 8201979 -2438453 -5539903 -6021364 -9609803 -11485896 -5386601 3846479
41329 3846479 6525047 2240992 -1234457 -165778 2447602 4575786 7399994 10120681
41321 10120681 9754472 6890611 5639100 6738310 5808549 -292445 -9452296 -17237389
41313 -17237389 -20114792 -16127113 -7022986 417082 394919 -4175886 -5188345 -728357
41305 -728357 3463894 4682739 7306866 12811844 13842924 4622701 -8564760 -14635656
41297 -14635656 -11679812 -6527655 -3274037 -71732 3809767 5626121 4853436 4891898
41289 4891898 7345933 9472186 8739480 5632007 912563 -5400697 -11082466 -12342217
$$ packed form
41345A303325o497568L158942O864814J592826j341964M425027Q368334O27267
41337A8501003j0299024j0640432l101450m81461l588439j876093O099295R233080
41329C846479K678568m284055l475449J068679K613380K128184K824208K720687
41321A0120681l66209k863861j251511J099210r29761o100994r159851p785093
41313a7237389k877403L987679R104127P440068k2163m570805j012459M459988
41305g28357M192251J218845K624127N504978J031080r220223j3187461o070896
41297a4635656K955844N152157L253618L202305L881499J816354p72685L8462
41289D891898K454035K126253p32706l107473m719444o313260n681769j259751
$$ plain form
41281 -12342217 -9312479 -6769531 -7330722 -7916086 -5370384 -1660662 -188255 -47532
41273 -47532 2138460 6329745 8647365 6610375 2447070 812649 4004107 9515169
41265 9515169 12771362 12852261 13767898 17967684 21084358 17710276 10818302 8866617 13039542
41256 13039542 14784569 8930477 1982900 1939098 5671190 3895972 -4304285 -9690994
41248 -9690994 -5606743 3531254 8107100 4104083 -3531670 -6676630 -2464913 3895627
41240 3895627 5523992 2265566 -446340 -651136 -2176412 -6310370 -7852635 -3609213
41232 -3609213 1369492 1775347 753278 3708335 8282174 8692683 6220824 6211419 7361141
41223 7361141 4082070 -1744133 -2129478 3335954 5835451 1569321 -2660753 -1849721
$$ packed form
41281a2342217L029738K542948n61191n85364K545702L709722J472407J40723
41273d7532K185992M191285K317620k036990m163305j634421L191458N511062
41265I515169L256193Q0899R15637M199786L116674l374082o891974j951685M172925
41256A3039542J745027n854092o947577m3802L732092j775218q200257n386709
41248i690994M084251R137997M575846m003017p635753l144960M211717O360540
41240C895627J628365l258426k711906k04796j525276m133958j542265M243422
41232c609213M978705M05855j022069K955057M573839M10509k471859r405J149722
41223G361141l279071n826203l85345N465432K499497m266130m230074Q11032
$$ plain form
41215 -1849721 -996243 -5335547 -10604267 -9839683 -3917464 1191979 3213806 3904502 4305548
41206 4305548 4672352 6031104 7851386 7424959 4626681 3185954 4376398 4580519 2361513
41197 2361513 1780489 4354410 4534999 -844451 -5339742 -2749857 1783348 -252659
41189 -252659 -6281478 -6628641 -345196 4006263 3010344 2941129 7590139 11226301 7850049
41180 7850049 345701 -4050599 -2501749 2653150 7716074 9311645 5844798 -75869
41172 -75869 -3287136 -1700640 2045431 4732765 5133930 2744613 -1707117 -4300434 -1256741
41163 -1256741 5011134 7912957 5681585 3593624 6148553 11883491 17036313 19242074
41155 19242074 16592218 8924743 1573640 1329335 6395504 7312787 870159 -4721973
$$ packed form
41215a849721Q53478m339304n268720P64584N922219N109443K021827O90696M01046
41206D305548L66804J358752J820282m26427k798278j440727J190444K04121k219006
41197B361513n81024K573921J80589n379450m495291K589885M533205k036007
41189b52659o028819l47163O283445M351459r95919o9215M649010L636162l376252
41180G850049p504348m396300J548850N154899N062924J595571l466847n920667
41172g5869l211267J586496L746071K687334M01165k389317m451730k593317L043693
41163a256741O267875K901823k231372k087961K554929N734938N152822K205761
41155A9242074k649856p667475p351103k44305N066169R17283o442628n592132
$$ plain form
41147 -4721973 -3115567 49499 -2596403 -7192981 -5392368 1189111 3900198 1608468
41139 1608468 1445304 5597553 7828952 4576816 211179 -1183986 -1042185 -744782 1112032
41130 1112032 2879197 -291830 -6684393 -6953643 1185503 5964778 -2049245 -13851969
41122 -13851969 -13477522 -1120897 7728185 5015618 -841286 -667870 2950521 4173116
41114 4173116 4593267 7699163 10298344 8262458 5593165 8648498 14668289 15332010
41106 15332010 10136705 6873347 8614664 9436985 5199917 160176 -806902 737149
41098 737149 2103296 5255386 11418454 15308003 11843570 5216258 4009942 9056456
41090 9056456 13042583 11432089 6944821 2824963 -1553322 -6425011 -8901442 -7695599
$$ packed form
41147d721973J606406L165066k645902m596578J800613O581479K711087k291730
41139A608468j63164M152249K231399l252136m365637j395165J41801K97403J856814
41130A112032J767165l171027o392563k69250Q139146M779275q014023j1802724
41122a3851969L74447J2356625Q849082k712567n856904J73416L618391J222595
41114D173116M20151L105896K599181k035886k669293L055333O019791O63721
41106A5332010n195305l263358J741317Q22321m237068n039741r67078J544051
41098G37149J366147L152090O163068L889549l464433o627312j206316N046514
41090I056456L986127j610494m487268m119858m378285m871689k476431J205843
$$ plain form
41082 -7695599 -6226886 -7578898 -9529562 -7916598 -2628592 2848491 6187741 7722933
41074 7722933 8338402 8332477 7862724 6895531 5249393 3500415 2614695 2088964 572041
41065 572041 -683220 1994425 8706091 13087483 9294466 370063 -4660373 -1880896
41057 -1880896 3382494 4348628 1004833 -1466074 18621 3183821 3485369 -1163582
41049 -1163582 -8297266 -12787766 -11572784 -6910398 -3853297 -4286553 -5250484 -3780631
41041 -3780631 -978246 528101 1027650 2821528 6080527 8742671 10075245 10927643
41033 10927643 10176659 4910357 -3890536 -9366837 -6142229 2047359 6100904 2705699
41025 2705699 -2216377 -2442023 -165852 -2485528 -10777427 -17650536 -15628507 -6091028
$$ packed form
41082g695599J468713j352012j950664J612964N288006N477083L339250J535192
41074G722933O15469n925m69753r67193j646138j748978q85720n25731j516923
41065E72041j255261K677645O711666M381392l793017q924403n030436K779477
41057a880896N263390R66134l343795k470907J484695L165200L01548m648951
41049a163582p133684m490500J214982M662386L057101m33256r63931J469853
41041c780631K802385J506347M99549J793878L258999K662144J332574Q52398
41033A0927643p50984n266302q800893n476301L224608Q189588M053545l395205
41025B705699m922076k25646K276171k319676q291899o873109K022029R537479
$$ plain form
41017 -6091028 2904690 6375666 6745040 8158568 10149759 9622477 6706866 4662428
41009 4662428 4713605 5104931 5382740 7011965 8597190 5660528 -1951125 -7249258 -4900659
41000 -4900659 1278339 4632683 5512415 8322690 11962835 11413001 7498068 6189569
40992 6189569 7851469 6450302 1466151 953855 8437929 15655731 14511042 8739321
40984 8739321 6617321 8617962 10198302 11110646 13016520 12432638 5798384 -1617220
40976 -1617220 -1885796 2706328 3354344 -110105 741606 7372440 10873041 6827928 1821774
40967 1821774 429514 -2932094 -12158156 -19610566 -17358909 -10504958 -9109207 -12492437
40959 -12492437 -12260808 -7114163 -3355387 -2217683 1949949 9834493 13988340 10795894
$$ packed form
41017f091028Q995718L470976L69374J413528J991191n27282k915611k044438
41009D662428N1177L91326K77809J629225J585225k936662p611653n298133K348599
41000d900659O178998L354344Q79732K810275L640145n49834l914933j308499
40992F189569J661900j401167m984151n12296P484074P217802j144689n771721
40984H739321k122000K000641J580340R12344J905874n83882o634254p415604
40976a617220k68576M592124O48016l464449Q51711O630834L500601m045113n006154
40967A821774j392260l361608r226062p452410K251657O853951J395751l383230
40959a2492437K31629N146645L758776J137704M167632P884544M153847l192446
$$ plain form
40951 10795894 6776954 8124507 11024187 8439882 1672000 -1406406 2752983 10041269
40943 10041269 15375629 17724684 18190700 17264316 15404951 13595218 11743611 8369318
40935 8369318 3347622 -532330 -669069 1387881 1169457 -3237718 -8694969 -10803368
40927 -10803368 -8668250 -4584336 -432286 3352659 5902472 5913094 4218901 3935213
40919 3935213 6564349 9611189 9528390 5604068 -543803 -7559302 -13868691 -15751963
40911 -15751963 -9773187 1532947 9473810 8005242 1886473 2252546 12653038 22953468
40903 22953468 20917013 7957644 -2241169 -1410421 3444476 1558718 -6202330 -10522596
40895 -10522596 -8624338 -6916028 -8768495 -9047335 -4009782 1508306 2241321 1547363
$$ packed form
40951A0795894m018940J347553K899680k584305o767882l078406M159389P288286
40943A0041269N334360K349055M66016r26384j859365j809733j851607l374293
40935H369318n021696l879952j36739K056950k18424m407175n457251k108399
40927a0803368K135118M083914M152050L784945K549813J0622j694193k83688
40919C935213K629136L046840q2799l924322o147871p015499o309389j883272
40911a5751963N978776J1306134P940863j468568o118769L66073J0400492J0300430
40903B2953468k036455j2959369j0198813Q30748M854897j885758p761048m320266
40895a0522596J898258J708310j852467k78840N037553N518088P33015o93958
$$ plain form
40887 1547363 5576927 12607438 15325059 11386594 5022340 -390051 -4678356 -6557360
40879 -6557360 -4112186 -544666 -2764318 -11772523 -19800483 -19916257 -13983684 -8109261
40871 -8109261 -4644993 -2651960 -2423026 -4288007 -5020762 -896535 5996005 9174313
40863 9174313 5989919 368485 -3466838 -5626457 -6870748 -4671059 2780296 11073789
40855 11073789 13266806 8912958 4831550 5890362 9335612 10373128 9242858 9046001
40847 9046001 9540568 7813111 3714641 -53429 -2806170 -6263993 -9921066 -10584881
40839 -10584881 -7357708 -2803716 1653423 6662519 10065185 7037430 -1784504 -7968880
40831 -7968880 -5691879 289335 2436786 1702053 4039972 8998493 10316768 6932512
$$ packed form
40887A547363M029564P030511K717621l938465o364254n412391m288305j879004
40879f557360K445174L567520k219652r008205q027960j15774N932573N874423
40871h109261L464268J993033K28934j864981p32755M124227O892540L178308
40863I174313l184394n621434l835323k159619j244291K199689P451355Q293493
40855A1073789K193017m353848m081408J058812L445250J037516j130270j96857
40847I046001M94567j727457m098470l768070k752741l457823l657073o63815
40839a0584881L227173M553992M457139N009096L402666l027755q821934o184376
40831g968880K277001N981214K147451p34733K337919M958521J318275l384256
$$ plain form
40823 6932512 4560367 5019499 2536270 -5661236 -12424352 -10180750 -2384805 1313190
40815 1313190 -1038556 -1554541 5250441 13865395 14546111 5792971 -3714057 -5525453
40807 -5525453 -559664 4164313 5671916 7483516 11450286 12562592 6169526 -3156919
40799 -3156919 -6124427 -1013125 4843240 6267964 6253169 8463732 10223483 7644758
40791 7644758 3093806 1872539 4081339 5212729 3447432 1319257 719886 973477
40783 973477 1917654 4393691 6957042 6362215 2883639 1499751 5518138 11737581 14476012
40774 14476012 12607167 10115570 10662235 13816547 16414988 16106248 13541877 11781032
40766 11781032 12993928 15149139 13223787 5212734 -4055535 -7408625 -3652065 999179
$$ packed form
40823F932512k372145M59132k483229q197506o763116K243602P795945L697995
40815A313190k351746n15985O804982Q614954O80716q753140r507028j811396
40807e525453M965789M723977J507603J811600L966770J112306o393066r326445
40799c156919k967508N111302N856365J424724j4795K210563J759751k578725
40791G644758m550952j221267K208800J131390j765297k128175n99371K53591
40783I73477R44177K476037K563351n94827l478576j383888M018387O219443K738431
40774A4476012j868845k491597N46665L154312K598441l08740k564371j760845
40766A1781032J212896K155211j925352q011053r268269l353090L756560M651244
$$ plain form
40758 999179 777545 -2656302 -3331955 446706 4150963 4067437 2640306 4204688 7829802
40749 7829802 8469542 4856014 1961273 3978060 8279799 9249679 5926743 2445702
40741 2445702 1934395 3410169 4491723 3862656 814165 -4167032 -7554889 -5368008
40733 -5368008 607614 3165825 -595395 -3651639 1879512 12530501 16835050 10770432
40725 10770432 3147190 3376799 9820537 14356627 13756797 10868383 7363166 1942363
40717 1942363 -4429316 -7474173 -5740488 -3767536 -6600636 -13373634 -18264527 -16482084
40709 -16482084 -8325451 1131124 5508064 1956743 -6139315 -12068933 -12015623 -7809351
40701 -7809351 -3779947 -2269148 -2308518 -1484374 981490 2487836 -418359 -6793373 -10935884
$$ packed form
40758I99179k21634l433847o75653L778661L704257q3526j427131J564382L625114
40749G829802O39740l613528k894741K016787M301739R69880l322936l481041
40741B445702n11307J475774J081554o29067l048491m981197l387857K186881
40733e368008N975622K558211l761220l056244N531151J0650989M304549o064618
40725A0770432p623242K29609O443738M536090n99830k888414l505217n420803
40717A942363o371679l044857J733685J972952k833100o772998m890893J782443
40709a6482084Q156633R456575M376940l551321q096058n929618N3310M206272
40701g809351M029404J510799l9370Q24144K465864J506346k906195o375014m142511
$$ plain form
40692 -10935884 -9521231 -6197886 -5377315 -4726658 258641 6830355 8311107 6103838
40684 6103838 8710889 16980340 20602013 13817518 4649170 1535794 158808 -6693031
40676 -6693031 -13911594 -11135003 -482246 6061207 5502311 6898433 14408728 19969119
40668 19969119 16895932 10037198 6756572 6413509 4919996 2853501 2827688 4020942
40660 4020942 4631701 5142260 4819810 314941 -7576632 -11419721 -6923048 107049 2547734
40651 2547734 2303762 4914224 9011288 9697287 8458339 10040236 11891801 7378485
40643 7378485 -767945 -1271846 8970526 19093939 19650210 14878734 13291439 13577862
40635 13577862 8728619 -67000 -3507649 1850201 7904725 6019200 -1993508 -7867110
$$ packed form
40692a0935884J414653L323345Q20571O50657M985299O571714J480752k207269
40684F103838K607051Q269451L621673o784495r168348l113376j376986o851839
40676f693031p218563K776591J0652757O543453n58896J396122P510295N560391
40668A9969119l073187o858734l280626l43063j493513k066495k5813J193254
40660D020942O10759N10559l22450m504869p891573l843089M496673P030097K440685
40651B547734k43972K610462M097064O85999j238948J581897J851565m513316
40643G378485q146430n03901J0242372J0123413N56271m771476j587295K86423
40635A3577862m849243q795619l440649N357850O054524j885525q012708n873602
$$ plain form
40627 -7867110 -8271584 -7281088 -8485629 -9735420 -7725118 -4197769 -3582770 -5767492 -5854574
40618 -5854574 -1816620 2279257 3193815 4267224 9664672 15939949 15577861 8308968
40610 8308968 2572989 4281056 9574826 11379765 8492354 4486367 1283229 -1415366
40602 -1415366 -2193963 1515966 8574867 13540415 12453341 7377699 3895080 4857170
40594 4857170 7563591 7282806 3196791 -309200 676914 3968777 4102429 442402 -1422240
40585 -1422240 2251726 7776647 9288044 6299949 2415889 -643508 -3134197 -3522310
40577 -3522310 -175262 3952245 4075300 1181965 829401 3329028 2070183 -5316358
40569 -5316358 -11122955 -8475830 -2343602 -1996832 -6230444 -5447653 2285444 7199646
$$ packed form
40627g867110m04474R90496j204541j249791K010302L527349O14999k184722q7082
40618e854574M037954M095877R14558J073409N397448O275277l62088p268893
40610H308968n735979J708067N293770J804939k887411m005987l203138k698595
40602a415366p78597L709929P058901M965548j087074n075642l482619R62090
40594D857170K706421k80785m086015l505991R86114L291863J33652l660027j864642
40585a422240L673966N524921J511397k988095l884060l059397k490689l88113
40577c522310L347048M127507J23055k893335l52564K499627j258845p386541
40569e316358n806597K647125O132228L46770m233612P82791P733097M914202
$$ plain form
40561 7199646 2701700 -4262525 -3370216 4644957 10833826 11764346 12460923 16091982 18322133
40552 18322133 14756715 8768263 7425867 11871745 15994419 14614740 9769993 7604921
40544 7604921 11028326 17420853 22750274 25454778 25643610 22903185 17247080 11197791
40536 11197791 8091312 7894959 6827238 1933566 -5411954 -10989132 -11307632 -5833021
40528 -5833021 2201722 7187391 6193271 3244016 5447124 13937526 22324066 25513742
40520 25513742 25397762 24953247 22088099 14849062 8573968 10326129 17840257 21709873
40512 21709873 18759200 15742854 18136275 22624472 24115218 23556711 23651332 22052301
40504 22052301 15464613 7640419 6261386 12026498 16706245 13611976 5741306 992466
$$ packed form
40561G199646m497946o964225Q92309Q015173O188869R30520O96577L631059K230151
40552A8322133l565418n988452j342396M445878M122674j379679m844747k165072
40544G604921L423405O392527N329421K704504J88832k740425n656105o049289
40536A1197791l106479j96353j067721m893672p345520n577178l18500N474611
40528e833021Q034743M985669r94120k949255K203108Q490402Q386540L189676
40520B5513742j15980m44515k865148p239037o275094J752161P514128L869616
40512B1709873k950673l016346K393421M488197J490746n58507R4621j599031
40504B2052301o587688p824194j379033N765112M679747l094269p870670m748840
$$ plain form
40496 992466 1859925 3069160 -719836 -7330598 -9145327 -2498389 7429315 12887234
40488 12887234 12765690 12054172 12970151 11736515 5966467 433428 1227159 6817827 9818594
40479 9818594 7072412 3586481 5380260 11636509 16060371 14597151 9714025 6879558
40471 6879558 8193552 10893567 11986054 12154477 13466914 15194642 15157634 14391529 16478959
40462 16478959 21823570 26554247 28138225 27900713 26401878 21233364 12662749 6939078
40454 6939078 9115204 15515521 18378678 16019984 13362267 13754039 15614264 16974645
40446 16974645 18332731 20207745 21896561 23614926 26573614 30136392 31762673 30301947
40438 30301947 26793998 22041241 16326454 11531493 10359856 13072104 17574100 22326435
$$ packed form
40496I92466Q67459J209235l788996o610762j814729O646938R927704N457919
40488A2887234j21544p11518R15979j233636n770048n533039P93731N590668L000767
40479I818594k746182l485931J793779O256249M423862j463220m883126k834467
40471F879558J313994K700015J092487J68423J312437J727728l7008p66105K087430
40462A6478959N344611M730677J583978k37512j498835n168514q570615n723671
40454F939078K176126O400317K863157k358694k657717L91772J860225J360381
40446A6974645J358086J875014J688816J718365K958688L562778J626281j460726
40438C0301947l507949m752757n714787m794961j171637K712248M501996M752335
$$ plain form
40430 22326435 26077601 25705244 19010002 9966681 6405641 11090227 19056349 24844627
40422 24844627 27993752 30017983 30903757 31194103 33244089 37483954 41229045 43826506
40414 43826506 48606898 56434491 62075506 61519740 58440731 57710967 56726334 50794798
40406 50794798 44413112 47668931 60774126 71304155 70333624 63799011 62495051 66583623
40398 66583623 67113026 59989324 51077421 47439786 49548370 53680027 57178418 58776083
40390 58776083 57426489 54404433 54543050 61692890 73559141 84267402 92124023 101759179
40382 101759179 117841029 139756179 164276459 190715085 220266399 251278912 278137465
40375 278137465 295087166 299790523 293954243 282429399 271046480 263289409 259385844
$$ packed form
40430B2326435L751166l72357o695242r043321l561040M684586P966122N788278
40422B4844627L149125K024231Q85774K90346K049986M239865L745091K597461
40414D3826506M780392P827593N641015n55766l079009p29764r84633n931536
40406E0794798o381686L255819J3105195J0530029r70531o534613j303960M088572
40398F6583623N29403p123702q911903l637635K108584M131657L498391J597665
40390E8776083j349594l022056J38617P149840J1866251J0708261P856621R635156
40382A01759179J6081850K1915150K4520280K6438626K9551314L1012513K6858553
40375B78137465J6949701M703357n836280j1524844j1382919p757071l903565
$$ plain form
40368 259385844 259337951 263900550 270132460 271074889 267196207 274754606 310230738 362566880
40360 362566880 392359140 368803070 302548969 233329803 189105203 166881639 150325616
40353 150325616 132458848 116952598 107345199 102860237 101105376 99915758 98590874 99601439
40345 99601439 106233092 117293667 128187116 138452746 153038337 174092231 197391908
40338 197391908 219874781 244012381 269837033 289175265 294951142 291513305 288004190
40331 288004190 285136037 277084661 264118766 253759949 249095808 244432841 234235996
40324 234235996 219338335 202468602 184107908 164996387 147106895 130078415 111710692
40317 111710692 93279524 78945214 68910861 59263624 49579328 43611134 40993240
$$ packed form
40368B59385844m7893M562599O231910R42429l878682P558399L5476132N2336142
40360C62566880K9792260k3556070o6254101o9219166m4224600k2223564j6556023
40353A50325616j7866768j5506250r607399m484962j754861j189618j324884J010565
40345I9601439O631653J1060575J0893449J0265630J4585591K1053894K3299677
40338A97391908K2482873K4137600K5824652J9338232N775877l437837l509115
40331B88004190k868153q051376j2965895j0358817m664141m662967j0196845
40324B34235996j4897661j6869733j8360694j9111521j7889492j7028480j8367723
40317A11710692j8431168j4334310j0034353r647237r684296n968194k617894
$$ plain form
40310 40993240 36541303 30560346 30795303 39345826 46317435 42913291 33253327 26227865
40302 26227865 22945051 20174061 19185863 21858945 23960283 22161532 22329251 30314080
40294 30314080 39828300 41596649 39808908 45009073 53429860 50128664 33696336 20843973
40286 20843973 21513299 25089425 19385566 9863874 9325357 18228325 26323337 27599922
40278 27599922 24140868 19745767 17468746 19389385 22825944 21697639 16638797 16749680
40270 16749680 25204373 31613049 27416841 20592789 23460468 32308074 33041039 24013419
40262 24013419 18659575 24521665 32702221 32066054 23902439 17467292 17845225 22652837
40254 22652837 26178520 23918299 16565644 10725244 12168415 18435092 22110581 20525793
$$ packed form
40310D0993240m451937n980957K34957Q550523O971609l404144r659964p025462
40302B6227865l282814k770990r88198K673082K101338j798751J67719P984829
40294C0314080R514220J768349j787741N200165Q420787l301196j6432328j2852363
40286B0843973O69326L576126n703859r521692n38517Q902968Q095012J276585
40278B7599922l459054m395101k277021J920639L436559j128305n058842J10883
40270A6749680Q454693O408676m196208o824052K867679Q847606P32965r027620
40262B4013419n353844N862090Q180556o36167q163615o435147L77933M807612
40254B2652837L525683k260221p352655n840400J443171O266677L675489j584788
$$ plain form
40246 20525793 17374162 15928743 16410176 19169103 24292920 28697430 29956077 32213658
40238 32213658 41291561 54658869 64400839 70503082 82699369 107399606 140081542
40231 140081542 171339134 191971683 191549616 163753497 118517231 79267436 60691473
40224 60691473 55363880 47843576 34837222 24293152 20682164 20239574 18620069 16231507
40216 16231507 16198325 20753109 28649520 34612623 34288192 30559135 30175430 33533628 34948819
40207 34948819 34589348 40566083 54986355 68375861 74962388 83316245 102708517 129532680
40199 129532680 159890862 204889609 273304856 342311066 367808193 330926074 259493138
40192 259493138 196147876 157980462 135789928 119369345 107727239 99638514 90216781
$$ packed form
40246B0525793l151631j445419M81433K758927N123817M404510J258647K257581
40238C2213658R077903J3367308R741970O102243J2196287K4700237L2681936
40231A40081542L1257592K0632549m22067k7796119m5236266l9249795j8575963
40224F0691473n327593p520304j3006354j0544070l610988m42590j619505k388562
40216A6231507l3182M554784P896411N963103l24431l729057l83705L358198J415191
40207C4948819l59471N976735J4420272J3389506O586527Q353857J9392272K6824163
40199A29532680L0358182M4998747O8415247O9006210K5497127l6882119p1432936
40192B59493138o3345262l8167414k2190534j6420583j1642106q088725r421733
$$ plain form
40185 90216781 80000529 77375886 86842292 100728050 108168938 109500663 115949818 135234721
40177 135234721 163560136 194690209 230115637 271074308 302913786 300900918 258239291
40170 258239291 198940284 153230726 126384553 102513843 73559563 49239810 38010860
40163 38010860 33668724 27029215 19322449 15924254 15387876 13586540 12700485 16972169
40155 16972169 23142668 23644480 17657571 11724371 10128664 11122663 12741071 16404176
40147 16404176 23149766 30256586 33556295 31539047 26792012 24189363 26599959 31480090
40139 31480090 33666595 32382173 32054990 34460426 34779231 29366297 22960512 22306879
40131 22306879 25721312 25955247 21974325 20377511 24516709 29254209 28870740 24359391
$$ packed form
40185I0216781j0216252k624643R466406J3885758P440888J331725O449155J9284903
40177A35234721K8325415L1130073L5425428M0958671L1839478k012868m2661627
40170B58239291n9299007m5709558k6846173k3870710k8954280k4319753j1228950
40163C8010860m342136o639509p706766l398195n36378j801336q86055M271684
40155A6972169O170499N01812n986909n933200j595707R93999J618408L663105
40147A6404176O745590P106820L299709k017248m747035k602649K410596M880131
40139C1480090K186505j284422l27183K405436L18805n412934o405785o53633
40131B2306879L414433K33935l980922j596814M139198M737500l83469m511349
$$ plain form
40123 24359391 19601000 15068914 9628314 5533946 6834953 13330199 19527597 20377158
40115 20377158 16431775 12538372 11974561 12830275 10990379 6147719 2746154 4314167
40107 4314167 9338134 14163661 17104972 17582222 14903407 11534363 13566718 22370002
40099 22370002 29337324 26420213 19302668 20532542 30277941 35457598 30468691 26277030
40091 26277030 32192809 40084795 37506185 28097122 25566087 31844074 35449306 31049860
40083 31049860 26958517 30203785 36113420 38239430 39012464 43566816 50143061 54094745
40075 54094745 56449400 61237298 67700426 71965241 74175188 77459537 81102700 81080078
40067 81080078 77462535 75638473 78716613 82773675 81574589 73744200 64015574 58645824
$$ packed form
40123B4359391m758391m532086n440600m094368J301007O495246O197398Q49561
40115B0377158l945383l893403n63811Q55714j839896m842660l401565J568013
40107D314167N023967M825527K941311M77250k678815l369044K032355Q803284
40099B2370002O967322k917111p117545J229874R745399N179657m988907m191661
40091B6277030N915779P891986k578610r409063k531035O277987L605232m399446
40083C1049860m091343L245268N909635K126010P73034M554352O576245L951684
40075E4094745K354655M787898O463128M264815K209947L284349L643163k2622
40067H1080078l617543j824062L078140M057062j199086p830389r728626n369750
$$ plain form
40059 58645824 59902018 64163720 65919299 64223972 63572280 67461405 74034456 80444823
40051 80444823 88119502 99317482 110775592 116204940 114338634 109205901 102689847 92862521
40043 92862521 80779566 72365699 70097448 68143811 60631863 50956724 47194103 50398914
40035 50398914 53630983 52406904 50081059 51036283 53718160 54051466 52272467 51835160
40027 51835160 53303572 54106264 53888616 54991838 56625181 54024454 46475690 41126289
40019 41126289 43483557 47731018 43647509 31866322 24276739 27869348 35655764 37038619
40011 37038619 30779078 22952437 17419993 14273552 13956978 16502682 18589519 16900653
40003 16900653 13097466 10797925 9472581 6484967 3508712 5106168 11541618 18335512
$$ packed form
40059E8645824J256194M261702J755579j695327o51692L889125O573051O410367
40051H0444823P674679J1197980J1458110N429348j866306n132733o516054r827326
40043I2862521j2082955q413867k268251j953637p511948r675139l762621L204811
40035E0398914L232069j224079k325845R55224K681877L33306j778999m37307
40027E1835160J468412Q02692k17648J103222J633343k600727p548764n349401
40019D1126289K357268M247461m083509j1781187p589583L592609P786416J382855
40011C7038619o259541p826641n532444l146441l16574K545704K086837j688866
40003A6900653l803187k299541j325344k987614k976255J597456O435450O793894
$$ plain form
39995 18335512 22620175 25006733 25748676 24367888 22945002 24668002 29025780 32844767
39987 32844767 35171162 36281456 33828159 26581402 20347305 21988013 28038352 28263618
39979 28263618 21103455 15713211 16656405 17219108 12212315 7149188 8337487 12671846
39971 12671846 14458786 14560966 15057057 12219544 3714540 -3407331 -1500117 5695580
39963 5695580 9299454 9118617 11009310 13922998 11038707 2745981 -2528254 -1291065
39955 -1291065 937673 47003 -1231812 -828105 -2113424 -7538417 -13676021 -16015118
39947 -16015118 -14098216 -9742536 -4519010 -422639 1278588 2635805 6016731 8719204
39939 8719204 6234335 693118 -930918 2178463 3278247 -183531 -1609019 3799359
$$ packed form
39995A8335512M284663K386558P41943j380788j422886J723000M357778L818987
39987C2844767K326395J110294k453297p246757o234097J640708O050339K25266
39979B8263618p160163n390244R43194N62703n006793n063127J188299M334359
39971A2671846J786940J02180M96091k837513q505004p121871J907214P195697
39963E695580L603874j80837J890693K913688k884291q292726n274235J237189
39955a291065K228738q90670j278815M03707j285319n424993o137604k339097
39947a6015118J916902M355680N223526M096371J701227J357217L380926K702473
39939H719204k484869n541217j624036L109381J099784l461778j425488N408378
$$ plain form
39931 3799359 10592643 11578566 9152918 11243746 19207350 26248460 26576451 21023448
39923 21023448 14058294 9176742 7302582 7070031 6397197 4732389 2949982 824255
39915 824255 -3066471 -7975161 -10216787 -7611046 -2812634 -461040 -2069267 -4605104
39907 -4605104 -3405867 3096808 10528892 12306692 8310069 6543977 11857360 16899178
39899 16899178 11795551 298791 -3755811 3697796 11673242 11479103 7871452 7198676
39891 7198676 5731286 -789119 -5027581 2366264 16145284 21613590 14356670 3976184
39883 3976184 -1005122 -1426134 -228410 2582938 5036380 2381290 -4649980 -8060132
39875 -8060132 -3742117 1559216 -309656 -7029813 -9213749 -3314902 4442495 6993481
$$ packed form
39931C799359O793284R85923k425648K090828P963604P041110L27991n553003
39923B1023448o965154m881552j874160k32551o72834j664808j782407k125727
39915H24255l890726m908690k241626K605741M798412K351594j608227k535837
39907d605104J199237O502675P432084J777800l996623j766092N313383N041818
39899A6899178n103627j1496760m054602P453607P975446j94139l607651o72776
39891G198676j467390o520405m238462P393845J3779020N468306p256920j0380486
39883C976184m981306m21012J197724K811348K453442k655090p031270l410152
39875h060132M318015N301333j868872o720157k183936N898847P757397K550986
$$ plain form
39867 6993481 5126374 5424188 11104562 17267299 16752404 9862634 4936291 7847768
39859 7847768 14685361 18245067 18082540 18377648 18300653 12473738 1738605 -4339186 660049
39850 660049 11161057 16789145 14448127 9167853 6136228 6324912 8188290 9654489
39842 9654489 9024678 6620004 4997572 5881519 8190020 10547111 13544396 17265166
39834 17265166 18780996 15253403 8314288 2465527 -145917 -921586 -1571687 -2012081
39826 -2012081 -846435 3893819 13128130 23556702 27966688 22314474 11587498 4748663
39818 4748663 4232249 4719166 2512201 839786 3525651 8066488 9266709 7083424
39810 7083424 6142391 8344742 10467124 9789924 8294697 9201370 11786196 12465386 10293090
$$ packed form
39867F993481j867107K97814N680374O162737n14895o889770m926343K911477
39859G847768O837593L559706j62527K95108p6995n826915j0735133o077791M999235
39850F60049J0501008N628088k341018n280274l031625J88684J863378J466199
39842I654489o29811k404674j622432Q83947K308501K357091K997285L720770
39834A7265166J515830l527593o939115n848761k611444p75669o50101m40394
39826b012081J165646M740254R234311J0428572M409986n652214j0726976o838835
39818D748663n16414M86917k206965j672415K685865M540837J200221k183285
39810G083424r41033K202351K122382o77200j495227R06673K584826O79190k172296
$$ plain form
39801 10293090 8610134 10287732 13328782 13587249 11383794 12046664 17904069 22711829
39793 22711829 18555792 7433247 261817 2699495 7684711 6073931 -498088 -3848394
39785 -3848394 -2690901 -3102334 -6151750 -4732651 4048030 11646486 9124646 -338356
39777 -338356 -6517465 -5687253 -2216700 644298 3988491 7674408 8363733 4656502 -397383
39768 -397383 -3166554 -2530867 1036735 6097513 10121039 11889420 13121034 14569755
39760 14569755 13116186 7669624 4527333 8947202 13850106 7802889 -5400586 -7924691
39752 -7924691 6786429 22280489 21064030 7684107 -1381237 -2357841 -4298522 -9162933
39744 -9162933 -8060532 1399828 8443829 4923977 -3191977 -6290747 -4180416 -1661221
$$ packed form
39801A0293090j682956J677598L041050K58467k203455O62870N857405M807760
39793B2711829m156037j1122545p171430K437678M985216j610780o572019l350306
39785c848394J157493m11433l049416J419099Q780681P598456k521840r463002
39777c38356o179109Q30212L470553K860998L344193L685917O89325l707231n053885
39768c97383k769171O35687L567602N060778M023526J768381J231614J448721
39760A4569755j453569n446562l142291M419869M902904o047217j3203475k524105
39752g924691J4711120J5494060j216459j3379923r065344r76604j940681m864411
39744i162933J102401R460360P044001l519852q115954l098770K110331K519195
$$ plain form
39736 -1661221 1668112 8657976 15941628 16354811 8567212 -1935998 -10207393 -14479622
39728 -14479622 -12882037 -4512552 5183497 6420085 -4040797 -17429538 -21690480 -14032441
39720 -14032441 -2635585 2566112 -1400453 -9731975 -14986106 -13068359 -6296264 -1121415
39712 -1121415 -1443808 -3964266 -1870909 6456727 14860074 17168827 15165494 15521116
39704 15521116 20002173 23045665 19768567 12274278 5847353 2288381 234815 -304088
39696 -304088 2264762 7488547 12343871 14446206 13576626 10514350 6824430 5302330
39688 5302330 7614934 11185494 11188654 6521252 1563324 898060 3993912 6407032 5323998
39679 5323998 2839432 3683382 9535990 15613110 14333164 3647597 -9412269 -15097138
$$ packed form
39736a661221L329333O989864P283652M13183p787599j0503210q271395m272229
39728a4479622J597585Q369485R696049J236588j0460882j3388741m260942P658039
39720a4032441J1396856N201697l966565q331522n254131J917747O772095N174849
39712a121415l22393k520458K093357Q327636Q403347K308753k003333L55622
39704A5521116M481057L043492l277098p494289o426925l558972k053566n38903
39696c04088K568850N223785M855324K102335q69580l062276l689920j522100
39688E302330K312604L570560L160m667402m957928o65264L095852K413120j083034
39679E323998k484566Q43950N852608O077120j279946j0685567j3059866n684869
$$ plain form
39671 -15097138 -10008805 1303956 11823988 16795010 14954596 8812357 3396475 1860850
39663 1860850 2736106 3703510 5946330 10658960 13343502 8074795 -2348998 -7398790
39655 -7398790 -2311787 5467700 6893248 2962940 914880 2927556 4445348 1724776
39647 1724776 -4209150 -10283286 -13778494 -12679642 -7513818 -2463716 -1252420 -2392077
39639 -2392077 -1746791 1021900 2515099 1856265 2511535 6761353 12002904 14376925 13484499
39630 13484499 11650842 10287865 8685911 5516603 596929 -4331708 -6720192 -6063195
39622 -6063195 -4844454 -4952960 -4391103 -492757 4540144 5676558 2982328 2393056 6412440
39613 6412440 9158571 4871404 -2849068 -6235809 -5144410 -6317040 -11270225 -13224161
$$ packed form
39671a5097138N088333J1312761J0520032M971022j840414o142239n415882j535625
39663A860850Q75256R67404K242820M712630K684542n268707j0423793n049792
39655g398790N087003P779487J425548l930308k048060K012676J517792k720572
39647A724776n933926o074136l495208J098852N165824N050102J211296j139657
39639b392077O45286K768691J493199o58834O55270M249818N241551K374021q92426
39630A3484499j833657j362977j601954l169308m919674m928637k388484O56997
39622f063195J218741j08506N61857L898346N032901J136414k694230n89272M019384
39613F412440K746131m287167p720472l386741J091399j172630m953185j953936
$$ plain form
39605 -13224161 -8938408 -5675057 -9949442 -15021929 -8861093 7065394 16812403 10275656
39597 10275656 -3718363 -9686208 -4546954 2469838 4769107 4670601 5511017 5775634
39589 5775634 3567615 964586 523385 1383247 1745702 1985777 2777776 3227627 3196839
39580 3196839 4194245 5656138 4353017 621685 696043 8151739 16942973 18716416 13930082
39571 13930082 9261534 6779802 3649647 981998 3433800 9030566 8954357 696478
39563 696478 -7284731 -8500564 -7618695 -10661906 -14012576 -11504903 -6129246 -4806810
39555 -4806810 -5879956 -2642223 3033787 2182505 -6048938 -12105719 -11146373 -9470113
39547 -9470113 -11735969 -12467593 -7058258 -1998847 -4962981 -11189207 -9909398 -677856
$$ packed form
39605a3224161M285753L263351m274385n072487O160836J5926487R747009o536747
39597A0275656j3994019n967845N139254P016792K299269r8506Q40416K64617
39589E775634k208019k603029m41201Q59862L62455K40075P91999M49851l0788
39580C196839R97406J461893j303121l731332P4358P455696Q791234J773443m786334
39571A3930082m668548k481732l130155k667649K451802N596766p6209q257879
39563F96478p981209j215833Q81869l043211l350670K507673N375657J322436
39555d806810j073146L237733N676010q51282q231443o056781R59346J676260
39547i470113k265856p31624N409335N059411k964134o226226J279809R231542
$$ plain form
39539 -677856 6674304 6827473 4265998 3541802 2962735 140898 -3101869 -4227731 -3286782
39530 -3286782 -567827 4368198 9421426 10479443 7431136 5158903 6226244 7325376
39522 7325376 6049975 6323406 12329828 20402894 22470743 16434459 8531525 5387248
39514 5387248 7222525 9494415 8690879 5325136 2150427 383039 -1321524 -3373039
39506 -3373039 -2648168 3119828 9130920 7158619 -2828031 -10231469 -7000433 1360703
39498 1360703 3485403 -2420139 -7630307 -6242859 -2336610 -2301819 -5721197 -7012274
39490 -7012274 -2940347 4118652 8574761 5933565 -3223651 -12407821 -14525589 -9334287
39482 -9334287 -3672540 -3021881 -4994606 -3178009 4086836 11231958 11617339 4554538
$$ packed form
39539f77856P352160J53169k561475p24196n79067k821837l242767j125862R40949
39530c286782K718955M936025N053228J058017l048307k272233J067341J099132
39522G325376j275401K73431O006422Q073066K067849o036284p902934l144277
39514E387248J835277K271890q03536l365743l174709j767388j704563k051515
39506c373039P24871N767996O011092j972301r986650p403438L231036Q361136
39498A360703K124700n905542n210168J387448L906249L4791l419378j291077
39490g012274M071927P058999M456109k641196r157216r184170k117768N191302
39482i334287N661747O50659j972725J816597P264845P145122L85381p062801
$$ plain form
39474 4554538 -4060467 -7205168 -2630536 5795473 11742600 11452478 6207430 851489
39466 851489 -424278 2168843 4649573 4401062 3441380 4540094 5700992 2797507 -2515639
39457 -2515639 -3229687 2663227 8089836 7156342 3929873 4916778 7434097 3855599 -4766394
39448 -4766394 -8728173 -4035717 2041652 2541902 104678 224429 1767201 384880
39440 384880 -2783410 -2449321 2333393 6493931 5731386 1089249 -3609069 -6095438 -6812778
39431 -6812778 -7338635 -8076175 -7180223 -2578325 4622189 10350793 12098275 11691416 12452961
39422 12452961 14883344 16247222 13695484 7476710 1732104 1189704 5394925 7809912
39414 7809912 3722559 -2664355 -3791096 -245636 -94188 -5941090 -10118234 -6033793
$$ packed form
39474D554538q615005l144701M574632Q426009N947127k90122n245048n355941
39466H51489j275767K593121K480730k48511r59682J098714J160898k903485n313146
39457b515639p14048N892914N426609r33494l226469R86905K517319l578498q621993
39448d766394l961779M692456O077369N00250k437224J19751J542772j382321
39440C84880l168290L34089M782714M160538p62545m642137m698318k486369p17340
39431f812778n25857p37540Q95952M601898P200514N728604J747482m06859P61545
39422A2452961K430383J363878k551738o218774n744606n42400M205221K414987
39414G809912m087353o386914j126741L545460J51448n846902m177144M084441
$$ plain form
39406 -6033793 2445308 7745874 8912968 9349716 9080307 6085062 2070308 145807
39398 145807 -852192 -3159404 -3531944 2558755 11168933 12237797 2709131 -9304521
39390 -9304521 -14890599 -12990603 -7299145 -681004 4603715 6194830 4563924 3430378
39382 3430378 4992627 7572688 9106456 9304262 7273613 1479976 -6000694 -9575815
39374 -9575815 -7011409 -2450128 -394315 -843862 -2731632 -7055971 -12689329 -13918444
39366 -13918444 -7675807 132796 1444862 -2996419 -5535424 -3190533 -838950 -2350822
39358 -2350822 -4635527 -2887456 2514581 7141216 7905001 5103642 1081844 -1139377
39350 -1139377 726634 6316535 12375639 15038800 12112113 3825751 -6906272 -15000420
$$ packed form
39406f033793Q479101N300566J167094M36748k69409k995245m014754j924501
39398A45807r97999k307212l72540O090699Q610178J068864r528666j2013652
39390i304521n586078J899996N691458O618141N284719J591115j630906j133546
39382C430378J562249K580061J533768J97806k030649n793637p480670l575121
39374i575815K564406M561281K055813m49547j887770m324339n633358j229115
39366a3918444O242637P808603J312066m441281k539005K344891K351583j511872
39358b350822k284705J748071N402037M626635P63785k801359m021798k221221
39350a139377J866011N589901O059104K663161k926687q286362j0732023q094148
$$ plain form
39342 -15000420 -16087278 -9985336 -696921 6915411 9674362 6715682 242146 -4662662
39334 -4662662 -3973047 911558 5143963 6910084 8693875 11518805 12282758 9226318
39326 9226318 6071761 6851477 9507663 9252805 6444612 5886585 8785136 10744945 8692297
39317 8692297 4970438 2679070 1176913 -1152538 -3170237 -3149044 -2018297 -1294907 36842
39308 36842 3350785 6944351 8190946 7671417 7677266 7862884 6266817 3879154 3914167
39299 3914167 6353761 7189736 3911088 -1518170 -5680200 -6427738 -2453799 5599430
39291 5599430 12585140 12004362 4059389 -3137576 -2864561 3003662 8288766 10089392
39283 10089392 8979033 5527487 975973 -1246371 1023903 5511274 9167586 12411817
$$ packed form
39342a5000420j086858O101942R288415P612332K758951k958680o473536m904808
39334d662662O89615M884605M232405J766121J783791K824930P63953l056440
39326I226318l154557P79716K656186k54858k808193n58027K898551J959809k052648
39317H692297l721859k291368j502157k329451k017699K1193J130747P23390J331749
39308C6842L313943L593566J246595n19529N849J85618j596067k387663L5013
39299C914167K439594Q35975l278648n429258m162030p47538L973939Q053229
39291E599430O985710n80778p944973p196965K73015N868223N285104J800626
39283A0089392j110359l451546m551514k222344K270274M487371L656312L244231
$$ plain form
39275 12411817 15863580 16094132 10087390 1611928 -2927381 -3469115 -4807480 -7436853
39267 -7436853 -7301952 -4475538 -3746572 -4998855 -1637220 7755195 14303705 10991792
39259 10991792 3234598 598646 3369528 5041709 4067150 4192420 4903416 835848
39251 835848 -8235511 -14756037 -13467645 -7981220 -4090769 -1779679 1928378 5992697
39243 5992697 6324852 2446475 -1002658 145076 4858733 8433044 7538095 3195927
39235 3195927 -879454 -2423366 -2520815 -3228596 -4480764 -4469006 -2135363 2081013 6843528
39226 6843528 9559228 7144320 214984 -4731311 -1570056 6967023 11568071 8115949
39218 8115949 2356974 490624 148078 -4597201 -12698323 -16761551 -13496602 -7963157
$$ packed form
39275A2411817L451763K30552o006742q475462m539309n41734j338365k629373
39267g436853J34901K826414P28966j252283L361635R392415O548510l311913
39259A0991792p757194k635952K770882J672181r74559J25270P10996m067568
39251H35848r071359o520526J288392N486425L890451K311090L708057M064319
39243E992697L32155l878377l449133J147734M713657L574311q94949m342168
39235C195927m075381j543912r7449p07781j252168J1758K333643M216376M762515
39226F843528K715700k414908o929336m946295L161255Q537079M601048l452122
39218H115949n758975j866350l42546m745279q101122m063228L264949N533445
$$ plain form
39210 -7963157 -6200045 -7919235 -8710775 -6526035 -3226796 -1072817 -113529 978217
39202 978217 2868346 4758636 5271310 4005556 2117626 1246233 2093362 4055751 5573237
39193 5573237 4871788 1848930 -280424 2539823 9350758 13080119 8453777 -409807
39185 -409807 -4237814 78729 6907935 11001881 13683010 17302386 18791684 13945356
39177 13945356 5113989 -1262860 -3679045 -6352438 -10986487 -13825668 -12682815 -11120049
39169 -11120049 -12122980 -12492071 -8457270 -3094318 -1793166 -2512819 1731057 10273508
39161 10273508 12967229 4688750 -5399489 -5675259 1563756 3982843 -2288586 -7558480
39153 -7558480 -4106616 1941448 222809 -8145636 -12319818 -7078562 1337120 5542841
$$ packed form
39210g963157J763112j719190p91540K184740L299239K153979R59288J091746
39202I78217J890129J890290N12674j265754j887930q71393Q47129J962389J517486
39193E573237p01449l022858k129354K820247O810935L729361m626342q863584
39185d09807l828007M316543O829206M093946K681129L619376J489298m846328
39177A3945356q831367o376849k416185k673393m634049k839181J142853J562766
39169a1120049j002931l69091M034801N362952J301152p19653M243876Q542451
39161A0273508K693721q278479j0088239k75770P239015K419087o271429n269894
39153g558480L451864O048064j718639q368445m174182N241256Q415682M205721
$$ plain form
39145 5542841 6392583 8656443 11937658 10983737 3946174 -3804899 -5330916 180244
39137 180244 6643224 7587484 2468289 -3964758 -7708632 -9007047 -9427741 -8237240 -4507000
39128 -4507000 -1297170 -3531885 -10792930 -15580580 -10980860 1561938 13823682 18923360
39120 18923360 16398705 10331004 4505449 -110858 -3935858 -6002228 -4096330 1749108
39112 1749108 7681771 9862621 8517948 5810386 1479946 -5303418 -10663147 -8246857
39104 -8246857 1657592 10099101 9503313 2320220 -3140061 -2538752 1596745 4171935
39096 4171935 1944405 -4285260 -9815908 -10459021 -7783291 -6610617 -6831230 -3546918
39088 -3546918 2608149 2937841 -6274917 -15273613 -13104782 -3035879 3060074 1581328
$$ packed form
39145E542841Q49742K263860L281215r53921p037563p751073j526017N511160
39137A80244O462980R44260n119195o433047l743874j298415m20694J190501L730240
39128d507000L209830k234715p261045m787650M599720J2542798J2261744N099678
39120A8923360k524655o067701n825555m616307l825000k066370J905898N845438
39112A749108N932663K180850j344673k707562m330440o783364n359729K416290
39104h246857R904449Q441509n95788p183093n460281O01309M135497K575190
39096D171935k227530o229665n530648o43113K675730J172674k20613L284312
39088c546918O155067L29692r212758q998696K168831J0068903O095953j478746
$$ plain form
39080 1581328 -1252542 -1783316 -2096201 -1933425 1537083 5228617 2114832 -6428010 -10510305
39071 -10510305 -6558925 -2101861 -2488734 -3449377 -1546748 -1280745 -5159049 -6584875
39063 -6584875 -739594 5931763 5675195 1204021 -1294665 -3249983 -7710453 -9441474
39055 -9441474 -2886370 5463214 5382929 -257632 -145175 6578568 10005205 7229413 5904088
39046 5904088 8565712 7854593 1267942 -2863777 63495 2706003 -726302 -3979235
39038 -3979235 -327428 5308233 5638066 3889530 6458042 9695806 6424375 863217
39030 863217 3471028 12370255 13473037 1319432 -11928184 -12996504 -3802215 4706357
39022 4706357 7930188 9554353 12169176 13550671 11872817 8988197 7014740 5013736
$$ packed form
39080A581328k833870n30774l12885J62776L470508L691534l113785q542842m082295
39071a0510305L951380M457064l86873r60643J902629K66003l878304j425826
39063f584875N845281O671357k56568m471174k498686j955318m460470j731021
39055i441474O555104Q349584q0285n640561J12457O723743L426637k775792j325325
39046E904088K661624p11119o586651m131719K927272K642508l432305l252933
39038c979235L651807N635661L29833j748536K568512L237764l271431n561158
39030H63217K607811Q899227J102782j2153605j3247616j068320R194289Q508572
39022D706357L223831J624165K614823J381495j677854k884620j973457k001004
$$ plain form
39014 5013736 1228352 -2867511 -3249092 1271483 6022935 5019536 -1682282 -7694368
39006 -7694368 -8077107 -4612086 -1721804 -245299 1753489 4534796 6869764 8892132
38998 8892132 10712101 9824435 4744297 23291 1644975 7329145 8065321 1043454
38990 1043454 -5666033 -4769306 279969 2148569 961415 1732656 4162705 3352064 -336392
38981 -336392 -380540 5599671 11621741 11942105 8144895 4783795 3187882 3035698 5241048
38972 5241048 8993483 10009235 6530391 3650849 6362898 11106453 10346434 3922731
38964 3922731 -723887 467065 3254864 2360166 -1823850 -5875777 -8379725 -9911728
38956 -9911728 -10866070 -10805292 -7886210 557491 13243662 21884219 18796355 7816977
$$ packed form
39014E013736l785384m095863l81581M520575M751452j003399o701818o012086
39006g694368l82739L465021K890282J476505J998788K781307K334968K022368
38998H892132J819969q87666n080138m721006J621684N684170P36176p021867
38990A043454o709487Q96727N049275J868600j187154P71241K430049q10641l688456
38981c36392m4148N980211O022070L20364l797210l361100j595913j52184K205350
38972E241048L752435J015752l478844k879542K712049M743555p60019o423703
38964C922731m646618J190952K787799q94698m184016m051927k503948j532003
38956i911728r54342O0778K919082Q443701J2686171Q640557l087864j0979378
$$ plain form
38948 7816977 847634 2215970 4402089 2325847 2516439 11024623 20011386 16751570
38940 16751570 2329605 -8956823 -8051441 163068 7227989 11367859 14404272 15370722
38932 15370722 12064681 5749559 663830 -214414 2276003 4371682 3241039 848148
38924 848148 1951278 6672385 8719736 4335059 -1375300 -2370808 -1549057 -5160485 -10692210
38915 -10692210 -9643437 -1042095 7505482 12126098 15953758 19349208 17980874 13313052
38907 13313052 13503710 19083121 19004775 7811256 -3803894 -4405176 1457279 2404957
38899 2404957 -1472421 -1504259 3416254 6098533 4240519 2859873 4131403 5022238 5186531
38890 5186531 7789212 11817151 12351527 9498681 8758467 11184100 10975473 4417167 -5756563
$$ packed form
38948G816977o969343J368336K186119k076242J90592Q508184Q986763l259816
38940A6751570j4421965j1286428R05382Q214509P064921M139870L036413R66450
38932A5370722l306041o315122n085729q78244K490417K095679j130643k392891
38924H48148J103130M721107K047351m384677n710359r95508Q21751l611428n531725
38915a0692210J048773Q601342Q547577M620616L827660L395450j368334m667822
38907A3313052J90658N579411p8346j1193519j1615150o01282N862455R47678
38899B404957l877378l1838M920513K682279j858014j380646J271530Q90835J64293
38890E186531K602681M027939N34376k852846p40214K425633k08627o558306j0173730
$$ plain form
38881 -5756563 -15542819 -21795030 -19436471 -6257905 8084654 8601926 -5512954 -17644742
38873 -17644742 -15019801 -3852591 2709505 2170311 -61492 -2545992 -6401319 -7722983
38865 -7722983 -2488732 4044074 3112735 -4061697 -7983997 -4922369 31319 3200431
38857 3200431 5744989 6329854 733016 -8571569 -12072116 -6732516 -1418216 -3652252
38849 -3652252 -8584366 -7438886 -358182 6446146 10890741 14056916 13022509 4154145
38841 4154145 -7649231 -11990631 -6282991 1263595 3393224 1712160 654754 188251
38833 188251 -1607135 -3732490 -4432022 -4731462 -5956014 -6470554 -4312633 -534604 3159588
38824 3159588 7231972 11408132 12247832 8090063 3616189 4103794 7096532 5798449
$$ packed form
38881e756563r786256o252211K358559J3178566J4342559N17272j4114880j2131788
38873a7644742K624941J1167210O562096n39194k231803k484500l855327j321664
38865g722983N234251O532806r31339p174432l922300L061628M953688L169112
38857C200431K544558N84865n596838r304585l500547N339600N314300k234036
38849c652252m932114J145480P080704O804328M444595L166175j034407q868364
38841D154145j1803376m341400N707640P546586K129629j681064j057406m66503
38833A88251j795386k125355o99532k99440j224552n14540K157921L778029L694192
38824C159588M072384M176160Q39700m157769m473874M87605K992738j298083
$$ plain form
38816 5798449 -299211 -4842194 -4897296 -4774990 -7576250 -9643728 -7286193 -3518443 -2985969
38807 -2985969 -4012174 -1379280 4907688 8984552 7020969 1774169 -1158605 787983
38799 787983 4966753 5794047 449893 -6337081 -5808531 3933420 13470644 12462995 2158256
38790 2158256 -7194079 -9460502 -7334454 -4997359 -3149008 -2473591 -5121611 -9649931
38782 -9649931 -10253731 -4988049 207926 262690 -944933 2687345 8259897 7135817 -1533594
38773 -1533594 -8540123 -7547695 -3177334 -2436017 -3998887 -2026394 2770991 3211765 -3051697
38764 -3051697 -8714650 -6221947 2141336 7445555 5197574 -838288 -5068033 -6036704
38756 -6036704 -5133514 -3158756 -603866 1000639 734820 33359 534248 1433206 1402929
$$ packed form
38816E798449o097660m542983n5102J22306k801260k067478K357535L767750N32474
38807b985969j026205K632894O286968M076864j963583n246800k932774J946588
38799G87983M178770Q27294n344154o786974N28550R741951R537224j007649j0304739
38790B158256r352335k266423K126048K337095J848351O75417k648020m528320
38782i649931o03800N265682N195975N4764j207623L632278N572552j124080q669411
38773a533594p006529R92428M370361P41317j562870J972493M797385M40774o263462
38764c051697n662953K492703Q363283N304219k247981o035862m229745r68671
38756f036704R03190J974758K554890J604505k65819p01461N00889Q98958l0277
$$ plain form
38747 1402929 1809603 4759851 8606781 9168773 5741545 2163777 880422 -344107
38739 -344107 -3980767 -8394474 -10355949 -9077048 -5392057 9053 4650606 3990917
38731 3990917 -2708636 -8952817 -8462332 -4097195 -3801729 -9109875 -14191896 -15761491
38723 -15761491 -16164117 -15380608 -8657362 3674678 11890320 9105764 1940271 990814
38715 990814 4959611 3740933 -4504936 -9750641 -5267624 2776294 5166608 2091748
38707 2091748 102736 1379149 2400079 1239657 288013 1275274 1612584 -2447180 -10217487
38698 -10217487 -15476788 -12036660 -1236231 7586464 6762732 -439837 -3961833 -25249
38690 -25249 5084578 5482525 3925115 5901489 10459587 12274145 9926968 6781490 5099279
$$ packed form
38747A402929M06674K950248L846930N61992l427228l577768j283355j224529
38739c44107l636660m413707j961475J278901L684991N401110M641553o59689
38731C990917o699553o244181M90485M365137K95466n308146n082021j569595
38723a5761491m02626P83509O723246J2332040Q215642k784556p165493r49457
38715I90814L968797j218678q245869n245705M483017Q043918K390314l074860
38707B091748j989012J276413J020930j160422r51644R87261L37310m059764p770307
38698a0217487n259301L440128J0800429Q822695q23732p202569l521996L936584
38690b5249N109827L97947j557410J976374M558098J814558k347177l145478j682211
$$ plain form
38681 5099279 3889723 1783386 -1547157 -5652047 -7952722 -4474356 4117165 9889304
38673 9889304 6356204 -2142230 -5795628 -2769103 -399162 -3000563 -6030776 -4490064
38665 -4490064 -324276 2191110 3077010 4337157 4992328 3057063 115994 -321356 1833802
38656 1833802 2642630 -1071202 -7695877 -11564279 -8050979 781691 6632022 3613879
38648 3613879 -4582328 -9702772 -9815629 -9957171 -12453947 -13576487 -11414753 -9749033
38640 -9749033 -10442940 -8802069 -1787449 4968651 4777545 -80916 -2923200 -3375466 -5495652
38631 -5495652 -7870998 -4944087 1933632 4128253 -1242685 -6176051 -3913942 702628
38623 702628 -972767 -7953882 -11052187 -5933970 1783827 4777561 1945934 -3355438
$$ packed form
38681E099279j209556k106337l330543m104890k300675L478366Q591521N772139
38673I889304l533100q498434l653398L026525K369941k601401l030213J540712
38665d490064M165788K515386Q85900J260147O55171j935265k941069m37350K155158
38656A833802Q08828l713832o624675l868402L513300Q832670N850331l018143
38648C613879q196207n120444j12857j41542k496776j122540K161734J665720
38640i749033o93907J640871P014620O756100j91106m858461k842284m52266k120186
38631e495652k375346K926911O877719K194621n370938m933366K262109M616570
38623G02628j675395o981115l098305N118217P717797K993734k831627n301372
$$ plain form
38615 -3355438 -8325911 -11209389 -10413093 -7062446 -6289999 -11527184 -18396026 -19140190 -13407033
38606 -13407033 -9163872 -10999888 -13369553 -9630620 -2533598 609811 -609913 -922601
38598 -922601 40526 -2407697 -7119338 -5697636 4304509 12665958 8517206 -6147666
38590 -6147666 -19889301 -24370175 -19091779 -8213564 2066192 6392141 5466981 5608722
38582 5608722 9296810 10248797 2660742 -9072036 -15944432 -15888723 -13004080 -8706899
38574 -8706899 -1770167 4860714 6302901 4855041 8187726 16642718 20437154 13243888
38566 13243888 2117760 -1071465 5866944 14141234 14984607 8152421 208442 -3020323
38558 -3020323 -1832353 -977433 -2880285 -4325693 -1710832 2563699 2920783 -976232
$$ packed form
38615c355438m970473k883478P96296L350647P72447n237185o868842p44164N733157
38606a3407033M243161j836016k369665L738933P097022L143409j219724l12688
38598i22601R63127k448223m711641J421702J0002145Q361449m148752j4664872
38590f147666j3741635m480874N278396J0878215J0279756M325949r25160J41741
38582E608722L688088R51987p588055j1732778o872396N5709K884643M297181
38574h706899O936732O630881J442187j447860L332685Q454992L794436p193266
38566A3243888j1126128l189225O938409Q274290Q43373o832186p943979l228765
38558c020323J187970Q54920j902852j445408K614861M274531L57084l897015
$$ plain form
38550 -976232 -3404686 -1004468 2595984 2818253 813955 342156 466617 -3438459 -10865737
38541 -10865737 -13440856 -5292452 6280398 7259704 -4313266 -13230618 -6726058 6848836
38533 6848836 8945938 -2776342 -12156903 -9721499 -5181404 -8170585 -10929933 -2508110
38525 -2508110 10499004 12952172 4818954 -272867 2613400 5056839 3210565 4123910
38517 4123910 10173682 11866476 3286220 -6899826 -8182452 -3113582 -1046872 -3811758
38509 -3811758 -6289659 -6860366 -9045901 -14320907 -19211192 -19425420 -14132516 -7043872
38501 -7043872 -3917768 -6485227 -9153271 -5859501 619634 2360372 -1082789 -1935576
38493 -1935576 2530921 5209574 1264903 -3978561 -4785965 -4492589 -8113448 -12106273
$$ packed form
38550i76232k428454K400218L600452K22269k004298m71799J24461l905076p427278
38541a0865737k575119Q148404J1572850R79306j1572970q917352O504560J3574894
38533F848836K097102j1722280r380561K435404M540095k989181k759348Q421823
38525b508110J3007114K453168q133218n091821K886267K443439j846274R13345
38517D123910O049772J692794q580256j0186046j282626N068870K066710k764886
38509c811758k477901n70707k185535n275006m890285k14228N292904P088644
38501g043872L126104k567459k668044L293770O479135J740738l443161q52787
38493a935576M466497K678653l944671n243464q07404K93376l620859l992825
$$ plain form
38485 -12106273 -9692019 -2110394 3019348 1869585 -3146313 -8389568 -11017841 -8810907
38477 -8810907 -3248452 -192122 -2742949 -6190452 -4619528 537884 3318955 1692902
38469 1692902 -1451920 -3092448 -1734426 2579385 6072632 2985673 -6252706 -13140366
38461 -13140366 -12186704 -8665346 -9317782 -10996137 -6824435 671156 2383073 -3290716
38453 -3290716 -8619774 -8605784 -6241699 -4869670 -3263488 -448249 1150739 172399 -742057
38444 -742057 1194105 5326817 8985949 9934561 7490310 3682896 2004091 2201552 -999608
38435 -999608 -9777132 -17155448 -15441314 -8326519 -6603691 -12226575 -15138923 -8014003
38427 -8014003 3427606 8802366 6216851 2214343 1753551 3018906 1839182 -1738780
$$ packed form
38485a2106273K414254P581625N129742j149763n015898n243255k628273K206934
38477h810907N562455L056330k550827l447503J570924N157412K781071j626053
38469A692902l144822j640528J358022M313811L493247l086959r238379o887660
38461a3140366R53662L521358o52436j678355M171702P495591J711917n673789
38453c290716n329058J3990K364085J372029J606182K815239J598988r78340r14456
38444g42057J936162M132712L659132R48612k444251l807414j678805J97461l201160
38435i99608q777524p378316J714134P114795J722828n622884k912348P124920
38427h014003J1441609N374760k585515m002508m60792J265355j179724l577962
$$ plain form
38419 -1738780 -2872524 1827332 8638270 10128372 4838674 -198603 1317360 7478213
38411 7478213 13181941 17705927 21989436 22888612 17458191 10244936 8524869 11520679
38403 11520679 11868683 7270774 3204047 3769721 6966598 9846302 11716909 11323997
38395 11323997 7291322 2355929 893451 1376263 -2181899 -10257519 -16105692 -15463030
38387 -15463030 -11201351 -6715629 -1847153 2323740 1961262 -2812199 -6094719 -4698322
38379 -4698322 -2712925 -4219936 -7121279 -7780036 -6517774 -5041021 -3381229 -2441355
38371 -2441355 -4452905 -8055560 -8256149 -3865916 750952 3437160 6723192 10123039
38363 10123039 8505354 2076718 -1333103 420198 -1993124 -13948175 -25061302 -23254388
$$ packed form
38419a738780j133744M699856O810938J490102n289698n037277J515963O160853
38411G478213N703728M523986M283509Q99176n430421p213255j720067K995810
38403A1520679L48004m597909m066727N65674L196877K879704J870607l92912
38395A1323997m032675m935393j462478M82812l558162q075620n848173O42662
38387a5463030M261679M485722M868476M170893l62478m773461l282520J396397
38379d698322J985397j507011k901343o58757J262262J476753J659792R39874
38371b441355k011550l602655k00589M390233M616868K686208L286032L399847
38363A0123039j617685o428636l409821J753301k413322j1955051j1113127J806914
$$ plain form
38355 -23254388 -12998540 -7693186 -9753675 -11230553 -10142531 -11965167 -15977795 -14168557
38347 -14168557 -5544998 741160 -323643 -2911135 -1494797 1156269 1289730 427057
38339 427057 -345766 -3959995 -10071053 -12001776 -6905421 -2147192 -5186870 -12933967
38331 -12933967 -17609743 -17912340 -17408365 -16199555 -11690060 -5085571 -589866 143727
38323 143727 -2255447 -7908494 -15141609 -18142984 -13430351 -5999440 -2607724 -1806216
38315 -1806216 1819207 6099110 3496441 -5449720 -10759793 -7161532 -804429 1333128
38307 1333128 603288 1052386 2117921 2313411 3847986 7565915 8571900 3293495 -3396455
38298 -3396455 -4627076 -1581761 -639999 -3603227 -7486501 -11203957 -14987555 -15268939
$$ packed form
38355b3254388J0255848N305354k060489j476878J088022j822636m012628J809238
38347a4168557Q623559O286158j064803k587492J416338K651066J33461q62673
38339D27057p72823l614229o111058j930723N096355M758229l039678p747097
38331a2933967m675776l02597N03975J208810M509495O604489M495705P33593
38323A43727k399174n653047p233115l001375M712633P430911L391716Q01508
38315a806216L625423M279903k602669q946161n310073L598261O357103K137557
38307A333128p29840M49098J065535J95490J534575L717929J005985n278405o689950
38298c396455j230621L045315R41762k963228l883274l717456l783598k81384
$$ plain form
38290 -15268939 -8574364 -43191 494625 -7767495 -14559528 -12462133 -5818951 -2541145
38282 -2541145 -3383693 -3870336 -2269826 -711309 -661100 -1094605 -486873 936281 416444
38273 416444 -4937341 -12825459 -15072490 -6762668 5834507 12353623 11579900 10127195
38265 10127195 9590800 5495756 -333539 1126172 10274447 14465517 6805070 -1874657
38257 -1874657 365482 7956476 8109923 1931587 944641 7026835 10649143 7861235
38249 7861235 4977948 5213738 3528719 -2192080 -6139354 -5063159 -4313679 -8584427
38241 -8584427 -14313873 -16039403 -14003922 -11176378 -8133378 -4782310 -2683677 -2561530
38233 -2561530 -3273430 -4914782 -8672938 -12607524 -12499276 -7818664 -1960074 3429725
$$ packed form
38290a5268939O694575Q531173N37816q262120o792033K097395O643182L277806
38282b541145q42548m86643J600510J558517N0209m33505O07732J423154n19837
38273D16444n353785p888118k247031Q309822J2597175O519116p73723j452705
38265A0127195n36395m095044n829295J459711R148275M191070p660447q679727
38257a874657K240139P590994J53447o178336r86946O082194L622308k787908
38249G861235k883287K35790j685019n720799l947274J076195P49480m270748
38241h584427n729446j725530K035481K827544L043000L351068K098633J22147
38233b561530p11900j641352l758156l934586J08248M680612N858590N389799
$$ plain form
38225 3429725 8495855 10245156 5327847 -2085443 -3983299 -1062740 -1860413 -7431493
38217 -7431493 -8149426 -143886 6545953 3283450 -3911733 -5113423 -1734688 -1150301
38209 -1150301 -3157099 -2299203 1589680 5343057 10343018 18036078 21612680 13621217
38201 13621217 -307191 -6779332 -3096218 489510 -2659314 -7621504 -8552596 -7056968
38193 -7056968 -6257219 -5091150 -2867383 -2445936 -4586471 -5195965 -2203971 520618 57355
38184 57355 -515138 1453968 2184325 -2405326 -8845091 -10655628 -7868701 -5756666 -5826855
38175 -5826855 -4483776 -517865 1847561 -1292306 -8788994 -16538941 -20830388 -18852071
38167 -18852071 -9954292 1504685 7737795 4736658 -3539996 -9594541 -9148937 -2709826
$$ packed form
38225C429725N066130J749301m917309p413290j897856K920559p97673n571080
38217g431493p17933Q005540O689839l262503p195183j201690L378735N84387
38209a150301k006798Q57896L888883L753377M999961P693060L576602p991463
38201A3621217j3928408o472141L683114L585728l148824m962190r31092J495628
38193g056968P99749J166069K223767M21447k140535o09494K991994K724589m63263
38184E7355n72493J969106P30357m589651o439765j810537K786927K112035p0189
38175e826855J343079L965911K365426l139867p496688p749947m291447J978317
38167a8852071Q897779J1458977O233110l001137q276654o054545M45604O439111
$$ plain form
38159 -2709826 6105633 11463710 8234960 -1892831 -9867706 -9395439 -5099492 -4961224
38151 -4961224 -7266424 -3500910 6149240 10504568 4024915 -3963864 -3045263 3356366
38143 3356366 5011353 490974 -3686360 -4917997 -5406815 -4177192 1230329 6373596
38135 6373596 3678868 -5266446 -10960664 -10025537 -8138229 -8040325 -5332541 1193343 5465078
38126 5465078 4340495 2582279 3563541 4089637 2629960 3165465 5949576 4346499 -3119619
38117 -3119619 -7570204 -3877060 -57196 -3823648 -9252532 -7492843 -2533503 -4022596
38109 -4022596 -10441537 -12282969 -8088165 -4788325 -4485971 -3134765 -1354339 -4594681
38101 -4594681 -11749229 -14390187 -9449207 -3635137 -2790923 -4511072 -3992017 -1041383
$$ packed form
38159b709826Q815459N358077l228750j0127791p974875M72267M295947J38268
38151d961224k305200L765514R650150M355328o479653p988779R18601O401629
38143C356366J654987m520379m177334j231637m88818J229623N407521N143267
38135F373596k694728q945314n694218R35127J887308R7904K707784O525884M271735
38126E465078j124583j758216R81262N26096j459677N35505K784111j603077p466118
38117c119619m450585L693144L819864l766452n428884J759689M959340j489093
38109d022596o418941j841432M194804L299840L02354J351206J780426l240342
38101d594681p154548k640958M940980N814070Q44214j720149N19055K950634
$$ plain form
38093 -1041383 1331497 1046185 -1751133 -4701718 -5090224 -3930374 -5276834 -8706942
38085 -8706942 -7840799 -1049919 3159269 -1211115 -6539796 -2851547 6010827 9127183
38077 9127183 6173310 4891199 4761346 -1451250 -11212774 -13396812 -7290832 -4854535
38069 -4854535 -10800581 -15340385 -11464010 -5223350 -2852861 -1096209 2601822 2880245
38061 2880245 -2548223 -6122279 -2939574 645939 -808595 -2002861 1611264 3654305
38053 3654305 -801980 -3084478 5582599 16671222 15054875 1820042 -8035060 -7638695
38045 -7638695 -4115027 -3633612 -3987695 -3294643 -4348185 -7293298 -7237733 -2636134 1056951
38036 1056951 -616376 -4749029 -5408135 -783534 5545907 8246195 5298096 1038051
$$ packed form
38093a041383K372880k85312k797318k950585l88506J159850j346460l430108
38085h706942Q66143O790880M209188m370384n328681L688249Q862374L116356
38077I127183k953873j282111j29853o212596r761524k184038O105980K436297
38069d854535n946046m539804L876375O240660K370489J756652L698031K78423
38061B880245n428468l574056L182705L585513j454534j194266L614125K043041
38053C654305m456285k282498Q667077J1088623j616347j3234833r855102L96365
38045g638695L523668M81415l54083O93052j053542k945113N5565M601599L693085
38036A056951j673327m132653o59106M624601O329441K700288k948099m260045
$$ plain form
38028 1038051 1868866 7047319 8233146 1755600 -4518659 -2604518 3058430 2862436
38020 2862436 -2618070 -4554827 -745068 1980102 -110088 -3181812 -4610333 -6883299
38012 -6883299 -10609722 -12081267 -10561284 -10393101 -12811740 -12774667 -7460004 -1473967 266468
38003 266468 -852272 -1542415 -2305051 -4255505 -4647566 -500886 5887639 9041196 6373940
37994 6373940 -212383 -6876792 -10177066 -9019060 -5874963 -4242780 -4313343 -3496191 -1043235
37985 -1043235 1359222 3436152 6183181 7468065 3184484 -5560718 -11721866 -11236671
37977 -11236671 -7754470 -5697402 -3743033 879880 6063158 7520642 4770304 201299
37969 201299 -5082359 -10280005 -12222934 -8283819 -719448 5511207 8091129 7697046
$$ packed form
38028A038051Q30815N178453J185827o477546o274259J914141N662948j95994
38020B862436n480506j936757L809759K725170k090190l071724j428521k272966
38012f883299l726423j471545J519983J68183k418639L7073N314663N986037J740435
38003B66468j118740o90143p62636j950454l92061M146680O388525L153557k667256
37994F373940o586323o664409l300274J158006L144097J632183p0563Q17152K452956
37985a043235K402457K076930K747029J284884m283581q745202o161148M85195
37977a1236671L482201K057068J954369M622913N183278J457484k750338m569005
37969B01299n283658n197646j942929L939115P564371O230655K579922l94083
$$ plain form
37961 7697046 5136591 1714093 578320 3584597 7804197 8919402 7368989 7481231
37953 7481231 10865319 14137148 13445377 8621964 2724237 -572369 429923 3665598
37945 3665598 5007060 3271000 1660509 2365525 2837102 837325 -263721 3273772
37937 3273772 7476369 4918668 -3373948 -7842755 -3770524 2465549 3653262 1590037
37929 1590037 1841269 4115848 4142953 1800156 909269 2454462 3837791 4345484 5936915
37920 5936915 8187177 7309296 1676994 -5105778 -8014243 -5287056 770273 5106242
37912 5106242 2687039 -6289626 -13937501 -11660674 -353245 10479406 14521806 14495082
37904 14495082 14484378 12580581 5818239 -2105093 -4293768 -29438 4686344 5182491
$$ packed form
37961G697046k560455l422498j135773L006277M219600J115205j550413J12242
37953G481231L384088L271829o91771m823413n897727l296606J002292L235675
37945C665598J341462j736060j610491P05016M71577j999777j101046L537493
37937C273772M202597k557701q292616m468807M072231O236073J187713k063225
37929A590037K51232K274579K7105k342797q90887J545193J383329N07693J591431
37920E936915K250262q77881n632302o782772k908465K727187O057329M335969
37912E106242k419203q976665p647875K276827J1307429J0832651M042400k6724
37904A4495082j0704j903797o762342p923332k188675M264330M715782M96147
$$ plain form
37896 5182491 2141177 -1805776 -4935694 -5893635 -4475600 -3234642 -4514333 -5869427
37888 -5869427 -2743278 3871739 7292261 4183101 -932806 -2730671 -2425543 -4387965
37880 -4387965 -8431829 -9793221 -5713705 1314807 6565092 7141378 3671481 -123604
37872 -123604 -273772 3172158 5402403 2142077 -4944093 -9976615 -9578974 -6038642 -3714062
$$ packed form
37896E182491l041314l946953l129918r57941J418035J240958j279691j355094
37888e869427L126149O615017L420522l109160n115907j797865L05128j962422
37880d387965m043864j361392M079516P028512N250285N76286l469897l795085
37872a23604j50168L445930K230245l260326p086170n032522L97641L540332K324580
$$ [...]
##END NTUPLES=NMR SPECTRUM
##END=
