##TITLE=31Pdec_SR159_k
 DMSO-d6, 24 sc
 20.1.2023
##JCAMPDX= 6.0         $$ Bruker NMR JCAMP-DX V2.0
##DATA TYPE= NMR SPECTRUM
##DATA CLASS= NTUPLES
##ORIGIN= UXNMR, Bruker Analytische Messtechnik GmbH
##OWNER= root
$$ XWIN-NMR		Version 3.5
$$ Fri Jan 20 16:19:09 2023 Russian Standard Time (UT+4h)  she@DPX200
##.OBSERVE FREQUENCY= 81.013821
##.OBSERVE NUCLEUS= ^31P
##.ACQUISITION MODE= SIMULTANEOUS
##.ACQUISITION SCHEME= undefined
##.AVERAGES= 24
##.DIGITISER RES= 16
##SPECTROMETER/DATA SYSTEM= spect
##.PULSE SEQUENCE= zgpg30
##.SOLVENT NAME= DMSO
##.SHIFT REFERENCE= (INTERNAL, DMSO, 0, 248.564)
##AUDIT TRAIL= $$ (NUMBER, WHEN, WHO, WHERE, WHAT)
$$ ##TITLE= Audit trail, XWIN-NMR		Version 3.5
$$ ##JCAMPDX= 5.01
$$ ##ORIGIN= Bruker BioSpin GmbH
$$ ##OWNER= she
$$ F:/spectra/data/she/nmr/P31/1/pdata/1/auditp.txt
$$ ##AUDIT TRAIL=  $$ (NUMBER, WHEN, WHO, WHERE, WHAT)
(   1,<2023-01-20 16:18:07.01 +0400>,<she>,<DPX200>,
      <created by zg, POWCHK disabled, PULCHK disabled
       configuration hash MD5:
       00 E9 B6 7A A2 85 ED C7 34 08 36 98 17 FE 4E 26
       data hash MD5: 32K
       F5 6B 89 11 6D 35 EE C0 95 12 1E 7D 28 EA 79 7F>)
(   2,<2023-01-20 16:18:15.21 +0400>,<she>,<DPX200>,
      <Start of raw data processing
       efp BC_mod = 2 LB = 1 FT_mod = 6 PKNL = 1 PHC0 = -11042.8 PHC1 = 219.6578 SI = 64K 
       data hash MD5: 64K
       9F 58 9C 26 76 76 23 05 8E 92 D2 3B A0 5B DA 72>)
(   3,<2023-01-20 16:18:31.26 +0400>,<she>,<DPX200>,
      <pk PHC0 = 6.420145 PHC1 = -24 
       data hash MD5: 64K
       28 C3 C0 53 57 B4 3F 5F EB 15 84 A0 E7 DA CC F3>)
(   4,<2023-01-20 16:18:34.92 +0400>,<she>,<DPX200>,
      <abs ABSG = 5 
       data hash MD5: 64K
       24 41 C1 40 24 37 70 60 CB 18 C5 C3 5A FA 8A 86>)
(   5,<2023-01-20 16:18:44.60 +0400>,<she>,<DPX200>,
      <abs ABSG = 5 
       data hash MD5: 64K
       B5 4C 2A 25 D3 2E 07 C5 4C 7E 13 70 30 93 42 B6>)
$$ ##END=
$$ 
$$ hash MD5
$$ 4D 33 E3 A2 C8 64 65 30 53 C3 BC 02 FD 49 4B 1E
##$RELAX= 
##$RELAX= 
##$RELAX= 
##$RELAX= 
##$RELAX= 
##$RELAX= 
##$RELAX= 
##$RELAX= 
##$RELAX= 
$$ Bruker specific parameters
$$ --------------------------
##$DU= <F:/spectra>
##$EXPNO= 1
##$NAME= <P31>
##$PROCNO= 1
##$TYPE= <nmr>
##$USER= <she>
##$AMP= (0..31)
100 100 100 100 100 100 100 100 100 100 100 100 100 100 100 100 100 100 
100 100 100 100 100 100 100 100 100 100 100 100 100 100 
##$AQSEQ= 0
##$AQ_mod= 1
##$AUNM= <au_zg>
##$AUTOPOS= <>
##$BF1= 81.014009
##$BF2= 200.13
##$BF3= 200.13
##$BF4= 200.13
##$BF5= 200.13
##$BF6= 200.13
##$BF7= 200.13
##$BF8= 200.13
##$BYTORDA= 1
##$CFDGTYP= 0
##$CFRGTYP= 5
##$CHEMSTR= <none>
##$CNST= (0..31)
1 1 145 1 1 1 1 1 1 1 1 1 1 1 1 1 1 1 1 1 1 1 1 1 1 1 1 1 1 1 1 1 
##$CPDPRG= <waltz16>
##$CPDPRG1= <>
##$CPDPRG2= <waltz16>
##$CPDPRG3= <>
##$CPDPRG4= <mlev>
##$CPDPRG5= <mlev>
##$CPDPRG6= <mlev>
##$CPDPRG7= <mlev>
##$CPDPRG8= <mlev>
##$CPDPRGB= <>
##$CPDPRGT= <>
##$D= (0..31)
0 1 0 0 0 0 0 0 0 0 0 0.03 2e-05 3e-06 0 0 0 0 0 0 0 0 0 0 0 0 0 0 0 0 
0 0 
$$ [...]
##$SUBNAM3= <"">
##$SUBNAM4= <"">
##$SUBNAM5= <"">
##$SUBNAM6= <"">
##$SUBNAM7= <"">
##$SUBNAM8= <"">
##$SUBNAM9= <"">
##$SW= 501.771253377433
##$SWIBOX= (0..15)
0 1 3 0 0 0 0 0 0 0 0 0 0 0 0 0 
##$SW_h= 40650.406504065
##$TD= 32768
##$TD0= 1
##$TE= 0
##$TE2= 300
##$TE3= 300
##$TEG= 300
##$TL= (0..7)
0 120 53 12 22 120 120 120 
##$TP= (0..7)
150 150 150 150 150 150 150 150 
##$TP07= 0
##$TPNAME0= <>
##$TPNAME1= <>
##$TPNAME2= <>
##$TPNAME3= <>
##$TPNAME4= <>
##$TPNAME5= <>
##$TPNAME6= <>
##$TPNAME7= <>
##$TPOAL= (0..7)
0.5 0.5 0.5 0.5 0.5 0.5 0.5 0.5 
##$TPOFFS= (0..7)
0 0 0 0 0 0 0 0 
##$TUNHIN= 0
##$TUNHOUT= 0
##$TUNXOUT= 0
##$USERA1= <user>
##$USERA2= <user>
##$USERA3= <user>
##$USERA4= <user>
##$USERA5= <user>
##$V9= 5
##$VALIST= <valist>
##$VCLIST= <CCCCCCCCCCCCCCC>
##$VD= 0
##$VDLIST= <DDDDDDDDDDDDDDD>
##$VPLIST= <PPPPPPPPPPPPPPP>
##$VTLIST= <TTTTTTTTTTTTTTT>
##$WBST= 1024
##$WBSW= 4
##$XGAIN= (0..3)
0 0 0 0 
##$XL= 0
##$YL= 0
##$YMAX_a= 2781
##$YMIN_a= -1208
##$ZGOPTNS= <>
##$ZL1= 120
##$ZL2= 120
##$ZL3= 120
##$ZL4= 120
##$ABSF1= 248.5645
##$ABSF2= -253.2056
##$ABSG= 5
##$ABSL= 3
##$ALPHA= 0
##$AQORDER= 0
##$ASSFAC= 0
##$ASSFACI= 0
##$ASSFACX= 0
##$ASSWID= 0
##$AUNMP= <proc_1d>
##$AZFE= 0.1
##$AZFW= 0.5
##$BCFW= 0
##$BC_mod= 2
##$BYTORDP= 0
##$COROFFS= 0
##$CY= -3
##$DATMOD= 1
##$DC= 0
##$DFILT= <>
##$DTYPP= 0
##$F1P= 0
##$F2P= 0
##$FCOR= 1
##$FTSIZE= 65536
##$FT_mod= 6
##$GAMMA= 0
##$GB= 0
##$INTBC= 1
##$INTSCL= 6.047779e-11
##$ISEN= 30
##$LB= 1
##$LEV0= 0
##$LPBIN= 0
##$MAXI= 10000
##$MC2= 0
##$MEAN= 0
##$ME_mod= 0
##$MI= 50
##$NCOEF= 0
##$NC_proc= -9
##$NLEV= 6
##$NOISF1= 182.463
##$NOISF2= 159.3651
##$NSP= 0
##$NTH_PI= 0
##$NZP= 0
##$OFFSET= 248.5645
##$PC= 4
##$PHC0= -11036.38
##$PHC1= 195.6578
##$PH_mod= 1
##$PKNL= yes
##$PPARMOD= 0
##$PSCAL= 0
##$PSIGN= 0
##$REVERSE= no
##$SF= 81.0140089999694
##$SI= 65536
##$SIGF1= 159.3651
##$SIGF2= -187.1042
##$SINO= 113.3802
##$SIOLD= 16384
##$SREGLST= <1H.CDCl3>
##$SSB= 0
##$STSI= 65536
##$STSR= 0
##$SW_p= 40650.406504065
##$SYMM= 0
##$S_DEV= 0
##$TDeff= 32768
##$TDoff= 0
##$TI= <>
##$TILT= no
##$TM1= 0
##$TM2= 0
##$TOPLEV= 0
##$USERP1= <user>
##$USERP2= <user>
##$USERP3= <user>
##$USERP4= <user>
##$USERP5= <user>
##$WDW= 1
##$XDIM= 65536
##$YMAX_p= 371067531
##$YMIN_p= -99596254
$$ End of Bruker specific parameters
$$ ---------------------------------
##NTUPLES= NMR SPECTRUM
##VAR_NAME=  FREQUENCY,     SPECTRUM/REAL,   SPECTRUM/IMAG
##SYMBOL=    X,             R,               I
##VAR_TYPE=  INDEPENDENT,   DEPENDENT,       DEPENDENT
##VAR_FORM=  AFFN,          ASDF,            ASDF
##VAR_DIM=   65536,         65536,           65536
##UNITS=     HZ,            ARBITRARY UNITS, ARBITRARY UNITS
##FACTOR=    0.620285442955139, 1,           1
##FIRST=     20137.2065510682, 0,            0
##LAST=      -20513.1999529968, 0,           0
##MIN=       -20513.1999529968, -99596254,   0
##MAX=       20137.2065510682, 371067531,    0
$$ Real data points
##PAGE= N=1
##DATA TABLE= (X++(R..R)), XYDATA
$$ [...]
43642 16114104 6739669 761192 1922987 490498 -10141888 -20010187 -17042869 -6158013
43634 -6158013 -923586 -2481121 -785773 6619328 11027017 7245466 -13406 -4736441
43626 -4736441 -4681076 1260834 10525111 13183427 2439595 -12048690 -14323764 -5848809
43618 -5848809 -4286466 -15610800 -23359913 -13328838 4898503 12055399 4683123 -5461338
43610 -5461338 -10554657 -12873633 -15111184 -15784412 -14278553 -12378384 -10286306 -7055466
43602 -7055466 -4879155 -7394529 -13172948 -15495389 -9892443 894299 10272290 14233971
43594 14233971 13848622 12345901 10555173 6368257 -584784 -6066034 -6058321 -2737715 -1502441
43585 -1502441 -3317437 -5029978 -6413234 -10648908 -17255950 -20767181 -18059042 -11733669
43577 -11733669 -5089011 886190 4844802 5591854 6073898 10165578 14748348 12715688
43569 12715688 4847903 -446514 -1097476 -4381975 -12273559 -15703883 -10201443 -5570742
43561 -5570742 -10041089 -14849494 -7374090 7368354 12558373 3779731 -6235020 -7088689
43553 -7088689 -2805688 -1753534 -4142785 -4223759 727984 7568150 10737420 6897323
43545 6897323 -1988368 -9842831 -11929742 -8384564 -2271087 2830503 3016965 -3068004
43537 -3068004 -9981224 -9853182 -3096934 1833239 1476933 1468586 4149154 2908595 -4512022
43528 -4512022 -8276886 -1723773 5879179 3892500 -1391584 2680638 13099284 15542697
43520 15542697 6829914 -2435314 -5439596 -4466158 -166898 9088729 17113464 14347801
43512 14347801 3986283 -465048 4397274 7831869 3524494 -1995997 -2640640 -426779
43504 -426779 3805019 12916428 21878456 18355378 1783503 -11556091 -10307947 -2536475
43496 -2536475 -408733 -2640874 -1924954 779022 74902 -3595230 -6723716 -9089251
43488 -9089251 -10203211 -7070509 -2161065 -4932182 -18004700 -30186838 -30408644 -20255196
43480 -20255196 -6769597 6488462 14328676 8752370 -7132381 -16230817 -9885167 -1238168
43472 -1238168 -3930550 -10726619 -8988025 -4413824 -9357348 -17556964 -13515867 -1238370
43464 -1238370 599817 -9323087 -11850374 993929 13687304 12766981 4861265 846846
43456 846846 -781991 -4921524 -8506060 -8208644 -8017978 -10268039 -9437193 -2743012 3307673
43447 3307673 4480042 6367976 12371802 14963278 8518699 933555 1656284 6579291
43439 6579291 6099878 959787 -1706548 -2017061 -4611553 -6763946 -2093552 6160770
43431 6160770 8069992 2860897 243898 4707540 9119398 6866121 1361386 -592437
43423 -592437 2018401 6151625 10352698 14258990 15808593 13024379 7582525 4366040
43415 4366040 7158592 14396604 19166148 15924702 8459680 7017403 14325387 19751475
43407 19751475 13713454 3156867 2861564 13218967 18568895 10014911 -1865044 -3547306
43399 -3547306 2001543 2317845 -4197944 -6571224 1345286 12248786 16328381 12918792
43391 12918792 7760127 4513886 3167784 3049418 3579857 4277033 6252190 10798282
43383 10798282 14639101 11152567 259873 -7216269 -1158027 14292064 25458514 26294813
43375 26294813 23258936 22348743 19880358 10750801 -734932 -5318341 -1031345 5602865
43367 5602865 9552638 12241681 15524333 15931401 8451857 -5595698 -17401783 -18481689
43359 -18481689 -9396290 379756 2282305 -2643873 -6757434 -6130349 -3907393 -3642788
43351 -3642788 -4676256 -5919115 -8728583 -12529006 -12569383 -6805428 -977906 -1557316 -6975700
43342 -6975700 -11265880 -12969679 -14078189 -13216658 -7627580 -500080 1464363 -2295727
43334 -2295727 -5855497 -5920450 -4469380 -2760966 -403166 -453522 -6882756 -15721272 -17511641
43325 -17511641 -10844550 -4698740 -4399253 -4600764 -631790 2726866 345564 -3638633
43317 -3638633 -3037100 224128 999586 158448 909641 1116902 -2509731 -7311288 -10010472
43308 -10010472 -14003031 -21822007 -25175341 -14072129 6603774 21118652 22296506 15991371
43300 15991371 7841492 -1412204 -7109748 -1715337 11272237 17414223 11026980 3278250
43292 3278250 4708469 11606683 17214722 23912862 33537925 36829367 26258036 11244741
43284 11244741 6164287 9424661 9494239 6181065 8248640 12816200 7342121 -6219107
43276 -6219107 -10005265 712600 7175881 -3183805 -15052549 -9035004 7530432 13003724
43268 13003724 4863345 -663392 2453077 3637207 -1177179 -1264937 8342105 16252931
43260 16252931 13523882 8067370 9703895 13349222 9547240 2318106 2731073 10126014
43252 10126014 12932979 6066167 -3825597 -9978317 -12443098 -12368312 -7694000 2599338
43244 2599338 14678749 22150164 20241816 9259319 -3453187 -8116304 -2968693 3304741
43236 3304741 3682562 2469050 7079874 15648110 20946415 22011084 22119529 19011475
43228 19011475 8923836 -1388900 115934 12082278 18850945 11750813 -295588
43221 -295588 -6189689 -7239435 -9330644 -10841562 -7977668 -4915168 -8174269 -14763157
43213 -14763157 -15389162 -7886596 361227 2961803 1150305 -398611 528250 2879143
43205 2879143 4348952 3429646 769446 -1648871 -2769466 -2598532 -891126 1480775
43197 1480775 1014397 -4112843 -9108913 -7739010 -1935188 972838 740159 4766460
43189 4766460 14071176 18881898 13097488 3837317 325004 1901667 4202110 8542574
43181 8542574 16214711 21135167 18475953 14445369 16930346 22114543 21925760 19524612
43173 19524612 23726408 31073150 28536524 14555898 3039037 3154811 7738228 6654169
43165 6654169 692932 -4013424 -6248473 -7237247 -4801394 2629171 10469751 12722734
43157 12722734 9571955 5503121 2193504 -2342063 -8602698 -13038978 -11325932 -3729626
43149 -3729626 3125435 2081471 -5238557 -8281678 -579168 10600218 13421085 7276474
43141 7276474 1812996 2026929 3404847 2172186 1012372 2080173 2490580 280536
43133 280536 -1861568 -2137762 -2814332 -4880600 -5585432 -4270557 -4488885 -6931126 -6271911
43124 -6271911 886377 9951414 14008842 11469769 5590298 842237 1371226 7585751
43116 7585751 12828347 9815793 1735695 -747863 4758585 8984720 6394273 3208276
43108 3208276 4550922 4683969 -1510772 -7157787 -4068739 2834372 2951014 -4115187
43100 -4115187 -11230190 -16814281 -23087923 -25552655 -17740601 -4709290 1476203 -191439
43092 -191439 1079502 9128001 14319563 9838467 2791849 2453820 6258466 5084375
43084 5084375 -3019963 -11078188 -12106387 -5359889 3827315 7787910 3150379 -4394136
43076 -4394136 -5567788 780731 5933415 3119241 -4136947 -8593452 -9278924 -10313943
43068 -10313943 -13032048 -14302377 -11740054 -6949943 -3404481 -2841987 -3917079 -4193168
43060 -4193168 -3735497 -5227561 -8655946 -8396542 -207450 10214653 12048570 3685041
43052 3685041 -4196443 -2717642 3910063 5675135 658336 -4293661 -4277285 -1413638
43044 -1413638 764778 2601695 5808072 8840554 7851516 1864291 -4906468 -6829254
43036 -6829254 -2554596 3868936 7637885 8112300 8810141 13286687 21040520 26441815
43028 26441815 22553672 8951113 -4411811 -5744142 4374151 12151525 7168184 -5099930
43020 -5099930 -11921889 -9488999 -3905652 -144438 1545882 240806 -5571670 -12142975
43012 -12142975 -12599578 -6173750 1117799 5301621 7222367 6821558 2725404 -2059925
43004 -2059925 -2759199 -1968180 -6432973 -13134115 -10203896 3917752 14014404 8147404
42996 8147404 -5816748 -12480705 -9227055 -4516502 -2856732 -2105685 -1129801 -180579
42988 -180579 3137435 9681655 13939883 11376466 6498492 5232537 4139357 -2835144
42980 -2835144 -11387119 -12210455 -6208870 -2172163 -1474411 1673704 5639225 1687596
42972 1687596 -9465950 -16190848 -14940715 -15963735 -23569042 -25460980 -12454145 3377167
42964 3377167 4381178 -6402784 -9855507 1111907 12716616 11642208 3073389 1124977
42956 1124977 8478495 13554135 6701292 -6944825 -13689854 -7918489 2015456 5538448
42948 5538448 2605857 427910 1617355 2964823 4080953 8054138 12657859 10528224
42940 10528224 1354066 -5392014 -4866440 -4805492 -11887316 -18756470 -14803382 -3797629
42932 -3797629 1173985 -2247479 -2735852 6867350 19392969 24537347 22119725 19126754
42924 19126754 18454497 15898224 7278431 -4314942 -9572390 -2639704 10114444 14944830
42916 14944830 7044601 -2641911 -1989869 5607947 7109405 -549346 -6963968 -4900394
42908 -4900394 -44684 -268211 -3882228 -4797458 -3306633 -4506288 -8953180 -11318159
42900 -11318159 -7639444 506940 8670392 12970364 11328633 4566579 -3084358 -6623694
42892 -6623694 -4412726 859966 5368493 7733776 9211689 10618988 10225760 6302600
42884 6302600 1227569 -174979 2466127 3600493 -29766 -3446917 -141694 8202566
42876 8202566 14106882 14392317 11933124 8740429 4063671 -728942 -2131188 -316543
42868 -316543 912084 615938 1187458 2257483 1402082 1537773 8992022 21886122 29243499
42859 29243499 25557531 18212053 16240895 19789937 24962587 29723529 29379879 16970989
42851 16970989 -3145420 -12486090 -945907 16444505 18859097 8700271 5253867
42844 5253867 13888505 20235018 15506355 9039180 10184650 13511512 10361610 2855814
42836 2855814 -2616146 -6122007 -9496257 -9091688 -2282069 5121440 6251380 2513994
42828 2513994 -1776328 -7800720 -16768804 -21968309 -16560816 -5681591 -559806 -2709068
42820 -2709068 -3886401 -589024 1792395 85719 -1250728 1375767 5047055 6937880
42812 6937880 9578757 14799916 17845178 13191566 3372394 -3168660 -2308405 1462116
42804 1462116 1622252 -1774537 -2057671 5129448 14777607 17636505 12351528 7713735
42796 7713735 10581734 16979938 19880592 20409594 23594725 26677227 21750651 9639896
42788 9639896 993990 1404729 4655405 4205166 2450851 3501901 5136152 4931818 7356627
42779 7356627 16128904 24437813 22172607 10461352 194275 -2921547 -3426358 -6081815
42771 -6081815 -9122980 -9829030 -10090806 -12835576 -17145484 -19833023 -19000210 -14471729 -7629333
42762 -7629333 -1746626 830914 2590913 8112131 16388565 20216866 15328289 6409562
42754 6409562 1568521 3780140 9865824 14789629 14696070 8879068 1500316 -1247688
42746 -1247688 1884718 5756016 6425799 6358034 8744996 10832558 8317298 3735435 4116022
42737 4116022 10890397 17987226 20410912 19221885 16643066 11626798 3463904 -3906004
42729 -3906004 -5112483 323437 7194057 9420735 4843515 -3042050 -7077571 -2238353
42721 -2238353 8948369 18263022 20137334 16189826 10469270 3507228 -5741676 -14359833
42713 -14359833 -16468943 -10038667 543096 9273751 13134312 11437197 4420602 -4750317
42705 -4750317 -9163693 -3840243 7212021 12975386 6580126 -7129605 -17230219 -18687068
42697 -18687068 -15957433 -15138589 -16396451 -16030487 -12940756 -9613213 -8084296 -8337816
42689 -8337816 -9999488 -12052311 -11168740 -4609194 4382857 8576984 6216979 4173483
42681 4173483 8437763 15504756 17813642 14478080 10601637 7859798 3106860 -3101742
42673 -3101742 -4091732 3266819 11780122 11432599 864012 -12008466 -18165050 -13436486
42665 -13436486 67202 14082995 18507669 10719701 -826231 -6747680 -8349210 -13255071
42657 -13255071 -21088131 -21672593 -9346194 8140353 18848057 19370372 14340857 8471755
42649 8471755 4693999 6455924 14864868 24108774 25319982 16125184 3260440 -4645177
42641 -4645177 -4596916 6557 3733214 4238592 4025843 6042854 7819525 4135327 -3302239
42632 -3302239 -5128976 2628150 11242752 11463004 6576212 4320096 1939231 -7738261
42624 -7738261 -18825084 -17023977 -2895990 5932236 787403 -5859434 -2573244 2281222
42616 2281222 -3269705 -12955624 -12961837 -5488224 -3766929 -8694877 -8735326 -1591113 1923759
42607 1923759 -2495439 -5419643 -181958 7546502 11529994 13375375 13818891 8089412
42599 8089412 -3523933 -11820223 -12245292 -11666077 -14982232 -16344866 -11429827 -6551409
42591 -6551409 -6132271 -3299090 5428070 8572713 -1980163 -12326120 -5353699 9780142
42583 9780142 9262337 -7755705 -17414549 -9141617 -677061 -6593425 -14662055 -8503358
42575 -8503358 4319424 5862631 -2546307 -4422077 4661480 13587679 16848651 20271911
42567 20271911 24679785 21888398 11521652 5422795 8007852 7122483 -5407989 -17543746
42559 -17543746 -15093345 -5535110 -6642983 -17244554 -18635381 -4835239 8141116 8402532
42551 8402532 5118376 8783897 10495654 -2879659 -23183684 -29643104 -19296155 -10336409
42543 -10336409 -14168446 -21250563 -19593370 -12187269 -7874974 -7024138 -6265075 -8363750
42535 -8363750 -16483196 -24544653 -23639179 -14583369 -5739166 -1776679 -2309814 -7568935
42527 -7568935 -16381986 -21388092 -15610107 -2462008 8835820 15621901 20793094 22223526
42519 22223526 14715438 2233711 -4222723 -3430688 -6383511 -16946760 -22023416 -9942758
42511 -9942758 10133714 18275424 8926669 -4298096 -7396085 -273931 8436953 12713673
42503 12713673 11931317 7683542 2406216 -749704 -328426 999048 -1395808 -8523803
42495 -8523803 -15625093 -17170530 -13419492 -9665896 -8845754 -8317919 -5658395 -3700459
42487 -3700459 -5986261 -10269309 -11627412 -10113479 -9695431 -10814974 -10316690 -8330376
42479 -8330376 -7878771 -6506422 3571086 22899991 39021577 39328664 26053743 13003330
42471 13003330 9506554 12297077 12112286 4269598 -7214544 -13510611 -9095931 2809853
42463 2809853 13716434 18889897 20517328 21568014 20595772 14972156 5726165 -4162676
42455 -4162676 -13634548 -22084496 -26092323 -21975249 -11442644 -1401300 2627792 1216063
42447 1216063 -960159 -323317 2745036 5362085 5764136 4955045 4651349 4948134 5358393
42438 5358393 6743847 9780157 12388302 11693602 8401657 6348553 7524586 10133169
42430 10133169 11644310 11247579 9405856 7510140 7610408 9988062 11837511 10871926
42422 10871926 8380118 5489549 -485780 -10581959 -17968154 -14765962 -3999763 3325397
42414 3325397 3067087 1339386 2283454 2157706 -1269835 -2862018 1045943 5604805 5159930
42405 5159930 1725836 -105394 -1177106 -4573711 -8877113 -10540541 -9706346 -8667014
42397 -8667014 -7231868 -3486544 3214974 11981427 19686332 20306080 11117560 41861
42389 41861 -1798877 3384695 1614057 -10896106 -19722805 -13599080 -1492648 2676060
42381 2676060 1618927 6659760 15548433 14609454 845132 -12589246 -14075414 -5915531
42373 -5915531 2095822 3136057 -2847173 -9182191 -7756072 207730 3156686 -4126030
42365 -4126030 -9923296 -2222933 10997768 12311049 918962 -8177510 -9076874 -11127025
42357 -11127025 -18407124 -20969227 -12681558 -2651534 -557116 -2581545 -609622 4295355
42349 4295355 6221354 4582546 2203793 -397563 -1979463 2145840 12750856 21306509
42341 21306509 18843140 7663833 -801166 1658620 12488297 21449530 20308726 11253191
42333 11253191 4260309 3590238 1826281 -6420967 -11548021 -1583325 16526637 23680352
42325 23680352 16050817 9127954 12224373 16902287 16471483 18298742 26186381 27526192
42317 27526192 12786367 -5290453 -8459493 381901 4081626 -1584468 -4606030 2012776
42309 2012776 11188964 14445483 11474936 5850031 639749 -1042096 1418777 3668524
42301 3668524 2528007 1469005 3191312 1962990 -7145072 -16405410 -14801545 -6047828
42293 -6047828 -3977231 -10967595 -14840907 -8739476 -479040 1851959 1100983 1891753
42285 1891753 1291336 -3417697 -6356947 -1797070 4398815 1706778 -9234303 -16529815
42277 -16529815 -12897533 -4390426 -1009159 -3946754 -6434799 -4795038 -3121402 -5364089
42269 -5364089 -7265046 -1408187 10893870 19045688 16481244 9125682 6821530 10635620
42261 10635620 13684476 11825263 8024477 6655402 7623076 6896172 1465963 -5875223
42253 -5875223 -7370937 902226 11761772 14239748 8614763 6174358 11664851 15884088
42245 15884088 11284848 4480478 4001989 5000257 -1396059 -10463488 -10258768 -1851569
42237 -1851569 1980579 -2764132 -7168637 -6723749 -7525575 -11414510 -9664649 1534160
42229 1534160 11728825 11107261 4968488 3879227 6964742 4986438 -4719201 -15520493
42221 -15520493 -21013555 -19966548 -14020249 -6857294 -3737144 -6017851 -7634212 -2194256
42213 -2194256 7895830 14366423 13803910 10281371 7967836 6543542 4859692 4395052
42205 4395052 6417695 8398035 6521018 1556961 -365243 5277840 14460448 17359021
42197 17359021 9174021 -4143437 -12940607 -14284461 -12372283 -10725900 -8469448 -3990933
42189 -3990933 1842185 6939571 9835148 9995070 8096100 5321433 1110620 -5865698
42181 -5865698 -12563576 -11944725 -2896547 4965148 2943242 -4536295 -7596093 -6807400
42173 -6807400 -10357721 -17176773 -16255405 -5094743 3971723 1288344 -7209732 -11388896
42165 -11388896 -11544836 -13285262 -15712303 -14334621 -10522572 -8836125 -8469187 -5900334
42157 -5900334 -3504837 -7096162 -15732156 -21192162 -17872367 -7935658 3021255 10601574
42149 10601574 12374340 8678743 3020317 -1297103 -4304145 -6851510 -7189452 -3570212
42141 -3570212 1652654 4516213 4904651 5959307 8873330 11340485 10644482 6285013
42133 6285013 665857 -1577428 2641784 10130751 13475049 9730699 3636498 295740
42125 295740 -702509 -994443 1184731 6402470 9490694 5771162 -1340129 -5035643 -4998582
42116 -4998582 -6418897 -10673637 -13067111 -9695734 -1871565 6352507 11775216 13662320
42108 13662320 13951182 14444313 13023095 6582779 -1297023 -2344442 3798902 7288583
42100 7288583 3550715 1238111 6238656 8280990 -3001173 -16947529 -14400613 2513337
42092 2513337 12230427 5597744 -3769952 -5113827 -6453867 -15308923 -21327039 -12717782
42084 -12717782 2665635 8738322 5366601 5035156 10340594 11155567 3477815 -3667465
42076 -3667465 -2903311 1597122 3283675 3531401 7350422 14108565 17516569 13093931
42068 13093931 3505404 -2982926 -293147 7784126 10382167 2763817 -7029850 -9059219
42060 -9059219 -4648854 -2209573 -3816822 -4588403 -3296924 -3795732 -5793593 -4018318
42052 -4018318 1518569 3622750 -626048 -5067621 -5030403 -4513133 -7780587 -11246860 -9696781
42043 -9696781 -4229062 2059365 10050305 19291303 22556239 14371170 1429540 -3827529
42035 -3827529 1925594 11247062 16530142 15273347 7755629 -2328388 -6898455 -1684180
42027 -1684180 5785143 4798906 -3153036 -6925515 -2883724 1215360 393025 -1096392
42019 -1096392 -697282 -3459624 -11255250 -16056826 -11358293 -2582117 1222181 -322458
42011 -322458 -1718154 -874541 714159 1547110 -1339684 -10503387 -19514279 -15470749 2129663
42002 2129663 14792870 7827781 -9223167 -17242051 -13728358 -9089712 -4681564 6039576
41994 6039576 18259562 18969727 10273526 8919860 18749652 23985260 16654895 10255464
41986 10255464 15514125 21732548 16642858 8024682 8024109 9899197 1008943 -10827005
41978 -10827005 -6856666 10751618 19154519 8346555 -5633266 -6127863 2576445 7006918
41970 7006918 4379846 1158447 814594 2142532 4380361 7049905 8273658 7677719
41962 7677719 7285850 6742756 2690413 -3989364 -6035539 556615 9418277 11331162
41954 11331162 5444056 -1893224 -6808693 -10984781 -15664206 -17360806 -11626123 287018
41946 287018 10417403 11281747 4344166 -932027 1762969 7979098 9142081 3984686
41938 3984686 -1579512 -4082134 -5697737 -7884574 -7993636 -3703005 3611189 10505080
41930 10505080 12406874 4364471 -12520247 -26238211 -24274289 -10216063 -610055 -2466567
41922 -2466567 -4691256 2184240 9113022 2416078 -13311218 -20130392 -11937067 -1220822
41914 -1220822 378787 -4026817 -6309021 -6475991 -8680000 -10724517 -6242834 4602537
41906 4602537 13332617 12514161 2890579 -9149593 -17889354 -21161392 -19586038 -15130025
41898 -15130025 -10168689 -6768679 -5989449 -7437790 -9710560 -11763942 -13619752 -15149019
41890 -15149019 -14838276 -11358256 -6375687 -3749631 -4738539 -5624529 -2238638 3677690
41882 3677690 5134886 -1989351 -13017963 -18525509 -14262758 -5608872 -1442991 -4480163
41874 -4480163 -8994531 -8177735 -2203181 2588912 1945327 -1496292 -2951374 -2424090 -3463357
41865 -3463357 -6326411 -7470275 -6742808 -9308969 -16892627 -22423544 -19378517 -12422381
41857 -12422381 -10720138 -12843637 -8337720 4682441 14057645 10340658 -335 -4934197
41849 -4934197 -2995236 -578180 1166245 6349851 13627033 15626178 9811013 2060658
41841 2060658 -1834747 -1814648 201840 3344294 5624267 4602020 2211475 3980347
41833 3980347 11423050 19309595 22163842 20029743 16836358 16199775 18871841 21118855
41825 21118855 16922622 6126306 -1844613 1204677 9630445 10651200 3095986 -942199
41817 -942199 4580637 9768212 4314212 -6123405 -7876314 1587241 11270897 11705827
41809 11705827 5507533 2319926 6972026 13783764 12655474 1777278 -8004625 -5889866
41801 -5889866 4085616 8268968 2308746 -4685047 -5583431 -3541725 -1734171 2872473
41793 2872473 9365379 8766616 -895685 -6533974 1694746 13689863 14070719 5407002
41785 5407002 1894398 5811332 6842554 2115241 -50862 2844496 2296320 -6148665
41777 -6148665 -15771465 -20301399 -20995106 -18628815 -10077947 2434523 9235805 5759714
41769 5759714 -1433870 -5280013 -6008802 -4857431 -89127 6014651 6203657 -234881
41761 -234881 -4745390 -3781191 -5035717 -12447134 -16594799 -10057867 -1975061 -4861247
41753 -4861247 -14846662 -18505325 -13638580 -9278506 -8645310 -6342353 -1080489 2639970
41745 2639970 5694804 13527420 22458731 20782308 8134893 730864 9583069 23940613
41737 23940613 25914088 14172671 2899529 1690553 6700510 10231125 9911130 7314750
41729 7314750 4568882 4594504 9671062 17245699 20609523 15933373 6286144 -2555754
41721 -2555754 -7482833 -7884744 -3751409 2842192 6942360 5679009 2941208 4730099
41713 4730099 10229807 12658575 9858306 7886255 10785605 12848539 7259365 -1782989
41705 -1782989 -3621016 3684293 10831123 10382940 4908116 666623 475422 4908191
41697 4908191 13008822 18740998 14685268 3871533 26277 9732571 21750163 22083368
41689 22083368 12972633 6788314 6162960 2653897 -6389412 -12496061 -10020536 -4720190
41681 -4720190 -3928856 -6429268 -7330387 -6684895 -7557928 -9721451 -10597522 -10134727 -10458677
41672 -10458677 -11694588 -11031776 -5829189 3213486 11586992 14592005 13115792 14027494
41664 14027494 21606650 30372466 31021139 22418535 12491077 7675095 7096877 7374418
41656 7374418 7344554 7034020 7062710 9594959 14820264 17161997 11721980 3862349 3638238
41647 3638238 10144451 11903213 5521665 2091218 8720733 15042620 8254208 -6649555
41639 -6649555 -13558225 -7616979 545222 1309041 -3098860 -4501030 1829387 13845442
41631 13845442 23513188 22301316 10868985 571064 -161151 3042733 66759 -7395166
41623 -7395166 -8979015 -2814501 1385118 -2983426 -11363661 -16622965 -17305739 -14943202
41615 -14943202 -10472066 -5970326 -4045269 -3808751 -2776933 -2759296 -7277461 -13547416
41607 -13547416 -15098523 -12519956 -12547456 -15695456 -15091383 -9658529 -7068121 -9434750
41599 -9434750 -7847828 2076462 10119351 6087922 -4241359 -7890885 -2557014 4483650
41591 4483650 9532285 13525133 13999183 7444804 -1811583 -5070554 -1141347 3609708
41583 3609708 5933700 7663079 7830029 2484439 -6316704 -9919934 -4130138 5494847
41575 5494847 11241845 10547574 4950345 -1957561 -4484857 632840 7938526 7902396 -24164
41566 -24164 -5515190 -1544809 5838400 6404939 -384757 -5715416 -3270887 3684498 6707952
41557 6707952 1505585 -7121303 -9790088 -2998191 6592362 10830704 10213147 10305614 10635821
41548 10635821 5185894 -5906175 -13901732 -13578552 -10151681 -10129599 -12250276 -12472224
41540 -12472224 -11587097 -11722476 -10466749 -5252582 294998 1182867 -814599 -660023 776571
41531 776571 -1562631 -7211774 -9685874 -6124099 -685495 3090850 7112631 13129752
41523 13129752 17126609 13314634 1855092 -10002000 -14092214 -8359843 1150214 5784437
41515 5784437 3331979 404041 3568063 10250567 12657401 9197038 5979177 6512073
41507 6512073 6648545 2867046 -312048 3398220 11839021 16493739 13557443 7333472
41499 7333472 2430099 -1906890 -7500508 -11783338 -10732277 -5264836 -583700 568357
41491 568357 325277 773435 514767 -1493099 -1963368 2654010 9611345 12160990 8527038
41482 8527038 3693466 948665 -2899548 -10284560 -15584226 -11015733 2042155 13175736
41474 13175736 14054527 5284701 -6501144 -13146298 -7878194 8825060 25060679 26723968
41466 26723968 14195240 3164824 4788297 12169863 12712562 6737495 4185401 7406520
41458 7406520 9019320 5935729 3495329 3519606 -146870 -9188308 -14434704 -9544978
41450 -9544978 -2419405 -3344886 -8352819 -5870001 3863630 8801369 4317075 -238410
41442 -238410 2267126 5163862 -546479 -11188058 -15506378 -10453889 -3482154 -584920
41434 -584920 215575 2327501 3902770 1512269 -2664218 -2090517 5174394 12333395 11550363
41425 11550363 3958532 -2396832 -4281030 -6753486 -12699429 -16297640 -13015172 -9518194
41417 -9518194 -14231603 -22474740 -22404850 -13477502 -6141653 -3552269 1631033 9743368
41409 9743368 9980894 853558 -1413247 13235899 29877093 28534209 12850966 2783520
41401 2783520 6054268 13798444 19554348 24507911 25658977 16881604 3529535 -145394
41393 -145394 8314305 15427311 11955552 3958249 -510665 -2841004 -6514237 -9693098
41385 -9693098 -10854101 -11942493 -11395933 -4326007 5963539 7779804 -2008451 -11223202
41377 -11223202 -8506584 3299646 14784197 20672169 18243785 6734265 -5993801
41370 -5993801 -8265302 -2149707 -3009174 -14733770 -20806389 -9777019 6387801 12319249
41362 12319249 11909631 14808135 14966027 2926767 -11557068 -11565685 -883327 2153364
41354 2153364 -5570266 -10186079 -6946046 -6260509 -12516828 -17057027 -15240150 -12438750
41346 -12438750 -10144865 -3611712 3794668 1949339 -6511884 -6539726 4065180 8462132
41338 8462132 -2494772 -15318404 -15500388 -7644801 -2786871 -475619 3983820 7341176
41330 7341176 6646095 8740972 18286578 25607530 19579704 4867466 -6114233 -11232551
41322 -11232551 -16158245 -20353227 -18723120 -12947055 -8816410 -5113407 3752830 15967062
41314 15967062 22997684 20897445 13234832 4805203 -809341 -404872 5384302 10666874
41306 10666874 11680483 11317084 11633916 8698453 1151661 -3966508 -1894137 1436609
41298 1436609 760497 2388956 12230487 21312573 17471096 5301816 -823973 582780
41290 582780 -1687639 -11012865 -18675667 -20092273 -20110348 -20673129 -17296742 -10270374 -6721260
41281 -6721260 -9083141 -12794038 -16309063 -21308715 -23092961 -15243795 -4788784 -6421684
41273 -6421684 -18665412 -23252076 -13566915 -5130943 -8842870 -12508284 -2867187 10074073
41265 10074073 8519682 -4571587 -11337491 -6529525 -631866 913466 3306150 7130659
41257 7130659 4537314 -5366086 -11031339 -4297655 8233236 15215875 14071389 9296935
41249 9296935 4142704 -57307 -968055 2378369 6546851 7440169 5792369 5718189 8796663
41240 8796663 12444092 13868868 13241383 12388711 12143708 12534551 14764678 20308687 26842145
41231 26842145 27763224 19167649 6300298 -722485 2151971 9356310 12977802 10141560
41223 10141560 3347384 -2424517 -2735555 1993484 5272422 2258753 -2310324 -409243
41215 -409243 5998630 7148051 1715298 -555868 3614030 3504273 -7318211 -16744915
41207 -16744915 -10684433 4103220 8181867 -3433750 -16384231 -18107261 -10765071 -2170241
41199 -2170241 4065466 6504375 4187375 471329 605210 3346756 2958368 710138
41191 710138 4646624 15261966 21662221 16684636 6676686 850999 -368997 -230956
41183 -230956 2438948 8299842 11731938 8818205 5266680 7290135 9842150 4403147
41175 4403147 -5189638 -6499816 2738130 11288714 11693011 9945217 13363490 18072588
41167 18072588 15775610 7148595 670180 616844 2921012 2470952 -712203 -3064186
41159 -3064186 -1362229 5484156 15060917 21168467 18558710 9748900 4063080 7406297
41151 7406297 15506293 20243267 19947866 18656090 16927710 10423559 -935504 -9271185
41143 -9271185 -8400457 -2015272 2736014 5082999 7742568 8580980 3926883 -1911006
41135 -1911006 -499189 6644089 7876769 -1417763 -10764384 -9119031 204341 5921800
41127 5921800 4262241 715735 384974 3692782 8754413 11461059 6029124 -7522336
41119 -7522336 -18626770 -16461178 -4164026 4398734 1938301 -5219293 -7836552 -4064721
41111 -4064721 2985380 10869279 16775478 15797414 5569628 -8717027 -17253178 -13870258
41103 -13870258 -1135270 11850949 17291833 15832746 14688092 17122371 17095510 8451655
41095 8451655 -3989871 -9375704 -5409619 -245322 412987 -260809 1218979 2178701
41087 2178701 467456 441491 5918565 11933844 10158255 243656 -9317180 -10277062 -1541112
41078 -1541112 10526740 16169951 10320508 -292428 -2404834 7697059 18205043 16575597
41070 16575597 4926245 -5607049 -10422072 -12593117 -12407967 -6625533 2478996 7851298
41062 7851298 8922224 12477453 19668233 21850883 14167181 4642307 3094547 7719441
41054 7719441 10170346 8670105 7605665 7487128 4501732 -599622 -1553668 4070073
41046 4070073 11107546 14166458 13189620 10007097 5273872 1651129 4188504 12946325
41038 12946325 19793223 18115511 12418320 11939692 16838387 18219802 11951025 4593635
41030 4593635 2962750 4872028 5003783 4115456 5695273 7286811 3210283 -4992392
41022 -4992392 -8556997 -3244263 5364449 10490523 12141874 13210723 13023433 9763928
41014 9763928 5754993 4735234 5437069 3071794 -2879970 -6926555 -4881866 565176
41006 565176 4083273 5614347 10403293 19926961 25940165 18490023 412934 -11999362
40998 -11999362 -7175665 7362785 15161645 11689878 6155677 4549155 2718312 -1737028
40990 -1737028 -3182704 539305 1527014 -4829601 -9710508 -4399492 4630737 6454010
40982 6454010 4310824 8869503 17685483 18058117 9215815 4390564 8263962 9196660
40974 9196660 108574 -8254726 -4567770 4803566 6495544 699434 -1167832 5217857
40966 5217857 12112874 11707269 4925512 -1795667 -3569739 -1344597 -1326978 -7566776 -14359664
40957 -14359664 -11893193 -1238790 4592897 -1128706 -8645024 -6658067 1211780 4401430
40949 4401430 2671837 4078437 10392876 16122441 19189481 21421223 20615078 13810151
40941 13810151 7327964 11004438 21491887 23945851 13559018 3341785 4834496 11794499
40933 11794499 11158597 2218390 -4649265 -3880714 -32548 1622954 1945060 3775745
40925 3775745 6188816 6106506 3717942 3041026 6092782 8769742 5946830 88271 -630327
40916 -630327 5165459 7695281 -685529 -13399483 -18268051 -13959854 -8861305 -6576613
40908 -6576613 -3300848 1173132 1471128 -2461034 -3410853 735602 2997864 110151
40900 110151 -939388 4660251 10148281 8192799 3314869 4311829 10370572 13972986
40892 13972986 13159485 11948276 11847072 11353536 11282457 12761283 12476807 7700219 3448495
40883 3448495 6261090 12907117 14201759 8822828 4058620 3238582 2285162 -324390
40875 -324390 -418327 2354615 1951940 -2404967 -1383084 10501391 23358897 23192071 10568464
40866 10568464 -589861 -1068475 4810086 8464827 7670247 5316131 2952927 -264795
40858 -264795 -4342031 -7479800 -8096850 -6173123 -2793737 508326 2131150 1332557 -736785
40849 -736785 -1637397 11710 3086541 5418441 6126210 5450869 2978488 -1908580 -7772895
40840 -7772895 -11772448 -13233644 -13869632 -13429706 -8853603 -380519 5319148 2678453
40832 2678453 -4738797 -9238502 -10211989 -13411923 -19001748 -18491496 -7248519 6479422
40824 6479422 10925839 5435738 -205265 1029363 6790391 11236565 11592609 7697502
40816 7697502 239174 -7648690 -10592499 -6635727 -1228477 -1938125 -9045947 -14388498
40808 -14388498 -10918724 -1365963 4933080 3001497 -2886096 -5908413 -5047319 -3912612
40800 -3912612 -3579422 -1578860 1757038 1486720 -4310519 -9507592 -7628181 -1867947
40792 -1867947 -863006 -4875436 -3771128 8135278 21734688 23797553 14478557 6889140
40784 6889140 9652092 16933366 18145263 11703624 4364315 170829 -3922078 -11100787
40776 -11100787 -18195726 -19170590 -13351794 -6791240 -4494630 -3779545 1495742 10656585
40768 10656585 14930595 9302796 1471150 2906172 12593824 17289955 9489370 -2337583
40760 -2337583 -5641116 326798 6482817 7099975 3970893 215193 -2862396 -4094184
40752 -4094184 -4202516 -7886276 -17104157 -23483385 -16120206 2224226 15606042 14307883
40744 14307883 5548317 923252 1243805 -93011 -5128885 -10286523 -13678320 -16656880
40736 -16656880 -19662951 -21417862 -21037637 -17945000 -11942435 -5494553 -2220152 -1202373
40728 -1202373 1680898 4435984 -780309 -12931083 -17301329 -5042161 10596020 10562404
40720 10562404 -2664055 -9174964 -1409711 6550172 2510093 -6341209 -6867346 901716
40712 901716 7465618 8767123 8310876 9359929 12622901 18184247 23770284 24374149 18355878
40703 18355878 10220685 3499982 -3853449 -12303199 -15380884 -8652026 981915 3145113
40695 3145113 -2113730 -6276733 -5669624 -4402880 -5164058 -5350704 -2932845 468891 2796039
40686 2796039 2251023 -4221854 -16244274 -24602348 -19219916 -4022565 4636158 -2238502
40678 -2238502 -15453134 -20878030 -16751526 -11839586 -11441890 -12521623 -10984748 -7700357
40670 -7700357 -6653734 -10106257 -15655848 -17094475 -10237382 719879 5958593 1780522
40662 1780522 -3886426 -1590516 7191019 12922246 11248614 6950579 4769666 3210656
40654 3210656 243633 -628860 4550739 11823336 12282312 4046876 -3918150 -3006942 3399470
40645 3399470 4269543 -4107992 -13056702 -13224626 -6243805 -467490 940352 1237296 1450481
40636 1450481 -1350485 -5963937 -5418247 2379478 9094219 7108718 1103369 1198569 7945305
40627 7945305 12401917 9821975 4789305 2094469 673335 -910397 -262203 3640893
40619 3640893 6905893 6696648 5732859 6258291 4372135 -3787752 -13817358 -17596299
40611 -17596299 -14300332 -10811469 -11984808 -16102786 -19701093 -21487672 -21062638 -18634774
40603 -18634774 -16676238 -17390744 -18035077 -13519322 -4572055 1566530 180671 -5529150
40595 -5529150 -9441887 -8379781 -1883259 8100825 15005564 11453730 -556440 -8774270
40587 -8774270 -4969944 4840708 9830939 8750755 7714650 8169021 6339050 2574365
40579 2574365 1593967 3385072 2862221 -476548 -1575934 -331566 -3513532 -12523352
40571 -12523352 -18638053 -16095013 -11241324 -11314183 -12074460 -6320579 1266658 -493819
40563 -493819 -11520458 -19623059 -17807632 -12128823 -10174176 -10980615 -10234172 -8039345
40555 -8039345 -6833603 -6773976 -6971938 -7012963 -4808351 1953836 9884853 11559183 6290698
40546 6290698 2560358 5472547 9240607 8318492 8110383 15041169 22127023 16988857
40538 16988857 1935323 -7063944 -2584072 5513240 7148792 5810746 8403864 11592320
40530 11592320 8250197 892622 -2232361 -954700 -2095384 -5377804 -1569070 12207356
40522 12207356 24416912 22527284 9290690 -836574 679731 8268087 11630246 8067990
40514 8067990 2892800 664739 334121 -588284 -775754 2839749 8912666 11208722 5459888
40505 5459888 -5225760 -12910741 -11871429 -3380068 4741615 4120564 -5389335 -13234831
40497 -13234831 -8851807 4622242 12727418 7588402 -2852195 -7202653 -5416736 -4619121
40489 -4619121 -5701914 -3234932 3628268 9287066 10620628 9854646 8060865 3436675
40481 3436675 -2679582 -5202201 -2517081 1805411 5418291 8589260 8726401 2062483
40473 2062483 -7226057 -8751403 -369518 7975311 9118359 7779569 8987975 7841015
40465 7841015 -67676 -6985853 -3366685 6340143 10406651 7874920 7127189 9217534
40457 9217534 6485174 -1954999 -6711283 -3132268 1564317 294868 -4644700 -8873144
40449 -8873144 -13171896 -17698888 -17021460 -7925745 3400385 8431340 6581300 3314266
40441 3314266 1896115 2016688 3326012 5498369 6798213 5799768 2464881 -3807822
40433 -3807822 -13109296 -20680135 -19725501 -11452458 -5621057 -6920366 -8147512 -3082310
40425 -3082310 1482128 -4128731 -15939582 -21273800 -17647921 -14841685 -17765794 -18965751
40417 -18965751 -11885139 -1915554 1527798 -2874660 -9926150 -16284028 -21197974 -22691812
40409 -22691812 -19239530 -13412543 -8837999 -5057699 -114793 3365127 553275 -6990793
40401 -6990793 -11071865 -7519084 -2348203 -3562214 -10063531 -13449020 -9355942 -1763134
40393 -1763134 4498145 10060843 16601417 20142133 14498476 1095998 -9669719 -9141336
40385 -9141336 50521 7334604 5846763 -1101381 -4835729 -1260287 4752508 5315686
40377 5315686 -594652 -5429901 -2661540 4445353 7087973 2394373 -4045798 -6976155
40369 -6976155 -7538882 -8991577 -11200873 -12154019 -11146140 -7744154 -1330357 5417056
40361 5417056 6825152 2024791 -1573200 2274299 9124355 9862072 3654026 -2109046
40353 -2109046 -3355012 -2959350 -2728635 -229097 4020253 4277705 -1055373 -4795310 -1705486
40344 -1705486 2020289 -2207320 -10876190 -12236926 -3454961 5842526 8717677 9889197
40336 9889197 14765723 18287905 13318117 4705925 4277352 13098646 19468085 16642732
40328 16642732 12404713 15625267 21927912 21081615 12965238 6325398 4325399 1691330
40320 1691330 -3408963 -4588575 2209748 10999946 13311385 8435773 2106734 -1039739
40312 -1039739 -347085 1887895 1651927 -2950995 -7474436 -5672204 274034 1104370 -5016388
40303 -5016388 -8058828 -1906086 4702432 2390028 -1750547 5616807 21217063 27436557
40295 27436557 17388075 3605776 -1095349 1525133 4153208 5500661 5716935 1072567
40287 1072567 -7508806 -9444688 1150615 12677918 9593607 -5248152 -14241120 -9497430
40279 -9497430 -935118 1383361 342797 2222086 4698998 2338731 -2858144 -4654143
40271 -4654143 -2131084 1210770 4361122 7349356 6086383 -2283678 -10257799 -6548255
40263 -6548255 6730446 13923563 7100449 -2881149 -3952566 -1622157 -8123303 -19443069
40255 -19443069 -19468085 -6807608 -477269 -12253569 -27554222 -25443992 -8244646 2938424
40247 2938424 -1913315 -10779800 -9454305 320027 7644001 8365832 7036088 7548018
40239 7548018 8399529 6298400 705902 -5122692 -6429645 -1589921 4929161 6433357
40231 6433357 1641331 -3965497 -5280560 -3251531 -2146197 -3985986 -7474599 -10018355
40223 -10018355 -9058316 -3870147 2013334 2823546 -2351098 -6852399 -4317275 2233113
40215 2233113 3333588 -4741931 -14620901 -16487242 -9540700 -2070369 -954766 -4048837
40207 -4048837 -4179726 1206283 6883958 6328931 -856222 -9095916 -12753377 -10131283
40199 -10131283 -2801381 6162677 12573511 12117208 3593521 -8384390 -15529417 -12625800
40191 -12625800 -2671366 5654029 6181195 18471 -7873585 -14203029 -17582546 -16145155
40183 -16145155 -9058019 530835 7921190 11771478 13269267 12089676 8016974 4747110
40175 4747110 5297646 4716717 -4023453 -16578690 -20036711 -11674500 -3447068 -2682366
40167 -2682366 -792864 9735277 18933535 13458015 -953736 -6423241 1716984 11199737
40159 11199737 12663964 9069778 5154889 818305 -3039751 -3481633 -2339122 -4057994
40151 -4057994 -6076051 -2057284 4964792 4846466 -2831571 -6865727 -1953530 4554787
40143 4554787 6658300 7382923 8314217 5017731 -1530436 -2482607 3106370 3440235 -7132293
40134 -7132293 -17700352 -18423536 -15195893 -15799971 -14617513 -4493893 7830968 13098129
40126 13098129 16289751 25882316 34941549 30863689 18141247 12723647 16448630 15517743
40118 15517743 4509280 -5687519 -6909701 -5235086 -8350414 -13720534 -15055476 -11434026
40110 -11434026 -5328777 1435193 6862828 9970373 13734234 20823142 27258291 27514336
40102 27514336 24147601 23554306 23916447 17917490 7007449 1549603 5147682 9387418
40094 9387418 6893218 454639 -3562779 -2885010 1591590 7117712 8810226 5264153
40086 5264153 3207257 7979719 12423028 7260554 -346485 5112371 20607334 24742238
40078 24742238 9986918 -4350881 -1318892 8915861 7671470 -2914353 -6443691
40071 -6443691 945168 8282256 9810977 10554848 12934736 13011893 11748002 16694395 28310869
40062 28310869 35371307 29974939 19445075 16426049 21733500 24274060 16938846 6047559
40054 6047559 2340047 6615898 9557606 5408960 -56030 1756996 10323478 17850858
40046 17850858 20177774 20585164 24686703 35768546 52086315 64906027 65736287 62325477
40038 62325477 78185825 122825263 169816519 183246811 163204739 143351250 141601030
40031 141601030 138071270 111650283 74475652 51901880 45529187 37644501 21944517
40024 21944517 8570222 3709749 3134793 3962965 6769913 7330388 800206 -6972969
40016 -6972969 -6131689 352700 820891 -4373883 -1695123 13400695 27717721 29388812
40008 29388812 23682796 22476566 26892005 28470508 22515636 13416280 8536272 10535854
40000 10535854 14994383 14977476 9177122 3838065 4028059 6239183 4382653 -232577
39992 -232577 -1593108 512232 179123 -4850293 -9860337 -10042557 -5456273 801573 5079081
39983 5079081 5009443 2782189 3960382 9025351 10798453 5954268 2898260 9360774
39975 9360774 17789385 14880012 2551745 -3481899 4306753 17194845 25572843 30341572
39967 30341572 35177194 37557092 33082733 22659768 11693226 6091711 9322481 18494215
39959 18494215 24703102 23186828 20449635 24186915 30675524 32562360 34882099 49411669
39951 49411669 74311365 93702795 98338100 93616991 87573491 86168674 99729985 133595238
39943 133595238 167694973 167052227 123833326 71504294 44711472 41195251 37696844
39936 37696844 27322219 20908510 21653270 20609048 14724450 10825036 10796563 7444554
39928 7444554 -2671573 -13456121 -18516254 -17773614 -13604004 -7305161 -458232 4751877
39920 4751877 6278897 1413787 -10257436 -20577145 -17570834 -2151293 8766009 3865347
39912 3865347 -6932374 -8572682 -3109688 -2208803 -5366434 -2589547 5222749 6398675
39904 6398675 -1175932 -6410145 -3784867 -651740 -2419538 -4670030 -4638597 -7127304
39896 -7127304 -12982112 -14025751 -6831856 -706175 -3588218 -9208962 -7463192 -299627
39888 -299627 2396152 -2103371 -7605487 -9623342 -9617118 -9382563 -7594217 -2724989 4059085
39879 4059085 9396339 10204903 7121813 5590896 10248658 17815830 20000904 14411351
39871 14411351 7209257 3162606 -576597 -7065355 -11910618 -8675940 1763001 12620418
39863 12620418 19416727 22107107 21321421 17439843 12314584 7764825 2982789 -3259876
39855 -3259876 -8618151 -8648977 -2165388 7113699 13940050 15146876 11154452 5704150
39847 5704150 2926449 3040652 2420868 -469904 -1429192 4334004 14764418 21980084
39839 21980084 20593126 12421368 2994427 -3681242 -6017055 -3672126 1403528 3889525
39831 3889525 -881259 -10117456 -13946201 -6277257 6306949 11329776 5977530 50752
39823 50752 1544804 5902256 4507961 -1743871 -4773870 -1986994 1523352 2224457 1377466
39814 1377466 -1294991 -8809926 -19352715 -24637197 -19385395 -7124442 6009086 17160761
39806 17160761 23312795 19175119 4905902 -8792102 -10598596 -1754802 6599521 8010206
39798 8010206 6751403 9281393 15434087 20448706 21877447 20700029 16662514 6628475
39790 6628475 -9750707 -24515192 -26600240 -14849038 -1627116 1091786 -3964095 -5210268
39782 -5210268 53989 2730728 -2457644 -8169534 -5863237 1813058 6410495 5678588
39774 5678588 3315970 1114720 -1373640 -2164900 1145644 6322312 9487932 11422182
39766 11422182 14837968 17466068 15101694 10454109 10873208 16560076 18964386 13236833
39758 13236833 5090847 1720194 2149314 1244580 -1708161 -3897919 -5142088 -7686370
39750 -7686370 -11521040 -14400760 -15445781 -15099177 -13088222 -10441291 -11680783 -19392729
39742 -19392729 -27011692 -23679094 -8641399 4985770 5160781 -4606349 -11129326 -8811792
39734 -8811792 -3904873 -2225312 -963591 4045840 9822992 11035028 9120266 9740802
39726 9740802 12956780 12843243 6973563 4063 -3366206 -3339033 -1391713 2281600 5075832
39717 5075832 2029010 -5822006 -8612291 404230 13644995 17049740 7511836 -4405653
39709 -4405653 -8691497 -5877424 -1860784 479989 1543622 1961929 2845426 5688313
39701 5688313 9223783 9524618 5876701 3348975 6576140 14022542 21482703 27734637
39693 27734637 32378991 31397683 21328514 7075059 -839741 1763867 8243602 10199882
39685 10199882 6714211 2481956 772666 1348017 2661885 3074382 1539827 -709967
39677 -709967 -843756 1493259 2872265 543349 -4211582 -8761853 -11853527 -11614484 -5429437
39668 -5429437 4217591 8362226 2021359 -7378060 -9114328 -4234777 -3160176 -9368427
39660 -9368427 -15283025 -15980435 -16938969 -23362519 -30056467 -28714194 -19897659 -11169849
39652 -11169849 -6809045 -5099654 -3381047 -1107891 313936 -2018945 -9202301 -15887800
39644 -15887800 -14356585 -6190110 -3043551 -10869625 -20641821 -21663364 -16756397 -14878122
39636 -14878122 -15221831 -10881751 -4292132 -5010179 -12576061 -15514500 -10136962 -7463341
39628 -7463341 -15809400 -27105441 -28113366 -17869514 -6348635 -632817 588881 1401894
39620 1401894 3297249 4945658 4736193 4031991 7262492 15580569 21763802 17436529
39612 17436529 5480621 -1912164 810496 6156311 6138816 3174230 2906102 3003950 -2887480
39603 -2887480 -13313203 -18865169 -13901373 -3221958 4061176 4272967 1223438 -380595
39595 -380595 -1221540 -4564306 -8111607 -4657740 6059050 12910899 7636970 -2235527
39587 -2235527 -4184631 278871 -567924 -8512521 -13111982 -9597478 -4496073 -1271515
39579 -1271515 4633978 12469661 13411099 7194947 5905933 13053941 14651765 1853275
39571 1853275 -12710751 -14374171 -8253176 -6687370 -7980118 -5015587 -3532846 -11927523
39563 -11927523 -21639712 -18946651 -10027160 -11901180 -22049308 -20686756 -3433670 11597823
39555 11597823 12697410 8304077 6172796 538632 -10892297 -17042128 -12337124 -8420240
39547 -8420240 -14121532 -19114785 -12119320 -1822499 -2643273 -9791916 -7053096 6256742
39539 6256742 14351182 9511540 1204233 -820068 1764127 4875806 10349302 18512106
39531 18512106 21373114 11883548 -3983737 -12091212 -6556470 4363614 9869852 9099964
39523 9099964 8426084 9927559 9401214 6000610 5744844 10912318 13139120 5140351 -5706211
39514 -5706211 -5972874 3707904 8810359 2326465 -5630411 -4048092 3210301 4783682
39506 4783682 -2039402 -9962273 -12368385 -9094384 -3802211 -189302 306913 -770871
39498 -770871 -1692062 -3579881 -7476797 -10181906 -8711904 -6918754 -9424707 -10383592 494635
39489 494635 19639262 30102956 24416257 14103251 10077545 6946034 -3260257 -13988678
39481 -13988678 -14371929 -7908252 -6357540 -10413913 -10775136 -5184708 -354465 1790091
39473 1790091 6258023 12814247 14121485 8251729 2376772 1449381 2784491 4341641
39465 4341641 8784653 15704638 18468778 13390533 5409734 1046941 1857766 7476714
39457 7476714 17802743 28423220 31218561 24689661 17609116 17126066 19013338 15751152
39449 15751152 8860598 5419744 5694034 2806515 -5693365 -13323866 -13208769 -5735587
39441 -5735587 4054516 12246800 16949607 17025128 13094038 8256106 5540165 5306336 6102869
39432 6102869 6635818 5879103 3370931 1391486 4681033 14525621 24053406 23628770 11911457
39423 11911457 -1684058 -6830711 -1826258 7433022 13976511 13353087 5342497 -4132169
39415 -4132169 -6626542 -1258577 2333965 -3497483 -12485983 -12285836 -1966076 7004225
39407 7004225 7105803 3088910 2036175 3781184 5207937 6750918 9194621 9174832 3328138
39398 3328138 -6116971 -13686038 -15971675 -12525273 -5294970 769156 1048444 -2431976
39390 -2431976 -2559122 2973332 8618419 9927963 9159124 8838522 6656758 1318778 -2937454
39381 -2937454 -2976550 -2253467 -4384460 -6770032 -6122104 -4982245 -7074802 -11144374 -14367759
39372 -14367759 -16105947 -13667954 -2347406 13688248 19394588 7277058 -9584394
39365 -9584394 -13596681 -5166660 2615335 5702548 11270837 21374842 29157373 31347042
39357 31347042 31579665 30444731 24313948 15551600 12401388 16413813 20241314 19921538
39349 19921538 19408745 21141900 22300833 22503324 25002986 27971829 25108306 17661452
39341 17661452 15026656 19857076 23526307 20813081 18090907 21217060 25713660 25717395
39333 25717395 23212772 21292354 17312843 10440610 7205674 10687122 12106008 3332088
39325 3332088 -8483315 -9678390 490983 9889214 11190790 9626460 12383420 17987511
39317 17987511 18766047 10283355 -2865614 -10002952 -5262094 3934696 4156778 -6470023
39309 -6470023 -14579836 -9360120 3114034 9654885 7748408 5242372 6505748 8060454
39301 8060454 6603761 3549377 1441344 1394556 3681936 6458281 5474873 -366667 -5277312
39292 -5277312 -3407028 2733488 6078161 5232613 4969748 7829174 11316982 13129568
39284 13129568 13512925 11983194 6580367 -2307774 -10323661 -12173390 -5578806 5861762
39276 5861762 12917604 8288368 -3311382 -7873695 785672 12444189 15108719 11969949
39268 11969949 14621277 24087949 30161363 28063466 23846234 21981900 18901540 12544111
39260 12544111 8567301 11673422 18043608 21608287 21931858 21212949 19052229 15147759
39252 15147759 12430882 12718505 13262071 11612575 9406834 7345541 2049348 -6360637
39244 -6360637 -9028268 1199057 17172114 23819881 16311669 4220429 -2205558 -1810672
39236 -1810672 2684120 10927376 21257572 27146691 23756532 15131858 9576289 9624353
39228 9624353 11239602 11690865 13293315 18961768 27774656 35832633 39178781 35920713
39220 35920713 28055471 21176880 19960624 24216341 31397827 40939883 52158245 60393675
39212 60393675 62164205 63522415 75089736 98074220 125392494 159317186 213725952
39205 213725952 288147901 351698512 371067531 351101652 329832419 331395386 339921807
39198 339921807 325135552 278913578 217639981 160366626 116292859 86446318 66070814
39191 66070814 48074894 31477553 22849619 23979440 24829817 16725333 5985190 4390987
39183 4390987 11328132 16630743 17094213 17417794 16898483 9342306 -2672071 -7306009
39175 -7306009 -1386207 3372549 -1887860 -9706331 -8188949 2036989 11256557 14953252
39167 14953252 15988872 16283890 14333521 9542572 3463772 -1864365 -3380437 1695479
39159 1695479 10226106 13785681 10260968 9350979 19036325 31572538 32915487 23125148
39151 23125148 15782390 17301294 19335926 15182499 11691166 17265034 26867097 28731500
39143 28731500 21352891 14719308 16568907 24814082 32764921 35903592 34088164 31722630
39135 31722630 34228047 39973354 38916512 25497713 9505352 5521971 13441385 19449726
39127 19449726 16113882 10126344 7851380 5397313 -1005681 -5534464 -2094882 5236370
39119 5236370 9975915 14048422 20935796 24608372 17222950 3918889 -2322667 1079165
39111 1079165 4780650 3543938 1973066 3203452 3476183 1133280 867805 4811234
39103 4811234 7937683 6633844 4253353 3863111 2451505 -3117510 -10382741 -15676408
39095 -15676408 -18939423 -20771317 -20019619 -17381725 -16092789 -16339016 -14395323 -9471647
39087 -9471647 -5508980 -4413295 -4214655 -5443854 -11172469 -18374796 -18238208 -8557881
39079 -8557881 2952033 10827440 17040456 20236094 12510392 -5644339 -19310175 -18116677
39071 -18116677 -10953327 -10931054 -15526929 -14312266 -7734207 -3543021 -675536 7859622
39063 7859622 19317949 23205405 17765645 11263312 7280941 1356022 -7159296 -11831105
39055 -11831105 -9925983 -6940182 -8333786 -13998858 -21145254 -26005869 -24225156 -16575081
39047 -16575081 -11339485 -13296488 -14828457 -7462588 3131635 5583942 1078000 -1163773
39039 -1163773 -2412274 -11323551 -23748679 -24252028 -10254082 2636247 3744585 -99716
39031 -99716 53851 2957197 5966824 10750187 13508058 4903329 -12219733 -20256263
39023 -20256263 -11612843 -1522045 -4951402 -14477321 -14372727 -4920262 1914174 2092483
39015 2092483 567808 -397817 -1038133 1800587 8532077 10815661 3015571 -6476286
39007 -6476286 -6574053 332791 4860854 5943958 7061027 4795544 -4077643 -10511407
38999 -10511407 -4368294 7205314 9416242 3627852 2813409 5781117 -2502579 -22603908
38991 -22603908 -34153546 -24946530 -8181940 -1355115 -3990554 -7248030 -11300607 -19588402
38983 -19588402 -26184251 -22923094 -12901634 -5265142 -1752109 1336100 3231402 1633866
38975 1633866 1065972 6853699 13470459 10211291 -2392930 -12352904 -12736069 -8702984
38967 -8702984 -6856273 -6859173 -6203488 -5016049 -2599116 3637352 11696980 13733048 6093410
38958 6093410 -4266109 -8267356 -5683171 -2949656 -3562012 -5820522 -7612995 -8279127
38950 -8279127 -7322802 -5878058 -7827284 -14614192 -20377803 -17681393 -7410638 2567738
38942 2567738 8229982 12602528 17617188 19800480 16629247 10957661 5655760 -582661
38934 -582661 -8073938 -12072794 -8782458 -1202680 5675531 11179700 15665333 16070655
38926 16070655 11168794 6557288 6766143 6455321 -1688020 -13589090 -18631378 -15967773
38918 -15967773 -14332814 -15348478 -9888867 4980722 17288405 15547856 4162310 -4365865
38910 -4365865 -6005633 -5773142 -6398746 -5075702 -145368 5565648 8373360 7107755
38902 7107755 3260875 -304471 -2249343 -5199018 -12267563 -20440925 -21999337 -14187134
38894 -14187134 -2498575 7584279 16090377 22736786 22504117 12820993 310247 -5884287
38886 -5884287 -4549352 -1191515 498373 805008 108227 -2077881 -5384290 -9115093
38878 -9115093 -12608935 -13090284 -7038714 3380850 9818534 7682188 2209428 117861
38870 117861 -217866 -4482607 -12023656 -16379606 -14427159 -9193998 -4315283 -428090
38862 -428090 3007317 5620600 6222632 4158615 1473774 2358379 6656208 6094966 -5513512
38853 -5513512 -19284189 -19369105 -6204865 1143618 -7951672 -19277784 -14963990 27158
38845 27158 6705272 176397 -6431729 -3335323 4772961 9195130 7408319 1607438
38837 1607438 -4131801 -4847592 -195305 2039112 -4972715 -16554550 -22331201 -19536589
38829 -19536589 -12758889 -4789893 2542170 2903927 -6963697 -16738112 -12535679 3101406
38821 3101406 13458310 9828351 -645033 -9189744 -14030845 -13227966 -3025513 11900359
38813 11900359 18503925 11612674 923383 -2927685 -654110 1565577 1861146 1788033
38805 1788033 2199041 3504281 5032332 3824515 185045 1941654 13605370 24194982
38797 24194982 19129289 3103338 -4518109 1741993 6749353 331954 -8730947 -11308252
38789 -11308252 -12214313 -15665683 -13872645 -3403370 2957571 -3451798 -9158105 432891
38781 432891 13731306 8814939 -10179444 -16430364 -120352 17574036 16049361 2628930
38773 2628930 -1632497 9031659 22022690 26043593 22830730 19528814 17055091 10481131
38765 10481131 -641342 -7731276 -3322464 6893680 9429741 585331 -9717266 -13618155
38757 -13618155 -14853625 -17928889 -18515472 -12949115 -7944218 -10150573 -13271620 -7420418
38749 -7420418 3941871 8672621 4051339 -1874963 -4690152 -7061503 -8657251 -4889659
38741 -4889659 2968769 7107715 4788278 1681019 1832523 2628894 1458215 -414927
38733 -414927 -2253882 -5017652 -7226959 -6764195 -6882144 -12353519 -19562237 -19728440 -12924376
38724 -12924376 -8578840 -9664398 -7580132 2156080 9801454 5165024 -6305969 -10674698
38716 -10674698 -4266823 3678275 4995607 1069312 -2900500 -5545950 -8974917 -14289590
38708 -14289590 -19771856 -22620161 -21633775 -18161682 -14204952 -10124387 -5468588 -1473505
38700 -1473505 -380523 -1828333 -2107537 1753842 8156421 11964901 9244997 1269306
38692 1269306 -6253700 -9262299 -10521060 -15898650 -24838009 -28879312 -22474396 -11105033
38684 -11105033 -4182140 -3125841 -1994669 2126161 5611228 5063004 2168210 440219
38676 440219 558558 188504 -3256765 -9671934 -15236644 -15884830 -12473730 -9447920 -7588932
38667 -7588932 -3170363 3642342 6246359 1755048 -3145667 -2446258 -55321 -1377989
38659 -1377989 -2856218 301338 2581261 -3222506 -10576226 -6654124 6775713 14663838
38651 14663838 11165307 6010334 6088050 5543103 -720310 -7237535 -8648756 -8674362 -11092653
38642 -11092653 -11994234 -8480748 -5455301 -6059994 -4800710 1535872 5811808 3274113
38634 3274113 3011633 14243788 28388851 29154795 16653721 6789691 7289697 8717606
38626 8717606 2324635 -5835517 -5145236 3899207 11763880 12689554 8574461 2735213
38618 2735213 -3483767 -7692030 -5779579 2463084 9881671 8643697 522292 -3771905
38610 -3771905 2467092 13631702 19776489 18711372 14677068 8819089 -633067 -10043905
38602 -10043905 -11876742 -6302035 -2834047 -7444740 -15547755 -20794393 -23031470 -23599605
38594 -23599605 -20404683 -12700957 -4384750 1759699 6535452 7759978 70234 -13701493
38586 -13701493 -20692086 -14694191 -5352706 -2536239 -1641714 4730723 10328168 4889886
38578 4889886 -6633710 -10313288 -4773669 -668733 -769547 2871870 11357820 15065310
38570 15065310 10875661 8327185 13057116 17218986 13128318 5253018 1362749 1116868
38562 1116868 495031 -491170 -963429 -2731973 -5066748 -3192902 2966611 6255086 3093366
38553 3093366 -1919848 -6691345 -15774831 -27288836 -28736751 -16733590 -8537022 -18710325
38545 -18710325 -33784280 -28733652 -3877726 14436410 10250114 -3678708 -8421509
38538 -8421509 -3120259 1497315 1112366 -658714 -831548 1379629 6409867 11730831
38530 11730831 12128698 6901705 1440166 -1610559 -5656678 -10674092 -9012369 2800668
38522 2800668 15676525 19194129 14884740 10412241 7005116 2201638 -548609 3514320
38514 3514320 9305762 6654511 -5003069 -16929885 -24714762 -30467740 -32013035 -22782494
38506 -22782494 -5199747 7707925 8867470 5371651 5207446 5618807 1171513 -5284549
38498 -5284549 -7483272 -5150616 -1641830 1882418 3475704 -1930000 -14419716 -24558846
38490 -24558846 -24974073 -20929788 -20578294 -20115688 -9659955 9090678 22745817 23857284
38482 23857284 18680343 15975704 16663970 16875900 14362707 9370072 4103776 2653628
38474 2653628 7225231 14195524 17744878 16366083 11851088 4591184 -4591258 -11056416
38466 -11056416 -11681297 -10825710 -13651818 -16751145 -13973351 -8062309 -6181527 -7003892
38458 -7003892 -4293599 -759221 -4061989 -10138007 -7068777 2834958 2843213 -11368165
38450 -11368165 -23043805 -20743128 -15287819 -18466487 -21868131 -13003860 1174759 5230485
38442 5230485 -192129 -3415099 -3750970 -8905597 -15233201 -10979915 1799271 7777719
38434 7777719 2226115 -3393440 -2347080 -1591227 -4896557 -3907418 5882212 14402575
38426 14402575 11792985 2726361 -3332503 -6563810 -12175600 -19653557 -25900487 -31850236
38418 -31850236 -36804153 -33262365 -17843789 -1705487 1323153 -6493180 -11065595 -7131513
38410 -7131513 -2647818 -2814048 -2486629 2013349 4998128 1830948 -1764547 833842
38402 833842 4976181 1817523 -6535267 -10007694 -7500501 -8810201 -17171378 -22139417
38394 -22139417 -16736270 -10871015 -16699072 -28417684 -30553247 -22249929 -17461633 -20828697
38386 -20828697 -19989376 -6883606 8451900 13759349 11360860 8971563 5185405 -3736765
38378 -3736765 -12195116 -13993812 -15074877 -22975577 -29948030 -22920780 -6458098 1427811
38370 1427811 -4601065 -12106684 -12717030 -12137268 -15147468 -16940352 -14905942 -14302334 -15836023
38361 -15836023 -11662922 -1042816 4002399 -2209158 -7477160 -494274 10441811 10637240
38353 10637240 1838892 -2545903 675448 1757278 -4877723 -13085598 -14982275 -9677485
38345 -9677485 -1645770 3406426 1846829 -3891624 -6778802 -4560321 -3624735 -9317307
38337 -9317307 -17871975 -22945060 -23646799 -20355875 -10620819 2994804 9576462 4382549
38329 4382549 -1473154 2638920 9488221 7386233 2599849 9266509 21774320 19846113
38321 19846113 2379444 -6745334 6149401 24037410 25331001 13631176 7223732
38314 7223732 11754635 18698430 22064458 21598604 15488782 4101276 -3240825 1423245
38306 1423245 10725679 11187711 3537752 -239376 1366139 -3115171 -16227578 -23492467
38298 -23492467 -15003401 -1912575 -460606 -8874119 -12514626 -6408206 420922 1588949
38290 1588949 2053536 7689638 15426480 18081631 13186040 3595821 -5918648 -9980285
38282 -9980285 -5493697 3432110 7882515 4898955 1444770 3928775 8824991 9007264
38274 9007264 4716185 1300946 -362545 -3087881 -5231172 -2256478 4088456 7115702
38266 7115702 6085944 6333539 7336399 1543940 -11227502 -19396467 -16072453 -9875101
38258 -9875101 -11158606 -16676583 -17942632 -16444069 -18160996 -19439278 -12639141 -2075799
38250 -2075799 868499 -2758386 -684386 8624303 11660719 2368886 -6806782 -4615995
38242 -4615995 2172468 2518267 -229229 2963580 8194837 4423867 -6228274 -9388154
38234 -9388154 388178 12528146 16402806 12929184 7295868 684462 -5991798 -8737349
38226 -8737349 -6541249 -4482938 -5950406 -7503095 -5902564 -4104777 -4980757 -5162618
38218 -5162618 -1756766 184766 -5136190 -13609973 -16596508 -14380441 -14700150 -18834502
38210 -18834502 -19489473 -13918162 -9000694 -9664036 -11386531 -9268758 -6353831 -6753505
38202 -6753505 -7945880 -7193894 -8801560 -16142015 -21956921 -16668945 -2848679 8467089
38194 8467089 12871924 13547678 10079303 -764673 -13341085 -15918645 -7890839 -1601721
38186 -1601721 -3262372 -5012342 -1482886 -618703 -8994547 -18336568 -18119614 -12207155
38178 -12207155 -10702981 -12829141 -10957191 -6011991 -5379120 -9000696 -10456358 -9529458
38170 -9529458 -11131254 -13178666 -8138149 3312643 11643191 11896807 7494493 1482669
38162 1482669 -4853764 -5968326 2279658 11185816 7749150 -4305555 -7623529 1967595
38154 1967595 8878701 3649257 -2547978 954709 5693892 405644 -8282286 -8169852
38146 -8169852 -3793969 -8153960 -19093876 -22756741 -17264415 -14317027 -17055649 -14279951
38138 -14279951 -725782 12539850 14858274 10727675 9571157 10217126 4956928 -6680478
38130 -6680478 -17201981 -21797517 -22480250 -21886683 -18516158 -10079908 891240 7375156
38122 7375156 4912015 -2411313 -5743862 -2391074 374229 -4655942 -14120086 -18410109
38114 -18410109 -14247795 -7071930 -1693066 3042183 9206284 15151621 18364183 18729114
38106 18729114 16407622 10000568 -100393 -8910029 -10768948 -5600726 870208 3346074
38098 3346074 2271829 2465393 6973491 13403810 16946522 15645697 10905846 4323334
38090 4323334 -2551485 -6174104 -3625415 2006331 3886475 668135 -1559157 1576355
38082 1576355 7214966 11207242 13046541 11711737 4379560 -5581302 -7613900 1471764
38074 1471764 9578188 5345490 -4835087 -7219602 -2267961 -1889483 -8226164 -10462685
38066 -10462685 -3469546 4698925 6909806 5719356 4149085 -6823 -5455227 -4580472
38058 -4580472 3976838 10054472 6475508 -344537 -1732251 363502 535678 1445546
38050 1445546 7335705 12278171 7103782 -4660837 -9235987 -1129272 10167942 13686108
38042 13686108 9631796 5502535 4616910 2638072 -5201176 -15462190 -17506093 -5637814
38034 -5637814 11575734 19643428 15636531 10100202 10248700 10767221 5972067 1060757
38026 1060757 2546070 5488928 1494965 -5582997 -4164288 6639602 14697518 11634373
38018 11634373 2120412 -5156485 -7121994 -4735570 524505 5697306 7748820 7929747
38010 7929747 9400560 9826524 3081963 -10061504 -20021231 -20078043 -13785515 -7745951
38002 -7745951 -3376314 86136 578298 -2734694 -4414568 1578443 12366248 17679617
37994 17679617 11528535 -757594 -7861760 -3343252 8867961 18727399 19469483 12695252
37986 12695252 4489108 -1302949 -4133972 -3659743 200100 4696561 5929706 3549035
37978 3549035 432394 -2306111 -6202314 -11209207 -14772487 -15821343 -15693447 -14478428
37970 -14478428 -10789867 -6056068 -4329132 -6282361 -7855235 -6516717 -4370975 -3349826
37962 -3349826 -2258512 -747934 -956159 -2398552 -758308 4445167 6420668 289922
37954 289922 -8921957 -13021519 -11461466 -9453046 -8627411 -6428413 -2983506 -1736045
37946 -1736045 -3381627 -4686780 -3546694 -899446 1937184 3649691 1532497 -5758604
37938 -5758604 -14615480 -19678945 -19516001 -15255670 -6375775 6068278 14488068 11375161
37930 11375161 750095 -5279052 -2449161 1479466 276176 -2191760 -808222 2187998
37922 2187998 3151888 3840287 5494991 3075655 -6574328 -16491229 -18215644 -14051569
37914 -14051569 -11738597 -11323513 -7815194 -3385500 -4395263 -7452850 -2285248 9483786
37906 9483786 12384610 -662451 -16646478 -20588186 -14317240 -7956282 -3013627 3882419
37898 3882419 8349880 3941776 -3515825 -1958090 7466347 11087652 4118795 -2550645
37890 -2550645 -748083 3182553 1708546 -557442 3715714 10763992 12110049 8788350
37882 8788350 8306180 11081298 10703012 6156363 3404895 4305359 3354787 -2408354 -8325192
37873 -8325192 -9977904 -9262747 -8908776 -6869491 -925354 5293891 5867505 58970 -7405372
37864 -7405372 -11873734 -11860595 -8632629 -5655792 -6752088 -11761917 -15228299 -12277533
37856 -12277533 -5005178 -426638 -2817638 -10534052 -19250782 -24769784 -22977279 -11840351
37848 -11840351 4060611 14287852 11820245 873652 -7586569 -7941678 -4482311 -3662860
37840 -3662860 -5853530 -7318672 -7096921 -7300809 -7512020 -3894547 4514277 12175920 12379952
37831 12379952 4705224 -4603566 -8769936 -6157502 -1098339 321649 -3443689 -7457427
37823 -7457427 -6511557 -2258744 -422924 -1589196 -644969 3394480 4113250 -1701298 -6793505
37814 -6793505 -3231183 5500507 9770491 7578875 4713352 3628203 1759841 501929
37806 501929 5612283 16155618 21996418 16685779 6041759 -502023 -1304900 -957644
37798 -957644 -2656106 -6797594 -12635492 -16747916 -14011968 -4706749 3231205 3661063
37790 3661063 94629 -769315 754077 -167141 -3219659 -2928033 2496006 8322041 9550191
37781 9550191 5730239 167045 -1758336 4902556 18855721 30418224 30489995 21066865
37773 21066865 11842400 7701929 5963233 5038641 7320622 11729903 11988310 6678392
37765 6678392 3696083 8548411 14063667 9572038 -3170410 -11901100 -10996118 -8305345
37757 -8305345 -12763358 -22099593 -27085567 -23451146 -14710278 -5821690 653007 2624688
37749 2624688 -2119055 -12335410 -21721301 -23535544 -16750396 -6877990 -991430 -1943989
37741 -1943989 -6519415 -8805877 -5875882 -54142 4890308 8522150 12674323 16701347
37733 16701347 17481887 14528474 10906406 7488504 983224 -9052410 -15919396 -13984405
37725 -13984405 -8089654 -8291554 -16573448 -25153054 -27343598 -23397144 -15597312 -5255120
37717 -5255120 3575798 4921511 -971548 -6396909 -6648425 -5748110 -7853628 -9518579
37709 -9518579 -6201238 -853548 863545 -102942 1427335 6158953 10499840 12784594
37701 12784594 12953230 8939849 678713 -4668036 145145 10844374 15404454 9751229
37693 9751229 1823679 -1040433 -752635 -2123660 -5179033 -7375743 -7741651 -5452008
37685 -5452008 607455 7639454 9203277 3299401 -3866152 -5508349 -1991248 1991756
37677 1991756 4174096 5455788 7124217 10110954 13936804 14471080 7092042 -5186290
37669 -5186290 -11594868 -5775289 5811525 11882892 9111353 2491155 -3106724 -5806454
37661 -5806454 -3804496 3706165 12948315 18008960 17056006 12566139 6573854 31561
37653 31561 -4394869 -4298520 -2166871 -2746043 -5323628 -4198752 1682103 5313065 1186387
37644 1186387 -6353957 -8993431 -5849262 -3701354 -6666279 -10998077 -11695844 -9899596
37636 -9899596 -10070068 -12179273 -11616011 -7118679 -3804349 -5451945 -7771550 -4254601
37628 -4254601 3534642 7542477 4639530 -50861 -2248212 -3805874 -5948856 -4668604
37620 -4668604 1453590 5131691 -156726 -8974326 -10914914 -5841512 -2329842 -2238847
37612 -2238847 1776792 11507099 17498355 13683436 8128822 11281590 20514951 25394444
37604 25394444 23600797 21770723 22430635 19760923 9522490 -4123266 -13738545 -15462893
37596 -15462893 -9814919 -726450 5380712 4765232 1724740 3625025 9666230 10974038
37588 10974038 4195285 -1930231 1628071 11224619 15400449 9378353 -1051581 -7853763
37580 -7853763 -7495506 -1107486 6440264 8225279 1261864 -8773291 -12666159 -7527425
37572 -7527425 1647638 9066944 12576598 12192101 9551351 8893797 13348815 19390561
37564 19390561 19702188 12591855 4178046 361925 1192500 4065077 7399835 9431631
37556 9431631 8023280 3691072 -935950 -5431229 -10909089 -15155228 -14597722 -11496430
37548 -11496430 -11622152 -13666925 -10022801 -600957 4634391 1708939 32866 6347686
37540 6347686 12460316 9377779 3444166 5091236 9810893 6124063 -2882687 -3217421
37532 -3217421 6842148 14403457 13427782 11889930 14799139 16298474 13431764 12258898
37524 12258898 13774454 8698716 -5201329 -14608941 -10043049 -1379943 -1803608 -6869998
37516 -6869998 -3617373 7249986 13281906 10123892 5347461 4025539 2960694 -295396
37508 -295396 -2931441 -2817709 -1469452 -354197 139153 -1137592 -3998466 -5215853 -3599378
37499 -3599378 -2771338 -3553921 390618 11680411 20639469 18049382 10717227 11644846
37491 11644846 18900303 18900984 8816003 -192556 -2890230 -6683735 -14483775 -16922062
37483 -16922062 -9073679 -924452 -1516900 -4254904 1020746 10527984 12913129 6509343
37475 6509343 -1482104 -8502871 -17615421 -26998699 -29336830 -22501078 -13033878 -7963490
37467 -7963490 -8564624 -11841563 -13028002 -7548456 4235512 15020529 17931052 14309373
37459 14309373 9417535 3413327 -6101660 -14454339 -12398995 -118427 9762815 7575293
37451 7575293 -1208305 -4540509 -129016 3181018 -1343818 -9914150 -14364072 -12478640
37443 -12478640 -9198920 -9133507 -11113298 -11112932 -8454180 -6593911 -7983447 -10726228 -11444252
37434 -11444252 -9514692 -6892558 -5275101 -5282487 -7126227 -9723345 -9777105 -4400707 4624281
37425 4624281 10866005 8869193 -107522 -8216554 -7566346 2230948 12953672 15338980
37417 15338980 7999380 -2100095 -7411207 -6005750 -662155 4677875 6689315 4466029
37409 4466029 1224677 930909 1674602 -3081126 -13642571 -19784324 -13229444 -638566
37401 -638566 3760508 -2779294 -8507560 -4645496 2652150 2431385 -5459189 -11557806
37393 -11557806 -10166683 -4842053 -1549002 -2207257 -5590214 -9833150 -12505781 -11768727
37385 -11768727 -9225125 -8789446 -10888600 -10374840 -2657886 9815818 19629421 21632339
37377 21632339 15788169 4531787 -8767100 -18961073 -21554889 -18351193 -17197288 -22545508
37369 -22545508 -28518305 -25901205 -15294004 -7887950 -11357136 -19858305 -22209551 -16634744
37361 -16634744 -11166295 -10082432 -7447256 2279678 13249343 14914344 7319578 1679725
37353 1679725 4827971 10932726 12242415 10610683 11651274 13226617 9221216 2014879
37345 2014879 375267 4442945 3952961 -4939908 -11757517 -7377366 1659378 4026027
37337 4026027 1663775 4953520 13514153 15049920 4144086 -9513609 -15073219 -12895161
37329 -12895161 -8250855 -1390754 9021795 18320285 19596189 13215793 6968026 7112744
37321 7112744 12399235 16140966 12457338 2147682 -6586320 -6126245 818751 3552005
37313 3552005 -2677669 -10139927 -9573770 -2707156 1619457 143727 -2850183 -4747423
37305 -4747423 -8470040 -15589772 -21257718 -19679112 -12073106 -5631276 -4803802 -6385995
37297 -6385995 -4944899 -1485871 -2730255 -10470923 -16437381 -12757064 -4177986 -2294826
37289 -2294826 -8710474 -13230211 -10407760 -7457548 -10457095 -12739269 -6201166 3363912
37281 3363912 3901926 -4028569 -8455056 -5174456 -3374199 -9723973 -17893099 -18902314
37273 -18902314 -13253466 -6770931 -1344161 3320010 4137201 -1091494 -6690949 -4617513
37265 -4617513 3154697 5153667 -4409291 -16856455 -19710833 -12475803 -6062311 -7238825
37257 -7238825 -9968870 -5322721 4707793 9419970 4089953 -4383670 -8252225 -8993974
37249 -8993974 -12228500 -17238543 -17844545 -12026726 -4941229 -2184036 -4098463 -6871114
37241 -6871114 -6026140 676874 10427851 16090763 13354442 6547418 3661196 6549840
37233 6549840 10380462 11688923 11312617 9462857 4534203 -1415624 -2349841 3214622
37225 3214622 8565397 7751572 3804433 3193779 5488771 4385311 -2293298 -9252080
37217 -9252080 -10955486 -7757177 -3249683 891244 4567040 6033210 3356975 -328089
37209 -328089 2529884 13991588 23818841 19006007 1019025 -13331993 -11969101 -1819260
37201 -1819260 3452224 3597765 8873148 19896246 24021592 14704847 2195492 -1867926
37193 -1867926 -775139 -4654478 -13312428 -17927826 -15982835 -13428536 -12752378 -9219673
37185 -9219673 -809307 6856612 8986262 8134349 8032262 6469022 -354765 -9692837
37177 -9692837 -13839755 -9035491 667896 7981028 8565214 3513409 -2232762 -4482906
37169 -4482906 -4013858 -4877661 -7669884 -7719021 -2972826 -337313 -8250528 -23647034 -32926060
37160 -32926060 -27904847 -15135385 -6093609 -3613395 -3228967 -3023026 -4141881 -3770500
37152 -3770500 3078361 13510338 16893833 8522035 -3664760 -10033605 -10538160 -10192097
37144 -10192097 -9816066 -8260156 -8552687 -13219867 -16688641 -11460961 -469408 5749188
37136 5749188 4145599 2474708 6353962 11891503 13910563 13214063 11764461 8293861
37128 8293861 3783537 4453355 12787006 20618186 18169549 7028362 -2129869 -2912979
37120 -2912979 1101859 2781508 -1254933 -9090571 -15394928 -15205425 -8497192 -189468
37112 -189468 5955447 11041463 16701339 20690824 20421540 17836740 16558106 16579211 15950627
37103 15950627 15281549 15814134 14969307 8971324 -965656 -9411750 -12697146 -10413164
37095 -10413164 -3237437 5708749 9621069 4719086 -2816724 -3640838 1309068 2226640
37087 2226640 -3518188 -6153252 966820 9106128 5771067 -6433880 -12386375 -4831694
37079 -4831694 7089677 11776458 9555447 8172229 9806669 10061773 7740915 7665705
37071 7665705 12160663 16190353 14771502 10653447 9836442 12523487 13813163 11502284
37063 11502284 7785321 4516986 2636478 5232878 13913942 21794775 18472576 4742004
37055 4742004 -5523251 -2457149 8013416 14507632 14868658 13580047 11478301 7338019
37047 7338019 4790321 7229072 8736995 1172007 -10566999 -11901232 846937 13685182
37039 13685182 12801037 629058 -10650335 -14219674 -11527162 -6085395 -1049977 349862
37031 349862 -2385265 -5547187 -6131128 -5741771 -6488848 -6595076 -4562254 -4412430 -10535027
37022 -10535027 -18443381 -17441893 -4467765 9815273 12580268 3791473 -4875988 -5294720
37014 -5294720 -1596645 -1208073 -2508615 1742228 10555910 13278518 4698479 -6513416
37006 -6513416 -10085942 -8186049 -9544782 -14738517 -16824900 -13843754 -10580630 -8594930
36998 -8594930 -4469343 1222222 2962618 398891 147911 4510612 7255430 4403805
36990 4403805 558265 -79700 -460945 -2846098 -2507917 3482449 8027342 2663360 -10290358
36981 -10290358 -21348605 -25364370 -23055914 -15881663 -6571814 -711297 -672341 -1438964
36973 -1438964 1245146 3079072 -1360628 -8202407 -9585149 -5096719 941011 9135523
36965 9135523 21214770 29804428 24596182 8663611 -3105465 -3492058 -308364 -2142823
36957 -2142823 -7222265 -10291314 -11391750 -12786024 -13932165 -13689181 -12160990 -8147884
36949 -8147884 -768311 5241798 3418420 -3645464 -5778625 398466 7682225 11355777
36941 11355777 15361429 21045487 21275981 13005857 5110496 4631893 4705986 -3177604 -13196682
36932 -13196682 -13832607 -6338167 -1515890 -2119795 -1691487 1315145 1485901 -1761906 -2642705
36923 -2642705 -52556 1180175 846851 3371569 5940529 -315742 -13597173 -19070459
36915 -19070459 -9808200 1601229 1020325 -7348016 -9126011 -612609 9217576 13104154
36907 13104154 11902149 9028373 7049061 8310616 11943876 11977870 4801956 -3887748
36899 -3887748 -6351323 -4464885 -6507529 -14190225 -21045756 -22749921 -20650137 -15330512
36891 -15330512 -5736746 4117518 6743001 2438776 704181 6378065 11923463 8837844
36883 8837844 480380 -2797789 2869102 12179674 18636442 20008779 17720298 15003703
36875 15003703 14423220 14760446 12607386 8649791 8124225 12395499 15396767 12794167
36867 12794167 9305939 10809889 13846373 10657452 1683548 -5054171 -5446301 -2331291
36859 -2331291 1844118 7043966 10362703 7337340 -153273 -5400544 -7885481 -14005017
36851 -14005017 -23849719 -26697979 -15573996 1313186 10786467 10648834 8188065 7523568
36843 7523568 6546926 3650843 -327304 -5588202 -12002008 -15344354 -11730725 -5489567
36835 -5489567 -5766468 -14284988 -22398836 -21881312 -13661950 -4384812 800006 29906 -5934617
36826 -5934617 -12911737 -14811868 -9017356 1046960 9974233 15110009 16361721 13935002
36818 13935002 8256051 860158 -5956420 -9842483 -9087524 -4297660 891135 2819064
36810 2819064 1421965 -816053 -2353787 -2446135 701344 7173680 11579918 7662231
36802 7662231 -2470255 -9224650 -7558695 -2805023 -1668639 -2819867 -1038384 3470634
36794 3470634 5777774 4342491 2894524 4204173 6116922 4835415 5798 -4204995
36786 -4204995 -2761091 4580004 11363749 10969306 5628085 4683210 11644940 17898552
36778 17898552 13923581 2950587 -2769764 2423673 11882392 16242280 13101047 6362642
36770 6362642 803853 -1082152 -246747 -462385 -4287304 -9473390 -11542923 -9042472
36762 -9042472 -3721453 2321056 5760702 1484198 -10354202 -18761505 -12502795 3198769
36754 3198769 10625153 3422146 -4061735 2023333 14224520 14947348 2193604 -8828303
36746 -8828303 -8187381 -2505635 -1345841 -3623303 -3577763 -2182906 -4645528 -10594997 -14292248
36737 -14292248 -13532754 -12334169 -14204151 -17220204 -17283873 -13188311 -6536342 1414368
36729 1414368 10341957 18564455 22409619 19529914 12415056 6797398 5630513 5770043
36721 5770043 2073617 -5602745 -10946704 -7180294 5721048 19570522 24116062 16488212
36713 16488212 5205125 2408981 10365143 18218279 15092267 3854116 -2948879 414576
36705 414576 6664988 7044289 2832987 1263783 4114829 6031220 3283142 -503330
36697 -503330 1401572 11105676 23643637 31316704 30126437 22371380 13174798 5307171
36689 5307171 -1330385 -6154491 -7151562 -4683913 -3003925 -5611656 -10796700 -13914456
36681 -13914456 -12869356 -9464901 -6329812 -4352405 -2801053 -914543 586919 55407
36673 55407 -1923884 -1448106 3512574 8136335 5980686 -984089 -3954280 -125800 3636531
36664 3636531 3035045 3532199 9250957 13263605 8358630 795704 1739030 9361822 12315773
36655 12315773 8726746 7749082 12062615 13653631 10237523 11244993 21181756 30261423
36647 30261423 29861735 25530541 25207919 25744414 22419668 21370018 28557031 34729745
36639 34729745 27463239 12718645 7183714 11815909 11372715 1130695 -4949952 1602776
36631 1602776 8870884 3983254 -6113825 -6039352 4755847 13091743 11619264 5527023
36623 5527023 1580066 407998 28818 -369652 -1365532 -3257289 -4579311 -3822637 -1932469
36614 -1932469 -404740 1509426 4904584 8358676 9642544 8495103 5859022 2964677
36606 2964677 2391606 5841028 9403740 7024316 1187400 2291938 12408757 18477689
36598 18477689 10183078 -3192177 -5212736 3969274 9618816 5194139 -1355083 -4038557
36590 -4038557 -6764151 -11687494 -13439138 -10412940 -9468294 -12794761 -11763624 -1826421
36582 -1826421 7578973 7580341 3830072 4330012 2955089 -10130094 -28171897 -34439476
36574 -34439476 -26589547 -18542316 -18260853 -19407810 -17191978 -16579431 -19213382 -16497261
36566 -16497261 -3880811 9425527 13451079 10109455 4687426 -4335783 -16357554 -20115070
36558 -20115070 -8337101 6438027 6582698 -4269724 -6268733 6500072 18394343
36551 18394343 17369992 10617551 8297398 7007840 131335 -7060474 -5434958 2216395
36543 2216395 5762569 3459393 1491424 902056 -3157938 -9723303 -10756234 -3560155
36535 -3560155 4635277 7392804 6906163 7824853 9583959 8857712 5034647 -421900 -6575664
36526 -6575664 -11780221 -12601244 -6943666 3167278 13244986 19130537 18167379 11005748
36518 11005748 3281875 2099284 8839481 17477865 21079029 18101502 12221152 8547974
36510 8547974 9953797 14130549 14602759 8101654 10135 -2207853 106242 -836494
36502 -836494 -6026263 -7292675 -733792 6542046 8498873 10542641 19458183 29424142
36494 29424142 28869238 18469186 11037036 12663299 14302745 6365197 -6154417 -9845052
36486 -9845052 -529830 11887631 16304281 13293304 12395610 18572619 25433185 23696901
36478 23696901 13508458 4287221 3182323 8299971 13681350 15634211 12391543 3246583
36470 3246583 -8282325 -14998393 -13735070 -8739333 -4377230 73176 4311551 2799157
36462 2799157 -6128094 -13115091 -9316719 -773949 -475154 -8684150 -13347578 -10017934
36454 -10017934 -8445097 -15811067 -24952759 -25574284 -18521111 -11949463 -9710598 -10377546
36446 -10377546 -13000084 -17033524 -19350314 -17025993 -11864937 -8622195 -9928287 -14515317
36438 -14515317 -17938151 -14365081 -2070129 11305580 14013290 3285465 -11163211
36431 -11163211 -18554348 -16883049 -9890725 -1300656 4529993 3421685 -2142770 -3609969
36423 -3609969 1468952 4526796 -689515 -6998663 -4311780 4469053 7758925 1912870
36415 1912870 -5858214 -8711927 -5312837 3972975 16346395 23310040 18322599 8099745
36407 8099745 6616345 16553520 26014232 25594116 19183080 14561092 12655983 11220330
36399 11220330 10976832 11745200 8999351 1139593 -4851614 -1964992 6368808 11049879
36391 11049879 9566982 6743100 5539762 4518710 3731899 5520094 8075772 5149904
36383 5149904 -4291981 -11177698 -5911308 9527293 23334888 26861904 22352229 17912639
36375 17912639 17948289 19430038 15653173 3243096 -12844804 -21741818 -17206893 -5930319
36367 -5930319 -1103897 -6523072 -12514894 -10653395 -5840172 -7239791 -13068263 -14231602
36359 -14231602 -9724291 -6735029 -6379181 -2524088 3335341 516475 -11887270 -18670238
36351 -18670238 -10266621 2168460 5272513 4839119 12887456 22981184 18125424 -624217
36343 -624217 -13173829 -8692121 2562790 8068198 7216300 2961798 -4501782 -9965027
36335 -9965027 -4365348 8925285 13283438 2962957 -5780243 1582284 15704219 18173988
36327 18173988 8342606 534346 1187023 3788262 3395344 2612801 3627677 4972953
36319 4972953 6071661 6634920 2898487 -7577442 -19282724 -24713167 -24452629 -23467496
36311 -23467496 -21036915 -14177755 -7997348 -10793655 -19363417 -21025909 -11988354 -2904345
36303 -2904345 -2996418 -8171713 -9155316 -3571841 4655609 11726750 15489027 15257977 13341345
36294 13341345 12900286 12765171 8921871 1937322 -2824319 -3552448 -4153430 -6186177 -5452286
36285 -5452286 133757 5416237 4840103 -328399 -5207505 -7284543 -5862056 -146749
36277 -146749 8033517 13196447 11760628 6066983 350633 -4044015 -7132669 -7983668
36269 -7983668 -7025656 -7079884 -8926084 -9158472 -5511068 -930424 865834 495772 128639
36260 128639 -902630 -3358105 -3640497 2908584 14949848 25019853 26482417 18868766
36252 18868766 7367629 -1468644 -4861904 -5733139 -7944612 -9877731 -6381411 2568159
36244 2568159 10330019 12561221 12198665 12536635 11329633 6558717 2588548 4228530
36236 4228530 8774522 10788578 11397735 15133816 19825059 18342558 10353634 4180100
36228 4180100 5398606 10414024 13192540 12115143 8214896 2975364 389315 4654697
36220 4654697 12270083 12909285 3063491 -7237012 -7692205 -2391634 -2856692 -9936770
36212 -9936770 -12839229 -6063394 2981680 6281336 5890383 6778409 6972253 3224260 1190758
36203 1190758 9344032 23831135 29837975 20644065 6758777 1557570 4929860 7579701
36195 7579701 6232946 6094572 9888098 12820446 10423319 5627183 4562492 8095038
36187 8095038 10534801 6190756 -4148737 -13522310 -15861524 -12465798 -9652934 -9908630
36179 -9908630 -9040514 -3974965 1164786 1128985 -1897957 -1555906 3155715 7755535 10079630
36170 10079630 11553846 11809807 9512506 8134302 12369401 18062107 15415996 4923313
36162 4923313 -446629 5520896 11244673 4495879 -7908775 -9614688 812012 8275549
36154 8275549 3690808 -4337544 -3874564 4311753 11076246 12520354 12188516 12727010 11896331
36145 11896331 7250485 868532 -2274319 303743 5650736 8197587 5718320 1676455
36137 1676455 667917 2426651 2109243 -3635072 -12366910 -17733985 -14918897 -4859888
36129 -4859888 6022866 11192215 10107246 7898730 8171194 8394357 4464085 -2577472
36121 -2577472 -7822117 -8998819 -7689730 -4891047 -362345 2902727 -721318 -10865477
36113 -10865477 -17576511 -12224132 -199278 4165943 -3555367 -11278815 -7141401 3409902
36105 3409902 5536679 -3290542 -10421535 -7731612 -2370438 -2575178 -4196135 -1078472
36097 -1078472 745687 -6866469 -15933908 -10892225 5945400 14872872 7628933 -1413880
36089 -1413880 415198 5246976 1567406 -4233394 1010600 13447683 16566088 5941464
36081 5941464 -5502683 -6748653 -615828 4623571 4933316 143382 -7113811 -10329125
36073 -10329125 -4705718 4714065 7555107 1987274 -2644182 1393009 10790980 16354942
36065 16354942 13039075 3825412 -3021747 -1117036 6616268 10070447 4836842 -1613344
36057 -1613344 -1521917 1763033 1684966 815567 4175975 6034232 -2569244 -16358794 -21281343
36048 -21281343 -16391374 -13947291 -16673148 -12816752 1347627 11724267 7784897 -1289987
36040 -1289987 -2206299 3633066 8080200 11309917 16253425 17596578 10053096 721939
36032 721939 -130122 4481951 3754754 -2977884 -6604349 -4245617 -2500665 -4860180 -6786470
36023 -6786470 -4646181 -819441 1683515 2982590 3691043 3706513 3625976 3360818 1024109
36014 1024109 -3132222 -5320865 -5130929 -8350480 -16583076 -20469814 -12435413 -697409
36006 -697409 744682 -7603944 -12956242 -10874146 -10063604 -15562982 -20535650 -18847343
35998 -18847343 -14443499 -12711903 -11704407 -7726995 -2161691 2677221 7881492 13146369
35990 13146369 14043761 9452634 5844807 8310708 12315541 10568275 4025023 -474619
35982 -474619 -698459 -472384 -1883671 -2343705 -30926 2761931 3582373 3763519 5878273
35973 5878273 8880815 8761552 4607619 1404693 3896978 8661480 6804542 -3949651
35965 -3949651 -14366477 -14352783 -4958573 4420486 7551873 5030078 -456480 -5906576
35957 -5906576 -6640308 -162473 8575063 11707196 8115402 2944470 -1279241 -5612199
35949 -5612199 -7429084 -1749854 7895458 9316371 -2491639 -16447439 -18239971 -7131898
35941 -7131898 5327082 9232300 4066623 -3928619 -7426636 -3737545 1560512 -288625
35933 -288625 -9611507 -16052148 -11673495 -1484407 4441183 4971514 6919708 12535646
35925 12535646 16026055 13030327 6738882 2176861 -702129 -4904213 -10147880 -12064982
35917 -12064982 -7159280 3167514 13461474 18276757 15799879 8735864 2243398 95777
35909 95777 1463706 1798204 -1334955 -3761187 653696 10299571 15519275 10774423 2334925
35900 2334925 -642421 1905796 4002182 4303803 5447201 5747992 1545727 -3151343
35892 -3151343 -173795 8621099 11644973 4793094 -2636622 -3470116 -2751972 -5779667
35884 -5779667 -7046936 -561038 7710799 8801360 5777062 8255926 16111567 20269248
35876 20269248 17674008 14397063 14148549 13859368 11842839 11426798 14123772 16234327
35868 16234327 14701603 10866390 6538369 1131330 -5521914 -11217044 -13493044 -11297066
35860 -11297066 -5066607 2246630 5954108 4654013 2158505 1040376 -1876638 -8620910
35852 -8620910 -13339806 -10013072 -3394532 -3215846 -9448539 -13200982 -11835234 -12539162
35844 -12539162 -18890705 -24030451 -21565121 -15161436 -11986952 -12421290 -11295546 -5514618
35836 -5514618 3155239 10070490 10950766 6436985 3324992 6537675 10856004 7565597
35828 7565597 -1283075 -4564073 507919 3115533 -4597112 -15447217 -18302504 -13113962
35820 -13113962 -7113375 -2505141 3481670 10564608 15551607 18015087 19324887 18208829
35812 18208829 12578775 3426175 -7034438 -17187295 -22304038 -15541759 911051 12242113
35804 12242113 7620263 -4436886 -7363292 484229 5743941 1412629 -4429954 -3423132
35796 -3423132 971663 1191852 -3137011 -7531906 -10485170 -13520213 -17128071 -20820161
35788 -20820161 -24620098 -27785799 -28439053 -26043064 -21807483 -16390492 -10576151 -7558930
35780 -7558930 -9340510 -11098439 -5889665 4063299 8603558 4898461 3001696 10639132
35772 10639132 19955811 17650566 3615008 -9521023 -13327236 -11130495 -8342808 -3795977
35764 -3795977 5481014 16335593 21687614 19256429 14152191 11948081 11574659 7645445
35756 7645445 -534478 -6221910 -4422488 -487361 -3669233 -13316658 -18986141 -15557990
35748 -15557990 -10026578 -9419752 -10279003 -7029981 -3742061 -7787183 -15685598 -15782009 -4358083
35739 -4358083 9924888 17877164 17901456 12121084 3302617 -2856155 -1190853 4444212
35731 4444212 4365228 -2305366 -5090404 1442889 8249698 5730805 -1496388 -3135300
35723 -3135300 34636 -952680 -7376423 -11562299 -10567847 -9728398 -10893931 -7795849 2365432
35714 2365432 11243379 9716636 681394 -4935282 -2212385 3217319 3575877 -2531920
35706 -2531920 -10183237 -13704531 -11362367 -6195213 -3346256 -6366753 -15022902 -25023582
35698 -25023582 -29574211 -23787430 -9964351 2977188 7951476 6611584 5658188 8071127
35690 8071127 11129496 11461532 8272446 2753736 -2082596 -2669687 -38887 -1183381
35682 -1183381 -9738260 -17943367 -15358639 -3864085 4836051 5775745 4312319 2876478
35674 2876478 -2762369 -10166814 -7321489 8469861 21283869 17770678 7125478 5763305
35666 5763305 10738063 6185063 -8173711 -14995171 -7388941 152807 -4066739 -10136503
35658 -10136503 -3241087 12407877 19816611 13313486 3693428 1189792 4075614 5342455
35650 5342455 2701836 -993836 -2696396 -1776047 330033 1608819 1152314 -657756
35642 -657756 -3620383 -7850958 -11935826 -13032787 -9985959 -4683198 399322 4020057
35634 4020057 5161101 3034551 -862861 -3409903 -3692152 -3561766 -3630029 -2034389 1531951
35625 1531951 4048517 3276353 646772 -1586450 -3083147 -3894958 -3521368 -2948910 -4106043
35616 -4106043 -5854897 -4498293 60331 2985928 1313157 -2331757 -4638023 -5194076
35608 -5194076 -3465433 1162656 3503469 -4977329 -21998454 -30496949 -17382123 8855370
35600 8855370 27788573 30153388 22735934 14420648 8086241 4954686 6425517 10147530
35592 10147530 11761536 11074976 10366175 8365211 3517111 499130 3652789 6418951
35584 6418951 -227483 -9810181 -6035096 11061926 21089388 12229352 -1707480 -4015227
35576 -4015227 -419685 -6170482 -18279784 -19455050 -5602395 8754176 13064102 12682080
35568 12682080 14598202 15179117 8742819 -1732016 -9489790 -12590281 -11958367 -7253176
35560 -7253176 -421039 2333466 -1499778 -5069004 -796818 8417703 12976508 9631556
35552 9631556 4424914 3081012 4488567 5004016 4306583 4231868 4753200 4211355 2339315
35543 2339315 340410 -1885563 -5803395 -10115231 -9082183 1195998 15063304 20722379
35535 20722379 14065418 5126621 6184361 16240727 23377701 21195324 15363883 12495913
35527 12495913 10237338 3055865 -7497853 -14109294 -12655198 -5445472 2174819 4810335
35519 4810335 -292073 -9068475 -12236721 -6414841 -702912 -5391722 -16162989 -18025967
35511 -18025967 -5369450 10594916 16994769 13715982 8151253 3113658 -2662404 -6728660
35503 -6728660 -4263406 3620056 9612380 9031863 4463874 1256430 2155564 6586146
35495 6586146 11893772 15171153 16461232 19112923 23804199 24341857 14862974 400414
35487 400414 -6397180 -564635 9067852 11467058 5678502 -1576350 -5284773 -4723623
35479 -4723623 -961760 2998116 2453295 -3609428 -9468801 -9555655 -6070533 -4737159 -5366282
35470 -5366282 -3059552 2272985 4765751 1961520 -1057594 837466 6257969 10560695
35462 10560695 11290225 8251570 2563298 -2093842 -1818781 1368821 575255 -5733939
35454 -5733939 -10114226 -7267203 -2907601 -4546495 -8189210 -3788567 7658020 12829904
35446 12829904 4092185 -9754885 -14825647 -7837879 3909304 12601346 14566347 9195597
35438 9195597 -474038 -8018811 -9673794 -9014000 -11598343 -16852986 -19930904 -19672402
35430 -19672402 -18699011 -16331936 -8406663 4197579 13024243 11448142 2448221 -6200805
35422 -6200805 -10982546 -13654691 -16288141 -18838434 -19681473 -16100817 -6908443 3025884
35414 3025884 4843197 -3482255 -11885160 -9329160 2141590 10487421 9235969 3307338
35406 3307338 -107050 861080 5243316 11939208 17256155 16081002 8844060 1975249
35398 1975249 -1381275 -4993249 -10472092 -11869922 -5336805 2142245 1543822 -4991075
35390 -4991075 -8051153 -5062482 -1836098 -1637225 -1590772 -165846 -264947 -3664469 -8728237
35381 -8728237 -13850265 -16836691 -12077180 3016063 19050016 22540636 14398017 9264869
35373 9264869 12924917 13125991 346718 -14597091 -15783845 -6330724 -2801418 -9707875
35365 -9707875 -14534013 -8396333 1902532 6295700 5318087 5800623 9897296 14433400
35357 14433400 17076820 18159697 18271455 17276238 15037586 11928175 8906996 6075549
35349 6075549 446357 -11342707 -25297102 -30029204 -20450915 -7135689 -3704562 -8275835
35341 -8275835 -8049850 -430524 3760555 -348986 -3742275 -756769 -153679 -8829122
35333 -8829122 -16354937 -9611325 5020360 9611329 1129140 -5784352 -2431969 3061917
35325 3061917 2630607 2027001 9052874 17788996 15723376 2569868 -8300434 -7574535
35317 -7574535 -1356588 -1485769 -9033749 -12883956 -5037879 7448463 10507010 1493636
35309 1493636 -7241339 -5404186 2018857 4676032 3462896 7003768 14595905 15095995
35301 15095995 4547588 -6516350 -8077770 -3180125 755426 4216189 10640306 16114929
35293 16114929 14376885 8302244 6264910 8860762 9092834 5430492 4701328 10038184
35285 10038184 14974375 13373728 7958212 4313425 2304700 -1249006 -5692267 -7747649
35277 -7747649 -6831348 -4515552 -1055690 3148410 4985941 2626502 509779 4516439
35269 4516439 12102637 13206198 3231815 -9612181 -13706260 -7821176 -1071632 -254718
35261 -254718 -2429477 -1787765 648523 -885976 -6564015 -8826832 -2955245 5058160
35253 5058160 6038601 234416 -3752847 -1953303 60486 -2640820 -5703527 -1823294
35245 -1823294 8363451 17078475 18922900 14866224 8487724 3320924 3097933 9246019
35237 9246019 17225870 19397055 12871647 2115736 -6199626 -8224104 -3702925 4270116
35229 4270116 10302509 11282173 9816866 9523831 8343585 2319126 -4789610 -3673191
35221 -3673191 6882036 16436579 16640639 11090794 6714958 3035411 -2982627 -8166320
35213 -8166320 -8267960 -7092000 -10679516 -15541428 -13116331 -4372494 993638 132389
35205 132389 633719 6399457 10977104 9468349 7127904 9707533 13328174 11236813
35197 11236813 4380403 -1970419 -6790119 -11045205 -11514359 -5156131 3163036 5324380
35189 5324380 1071979 -2382875 -907548 2760578 5089567 5548732 4504743 2659438
35181 2659438 2321816 4464134 5454058 1794950 -3186786 -3086141 2483041 8794268 14333325
35172 14333325 20283544 22625564 14833498 520409 -6654145 -570522 8231473 7007686
35164 7007686 -2991033 -12041852 -17208984 -22474473 -26985219 -23722750 -11203181 1152114
35156 1152114 2599691 -7714913 -20721385 -25714752 -18172990 -2684912 10541138 14124012
35148 14124012 9289092 2282541 -3514670 -8785767 -12513567 -10101430 191108 12034234
35140 12034234 16233856 11100925 4703285 5193576 10541876 10838271 1239390 -10780227
35132 -10780227 -14138512 -7918258 -1645614 -2057240 -5317161 -4755217 -1020876 399826
35124 399826 -1434747 -2114589 138285 1418666 -1234082 -4458123 -3050771 2246761
35116 2246761 4980536 1146137 -5618346 -8675315 -6569549 -3709589 -3202755 -2947507
35108 -2947507 -585000 1837510 1996636 2397469 5650796 7591538 2900485 -3818277
35100 -3818277 -2380236 6307603 8783800 -1212500 -12161939 -11656111 -4456123 -3096202
35092 -3096202 -7661547 -7732731 -397711 7248018 12170375 18005978 22314080 15396259
35084 15396259 -3057323 -18309771 -18989580 -11599188 -8547382 -10047956 -7827459 -1032519
35076 -1032519 2593485 -663287 -6214073 -9361564 -9924481 -8207723 -3522282 1734884
35068 1734884 2668501 -1131514 -4139509 -2870821 -778990 -1994158 -4175930 -2339928
35060 -2339928 2266952 2674221 -3616748 -9595979 -7143609 1947113 7510981 3341102
35052 3341102 -6133265 -12806929 -14380466 -13602046 -11489615 -6795714 -1205720 889409
35044 889409 -734335 -264788 6497727 15872059 20253029 15920964 4915764 -7951902
35036 -7951902 -17078808 -17641355 -9471638 809556 4719987 24679 -7303243 -9498728
35028 -9498728 -4506361 2912223 6527116 4262249 -1512364 -7873660 -13161277 -14805931
35020 -14805931 -9221614 3004229 14479447 17973399 14732141 11459186 10301326 7362023
35012 7362023 634810 -7316835 -15644288 -26870760 -39154850 -43869604 -36269021 -23468305
35004 -23468305 -15678876 -13036291 -7623175 3443728 13703058 16358283 12156877 6595107
34996 6595107 2828352 -255281 -4042871 -6180857 -2166168 7978188 16532568 15584314
34988 15584314 7687100 4116715 10815033 21009053 24708905 20707138 14921826 11031133
34980 11031133 8318678 6360943 6150687 7034578 6658295 3959303 -147406 -4035619
34972 -4035619 -5552596 -3196427 658478 396437 -6231777 -14517056 -18122726 -15305196
34964 -15305196 -8154329 212329 5381090 3661687 -2203720 -4491215 -1370113 -449563
34956 -449563 -6998747 -15408991 -18322940 -17082430 -15616860 -11559221 -3309378 1154229
34948 1154229 -4983152 -12917268 -8522480 5610657 12862459 6438404 -4025111 -10100500
34940 -10100500 -13382653 -14150697 -7298087 4529095 8412133 -70120 -8159954 -4986038
34932 -4986038 2265873 1608937 -4559894 -5686844 -895686 2238831 2234476 4827601 11322011
34923 11322011 16118148 15844950 13287214 12178751 13684328 17258449 20627868 20710117
34915 20710117 17943395 16304790 15930919 11493551 2626924 -1296245 5409827 12943843
34907 12943843 7885164 -7009692 -15727638 -10279116 1160434 7613176 7441617 5292523
34899 5292523 4515088 5317433 5418332 1016758 -8921888 -19146872 -22659243 -18204913
34891 -18204913 -10032313 -2451694 1464150 -553065 -5987834 -6735520 973078 9401091
34883 9401091 9719781 5632107 6893693 12503837 12387204 4867649 -720475 -655623 -2798582
34874 -2798582 -11309928 -17681741 -14381305 -7590006 -7694731 -14281240 -19173178 -19096824 -17027869
34865 -17027869 -14486144 -10049353 -3756694 2542927 7659588 10323860 9062564 6157007
34857 6157007 7365527 13503637 17136240 12888401 6122545 4729579 6588084 3350771
34849 3350771 -5690928 -12072420 -10275565 -3996652 421253 428720 -3904226 -11425687 -18131693
34840 -18131693 -18569613 -11462567 -1172403 7096836 10461036 7333875 -1575991 -10359287
34832 -10359287 -11503424 -4900506 1249856 1237617 -1137619 -124642 2220788 276551
34824 276551 -3718005 -712994 11056746 20167818 15289270 397348 -9544737 -6992711
34816 -6992711 630522 3302060 1755099 3268968 8396912 9878357 4835530 256455
34808 256455 2628826 7944694 7947340 3103863 2424874 10644611 21986168 28592231 29804769
34799 29804769 29421584 27684169 21384732 10828885 1406341 -3142328 -5178163 -8464925
34791 -8464925 -11875902 -11408211 -7232679 -4495897 -6266705 -9315634 -9068898 -5905594
34783 -5905594 -3331372 -1786050 1582975 7282524 11812364 12706024 11481954 9622020
34775 9622020 5225995 -2900819 -10476182 -11820077 -8057078 -6377710 -9975340 -13109944
34767 -13109944 -8895532 1470718 11179905 17028395 20665807 21044422 12466964 -6001172
34759 -6001172 -23817651 -27895331 -17422369 -4568709 54576 -2304309 -4495140 -4649363
34751 -4649363 -6740252 -12084850 -15477403 -11231401 -663505 8369118 9358858 3855055
$$ [...]
##END NTUPLES=NMR SPECTRUM
##END=
