##TITLE=31Pdec_SR159_k TFA
 DMSO-d6, 64 sc
 27.1.2023
##JCAMPDX= 6.0         $$ Bruker NMR JCAMP-DX V2.0
##DATA TYPE= NMR SPECTRUM
##DATA CLASS= NTUPLES
##ORIGIN= UXNMR, Bruker Analytische Messtechnik GmbH
##OWNER= root
$$ XWIN-NMR		Version 3.5
$$ Fri Jan 27 15:58:16 2023 Russian Standard Time (UT+4h)  she@DPX200
##.OBSERVE FREQUENCY= 81.013821
##.OBSERVE NUCLEUS= ^31P
##.ACQUISITION MODE= SIMULTANEOUS
##.ACQUISITION SCHEME= undefined
##.AVERAGES= 64
##.DIGITISER RES= 16
##SPECTROMETER/DATA SYSTEM= spect
##.PULSE SEQUENCE= zgpg30
##.SOLVENT NAME= CDCl3
##.SHIFT REFERENCE= (INTERNAL, CDCl3, 0, 248.564)
##AUDIT TRAIL= $$ (NUMBER, WHEN, WHO, WHERE, WHAT)
$$ ##TITLE= Audit trail, XWIN-NMR		Version 3.5
$$ ##JCAMPDX= 5.01
$$ ##ORIGIN= Bruker BioSpin GmbH
$$ ##OWNER= she
$$ F:/spectra/data/she/nmr/P31/1/pdata/1/auditp.txt
$$ ##AUDIT TRAIL=  $$ (NUMBER, WHEN, WHO, WHERE, WHAT)
(   1,<2023-01-27 15:57:24.10 +0400>,<she>,<DPX200>,
      <continue with go, POWCHK disabled, PULCHK disabled
       configuration hash MD5:
       00 E9 B6 7A A2 85 ED C7 34 08 36 98 17 FE 4E 26
       data hash MD5: 32K
       1B 61 5C 52 06 98 D7 70 0E 6F 07 C9 B7 59 BF 9B>)
(   2,<2023-01-27 15:57:26.15 +0400>,<she>,<DPX200>,
      <Start of raw data processing
       efp BC_mod = 2 LB = 1 FT_mod = 6 PKNL = 1 PHC0 = -11131.74 PHC1 = 455.8113 SI = 64K 
       data hash MD5: 64K
       6A C9 D2 D8 DF A5 94 D9 CE 10 6A 89 51 73 C1 F4>)
(   3,<2023-01-27 15:57:39.70 +0400>,<she>,<DPX200>,
      <pk PHC0 = 7.00341 PHC1 = 0 
       data hash MD5: 64K
       1C 50 5A 93 43 5B 94 0D 8C 82 43 AC 77 57 F4 FA>)
(   4,<2023-01-27 15:57:42.89 +0400>,<she>,<DPX200>,
      <abs ABSG = 5 
       data hash MD5: 64K
       0B 05 88 98 8E 07 22 7D 09 BA 20 25 AE FF DC 36>)
$$ ##END=
$$ 
$$ hash MD5
$$ 7A 8F 61 40 E5 C1 EE 54 B4 65 82 A1 D6 76 94 A1
##$RELAX= 
##$RELAX= 
##$RELAX= 
##$RELAX= 
##$RELAX= 
##$RELAX= 
##$RELAX= 
##$RELAX= 
##$RELAX= 
$$ Bruker specific parameters
$$ --------------------------
##$DU= <F:/spectra>
##$EXPNO= 1
##$NAME= <P31>
##$PROCNO= 1
##$TYPE= <nmr>
##$USER= <she>
##$AMP= (0..31)
100 100 100 100 100 100 100 100 100 100 100 100 100 100 100 100 100 100 
100 100 100 100 100 100 100 100 100 100 100 100 100 100 
##$AQSEQ= 0
##$AQ_mod= 1
##$AUNM= <au_zg>
##$AUTOPOS= <>
##$BF1= 81.014009
##$BF2= 200.13
##$BF3= 200.13
##$BF4= 200.13
##$BF5= 200.13
##$BF6= 200.13
##$BF7= 200.13
##$BF8= 200.13
##$BYTORDA= 1
##$CFDGTYP= 0
##$CFRGTYP= 5
##$CHEMSTR= <none>
##$CNST= (0..31)
1 1 145 1 1 1 1 1 1 1 1 1 1 1 1 1 1 1 1 1 1 1 1 1 1 1 1 1 1 1 1 1 
##$CPDPRG= <waltz16>
##$CPDPRG1= <>
##$CPDPRG2= <waltz16>
##$CPDPRG3= <>
##$CPDPRG4= <mlev>
##$CPDPRG5= <mlev>
##$CPDPRG6= <mlev>
##$CPDPRG7= <mlev>
##$CPDPRG8= <mlev>
##$CPDPRGB= <>
##$CPDPRGT= <>
##$D= (0..31)
0 1 0 0 0 0 0 0 0 0 0 0.03 2e-05 3e-06 0 0 0 0 0 0 0 0 0 0 0 0 0 0 0 0 
0 0 
##$DATE= 1674820565
##$DBL= (0..7)
120 120 120 11 120 120 24 19 
##$DBP= (0..7)
150 150 150 150 150 150 150 150 
##$DBP07= 0
##$DBPNAM0= <>
##$DBPNAM1= <>
$$ [...]
##$SUBNAM3= <"">
##$SUBNAM4= <"">
##$SUBNAM5= <"">
##$SUBNAM6= <"">
##$SUBNAM7= <"">
##$SUBNAM8= <"">
##$SUBNAM9= <"">
##$SW= 501.771253377433
##$SWIBOX= (0..15)
0 1 3 0 0 0 0 0 0 0 0 0 0 0 0 0 
##$SW_h= 40650.406504065
##$TD= 32768
##$TD0= 1
##$TE= 0
##$TE2= 300
##$TE3= 300
##$TEG= 300
##$TL= (0..7)
0 120 53 12 22 120 120 120 
##$TP= (0..7)
150 150 150 150 150 150 150 150 
##$TP07= 0
##$TPNAME0= <>
##$TPNAME1= <>
##$TPNAME2= <>
##$TPNAME3= <>
##$TPNAME4= <>
##$TPNAME5= <>
##$TPNAME6= <>
##$TPNAME7= <>
##$TPOAL= (0..7)
0.5 0.5 0.5 0.5 0.5 0.5 0.5 0.5 
##$TPOFFS= (0..7)
0 0 0 0 0 0 0 0 
##$TUNHIN= 0
##$TUNHOUT= 0
##$TUNXOUT= 0
##$USERA1= <user>
##$USERA2= <user>
##$USERA3= <user>
##$USERA4= <user>
##$USERA5= <user>
##$V9= 5
##$VALIST= <valist>
##$VCLIST= <CCCCCCCCCCCCCCC>
##$VD= 0
##$VDLIST= <DDDDDDDDDDDDDDD>
##$VPLIST= <PPPPPPPPPPPPPPP>
##$VTLIST= <TTTTTTTTTTTTTTT>
##$WBST= 1024
##$WBSW= 4
##$XGAIN= (0..3)
0 0 0 0 
##$XL= 0
##$YL= 0
##$YMAX_a= 3168
##$YMIN_a= -2748
##$ZGOPTNS= <>
##$ZL1= 120
##$ZL2= 120
##$ZL3= 120
##$ZL4= 120
##$ABSF1= 248.5645
##$ABSF2= -253.2056
##$ABSG= 5
##$ABSL= 3
##$ALPHA= 0
##$AQORDER= 0
##$ASSFAC= 0
##$ASSFACI= 0
##$ASSFACX= 0
##$ASSWID= 0
##$AUNMP= <proc_1d>
##$AZFE= 0.1
##$AZFW= 0.5
##$BCFW= 0
##$BC_mod= 2
##$BYTORDP= 0
##$COROFFS= 0
##$CY= -3
##$DATMOD= 1
##$DC= 0
##$DFILT= <>
##$DTYPP= 0
##$F1P= 0
##$F2P= 0
##$FCOR= 1
##$FTSIZE= 65536
##$FT_mod= 6
##$GAMMA= 0
##$GB= 0
##$INTBC= 1
##$INTSCL= 6.047779e-11
##$ISEN= 30
##$LB= 1
##$LEV0= 0
##$LPBIN= 0
##$MAXI= 10000
##$MC2= 0
##$MEAN= 0
##$ME_mod= 0
##$MI= 50
##$NCOEF= 0
##$NC_proc= -9
##$NLEV= 6
##$NOISF1= 182.463
##$NOISF2= 159.3651
##$NSP= 0
##$NTH_PI= 0
##$NZP= 0
##$OFFSET= 248.5645
##$PC= 4
##$PHC0= -11124.74
##$PHC1= 455.8113
##$PH_mod= 1
##$PKNL= yes
##$PPARMOD= 0
##$PSCAL= 0
##$PSIGN= 0
##$REVERSE= no
##$SF= 81.0140089999694
##$SI= 65536
##$SIGF1= 159.3651
##$SIGF2= -187.1042
##$SINO= 113.3802
##$SIOLD= 16384
##$SREGLST= <1H.CDCl3>
##$SSB= 0
##$STSI= 65536
##$STSR= 0
##$SW_p= 40650.406504065
##$SYMM= 0
##$S_DEV= 0
##$TDeff= 32768
##$TDoff= 0
##$TI= <>
##$TILT= no
##$TM1= 0
##$TM2= 0
##$TOPLEV= 0
##$USERP1= <user>
##$USERP2= <user>
##$USERP3= <user>
##$USERP4= <user>
##$USERP5= <user>
##$WDW= 1
##$XDIM= 65536
##$YMAX_p= 264266240
##$YMIN_p= -339486017
$$ End of Bruker specific parameters
$$ ---------------------------------
##NTUPLES= NMR SPECTRUM
##VAR_NAME=  FREQUENCY,     SPECTRUM/REAL,   SPECTRUM/IMAG
##SYMBOL=    X,             R,               I
##VAR_TYPE=  INDEPENDENT,   DEPENDENT,       DEPENDENT
##VAR_FORM=  AFFN,          ASDF,            ASDF
##VAR_DIM=   65536,         65536,           65536
##UNITS=     HZ,            ARBITRARY UNITS, ARBITRARY UNITS
##FACTOR=    0.620285442955139, 1,           1
##FIRST=     20137.2065510682, 0,            0
##LAST=      -20513.1999529968, 0,           0
##MIN=       -20513.1999529968, -339486017,  0
##MAX=       20137.2065510682, 264266240,    0
$$ Real data points
##PAGE= N=1
##DATA TABLE= (X++(R..R)), XYDATA
$$ [...]
##PAGE= N=2
##DATA TABLE= (X++(I..I)), XYDATA
12244A2657783P47099k765438n0143k60031j0007827j3232947J663171J4035185
12236B786852K484334j5015476r077493J0248301J1606483k410101k935231J0871217
12228H558886J2033076k689812q097884J089151K723681p493437q322398K467743
12220B69006J126039j4657718j6852952J392846J0980322k27340n979218O696254
12212a7252761J1437736n882403j5782123K192158J8819407N552842j3643429
12205a4558573m453958J7390152J5804748k267502l599202J0471499J0860572
12198B9647736l665143p240053K780997L307667q091920q800298M280059P540184
12190A9759229n859234j3784220m989310L986910J945199N69163P230022J0083905
$$ plain form
12244 12657783 13404882 10639444 10589301 10329270 321443 -12911504 -11248333 2786852
12236 2786852 5271186 -9744290 -18821783 -8573482 3033001 622900 -2312331 8558886
12228 8558886 20591962 17902150 9804266 10893417 13617098 6123661 -2198737 269006
12220 269006 1395045 -13262673 -30115625 -28722779 -17742457 -17969797 -23949015 -17252761
12212 -17252761 -5815025 -11697428 -27479551 -25287393 -6467986 -915144 -14558573
12205 -14558573 -19012531 -1622379 14182369 11914867 8315665 18787164 29647736
12198 29647736 25982593 18742540 21523537 24831204 16739284 7938986 12219045 19759229
12190 19759229 13899995 115775 -4873535 -886625 1058574 1627737 8857759 18941664
12182A8941664L176614p52479L890627K115877j4175649k7432321j9473917K136084
12174c1573500J7256902J8239215R942812j587414r561186p548710R64012M709037
12166H41168J437574K53629M095554N282973K220990L282933Q892576P648911
12158C3956308l147376j0765747p948242l233271l560051m370398l577269o215541
12150h861587q658789J83055J4386198J2621745n250255j1137483N976282J7292430
12142A6551596j23638k3147132j8988753J481846L929460j1676460j4320112L423757
12134d2869436J4732955N229057o455528l824433L272078K371693J99931N902835
12126b1440848J3124790J3299322J0172421Q320007K580530q537032j3472004
$$ plain form
12182 18941664 22118278 21365799 25256426 27372303 13196654 -14235667 -33709584 -31573500
12174 -31573500 -14316598 3922617 13865429 12278015 2716829 -4831881 -3867869 841168
12166 841168 2278742 2532371 6627925 11910898 14131888 17414821 26307397 33956308
12158 33956308 30808932 20043185 12094943 8861672 5301621 931223 -2646046 -8861587
12150 -8861587 -17520376 -17337321 -2951123 9670622 4420367 -6717116 -740834 16551596
12142 16551596 16427958 -6719174 -25707927 -24226081 -20296621 -31973081 -46293193 -42869436
12134 -42869436 -28136481 -22907424 -29362952 -33187385 -29915307 -27543614 -27343683 -21440848
12126 -21440848 -8316058 4983264 15155685 23475692 26056222 17519190 4047186
12119D047186n310083L581015j027657j2947667j4955567l362873R974888J5103944
12111d896814J1647646L004193o244234r529603m049502M203803P768572P120240
12103I024301O617220N354383k40906p765059j0577377o759918m15165M148081
12095f14440M673490N37221m707646m092874L659919R847607P041050O5997k136690
12086A4273634r65672m124305j0016066q427575K594090J2286456J2705184Q246977
12078B6572723N094748J057828p065477j3945641j2417031m979745N2922J209431
12070d420242M148110R983113J1657809M273130o929023j2422998q932058j163251
12062c805410M803735O820921N891238K735470k961125r671272j2439245p501389
$$ plain form
12119 4047186 -1262897 2318118 1290461 -11657206 -26612773 -29975646 -20000758 -4896814
12111 -4896814 6750832 9755025 3510791 -6018812 -10068314 -5864511 1904061 9024301
12103 9024301 15641521 20995904 20754998 12989939 2412562 -4347356 -4762521 -614440
12095 -614440 4059050 4596271 -111375 -4204249 -544330 9303277 16344327 16410324 14273634
12086 14273634 13307962 9183657 -832409 -9259984 -6665894 5620562 18325746 26572723
12078 26572723 31667471 32725299 25659822 11714181 -702850 -5682595 -5629673 -4420242
12070 -4420242 -272132 9710981 21368790 25641920 18712897 6289899 -2642159 -3805410
12062 -3805410 998325 7819246 13710484 16445954 13484829 3813557 -8625688 -16127077
12054a6127077J060766L556264l243593r915135n682077O281491J2216334O839740
12046e013287N00103L044673Q413733M066355q142810j1580992K542609K1083015
12038A4913399K3591655O483721j3991443k1397044j5413508p409740n265282
12031a8488242o833860o125931r00965O726214J3281432J5071897R330378j874740
12023A0186183j0421228r529550k351247J604397p48301k636602R89722N029320
12015g877306K516588m096582p101848n462137m501780n366238l281921L336647
12007c1834577R802020J2490191J2351706R809721L312331n081723r700158r156428
11999h006917p405926n037772K040660J1763377J2973117j48038j7402052k3043732
$$ plain form
12054 -16127077 -15066311 -11510047 -14753640 -24668775 -30350852 -24069361 -11853027 -5013287
12046 -5013287 -4513184 -1468511 6945222 11011577 2868767 -8712225 -6169616 14913399
12038 14913399 38505054 44988775 30997332 9600288 -5813220 -13222960 -18488242
12031 -18488242 -25322102 -31448033 -32348998 -25622784 -12341352 2730545 12060923 10186183
12023 10186183 -235045 -9764595 -12115842 -10511445 -11259746 -13896348 -12906626 -7877306
12015 -7877306 -5360718 -9457300 -16559148 -22021285 -26523065 -31889303 -35171224 -31834577
12007 -31834577 -22032557 -9542366 2809340 12619061 15931392 10849669 1149511 -8006917
11999 -8006917 -15412843 -20450615 -18409955 -6646578 6326539 6178501 -11223551 -34267283
11991c4267283j2666476M423623J4562220R237401o860571j5127190j412508K1606015
11983b0504769K5417556N691952p811385M998038K1476241J0468128j6849143
11976B2886618k2561855j245670J2560435l10711j6051139r166865Q573971J1060411
11968E745195k186123j1803781r862419l582679K840084J0501042J5378318J1788907
11960A8818544K716834m685172q499923q422176k457071L411586m111889k2313044
11952b5542311k5632703o54992K7271516K6429707N312577k276712R123741J1788701
11944B5819524n829289j9630932r999770Q174650J1215622l84868j1037554j3857943
11936a5530560r947045L69100J1065295R841735k214792n592713Q395784J9616374
$$ plain form
11991 -34267283 -46933759 -42510136 -27947916 -18710515 -25571086 -40698276 -42110784 -20504769
11983 -20504769 4912787 10604739 2793354 7791392 29267633 39735761 22886618
11976 22886618 324763 -920907 11639528 11328817 -4722322 -13889187 -5315216 5745195
11968 5745195 3559072 -8244709 -18107128 -21689807 -18849723 -8348681 7029637 18818544
11960 18818544 21535378 16850206 8350283 -71893 -2528964 882622 -3229267 -25542311
11952 -25542311 -51175014 -51830006 -24558490 1871217 7183794 4907082 14030823 25819524
11944 25819524 19990235 359303 -9640467 -1465817 9749805 9364937 -1672617 -15530560
11936 -15530560 -25477605 -25108505 -14043210 -4201475 -6416267 -12008980 -3613196 16003178
11928A6003178Q502921j1695293j4254484P57800J0091699M580320k405490k015622
11920I565029j132197l827165l466858R48939l56731r209315j2249623j449922
11912b1177843J2093098J4523548P749581J921431m82325k791261m470374l550062
11904C815793k647971l450997r61134P623454J4058009R605319j99906l442179
11896B4400388j723719p826419k1989778k5831583q129462J5144028J9512289
11889f444256M745385n791050J676458J3739943J1466828l040574j3286313j3412109
11881a0345688j1575766j1007139m429500Q739448J4935794N568273p657636q212594
11873b3984808K231827Q791945N889013R58815j561323n040295q579912m718892
$$ plain form
11928 16003178 24506099 12810806 -1443678 -685878 9405821 13986141 11580651 9565029
11920 9565029 8432832 4605667 1138809 2087748 1731017 -7478298 -19727921 -21177843
11912 -21177843 -9084745 5438803 13188384 15109815 14627490 11836229 7365855 3815793
11904 3815793 1167822 -2283175 -3244309 4379145 18437154 28042473 27842567 24400388
11896 24400388 22676669 14850250 -7139528 -32971111 -41100573 -25956545 -6444256
11889 -6444256 -1698871 -7489921 -5813463 7926480 19393308 16352734 3066421 -10345688
11881 -10345688 -21921454 -32928593 -37358093 -28618645 -13682851 -8114578 -15772214 -23984808
11873 -23984808 -21752981 -12961036 -7072023 -6113208 -7674531 -12714826 -21294738 -26013630
11865b6013630O278859J2387446O646349k402397m468630k105519k496138l158297
11857a5331957K344909R614784P474342l947450j1003811m826245P332931J2611492
11849D268995P416151j758239o639611l043846O253624J1485759M472260r402251
11841A3052842j4622204n820185L553526J100036m567368K317967J6263949J5347649
11833B6626212l756232j6722262p382961P096576M090573p654006l734223J2594480
11825A1158157J2948060r144414k4148255j0776375J1913042J5028086J844641
11818H822942l899602K381198M478585k742056n557470L213098J2205542R685420
11810B8587657k116614j4572452k0802029j4443016M706886K1486361J7960816
$$ plain form
11865 -26013630 -19734771 -7347325 -700976 -3103373 -7572003 -9677522 -12173660 -15331957
11857 -15331957 -12987048 -3372264 4102078 154628 -10849183 -15675428 -8342497 4268995
11849 4268995 11685146 9926907 3287296 243450 6497074 17982833 22455093 13052842
11841 13052842 -1569362 -7389547 -3836021 -2735985 -7303353 -4985386 11278563 26626212
11833 26626212 22869980 6147718 -1235243 5861333 9951906 2297900 -1436323 11158157
11825 11158157 24106217 14961803 -9186452 -19962827 -8049785 6978301 8822942
11818 8822942 4923340 7304538 11783123 9041067 3483597 6696695 18902237 28587657
11810 28587657 26471043 11898591 -8903438 -23346454 -18639568 2846793 20807609
11803B0807609r16622j0939364l053838M492287k821479j2168793n793386R010047
11795a383539J1720175M70468p686988l568614N140535R916945J0260701O169664
11787C1039347l905557j5230730j8198038j0127199K288219J2010334J5294124
11780A3170500R252360l800245j2329767p859868J258214J810046j694134N714634
11772E521740K0042837J8509159m271024k2440632j4398642O623942J4427678
11765B4015058O593927j008743m254813j1009033j7358115r209578J1078646K2344133
11757B1191482J4308728O83244l905082k683515m329631p572987p767774n537346
11749D387119k87312J1184972K1211257J2868356j2985772k9538905j9211592
$$ plain form
11803 20807609 19890987 8951623 5897785 10390072 7568593 -4600200 -10393586 -1383539
11795 -1383539 10336636 10807104 3120116 -448498 4692037 14608982 24869683 31039347
11787 31039347 27133790 11903060 -6294978 -16422177 -14133958 -2123624 13170500
11780 13170500 22422860 18622615 6292848 -1567020 -308806 1501240 -192894 5521740
11772 5521740 25564577 44073736 39802712 17362080 2963438 9587380 24015058
11765 24015058 30608985 29600242 25345429 14336396 -3021719 -12231297 -1152651 21191482
11757 21191482 35500210 36183454 32278372 29594857 25265226 17692239 9924465 4387119
11749 4387119 4099807 15284779 36496036 49364392 36378620 6839715 -12371877
11742a2371877m71117J181819o866389r16577J4318329J2139287p557712j3329536
11734a3873773O318255K1633023Q322214j4937430j8410204n718907P98171k06839
11726a6075490N030137J2244863M987024j0808382j0385337Q990517K0307197
11719A4290529Q287257p484891m424322R166274R736763n834498j8740544j5987990
11711a0991422l825178N164957O475408L346782n82982m595349q372276q458472
11703b1838532o70300J1765428J7112032Q278127o369446j2918978r372264m097046
11695a8110979m91283M525304Q531833M661552m016932n586433K095709P843410
11687e47819N889219L275115L590006l43815r946667j3689302o741935j507817
$$ plain form
11742 -12371877 -12842994 -11661175 -18527564 -19444141 -5125812 7013475 -544237 -13873773
11734 -13873773 -7555518 14077505 22399719 7462289 -10947915 -16666822 -15868651 -16075490
11726 -16075490 -11045353 1199510 6186534 -4621848 -15007185 -6016668 14290529
11719 14290529 22577786 15092895 10668573 19834847 29571610 23737112 4996568 -10991422
11711 -10991422 -14816600 -9651643 -3176235 170547 -412435 -5007784 -13380060 -21838532
11703 -21838532 -22508832 -10743404 6368628 14646755 8277309 -4641669 -14013933 -18110979
11695 -18110979 -18602262 -14076958 -5545125 -883573 -4900505 -10486938 -8391229 -547819
11687 -547819 5341400 8616515 12206521 11862706 1916039 -11773263 -18515198 -20023015
11679b0023015n729717o422830P628578K2139581J7045954q66834q313684j917601
11671C540432L45986p793559j1590335l126688M326042j145081j1015790j0522640
11663c6981633J117549J4184592K1273425J8527257M919668j0984418j3778380
11656a721940n05933J1641303P215770n954374r037706J12028N384978l072023
11648D062103j5524806j6354952k507147J4710747K1006990J1189036n703728
11641A0878243j3756099p157252K342761J142070o620700n798746M878735R538337
11633d552651J164135n232788L002657J2469294K786627j8635353k3526535m233478
11625c6758092J4752842J3238567J683843r94650L398622K855991m27431K713863
$$ plain form
11679 -20023015 -25752732 -32175562 -24546984 -2407403 14638551 13771717 5458033 3540432
11671 3540432 3886418 -3907141 -15497476 -18624164 -14298122 -15443203 -26458993 -36981633
11663 -36981633 -35864084 -21679492 -406067 18121190 23040858 12056440 -1721940
11656 -1721940 -2227873 9413430 16629200 10674826 1637120 1749148 7134126 4062103
11648 4062103 -11462703 -27817655 -30324802 -15614055 5392935 16581971 10878243
11641 10878243 -2877856 -10035108 -7692347 -6550277 -13170977 -18969723 -14090988 -4552651
11633 -4552651 -3388516 -8621304 -5618647 6850647 9637274 -8998079 -32524614 -36758092
11625 -36758092 -22005250 -8766683 -7082840 -8077490 -4678868 -1822877 -2250308 463555
11617D63555P269989K597071m990887j749113O058116K14237j5008911j4858648
11609b0004591N050623J8777887J0832513j089895R15585N782878k186056j2738994
11601E339950q577419K564891J757928p492335o625477N087362J1500432Q431975
11593A1987307O145192N966813o19371j0318264r747423J7781L666178j805731
11585E292482l888884l41404l272855j1966267p607545J4049007K8579689J6663013
11577C7507236p286331j7026510r738065j850642j109947r01993L472628Q257123
11569A1323499R289744O722251L063008J574353K883596R55402r954135k2026439
11561C831279j8623832K413429K1340308J9769938J963787j4165037j8130390
$$ plain form
11617 463555 7733544 10330615 5339728 3590615 9648731 9862968 -5145943 -20004591
11609 -20004591 -14953968 3823919 14656432 13566537 14482122 20265000 18078944 5339950
11601 5339950 -3237469 -672578 1085350 -6406985 -13032462 -7945100 3555332 11987307
11593 11987307 18132499 24099312 23479941 13161677 3414254 3432035 7098213 5292482
11585 5292482 1403598 1062194 -2210661 -14176928 -21784473 -7735466 20844223 37507236
11577 37507236 30220905 13194395 3456330 1605688 495741 -406252 3066376 11323499
11569 11323499 20613243 27335494 30398502 31972855 34856451 35811853 25857718 3831279
11561 3831279 -14792553 -12379124 8961184 28731122 30694909 16529872 -1600518
11554a600518j1728558j569602N603726O731381O361623R647993J0366329j752311
11546B2060063j9544599k1016798l66836K0365717K0770842P529828j265080j957957
11538B6575180j704311k807629n359101j2968997k1569826j6113987N695053K0841170
11530g412448J1114620p825513r264100M901179J2116698P094102L927066N641980
11522B0293584Q34224r519016j0089552L32208M565035k954474o821261P20023
11514b639229N893221q47980p204027r75173R123339R755859M561027L833266
11506B1500303N246627O35906p422501j0411948q150307n677158k435612L652524
11498c062166P322841K893649m430018m856478J741274P023437O516672K695129
$$ plain form
11554 -1600518 -13329076 -14898678 -9294952 -2563571 3798052 13446045 23812374 22060063
11546 22060063 2515464 -18501334 -18868170 1497547 22268389 29798217 28533137 26575180
11538 26575180 24870869 22063240 16704139 3735142 -17834684 -33948671 -28253618 -7412448
11530 -7412448 3702172 -4123341 -13387441 -8486262 3630436 10724538 14651604 20293584
11522 20293584 21127808 11608792 1519240 1851448 6416483 3462009 -3359252 -2639229
11514 -2639229 3253992 2406012 -4798015 -5773188 3350151 13106010 17667037 21500303
11506 21500303 26746930 27382836 19960335 9548387 1398080 -4279078 -6714690 -3062166
11498 -3062166 4260675 7154324 2724306 -2132172 -390898 6632539 13149211 15844340
11490A5844340j297459m012477m611762m593871o505666p231337j114J1735974
11482f73372J2668330k714340j6629022r804635J0036973J7656893N446455q105745
11474G881537o897738K526530O002169L089862K416989M688832L070142l081221
11466A9697102o646208n036653l852700n628884m098921M720636J2951529J0485824
11458B2591725n3582o990277o026062l077714j224489L418715R991031R330174
11450B7959521j279975j0521348q796495k288632j818789o656369j0076144j1712234
11442b5190465j1722563k516117J7364805K9686399J6819958r576306k1165798
11435f300087j0861906L968740J2924002K0308310K1284294K267857k6418637
$$ plain form
11490 15844340 14546881 10534404 5922642 1328771 -5176895 -12408232 -12409346 -673372
11482 -673372 11994958 9280618 -7348404 -17153039 -7116066 10540827 15987282 7881537
11474 7881537 983799 3510329 9512498 12602360 15019349 19708181 22778323 19697102
11466 19697102 13050894 8014241 4161541 -1467343 -5566264 -845628 12105901 22591725
11458 22591725 22538143 15547866 9521804 6444090 5219601 8638316 18629347 27959521
11450 27959521 26679546 16158198 7361703 5073071 3254282 -3402087 -13478231 -25190465
11442 -25190465 -36913028 -39429145 -22064340 7622059 24442017 14865711 -6300087
11435 -6300087 -17161993 -13193253 -269251 20039059 41323353 43591210 17172573
11428A7172573l0566736j249695K4764066J5193425j2525687k1712943r904079
11421a8829076j200617j725415K695541J2306951J0977497k075517p671301K138434
11413c383503J2621621J0901848J072037r275676j8117292k0667214j0744042
11406c7592221M939680J0817136M554386r52243M32030J605540n06735k02429
11398a6904856K137213L94602L4342J2263797K7489076K1318970n169991j9993948
11390B1569205q136400M801219l885277j6228869p027043R986994M966773j5138139
11382i091537j5699407R162513K7145613J7780619j787245r618290q251484q186222
11374A454560o514833J445478O993646J357933p850125q111381r93034K948513
$$ plain form
11428 17172573 -13394163 -14643858 10120208 25313633 12787946 -8924997 -18829076
11421 -18829076 -20029693 -21755108 -19059567 -6752616 4224881 2149364 -5521937 -3383503
11413 -3383503 9238118 20139966 21212003 11936327 -6180965 -26848179 -37592221
11406 -37592221 -32652541 -21835405 -17281019 -18233262 -17801232 -16195692 -16702427 -16904856
11398 -16904856 -14767643 -14373041 -14338699 -2074902 25414174 46733144 41563153 21569205
11390 21569205 13432805 18234024 14348747 -1880122 -8907165 1079829 6046602 -9091537
11382 -9091537 -24790944 -15628431 11517182 29297801 27510556 17892266 9640782 1454560
11374 1454560 -5060273 -3614795 3378851 4736784 -3113341 -11224722 -12217756 -9269243
11366i269243J025720j322856j790822k591391l962581l826893j238224M062017
11358a8914273J0798301J2194773J167911j5850277k0160281l757638J7548508
11351a6972976K3198650J2561253O65853l454788k474318o93877j079669p990958
11343C759170j9376511k0209876Q8505K5219688K6048250O17405j9384075j1152475
11335a4389919Q582288J0301924n860385j5080398p229081K039831J8110n132763
11327b6750393k837329J092857l324391j0815083q094793M920013J4389444J1799039
11319a9620636L230310j369281M32795M862221P994128P907796N057219K190978
11311A0685530J192341M11439j709900k408808R85181M565667K631372k344682
$$ plain form
11366 -9269243 -8243523 -9566379 -11357201 -13948592 -17911173 -21738066 -22976290 -18914273
11358 -18914273 -8115972 4078801 5246712 -10603565 -30763846 -34521484 -16972976
11351 -16972976 6225674 18786927 19452780 15997992 13523674 12829797 11750128 3759170
11343 3759170 -15617341 -35827217 -35738712 -10519024 15529226 16146631 -3237444 -14389919
11335 -14389919 -5807631 4494293 -1366092 -16446490 -23675571 -21635740 -21617630 -26750393
11327 -26750393 -29587722 -28494865 -31819256 -42634339 -50729132 -45809119 -31419675 -19620636
11319 -19620636 -16390326 -17759607 -17326812 -12464591 -4470463 3437333 8494552 10685530
11311 10685530 11877871 12289310 10579410 8170602 9155783 13721450 16352822 14008140
11303A4008140k770500J116635Q85473n719931j0392344q318122n970964q080978
11295b5242591p197258L407174J4564111J2106178j233647q392723j723124Q472475
11287e239405J0589969N052994k363961r404370j3913706j1231488k625073J164631
11279b7970409o203675j4331820p769968J1575638K3763190J5039599m645622
11272a0543067j3361410k854654J2938321J5210229K079425j0218688p340098
11265a4089942O120685J3181489O216239m023571l778148M771947P108829k065442
11257A3442086r803262k753560J2439314J7083067P828312K659749J2581475K0214426
11249G3691607L056687k8067598l6414536r804631J8744154J5195782r294378
$$ plain form
11303 14008140 11237640 12354275 13239748 7519817 -2872527 -11190649 -17161613 -25242591
11295 -25242591 -32439849 -29032675 -14468564 -2362386 -3596033 -11988756 -13711880 -5239405
11287 -5239405 5350564 10403558 8039597 -1364773 -15278479 -26509967 -29135040 -27970409
11279 -27970409 -34174084 -48505904 -56275872 -44700234 -20937044 -5897445 -10543067
11272 -10543067 -23904477 -26759131 -13820810 1389419 3468844 -6749844 -14089942
11265 -14089942 -7969257 5212232 11428471 7404900 3626752 8398699 15507528 13442086
11257 13442086 3638824 885264 13324578 30407645 38235957 40895706 53477181 73691607
11249 73691607 76748294 48680696 12266160 2461529 21205683 36401465 27107087
11242B7107087j8541469n209442M449000k893560q249600L092535J4161547M933209
11234A8849307j2569601j2765157K311259P263440n667753j6401918j0489026
11227b9469449J439050N984820P525711J3142361J4328997J804608j2634059r600244
11219g478205O930101J2639000j370433j4920266q672261Q108265J2765550J916907
11211I918658p237625m617693K37314l384709r882370o578351P161104J8790246
11203D406574J7570503M482021j0795180j7982528j3350375l137326J965231j073528
11195a7914608m211570l09904O708097R224842P757580P202902O101540K12239
11187A4771118o259771n213240M37693m89190q530725j1262349l617480L672289
$$ plain form
11242 27107087 8565618 3356176 7805176 4911616 -3337984 -245449 13916098 18849307
11234 18849307 6279706 -6485451 -4174192 3089248 -2578505 -18980423 -29469449
11227 -29469449 -28030399 -22045579 -14519868 -1377507 12951490 14756098 2122039 -7478205
11219 -7478205 -548104 12090896 10720463 -4199803 -12872064 -4763799 8001751 9918658
11211 9918658 2681033 -1936660 -1699346 -5084055 -14966425 -21544776 -14383672 4406574
11203 4406574 21977077 26459098 15663918 -2318610 -15668985 -18806311 -16841080 -17914608
11195 -17914608 -22126178 -22436082 -15727985 -6503143 1254437 8457339 14558879 14771118
11187 14771118 8511347 3298107 3735800 3246610 -5284115 -16546464 -20163944 -16491655
11179a6491655K579205R08538O991212J3242555P839460n571136j3073815r864864
11171a3440500k258947N004532J1196805J2866003P053202p09184k961445k760872
11163A3989594p810202j4422366j1436961m47345L151384o187536j3361965l873054
11155d0398451J4239266K0245847P687702q092615r098337N008646J8065142J6425970
11147B4083170L374481p447848j0006414j0363872j2927640j2411090n087367
11140c0786580J944601K148079J514428P336514J2862929P789261k045626k517260
11132a753654M857304N425844l176282p509973j826221M254046M764951M546031
11124I582046L203866o760573j9157692j4521084P720189K0342133O739972j3165627
$$ plain form
11179 -16491655 -13912450 -13003912 -6012700 7229855 15069315 9498179 -3575636 -13440500
11171 -13440500 -15699447 -10694915 501890 13367893 20421095 19711911 16750466 13989594
11163 13989594 6179392 -8242974 -19679935 -20127280 -16975896 -23163432 -36525397 -40398451
11155 -40398451 -26159185 -5913338 1774364 -6318251 -15416588 -10407942 7657200 24083170
11147 24083170 27457651 20009803 10003389 -360483 -13288123 -25699213 -30786580
11140 -30786580 -28841979 -26693900 -25179472 -17842958 -4980029 2809232 763606 -1753654
11132 -1753654 3103650 8529494 5353212 -2156761 -3982982 271064 5036015 9582046
11124 9582046 12785912 6025339 -13132353 -27653437 -19933248 408885 7148857 -6016770
11116f016770j3997557k004517J441935l620619k083033N331403N181944j560817
11108a7328031k170869J824528k989908j4969968j7705526p775335J666608O297982
11100e3150519J4954802K5278799K0881537O59105j2878862n490878Q955479J1810355
11092A1019818M350215k254164m451674k363357N295015J1469461K982210j6326526
11084I720998k3152047q259889P453664O052447J96798O876150J4587515M272338
11076A7747974j3604792j4786875k884914j100371q573729k088580J7962310K1646623
11068A4317646j193552k1209315j4892500J827591N603827L005477J0082015J7661030
11060A5202219P627213j1240078j5139039m487109o86624p328778n300086J0990556
$$ plain form
11116 -6016770 -20014327 -22018844 -20576909 -24197528 -26280561 -20949158 -15767214 -17328031
11108 -17328031 -19498900 -17674372 -20664280 -35634248 -53339774 -61115109 -59448501 -53150519
11100 -53150519 -38195717 -12916918 7964619 8623724 -4255138 -9746016 -790537 11019818
11092 11019818 15370033 13115869 8664195 6300838 11595853 23065314 26047524 9720998
11084 9720998 -13431049 -21690938 -14237274 -8184827 -7988029 -1111879 13475636 17747974
11076 17747974 4143182 -10643693 -13528607 -14628978 -23202707 -25291287 -7328977 14317646
11068 14317646 13124094 -8085221 -22977721 -21150130 -15546303 -12540826 -2458811 15202219
11060 15202219 22829432 11589354 -3549685 -8036794 -8723418 -16052196 -21352282 -10361726
11052a0361726K1570807J3480620M45892j866435R58450k014730n983430k330453
11044A3898995K168143k989934j0231731l528052J3954436K0595831O147157j4443377
11036B5571468k1183693j1525524K171906Q733050O030880j468383p560520q617008
11028g847824n272591N81591Q038358J3584708J0353939j818010j0159825l764701
11020C695645P914888N702488r226065j3423337L292200J8379178Q236795j4522651
11012A0049141j7822281J881743J4106806N11083j8430641j6219583K62548N177020
11004b0484164m279936n842777R156217K0189966R584471r243438j0807614O884895
10996d842380K2458394K1201472Q863562l171612j1138521j4542311j1608931
$$ plain form
11052 -10361726 11209081 24689701 25135593 23269158 24227608 22212878 16229448 13898995
11044 13898995 16067138 13077204 2845473 -682579 13271857 33867688 40014845 25571468
11036 25571468 4387775 -7137749 -4965843 3767207 9798087 8329704 769184 -7847824
11028 -7847824 -13120415 -12538824 -4500466 9084242 19438181 17620171 7460346 3695645
11020 3695645 11610533 17313021 8086956 -5336381 -2044181 16334997 24571792 10049141
11012 10049141 -7773140 -5891397 8215409 8726492 -9704149 -25923732 -25661184 -20484164
11004 -20484164 -24764100 -30606877 -21450660 -1260694 8323777 -919661 -11727275 -4842380
10996 -4842380 17616014 38817486 47681048 44509436 33370915 18828604 7219673
10989G219673m711082r40119k049265j811233K450606M871133K779018L080370
10981A0889101Q924569J0163591j301500j4558421j2425125K843321J1596607
10974A6132143M260449p533117j0090705n002176j574171k090237k328808o91882
10966h918504M53390R5103M26580L728613Q703276R714105J998209j0071017j4247989
10957h118234m939879Q272756J3379066J1303128Q891436L432466j0602187k3105267
10949a486715j6023928P808796K2241610J1602912q936156j6184871q374719o02404
10941i955475j504978o102673n421092M776246J9034782K2488388N983545j6325116
10933A2973627j8944325L54920J5392390R274637k874743k118446M490997K062622
$$ plain form
10989 7219673 2508591 1568472 -480793 -2292026 158580 5029713 7808731 10889101
10981 10889101 19813670 29977261 28675761 14117340 1692215 4535536 16132143
10974 16132143 20392592 12859475 2768770 -2233406 -3807577 -5897814 -8226622 -8918504
10966 -8918504 -8465114 -8370011 -7943431 -4214818 4488458 14202563 16200772 6129755 -8118234
10957 -8118234 -13058113 -4785357 8593709 19896837 28788273 32220739 21618552 -1486715
10949 -1486715 -17510643 -9701847 12539763 24142675 15206519 -978352 -9353071 -9955475
10941 -9955475 -11460453 -17563126 -22984218 -18207972 826810 23315198 29298743 12973627
10933 12973627 -5970698 -5615778 9776612 19051249 16176506 14058060 18549057 20611679
10925B0611679l089485K062897Q100078k414040k0026962j8653822J943139J4075005
10917B608489N029610o124895j410156J1401829J6663130J2402513L705829p578156
10909C6698193j6666064j5261892o154826l505224j0577637j2757996j414311
10902b9639757J1329638J2162677N739502K208554m49572p677246j3451047r256664
10894b9033915K4592L454378J677103L989068J1276131J4206842P923190j194908
10886A2322481n066091m108728n128002j0579425j2680529k717137J2863466J4876167
10878b17798k506275j8279903j1301810Q293011J3978686L094511k781547L475214
10870f245911M757787n194454p406783P421110J7615006M797214j3899341j2693282
$$ plain form
10925 20611679 17522194 19585091 27685169 25271129 5244167 -13409655 -11466516 2608489
10917 2608489 7638099 1513204 103048 11504877 28168007 40570520 44276349 36698193
10909 36698193 20032129 4770237 -1384589 -4889813 -15467450 -28225446 -29639757
10902 -29639757 -18310119 -6147442 -407940 1800614 1351042 -6326204 -19777251 -29033915
10894 -29033915 -29009323 -25554945 -23877842 -19888774 -8612643 5594199 13517389 12322481
10886 12322481 7256390 3147662 -1980340 -12559765 -25240294 -27957431 -15093965 -217798
10878 -217798 -2724073 -21003976 -32305786 -24012775 -10034089 -6939578 -9721125 -6245911
10870 -6245911 -1488124 -6682578 -14089361 -6668251 10946755 15743969 1844628 -10848654
10862a0848654J836514L966449r022318j5908752p122974M470785P808083P125422
10854a7695445Q940657J1842936J1961204P808669J4613o310016m336238J864867
10846A4091247k263320j8315128k5421757r539967J1801168J4308114L724839
10839a1614804K786597J1166737Q378316o778186j1574328J536949J0848170P93939
10831E543390j3764143j2582804P47360J0004715J1153101J0111473P076694j141698
10823A7148088r602908r740993k811672J290689k086796o789035m791926L414153
10815a3970400R182978O108924j747050n408995l686049k994269l716800J778893
10807a4452768J2735830J5632168N850680r32396O750583J4675313M978044j2913533
$$ plain form
10862 -10848654 -9012140 -5045691 -14068009 -29976761 -37099735 -32628950 -24820867 -17695445
10854 -17695445 -8754788 3088148 15049352 22858021 22872634 16562618 12226380 14091247
10846 14091247 11827927 -6487201 -31908958 -41448925 -29647757 -15339643 -11614804
10839 -11614804 -8828207 2338530 10716846 3938660 -7635668 -6098719 4749451 5543390
10831 5543390 -8220753 -20803557 -20056197 -10051482 1101619 11213092 18289786 17148088
10823 17148088 7545180 -2195813 -5007485 -3716796 -5803592 -12592627 -17384553 -13970400
10815 -13970400 -4787422 1321502 -425548 -5834543 -9520592 -12514861 -16231661 -14452768
10807 -14452768 -1716938 13915230 19765910 18833514 25584097 40259410 45237454 32323921
10799C2323921j6569468o084897O88206J257453P445622J4691191N134897j5982693
10791B2904232k0538644k902756P363726p385304k3362390j3476881J0223853
10784b7174164J7160393L453159r092758q430568k832588n76653J130534O327734
10776b0034911J1892359J0836018k2774j3430658j4146934K858300J9184306J3480527
10768A0616233o064003j0934858L944910J2077195q35587j4103303q869718O80022
10760a3489109l902407j0212587J864134K0190229J6483531p384087k0739617
10753a7189913q835713J0679571J6378232O303708q263405j4868418o404409J0222587
10745a1977760J5926708K953621j1566479r981726j37193J465909j049907N248082
$$ plain form
10799 32323921 15754453 9669556 10357762 11615215 19060837 33752028 38886925 22904232
10791 22904232 2365588 -537168 6826558 -558746 -23921136 -37398017 -27174164
10784 -27174164 -10013771 -6560612 -15653370 -24083938 -26916526 -27493179 -26362645 -20034911
10776 -20034911 -8142552 2693466 2670692 -10759966 -24906900 -22048600 -2864294 10616233
10768 10616233 4552230 -6382628 -2437718 9639477 8803890 -5299413 -14169131 -13489109
10760 -13489109 -17391516 -27604103 -25739969 -5549740 10933791 3549704 -17189913
10753 -17189913 -26025626 -15346055 1032177 7335885 -927520 -15795938 -22200347 -11977760
10745 -11977760 3948948 6902569 -4663910 -14645636 -14782829 -13316920 -14366827 -9118745
10737i118745J2714521M516276j1810528j2894005J326128P514169j934046r632501
10729a9318731n427408J153153M244489Q910327J1226949O74994j2948970o800255
10721a8285452J4057922J7268088m698939j9463725p791175N700439j926981j1664192
10713b6804015R30961J9469579J3985307q236699j7600355j1359609q962143j0309430
10705d8886404J037120J8864559J8445885k0308r070950J122837J0296637O737561
10697a473063M145147R799335Q944894m323241j0841342M50328R918981o20718
10689A6000321j6312784j4128307m22772L066485l002781m2094J3543030J9173186
10681A7874284Q775395m612884q980326o810020l398081J569798O766055P327658
$$ plain form
10737 -9118745 3595776 8112052 -3698476 -16592481 -15266353 -7752184 -9686230 -19318731
10729 -19318731 -24746139 -23592986 -19348497 -10438170 788779 1463773 -11485197 -18285452
10721 -18285452 -4227530 13040558 8341619 -11122106 -18913281 -13212842 -15139823 -26804015
10713 -26804015 -25873054 -6403475 7581832 -654867 -18255222 -29614831 -38576974 -48886404
10705 -48886404 -47849284 -28984725 -10538840 -10559148 -19630098 -18507261 -8210624 -1473063
10697 -1473063 2672084 12471419 21416313 17093072 6251730 6702058 16621039 16000321
10689 16000321 -312463 -14440770 -14863542 -11797057 -14799838 -14841932 -1298902 17874284
10681 17874284 26649679 22036795 13056469 6246449 2848368 4418166 11184221 18511879
10673A8511879L741692J145735j451961q836195j5891834j0911800M402072J2928752
10665C638340N520927o711193r725431m031712J889564M113657J840345n614181
10657i079684j2608003q685691N424243J4181409Q537088p69668j707119J20962
10649d586463m683385q710520Q656J3269317J1671870m555722j4663618q253064
10641b0502929K386554M328310N34549j334116r63134N35309N291532J0995439
10633A271514J0252336K683743l880532p456487j3104969j6881586o485859J4892968
10625a8708872K4255512R981066r688992j3216155m843483q75047j843963J812180
10617a3127754P772814O942078K754984M476804P367115R07673p990784l204370
$$ plain form
10673 18511879 22253571 23399306 21947345 13111150 -2780684 -13692484 -9290412 3638340
10665 3638340 9159267 2448074 -7277357 -11309069 -9419505 -5305848 -3465503 -9079684
10657 -9079684 -21687687 -30373378 -24949135 -10767726 -2230638 -3000306 -4707425 -4586463
10649 -4586463 -9269848 -17980368 -17971712 -4702395 6969475 2413753 -12249865 -20502929
10641 -20502929 -18116375 -13788065 -13253516 -14587632 -15550766 -15015457 -9723925 1271514
10633 1271514 11523850 14207593 10327061 2870574 -10234395 -27115981 -33601840 -18708872
10625 -18708872 5546640 15527706 5838714 -7377441 -12220924 -13095971 -14939934 -13127754
10617 -13127754 -5354940 1587138 4342122 8818926 16186041 17093714 9102930 5898560
10609E898560J0929194J2356067l900705j7151066j3046718j982772L253666O886753
10601C242979J4076168J4096596k338428k1102044j9596706J083819J5939659
10594E402043Q190890j1624663k1726386j4495903l82625P843100P474816K923269
10586a6395459k430975o089279k612711J0309608K2134831J7750034m80028j1655259
10578A0530762m569715O781717O590412P46095J005108J229659q047444j4502393
10570b35799k059734J4719708P864539j5267096j7818249P391581K3484316P180584
10562B5259850j6886933j9493370r274125n771005k265567J1884382J9064163
10555B517395J555922j8773670j0026318J4770247J5646897r023305k0529464
$$ plain form
10609 5898560 16827754 29183821 25283116 8132050 -4914668 -6897440 -3643774 3242979
10601 3242979 17319147 31415743 29077315 7975271 -11621435 -10537616 5402043
10594 5402043 13592933 1968270 -19758116 -34254019 -34636644 -26793544 -19318728 -16395459
10586 -16395459 -18826434 -24915713 -27528424 -17218816 4916015 22666049 22186021 10530762
10578 10530762 5961047 12742764 19333176 20079271 21084379 22314038 14266594 -235799
10570 -235799 -2295533 12424175 20288714 5021618 -12796631 -5405050 18079266 25259850
10562 25259850 8372917 -11120453 -20394578 -26165583 -28431150 -16546768 2517395
10555 2517395 4073317 -14700353 -24726671 -9956424 5690473 -3332832 -23862296
10548b3862296l720403J1991622M954352o667231k051243Q132185O356011o37068
10540e504071J741682R335301J0247715N550439P73152o965938j6386318j4159025
10532a5367063J887116R676519n159884k1121377j0660049J5451060K3557763
10525a735915Q701584j931850L974330O923884o398480j8222705q808834J1526913
10517e971073J8490938P835847m567585p460010k711345M827497J0988537R377499
10509C0810305j538085j0490216n539804O911711Q859154k811877j1714511q292096
10501F194581m404849j0921504j5793011k856297J6844866J6749252k848854j0897886
10493g933702O664481K1839253P762378j5244045q862871J9721679K3392042j2281503
$$ plain form
10548 -23862296 -27582699 -15591077 -10636725 -17303956 -19355199 -11223014 -4867003 -5504071
10540 -5504071 -3762389 5572912 15820627 21371066 22144218 15178280 -1208038 -15367063
10532 -15367063 -13479947 -3803428 -8963312 -30084689 -40744738 -25293678 -1735915
10525 -1735915 6965669 5033819 9008149 15932033 9533553 -8689152 -17497986 -5971073
10517 -5971073 12519865 20355712 15788127 8328117 5616772 10444269 21432806 30810305
10509 30810305 29272220 18782004 13242200 20153911 29013065 26201188 14486677 6194581
10501 6194581 1789732 -9131772 -24924783 -27781080 -10936214 5813038 2964184 -7933702
10493 -7933702 -1269221 20570032 28332410 13088365 4225494 23947173 47339215 35057712
10485C5057712m2311000k7170403R282273J7296111o526172k2074720j0205296
10478d6651495N661000N198494J531467J1372192K3317183J7414064j451574j1782533
10470D608798p393812j199979j360195j289450N473988J3425337J2325814P5402
10462B4665903j4022406j6897203m280705J2750300J7776875P281953o769593
10455B0505124j3778944j4756356j2611915m657552P197259J1029032J826906
10448e246446o511118q50755Q364845K078447j5413012k0599233o302861Q495912
10440c5984221Q922851M030624P218112J4175099J3177761M894694j496789l421913
10432A1516218m013213k961712K49452j99338q064191j4538518q393246N576145
$$ plain form
10485 35057712 -7253288 -34423691 -25141418 -7845307 -14371479 -36446199 -46651495
10478 -46651495 -40990495 -35792001 -34260534 -22888342 428841 17842905 16391331 4608798
10470 4608798 -2785014 -3984993 -5345188 -6634638 -1160650 12264687 24590501 24665903
10462 24665903 10643497 -6253706 -10534411 2215889 19992764 27274717 20505124
10455 20505124 6726180 -8030176 -20642091 -25299643 -18102384 -7073352 -5246446
10448 -5246446 -11757564 -12608319 -4243474 -2165027 -17578039 -38177272 -44480133 -35984221
10440 -35984221 -27061370 -23030746 -15812634 -1637535 11540226 16434920 14938131 11516218
10432 11516218 7503005 4541293 4790745 4591407 -3472784 -18011302 -26404548 -20828403
10424b0828403J0440739J95145j1819305j0691797K106088J2976306J2722315
10417d898912L714019o375338j2238457j1663189l530267R750234J8861438J4002607
10409G622135j629806j1695846o812595J976614J2122p349278l536841R985339
10401a1428156J3310304J26329j0574966l968676Q389474R248095K125271L30247
10393G557922K662495r08719q296547r132282l749982n00492J302256Q088519
10385b976830J5018590J0193071m900858j5237521j2771517l544812M447158P456793
10377b315926K887055o338099q200942L134765J3872955Q798079l865048n638231
10369B334608J193916J68710o845870k621149J0639713J0788794n533760j5029688
$$ plain form
10424 -20828403 -10387664 -10192519 -22011824 -32703621 -30597533 -17621227 -4898912
10417 -4898912 -1184893 -7560231 -19798688 -31461877 -34992144 -25241910 -6380472 7622135
10409 7622135 5992329 -5703517 -12516112 -10539498 -10527376 -17876654 -21413495 -11428156
10401 -11428156 1882148 2008477 -8566489 -12535165 -4145691 5102404 7227675 7557922
10393 7557922 10220417 9311698 1015151 -8117131 -11867113 -12367605 -11065349 -2976830
10385 -2976830 12041760 22234831 17333973 2096452 -10675065 -14219877 -9772719 -2315926
10377 -2315926 571129 -5766970 -13967912 -10833147 3039808 11837887 7972839 2334608
10369 2334608 3528524 3697234 -3148636 -5769785 4869928 15658722 10124962 -4904726
10361d904726o867310J436180j528868k420837N838495O102349r787058j9476746
10353c1608521n748475J3204886J5130386R520825J2965748J3786348l900886
10346B3350311k1704840j1990406J2770032J6341606l712803j5115328m419925
10339d481353P875886P495635M482952N557973K446406m442920j893324Q147262
10331B5188517O105927j0662413j9757106j0356863J92642k078676o943222l572205
10323b1883399J070176R39487L062967Q010858M103691n736036j60851K1319427
10315A0726320K6435977k80185k6644279j9689261M402239J0304985q08811l632640
10307H14345K413077j170807r572561j943013J3917331Q510309j5657621k1052806
$$ plain form
10361 -4904726 -11772036 -10335856 -11864724 -14285561 -8447066 -2344717 -12131775 -31608521
10353 -31608521 -37356996 -24152110 -9021724 499101 13464849 27251197 23350311
10346 23350311 1645471 -10344935 2425097 18766703 15053900 -61428 -4481353
10339 -4481353 3394533 10890168 15373120 20931093 23377499 18934579 17041255 25188517
10331 25188517 31294444 20632031 874925 -9481938 -9289296 -11367972 -18311194 -21883399
10323 -21883399 -20813223 -19873736 -16810769 -8799911 -4696220 -10432256 -10593107 10726320
10315 10726320 37162297 36882112 10237833 -9451428 -5049189 5255796 4446985 814345
10307 814345 3227422 2056615 -7515946 -9458959 4458372 12968681 -2688940 -23741746
10299b3741746M514675K5537241J3859272r956887j3198288N22997O272456k92757
10291C516963m293347j655011j568628n573388n766204o24293L943344O030157
10283e990407O749324K829899o523835j1089303k381885R886232R529135j100095
10275A909065m081936O468300J5782364J0475525m335121j4817138j4822933p541747
10267a0963621J031828N707977M969755K758204K743444J713403m523384j1064255
10259g626649r822316l735572k305942l478117L948122J7128805J7206677j214772
10251A0100236j7076035j2501740J146765L800348j466043J504773J0960545J1088111
10243G556960J508689k068520M536049R482188Q312710P889092O094523n913919
$$ plain form
10299 -23741746 -19227071 6310170 20169442 10212555 -2985733 -2462736 3809720 3516963
10291 3516963 -776384 -2431395 -4000023 -9573411 -15339615 -15963908 -12020564 -5990407
10283 -5990407 758917 3588816 -2935019 -14024322 -16406207 -6519975 3009160 1909065
10275 1909065 -2172871 4295429 20077793 30553318 26218197 11401059 -3421874 -10963621
10267 -10963621 -9931793 -4223816 745939 3504143 6247587 7960990 3437606 -7626649
10259 -7626649 -17448965 -21184537 -23490479 -26968596 -23020474 -5891669 11315008 10100236
10251 10100236 -6975799 -19477539 -18330774 -14530426 -15996469 -14491696 -3531151 7556960
10243 7556960 9065649 6997129 11533178 21015366 29328076 37217168 43311691 37397772
10235C7397772j8361884r904431J2903618J6417034o872107k1546560o208796
10228C824646R883127k086111j8141998l218238K2839220J4319499k0894342k9472339
10220b2946536J327358K4199817R596396j1721253o242844J0131285Q467049l200723
10212I610549j907270O534036J917921j1692633j4581995n035642L538645P209565
10204d406824R170535N557915m002179n978508M812313R197504n967342k0075133
10196a1691719j0198892Q034640N356580j0344999p479979J3744383K0902439
10189H322453L187542j4233679j3704694o009510j029120P523838J8277432J5517331
10181A7851593j678112j2415657p582383l037547q377315j0628935j500097O795825
$$ plain form
10235 37397772 19035888 9131457 22035075 38452109 31580002 10033442 3824646
10228 3824646 13707773 11621662 -6520336 -9738574 13100646 27420145 6525803 -22946536
10220 -22946536 -21619178 2580639 12177035 455782 -5787062 4344223 12811272 9610549
10212 9610549 7703279 14237315 16155236 4462603 -10119392 -15155034 -11616389 -4406824
10204 -4406824 4763711 10321626 6319447 340939 5153252 14350756 8383414 -11691719
10196 -11691719 -21890611 -13855971 -8499391 -18844390 -26324369 -12579986 8322453
10189 8322453 11509995 -2723684 -16428378 -22437888 -23467008 -15943170 2334262 17851593
10181 17851593 16173481 3757824 -3824559 -6862106 -15239421 -25868356 -27368453 -20572628
10173b0572628O525656Q053868J4401963J0422303o323907j2727211K171598J4702322
10165A6653964M574799j1354897r278325K307959K585602m061226j943411K727518
10157B211983m405676j3304872m569154J3507514J6220303L203902m523856k258579
10149F081565l443727p528676P3537J5355593J5855750k068375j5662676j1405577
10141b742586j351078K017467J487132m51415p639450j4038541o222079J0817621
10133a8122929J5022733K020573o715174Q35131R889686P719078L425994N164875
10125A9239967L355311o898673j0988040r82051O294209k217277j1088358l144298
10117f429210R378366O329629n222338n732924J136424j814909r948184l536221
$$ plain form
10173 -20572628 -14046972 -5993104 8408859 18831162 12507255 -219956 1951642 16653964
10165 16653964 21228763 9873866 595541 2903500 5489102 1427876 -515535 2211983
10157 2211983 -2193693 -15498565 -20067719 -6560205 9660098 12864000 8340144 6081565
10149 6081565 2637838 -4890838 -4817301 10538292 26394042 24325667 8662991 -2742586
10141 -2742586 -4093664 -2076197 -589065 -1040480 -8679930 -22718471 -28940550 -18122929
10133 -18122929 -3100196 -1079623 -7794797 -6959666 2930020 10649098 14075092 19239967
10125 19239967 22595278 15696605 4708565 3726514 10020723 7803446 -3284912 -6429210
10117 -6429210 2949156 9278785 4056447 -1676477 -540053 -2354962 -12303146 -15839367
10109a5839367J4101297J7192128j553221j9109423j7170048m306238M736865
10102b1948007R772028J4630887J4119656M342098o008583o203916J683296O300530
10094A6687989Q86776j0170120j5077794n505366J1538851J7019048L078397j3200718
10086E257063j1219681M032936J0274527J209510p652743n995340j079176L64565
10078d808339K745569P330180N522969m521322j0385389m315389M289613N029308
10070H87200J859163K077322K576030j737615o813265p631072p327920q137275
10062b4247432m288804N187334Q330943j947147j2646962q215263N430350J0356566
10054b2040415L621003j536660K164487Q133774R023316N032287m06769l448746
$$ plain form
10109 -15839367 -1738070 15454058 13900837 -5208586 -22378634 -26684872 -21948007
10102 -21948007 -12175979 2454908 16574564 20916662 14908079 8704163 10387459 16687989
10094 16687989 17574765 7404645 -7673149 -13178515 -1639664 15379384 18457781 5257063
10086 5257063 -5962618 -1929682 8344845 9554355 1901612 -4093728 -5172904 -4808339
10078 -4808339 -2062770 5267410 10790379 6269057 -4116332 -8431721 -4142108 887200
10070 887200 2746363 4823685 7399715 5662100 -1151165 -8782237 -16110157 -24247432
10062 -24247432 -28536236 -23348902 -15017959 -16965106 -29612068 -37827331 -32396981 -22040415
10054 -22040415 -18419412 -19956072 -17791585 -9657811 -634495 4397792 3991023 542277
10046E42277l32128O781705Q923260L242811o01840L421281N369890l454378j1948474
10037A1944404o114352M803775J445694j2314382j4212176j26696J0406650P597111
10029C430028L852170O601886N060133n238448r634202n81328N849766k960350
10021F379655j2838655o598977O354898O834040j822889k937747K003633k782536
10013e408578j6529496k0193772o299039J0722351J6434856J1014387O77037q547870
10005a8130124p788122O321076J9213607J2881528n573063j0568982L026817J1101346
9997A0484083o75002j3278873n739675J0935226J2865093J018332m724785J7153
9989A0901552J291812m830340o093484J408811N307689k200k599888N039894J1008945
$$ plain form
10046 542277 210149 6991854 15915114 19157925 18556085 21977366 27347256 23892878 11944404
10037 11944404 5830052 10633827 12079521 -234861 -14447037 -14573733 -4167083 3430028
10029 3430028 7282198 13884084 18944217 13705769 4071567 3490239 9340005 6379655
10021 6379655 -6459000 -13057977 -6703079 130961 -1691928 -4629675 -2626042 -5408578
10013 -5408578 -21938074 -42131846 -48430885 -37708534 -21273678 -10259291 -9582254 -18130124
10005 -18130124 -25918246 -19597170 -383563 12497965 6924902 -3644080 -617263 10484083
9997 10484083 9809081 -3469792 -9209467 1725759 14590852 15609184 10884399 10901552
9989 10901552 12193364 7363024 1269540 2678351 7986040 7983840 5383952 10423846 21432791
9980B1432791L577561q438219r708850j948613K484924K407988N563091R151765
9972B4522438J908907j3628838j9379297p800710N883267N870545k839072n799094
9964a1261854j555138r8432n000574r547052q328912k574098M914230J1805817
9956b1646013J4211143R794876K116156l456501n611377m225074K702355J2294730
9948F180295J4066984L974237n701351k968654M277838J109966q096081o597339
9940F245895M066322M390479r164699j5649960l687304J0004479R406522M047235
9932I658969P359298J0239622j322809j7209521j6559829j116823Q543063M653338
9924D245308k058978m800109p224930q785347m077097K430165j18635q897828
$$ plain form
9980 21432791 25010352 16572133 6863283 4914670 7399594 9807582 15370673 24522438
9972 24522438 26431345 12802507 -6576790 -14377500 -8494233 -2623688 -5462760 -11261854
9964 -11261854 -12816992 -12915424 -17915998 -27463050 -35791962 -38366060 -33451830 -21646013
9956 -21646013 -7434870 2360006 4476162 1019661 -4591716 -8816790 -6114435 6180295
9948 6180295 20247279 24221516 18520165 15551511 19829349 20939315 12843234 6245895
9940 6245895 10312217 14702696 5537997 -10111963 -13799267 -3794788 5611734 9658969
9932 9658969 17018267 27257889 25935080 8725559 -7834270 -8951093 -408030 4245308
9924 4245308 2186330 -2613779 -9838709 -18624056 -22701153 -20270988 -20389623 -29287451
9916b9287451q319436O092968K0337679K1438252J0664190m244003j6235277j7177193
9908a6730271l329273J4769303K0118599Q876500p612080j8406076j9645764j0430606
9900c2389668M108612J0549127K716659o840733o168363m065915j1351554j6085354
9892e9527189m597696P205016j836049j6863944j4255453j6303799n7202040r6592033
9884b59973187m6065988R1525884J86742100J40585640J5843063n3518577l5111261
9877D0027674k852240l091053p294606O554834J2360950m342732j3853865J731093
9869B9240055J3841791p67597j8015585q598507J3529203J7319642K208131j0329782
9861C8427351j1809657p417878O49177Q268161M205533j0697003j5887220j082563
$$ plain form
9916 -29287451 -37606887 -31513919 -11176240 10262012 20926202 16682199 446922 -16730271
9908 -16730271 -20059544 -5290241 14828358 23704858 16092778 -2313298 -21959062 -32389668
9900 -32389668 -28281056 -17731929 -15015270 -21856003 -28024366 -32090281 -43441835 -59527189
9892 -59527189 -64124885 -56919869 -58755918 -75619862 -89875315 -106179114 -163381154 -259973187
9884 -259973187 -306039175 -214513291 -27771191 112814449 128657512 75138935 40027674
9877 40027674 37175434 34084381 26789775 33344609 45705559 41362827 27508962 29240055
9869 29240055 43081846 42314249 24298664 15700157 29229360 46549002 48757133 38427351
9861 38427351 26617694 19199816 19848993 28117154 32322687 21625684 5738464 4655901
9853D655901J3640272P295989r377327j2221025l53787P836490N048340K5563
9845A6550416j310346j380074j716153j961606l681722n576302k071163N657469
9837D510519P748883K231380J2473M898080N175215l816163p321823L511881J2482343
9828B9432788L579217j1195815j1143825J993L977324l04137j42910L818124l57662
9819A7665097j0782317j3197993o312046l088697o431250m911349N066554J2376585
9811i615416J0288975N789733N590699O713756M530129j128122r099811j5740937
9803b670994j2300643M384903K0670870J9340599L306236p431661k511217P928020
9795C0716113R608149k68326j4266408k1761043j5470245N61654J2088495J0885856
$$ plain form
9853 4655901 18296173 25592162 16214835 3993810 3640023 11476513 16524853 16550416
9845 16550416 15240070 13859996 12143843 10182237 6500515 924213 -1146950 4510519
9837 4510519 12259402 14490782 14503255 19401335 24576550 20760387 13438564 16950445 29432788
9828 29432788 33012005 21816190 10672365 10674358 14651682 14347545 14204635 18022759 17665097
9819 17665097 6882780 -6315213 -12627259 -15715956 -22147206 -27058555 -21992001 -9615416
9811 -9615416 673559 6463292 12053991 18767747 23297876 22169754 13069943 -2670994
9803 -2670994 -14971637 -10586734 10084136 29424735 32730971 25299310 22788093 30716113
9795 30716113 40324262 40055936 25789528 4028485 -11441760 -10880106 1208389 12094245
9787A2094245L841875r59912n727026j0264785l852497J3032888J5873541j0168676
9779A3869653l7867942l0221769M083230K2331865J0963400j063831M996114J1626144
9771a283136L950957k451096P206779J8117067J1828998k490749o324935k402596
9763B6151289l799878p722047l267402N460670N252938m149455j1255397j0496422
9755c825704m985339K477414R854693J3402060J2937001J2046521Q377003m123020
9747D6160629j9045344k0524169q635429j662650m769459r62368J3655273J3912466
9739A8128949j3223571l7880899k7316762L869980J6638386N122138m086759J95321
9731c8553217M038065K728731Q112372J9242544J8816058M654008m492168r32866
$$ plain form
9787 12094245 15936120 14976208 9249182 -1015603 -4868100 8164788 24038329 13869653
9779 13869653 -23998289 -54220058 -50136828 -27804963 -16841563 -17905394 -12909280 -1283136
9771 -1283136 2667821 216725 7423504 25540571 37369569 34878820 28553885 26151289
9763 26151289 22351411 14629364 11361962 16822632 22075570 17926115 6670718 -3825704
9755 -3825704 -8811043 -6333629 3521064 16923124 29860125 41906646 50283649 46160629
9747 46160629 27115285 6591116 -2044313 -3706963 -8476422 -9438790 4216483 18128949
9739 18128949 4905378 -32975521 -60292283 -56422303 -39783917 -34661779 -38748538 -38553217
9731 -38553217 -34515152 -31786421 -23674049 -4431505 14384553 19038561 14546393 13613527
9723A3613527J526220m180778o752053j459732m26373p630162q488242L659830
9715a0137763J3741062J0288852K867862J377813l77221o642676p172906J601314
9707E546337M730404m138789o215555J0004014K1637706M829528k2196446k2500807
9699h303608L426508J9716673J0431513k004750J263427P536617k25695j3813806
9691A8026879j5443063o125694m52812l192364o625638n401964j377594L320556
9683a7271694Q383759J1833119J0857940N208563l180364j1163682j3719629p753807
9675a6805795J507405M605586R78547K28588O422243J0041536K311381j0212521
9667i23030j4052800o512549L475571Q152417O568009R93750m246339l304201
$$ plain form
9723 13613527 15139747 10958969 4206916 2747184 2320811 -5309351 -13797593 -10137763
9715 -10137763 3603299 13892151 16760013 18137826 17760605 11117929 3945023 5546337
9707 5546337 10276741 6137952 -77603 9926411 31564117 36393645 14197199 -8303608
9699 -8303608 -4877100 14839573 25271086 23266336 24529763 32066380 31840685 18026879
9691 18026879 2583816 -3541878 -3994690 -7187054 -13812692 -19214656 -20592250 -17271694
9683 -17271694 -8887935 2945184 13803124 19011687 15831323 4667641 -9051988 -16805795
9675 -16805795 -15298390 -10692804 -9714257 -9485669 -3063426 6978110 9289491 -923030
9667 -923030 -14975830 -21488379 -18012808 -9860391 -3292382 -2298632 -6544971 -9849172
9659i849172M098240R049768M632541k824758k507949M427548P701204M677358
9651A9404780K268172K733523L37462o147157r725681p038625k957676m49620
9643a574822K965311N847016K423617m659656m728455K681322M661238l182232
9635D433339p832178j611737L073357m574149j3281812q139415M313568Q700438
9627a4918589O284504O652195N279454o001972j5030805l723850J8228824K3343948
9619B0113709Q948821n36800L876180L444150j0176859j7244251n189066P795782
9611A1031666L706133o076597m479003N80728n543039j2863145j668849K1517930
9603F205824K9477610J1768620j4584848k9203019k5803201r155259R159360J4900550
$$ plain form
9659 -9849172 -5750932 3298836 7931377 5106619 2598670 7026218 14727422 19404780
9651 19404780 21672952 24406475 24743937 18596780 8871099 1832474 -1125202 -1574822
9643 -1574822 1390489 7237505 9661122 5001466 273011 2954333 7615571 4433339
9635 4433339 -3398839 -5010576 -1937219 -6511368 -19793180 -27932595 -23619027 -14918589
9627 -14918589 -8634085 -1981890 3297564 -2704408 -17735213 -21459063 -3230239 20113709
9619 20113709 29062530 28525730 32401910 35846060 25669201 8424950 3235884 11031666
9611 11031666 14737799 8661202 4182199 4762927 -780112 -13643257 -15312106 6205824
9603 6205824 35683434 47452054 32867206 3664187 -22139014 -31294273 -22134913 -7234363
9595g234363N103571n538060l590431M542073N145608o91902k602115k49359l70774
9586e485752j396609J887356M438025r09219p120252k840188O413090N804958
9578G91409l773113p376628m85614O850620Q923021R291130P878872J026333o258797
9569A6867233n438379o36109k244437o753696k575302O117426L992487o472031
9561B857192n222977J1157972J9686131N325928j5596754j9143661n278667P199209
9553I84373O302535l270769q846941k174352J1110039J3884920j995163k0302998
9545d308356j8498058J445191J6370104J4318408N005095j597744o208395p701957
9537a175712j382592N920592O37333j2422407j2167253M906793J6558778R515158
$$ plain form
9595 -7234363 -2130792 -7668852 -11259283 -6717210 -1571602 -2263504 -4865619 -5114978 -5485752
9586 -5485752 -6882361 -4995005 -556980 -1466199 -8586451 -11426639 -5013549 791409
9578 791409 -2981704 -10358332 -10843946 -3993326 4929695 14220825 22099697 23126030 16867233
9569 16867233 11428854 10792745 8548308 1794612 -780690 5336736 9329223 2857192
9561 2857192 -2365785 8792187 28478318 33804246 18207492 -936169 -6214836 984373
9553 984373 7286908 4016139 -4830802 -7005154 4104885 17989805 15994642 -4308356
9545 -4308356 -22806414 -21361223 -4991119 9327289 14332384 12734640 6526245 -1175712
9537 -1175712 -2558304 3362288 3999621 -8422786 -20590039 -15683246 875532 10390690
9529A0390690j949943l972450m905113j3174503j6676300m818160P917289L170424
9521b4018066j0476948j0294863O399248K1084432K0785569Q991504m968208j3115983
9513e613315j0114633Q30043P919631M962555j009098k331929o91263J626689
9505d421320P266971J2940819Q014585o487547j3280689m439319M714524K29868
9497D537892q738130p949759j630510q47754l029598j082881N62816k650380j236444
9488b2064748J1514088K0891339J0309639j0129312j6058612l196163J0291922
9481A558153J0860021K058340n853707n323584M202557J1986670N380932r361247
9473A5508135j1403842J378991N925924o402529j1547973N316790J9177713N788471
$$ plain form
9529 10390690 8440747 4468297 -436816 -13611319 -30287619 -35105779 -27188490 -24018066
9521 -24018066 -34495014 -44789877 -38390629 -17306197 3479372 12470876 7502668 -5613315
9513 -5613315 -15727948 -14897905 -6978274 -2015719 -3024817 -5356746 -6048009 -4421320
9505 -4421320 2845651 15786470 23801055 17313508 4032819 -406500 4308024 4537892
9497 4537892 -4200238 -12149997 -13780507 -14628261 -17657859 -18740740 -18177924 -20828304 -22064748
9488 -22064748 -10550660 10340679 20650318 10521006 -5537606 -8733769 1558153
9481 1558153 12418174 14476514 8622807 3299223 7501780 19488450 24869382 15508135
9473 15508135 4104293 5483284 11409208 5006679 -6541294 -1224504 17953209 23741680
9465B3741680j4731072j1394084M409925J569777j3763464j1264415N766874O111936
9457i552843j0652529j2031986Q650422K0648721J0228335l87425P95708l257876
9449D440527j6377050j3798611J0459245K3565632O517920j1974364l236762J4684229
9441A4280766J1354426m279685l449614J1754408J4446929j612769j5436850j3172101
9433A3885510l268710J413187j675887o931515o438470K494732J0544613O560476
9425A6583936l464209l843317K654016k335124j6820689j5240259P157556J9389834
9417D081744L411229j4671804q090632O356482M77766j4847865j0021346J0861900
9409b2442526J8288354O770392k809699l354845o515093j1154273l629994J0500315
$$ plain form
9465 23741680 9010608 -2383476 2026449 3596226 -10167238 -21431653 -15664779 -9552843
9457 -9552843 -20205372 -32237358 -23586936 -2938215 7290120 6902695 7698403 4440527
9449 4440527 -11936523 -25735134 -15275889 8289743 14807663 2833299 -403463 14280766
9441 14280766 25635192 21355507 17905893 29660301 44107230 42494461 27057611 13885510
9433 13885510 10616800 12029987 10354100 3422585 -3015885 -521153 10023460 16583936
9425 16583936 13119727 9276410 11930426 9595302 -7225387 -22465646 -15308090 4081744
9417 4081744 7492973 -7178831 -15269463 -8912981 -8435215 -23283080 -33304426 -22442526
9409 -22442526 -4154172 2616220 -193479 -3548324 -10063417 -21217690 -24847684 -14347369
9401a4347369J0287268k600363l771188J1117497J7249324K923226j1272479q093440
9393A492476P12053k15682m403340q08041N100841N268559N479295J0362447R292464
9384C2281072l752629j1857798J205585K0284407J6192669j0705877k8038917
9377A5608512j5249463R983819J7295565J626515j5571915j5989515l630118N432633
9369d93967L482732l472908o598186l902359J356368O195243Q692770P112008
9361A2371701K165870k024121k339008k68745P27250j060434n268899q727438
9353d423824n207409O904974J6393082R837235o331869q939045Q212925J9516622
9345C5962691K213914k7082384l2404684q332439J4555398J4254273K788840o3969
$$ plain form
9401 -14347369 -4060101 -6660464 -10431652 685845 17935169 20858395 9585916 1492476
9393 1492476 2204529 1988847 -2414493 -3222534 1878307 7146866 12626161 22988608 32281072
9384 32281072 28528443 16670645 17876230 38160637 54353306 43647429 15608512
9377 15608512 359049 10342868 27638433 29264948 13693033 -2296482 -5926600 -493967
9369 -493967 2988765 -484143 -7082329 -10984688 -9628320 -3433077 5259693 12371701
9361 12371701 14537571 12513450 10174442 9905697 10632947 9572513 4303614 -4423824
9353 -4423824 -9631233 -2726259 13666823 23504058 17172189 8233144 16446069 35962691
9345 35962691 38176605 11094221 -21310463 -29642902 -15087504 -833231 1955609 1891640
9337A891640L467526k67992j0739510j4495351n551613Q068285J5368021J1745630
9329I486636K30770j0352930j1461587l968686K128688P15914k769653q84380
9321a6875228M585298O798450L898057j775445r235658j5408492j1082781Q156173
9313c0939626K8362796K7791214M801401j6362209j4912267J075288Q851585K680355
9305A1348537l305776p08781K132407j759314n464063k430320Q99528j363162
9297f50944q91716R648045J8163706Q965188r715953j5309946m953045K647865
9289G903200n74249k439217K628425K725772o144675q678296J935310Q411693
9281E767963o24652p494174M680244J8502290P250599j9948105k9056501j1118476
$$ plain form
9337 1891640 5359166 5091174 -5648336 -20143687 -25695300 -17627015 -2258994 9486636
9329 9486636 9717406 -635524 -12097111 -16065797 -13937109 -13221195 -15990848 -16875228
9321 -16875228 -12289930 -5491480 -1593423 -3368868 -12604526 -28013018 -39095799 -30939626
9313 -30939626 -2576830 25214384 30015785 13653576 -1258691 -183403 8668182 11348537
9305 11348537 8042761 7333980 9466387 7707073 2243010 -187310 712218 -650944
9297 -650944 -1542660 8105385 26269091 35234279 25518326 10208380 5255335 7903200
9289 7903200 7328951 4889734 7518159 10243931 4099256 -4579040 -2643730 5767963
9281 5767963 5143311 -2350863 2329381 20831671 28082270 8134165 -20922336 -32040812
9273c2040812R094536J3458956J0204541R351430N971012k767815o728125p87764
9265E755959M335069Q23674k405458L063313P847366q27553j6882296k2445877
9257b0735803j2728153q77148J345960k623943k326963M385515R485870P110697
9249a6963968K369834L469733Q268935P468268J590962K632062J3041022J6228263
9241C8105111j29590k1990743k5787717j0343943M884021Q656549O645098L558036
9233C596822l239699j0121834o864700M053427N518057p827058j6541009k032681
9225c3458675K5211520L6421921J9296454q489618k0131689p900606J0805798
9218B1755105J3855455j061756j5979598j7105477j1004757j0079985j1603376
$$ plain form
9273 -32040812 -22946276 -9487320 717221 10068651 16039663 13271848 6543723 5755959
9265 5755959 10091028 10914702 8509244 11572557 19419923 18592370 1710074 -20735803
9257 -20735803 -33463956 -34341104 -32995144 -35619087 -37946050 -33560535 -24074665 -16963968
9249 -16963968 -14594134 -11124401 -2855466 4612802 6203764 8835826 21876848 38105111
9241 38105111 37975521 15984778 -9802939 -20146882 -15262861 -6606312 38786 3596822
9233 3596822 357123 -9764711 -16629411 -12575984 -7057927 -14884985 -31425994 -33458675
9225 -33458675 -8247155 28174766 47471220 38981602 18849913 10949307 21755105
9218 21755105 35610560 34548804 18569206 1463729 -9541028 -19621013 -31224389
9211c1224389m025646J1518162K0953421J7011709N927893m874772j3038796j5553984
9203a3306402r402343J332054R339714J3718045J5853121J0705124m406248j7842355
9195E990710j6905019q250535o720114q981045o78880J3442343J2946605l402816
9187a2558751j3187951n764749M342126O296572P900348J2214128P410049o639348
9179A2424r231390O670747J6916985L345912j5625752j4572201L78641P776637
9171d327997O832818R925107J4145143Q206576l068307o961460n917804q205928
9163A0628148o469905Q207317K1119522J1875179r738896j6028062m974144m6021
9155A4573138p693254q361112N204397J2923208J909290j1467235q928445K235260
$$ plain form
9211 -31224389 -35250035 -23731873 -2778452 14233257 20161150 15286378 2247582 -13306402
9203 -13306402 -22708745 -21376691 -12036977 1681068 17534189 28239313 23833065 5990710
9195 5990710 -10914309 -19164844 -25884958 -34866003 -35544883 -22102540 -9155935 -12558751
9187 -12558751 -25746702 -31511451 -27169325 -20872753 -12972405 -758277 6651772 12424
9179 12424 -9218966 -2548219 14368766 17714678 2088926 -12483275 -12104634 -4327997
9171 -4327997 2504821 12429928 26575071 34781647 31713340 24751880 18834076 10628148
9163 10628148 4158243 12365560 33485082 45360261 35621365 19593303 14619159 14573138
9155 14573138 6879884 -1481228 3723169 16646377 18555667 7088432 -1840013 395247
9147C95247N084928o33453m284839m098374n667934q181181n183454L813510J0742357
9138h013193P541084m752875j4109830p882370J0319468K0355505J0497776n218100
9130H737465o769778L277512P338325J064608o041140j1659621j8718897j7578180
9122d0349706J812775K1858306J3793065j4415871k1994053L019207K3307473
9115a2968804J1250823q689071l879930J3191644J1578659l402862l778385Q487405
9107A1789479O350945j0999247j4695709L441445J6621275Q077268m714536m046825
9099A1824095N75111m373344j1891740j1515148r082812j0849199p506239O167786
9091c6651490J3720655J477651j4217518q791210J2052458K1176367J1153118
$$ plain form
9147 395247 5480175 4846722 561883 -3536491 -9204425 -17385606 -22569060 -18755550 -8013193
9138 -8013193 -472109 -5224984 -19334814 -27217184 -16897716 3457789 13955565 8737465
9130 8737465 1967687 5245199 12583524 13648132 7606992 -4052629 -22771526 -40349706
9122 -40349706 -38536931 -16678625 -2885560 -17301431 -39295484 -36276277 -12968804
9115 -12968804 -1717981 -10407052 -14286982 -1095338 10483321 7080459 3302074 11789479
9107 11789479 18140424 7141177 -7554532 -4113087 12508188 20585456 15870920 11824095
9099 11824095 12399206 8025862 -3865878 -15381026 -24463838 -35313037 -42819276 -36651490
9091 -36651490 -22930835 -21453184 -35670702 -44461912 -32409454 -11233087 -79969
9084g9969O67239J388723L803127l08958l875043m93266L786107L032208J031661
9075H951829P56572k100922p559051o667323L026632R694328M458790m555132
9067F005723n325573P06575M357169K894915j023719n818542p372402Q74056J4279835
9058I578037J5286677k038918j8090861j4155596n61201J335198n857271l536972
9050a8040907P266298P653581k823171l045583J0646974J3979456l429873j5385019
9042c178244Q00177K5679229K5433394J469431j6098691j4571831r204651j0447696
9034a18882q538796M027454J6756681J7280841Q438518M08825l937896q146873
9026B6169872j3292416j5780622j0968532K008430J5625209J7216352L746280
$$ plain form
9084 -79969 587270 1975993 5779120 5470162 1595119 1101853 4887960 7920168 8951829
9075 8951829 9708401 7607479 48428 -6618895 -3592263 6102065 10560855 6005723
9067 6005723 680150 1386725 5743894 8638809 7615090 1796548 -5575854 -4701798 9578037
9058 9578037 24864714 22825796 4734935 -9420661 -9981862 -8646664 -14503935 -18040907
9050 -18040907 -10774609 -3121028 -5944199 -8989782 1657192 15636648 12206775 -3178244
9042 -3178244 -2378067 23301162 48734556 50203987 34105296 19533465 10328814 -118882
9034 -118882 -8657678 -4630224 12126457 29407298 37845816 38254641 34316745 26169872
9026 26169872 12877456 -2903166 -13871698 -11863268 3761941 20978293 24724573
9019B4724573j0068198p939218O122925J3322950O112049m490040q679695j0285854
9011H819492j4021783j3915298m114469Q221958J1687421O671318K498840J976090
9003G823569r11913q135767j1940106n719052N256452R314603K839174n572039
8995g045079o546759j415931J963457K379409O517098J5019947J6057076P17285
8987B7646503k0406522k6628399j2541717N901194J2440105Q119511L583760K728110
8979H42545K207780J953957O039626J3037885J3986224L730009j0547419j6660132
8971A4590475j1112278j445290L845438L204986j45057l012355k986712N32477
8963C471684L030394j844836j1191523j1784365K100523J6341320J4133656P44576
$$ plain form
9019 24724573 14656375 6717157 12840082 26163032 32275081 27785041 19105346 8819492
9011 8819492 -5202291 -19117589 -23232058 -15010100 -3322679 3348639 5847479 7823569
9003 7823569 6911656 -1224111 -13164217 -18883269 -13626817 -4312214 -1473040 -7045079
8995 -7045079 -13591838 -15007769 -13044312 -10664903 -4147805 10872142 26929218 27646503
8987 27646503 7239981 -19388418 -31930135 -26028941 -13588836 -5469325 -1885565 842545
8979 842545 3050325 5004282 11043908 24081793 38068017 41798026 31250607 14590475
8971 14590475 3478197 2032907 5878345 9083331 8938274 5925919 2939207 3471684
8963 3471684 6502078 4657242 -6534281 -18318646 -16218123 123197 14256853 15001429
8955A5001429m126687L169048O177356k319776p953611j179992M546319l182119
8947A0131967j1423077k930373J2073368J0645800m484010r488311k35638J675347
8939E965073j0994739j5197185L796013K3631951J6686059p168705j5091881O32908
8931B259494J4756433Q172668q284826j4723129q672161r15017L015773N923586
8923A532821R516677J1430944R879686N395845q22266o546990q495877o156497
8915A5734343l510394l495186l186079J274929P038913P048453m87818r791975
8907A0625186j4147989j0453314R86501J4573764J8861560P442680q677689j0767223
8899H443476K011735R314491r70766j3806665r951433M484628Q902427J10120
$$ plain form
8955 15001429 10874742 14043790 20221146 17901370 9947759 8767767 13314086 10131967
8947 10131967 -1291110 -4221483 7851885 18497685 14013675 4525364 4289726 5965073
8939 5965073 -5029666 -20226851 -16430838 7201113 23887172 16718467 1626586 2259494
8931 2259494 17015927 25188595 16903769 2180640 -6491521 -7406538 -4390765 1532821
8923 1532821 11049498 22480442 32360128 37755973 36933707 30386717 21890840 15734343
8915 15734343 12223949 8728763 5542684 6817613 13856526 20904979 20417161 10625186
8907 10625186 -3522803 -13976117 -12989616 1584148 20445708 27888388 19210699 8443476
8899 8443476 10455211 19769702 18798936 4992271 -4959162 -474534 8427893 8538013
8891H538013p155917p152221q061935j0124230k619746J2129105J4799810q81143
8883e28264j4530532q620239N878155Q359180j421001q334839n675361J621028
8875b3251873Q765631J2145540O565854n774356j1519047l213147Q349882R959125
8867B027609M271822P65312l14234k134890j195382L264865K318174n957994p554264
8858d508982L402701Q985986l302661j4101273k022610J6870613J2511939q816295
8850I019418j5035739j788287N228313j51741M081575K0945929K1969233l238490
8842D1030211k4079962j6387263J030098J143441r214919q730613O80540L500840
8834a1027627L81490K118427P123804P599150O156532O437770O35754j3738737
$$ plain form
8891 8538013 1382096 -5770125 -13832060 -23956290 -26576036 -14446931 352879 -528264
8883 -528264 -15058796 -23679035 -17800880 -9441700 -10862701 -19197540 -24872901 -23251873
8875 -23251873 -14486242 -2340702 4225152 -1549204 -13068251 -16281398 -7931516 2027609
8867 2027609 6299431 7064743 6750509 4615619 3420237 6685102 9003276 3045282 -4508982
8858 -4508982 -1106281 7879705 4577044 -9524229 -11546839 5323774 17835713 9019418
8850 9019418 -6016321 -7804608 -2576295 -2728036 1353539 22299468 44268701 41030211
8842 41030211 16950249 562986 1593084 2736525 -6478394 -15209007 -14528467 -11027627
8834 -11027627 -10646137 -8527710 -1403906 6195244 12351776 18789546 19425300 5686563
8826E686563j9522810m803130J1894327O630992j1203168j2920518M033769J3818722
8818f385253L821211r224827q621614P41896P483393J0722975J2537829Q361314
8810A9436924m209065j5754650j3657502K450036J8572858J9504510M428826j0456761
8802B0315176q826473N788368J4294076P782017k296444m196993k224597m020926
8794B6614204n512236j547889P63872n159538r726043j546018J0943752J0610896
8786B5441000j779351j0667670j0673242r394645q509681k163676O207898N149384
8778f389983m436388q026271j31294P957466P062945J737810j212607j554411
8770d992733J291027R781651J7857624J3051044m558019j8242762j6390406o489387
$$ plain form
8826 5686563 -13836247 -18639377 -6745050 -114058 -11317226 -24237744 -20203975 -6385253
8818 -6385253 -2564042 -11788869 -20410483 -19668587 -12185194 -1462219 11075610 19436924
8810 19436924 15227859 -526791 -14184293 -11734257 6838601 26343111 30771937 20315176
8802 20315176 11488703 17277071 31571147 39353164 37056720 32859727 30635130 26614204
8794 26614204 21101968 19554079 20317951 15158413 5432370 3886352 14830104 25441000
8786 25441000 23661649 12993979 2320737 -7073908 -15583589 -17747265 -11539367 -6389983
8778 -6389983 -10826371 -18852642 -18983936 -11026470 -3963525 -2225715 -3438322 -4992733
8770 -4992733 -3701706 6079945 23937569 36988613 32430594 14187832 -2202574 -8691961
8762h691961l03254K754486Q216738J3153570J1249102M184719k021587o384196
8754B2157617r705465p848483J439042R277189M738496q183617j3958929o967139
8746i051289J583847K269952J852445R745315J8192392J0548334j1552036k4750988
8738a162028j3855271P418782J5624475P465491k432056n764648o407629o189428
8730e302312k372520J246121k282189q067994n150353K538167J416807m300802
8722b2275075M094123K3243203K4162090j013316j9109791n053755J6820286J0640295
8714C1508060j4191095k0196201j473316J2564199P240667j161987j39558K250092
8706A6400861L22622L50133J159956o958322j7868742j2102100Q639948J7634628
$$ plain form
8762 -8691961 -8995215 -6240729 1976009 15129579 26378681 30563400 28541813 22157617
8754 22157617 12452152 4603669 6042711 15319900 20058396 11874779 -2084150 -9051289
8746 -9051289 -7467442 -5197490 -3345045 6400270 24592662 35140996 23588960 -1162028
8738 -1162028 -15017299 -7598517 8025958 15491449 13059393 7294745 887116 -5302312
8730 -5302312 -7674832 -6428711 -8710900 -16778894 -21929247 -19391080 -17974273 -22275075
8722 -22275075 -18180952 5062251 29224341 28211025 9101234 4047479 20867765 31508060
8714 31508060 17316965 -2879236 -4352552 8211647 15452314 14290327 14150769 16400861
8706 16400861 16723483 17073616 18233572 11275250 -6593492 -18695592 -10055644 7578984
8698G578984L831072j1189847r222756j070286q22381j138008O196432Q921424
8690C084634l244443j4309170n299468J2868622J5236718J142506q075230l352424
8682a948255L338965J908544m160402q449238p951430k24856J2015624J6867784
8674A1396736P719517l025179k62581Q879876N202147j0191321j5302021j809495
8666B607679J0993101N487240q549829j0158370K778714J3549022J0472290j434002
8658B5745845j0427313j0337574l257489L395097K653527m173481o642054K066465
8650i76977J2537574P574317j3994127l0408330k1516633N063230K2632956J8352263
8642g35727N172995r56703j214104k953353k307304P029213J5870274Q874789
$$ plain form
8698 7578984 11410056 220209 -9002547 -10072833 -10895214 -12033222 -5836790 3084634
8690 3084634 -159809 -14468979 -19768447 -6899825 8336893 9479399 1404169 -1948255
8682 -1948255 1390710 3299254 -861148 -9310386 -17261816 -17486672 -5471048 11396736
8674 11396736 19116253 16091074 15828493 24708369 29910516 19719195 4417174 2607679
8666 2607679 13600780 19088020 10538191 379821 3158535 16707557 27179847 25745845
8658 25745845 15318532 4980958 1723469 5118566 7772093 3598612 -3043442 -976977
8650 -976977 11560597 19134914 5140787 -25267543 -46784176 -41720946 -19087990 -735727
8642 -735727 4437268 3480565 2266461 -686892 -2994196 4035017 19905291 28780080
8634B8780080j0016375j9285969r422139N200746Q778370L612342J91226Q98705
8626H736986K509943M354225M989176k42282r762807j2554339l391028O771343
8618A411217N053096n913705j4055717j4053221p727463L846938J6648343J9072095
8610D281583N479814r523994n732806J4148379K5266279J2510420j1173984k3042594
8602A2213097j6444249k385981O295175M907698l704077j2344264j3599879n754930
8594c0817410N263500J1702342J1092597O965800M153073M180507M160072L22056
8586A7022537o115896q065024o63012J0457229J3236784K881161j1611411j6635295
8578E07073q030036N523218J1984114P651616q1408j321225M689159P933697J8241
$$ plain form
8634 28780080 18763705 -522264 -9944403 -4743657 4034713 7647055 7838281 8736986
8626 8736986 11246929 15601154 20590330 20348048 10585241 -1969098 -5360126 1411217
8618 1411217 6464313 550608 -13505109 -27558330 -35285793 -31438855 -14790512 4281583
8610 4281583 9761397 237403 -5495403 8652976 33919255 46429675 35255691 12213097
8602 12213097 -4231152 -6617133 -321958 4585740 881663 -11462601 -25062480 -30817410
8594 -30817410 -25553910 -13851568 -2758971 4206829 8359902 12540409 16700481 17022537
8586 17022537 10906641 2841617 2178605 12635834 25872618 28753779 17142368 507073
8578 507073 -7522963 -1999745 9984369 17635985 17554577 16233352 20922511 28856208 28874449
8569B8874449j3045198j5664269k329452J2977929J2756361j961209j3584054
8562H024557j1296724k305405L329000P502035J4566133J6717599L814059j6080269
8554B4270985k2468589j0176422L929189N924346J385613K70170M42664k899061
8546F78895m252699K079885Q181725K925090r976216j6947642j2532627j593941
8538c1437530J0188533J7204936J2956311L39021n376488K885999J0177841K135610
8530A9074233r754541o686666L396791k582067k1441929k4500926k983773J7127148
8522b8351730J5172205L803615K792611Q300513O611089N98105J995195Q310584
8514A9232187O614872m832995j3849332j1293221o46976Q119864Q333229K019876
$$ plain form
8569 28874449 15829251 164982 -2164470 10813459 23569820 21608611 8024557
8562 8024557 -3272167 -5577572 -2248572 5253463 19819596 36537195 40351254 24270985
8554 24270985 1802396 -8374026 -4444837 1479509 2865122 3135292 3577956 678895
8546 678895 -3573804 -1493919 6687806 9612896 -363320 -17310962 -29843589 -31437530
8538 -31437530 -21248997 -4044061 8912250 9251271 3874783 6760782 16938623 19074233
8530 19074233 9319692 2633026 6029817 3447750 -17994179 -42495105 -45478878 -28351730
8522 -28351730 -13179525 -9375910 -6583299 1717214 8328303 8926408 10921603 19232187
8514 19232187 25847059 21014064 7164732 -4128489 -4775465 3344399 11677628 13697504
8506A3697504k208695L16075L486450K38663m975184m050958q90572m495418j0091497
8497h973632n410735N736239O862275l291629q221919j938489L298830K182280
8489i756780M836720J3018062J3038644K135148l163765L612174O390999l765940
8481B6345262j2438605r933318q610566j4835768j1614097R150018K3976464J2843413
8473A4882803p206073j0537186k615570k525122o648690p15483R567623J0647864
8465D850166P851420J0487540P723862r507270k1152726p557365J1356726N026316
8457I078669j5510968j6669358m58811L045751o891275j774159J9648160K5161601
8449A5629610N502821j0034095m871587J935505k591369k531828J0947271J8499836
$$ plain form
8506 13697504 11488809 11804884 15291334 15529997 10554813 6503855 5613283 1117865 -8973632
8497 -8973632 -14384367 -8648128 -1785853 -5077482 -13299401 -15237890 -11939060 -9756780
8489 -9756780 -4920060 8098002 21136646 23271794 20108029 23720203 30111202 26345262
8481 26345262 13906657 3973339 -4637227 -19472995 -31087092 -21937074 2039390 14882803
8473 14882803 7676730 -2860456 -5476026 -8001148 -14649838 -15365321 -5797698 4850166
8465 4850166 12701586 23189126 30912988 21405718 252992 -7304373 4052353 9078669
8457 9078669 -6432299 -23101657 -23560468 -20514717 -27405992 -29180151 -9531991 15629610
8449 15629610 21132431 11098336 6226749 8162254 5570885 3039057 13986328 32486164
8441C2486164O725603r040047j3635213j3646721j4547193o822708R191836J4769250
8433E480971N097105L79816R330292J2983534J502838o054344J635871N325904
8425C5681987p897909j7606001o666431N789557j983240j5235086r566433O516688
8417a0966868Q925597j250421n919125k543892N90031N588410J3893768J1301014
8409A9618514q141951k1524273r399974J0402004J2164601M774772R400943J5121139
8401C2415775r75617k4644437k1606630M428933J6958336O362759j592962K754056
8393A4100213J27086j2809354j2272013O139914J3041168n024667k0710866j1483962
8385b8892481N652431Q564057O260476J3542536J8044482L754006j4333837j1381564
$$ plain form
8441 32486164 39211767 30171720 16536507 2889786 -11657407 -18480115 -9288279 5480971
8433 5480971 10578076 10957892 20288184 33271718 34774556 28720212 30356083 35681987
8425 35681987 27784078 10178077 3511646 9301203 7317963 -7917123 -17483556 -10966868
8417 -10966868 -2041271 -3291692 -9210817 -11754709 -11164678 -5576268 8317500 19618514
8409 19618514 11476563 -10047710 -19447684 -9045680 3118921 7893693 17294636 32415775
8401 32415775 31440158 6795721 -14810909 -10381976 6576360 12939119 11346157 14100213
8393 14100213 14227299 1417945 -10854068 -4714154 8327014 3302347 -17408519 -28892481
8385 -28892481 -23240050 -14675993 -8415517 5127019 23171501 26925507 12591670 1210106
8377A210106O068130J0603358l437725j5755656j3562469m421729K787677Q415064
8369h093244J2518233J1615607O771193K862758j8867m613883q353843o662291
8361F025663j208717L620383P649991J0005247M568161r046436j7660828j0645708
8353f692244K807641O710091K131601J446218M145721j163316j1787181j0502629
8345a2904098N161493J4739454N638569p108256n496954L838213M269647j993945
8337F144123j308783L698292j367492j2520592q288040J3303301K3973925N406338
8329B9041072k0546396k1548614R7249J5009732J0581109K015385J399334J136933
8321A7185804n930215j1372477o762909J306516K912150l87852k338994l047299
$$ plain form
8377 1210106 7278236 17881594 14443869 -1311787 -14874256 -19295985 -16508308 -8093244
8369 -8093244 4424989 16040596 22811789 25674547 25655680 21041797 12687954 6025663
8361 6025663 4816946 8437329 16087320 26092567 30660728 21614292 3953464 -6692244
8353 -6692244 -3884603 2825488 4957089 6403307 10549028 9385712 -2401469 -12904098
8345 -12904098 -7742605 6996849 12635418 5527162 30208 3868421 8138068 6144123
8337 6144123 4835340 8533632 7166140 -5354452 -13642492 -339191 23634734 29041072
8329 29041072 8494676 -13053938 -12956689 2053043 12634152 14649537 16048871 17185804
8321 17185804 11255589 -116888 -6879797 -5573281 -2661131 -3048983 -5387977 -8435276
8313h435276l843558r94038O020387R194174M263517p81970J288532M911001K744840
8304A4367609r16427Q89356M262257J811980m402914q693032j1896575j4393239
8296a8970985r485922L085666R044072J089675m565341O334678J7222485M392983
8288H147311j9764050k0115630O411075K4232622J3293143m318379m978642J311192
8280D218642l137611r549446r93700J3799378J3151984j702029r904819m794432
8272A087967j57682l622561n583111J819518J1748679J4161048Q348573l39419
8264B7463012p302891r280428n522020k78189J654451J648723L582402N426664
8256A7391724K429092k582606j396170O113502R525155J903116j0703107j7742455
$$ plain form
8313 -8435276 -12278834 -13272872 -7252485 1941689 6205206 5423236 6711768 11622769 14367609
8304 14367609 13451182 14340538 18602795 20414775 16011861 7318829 -4577746 -18970985
8296 -18970985 -28456907 -25371241 -16327169 -15237494 -19802835 -13468157 3754328 8147311
8288 8147311 -11616739 -31732369 -25321294 -1088672 12204471 7886092 2907450 4218642
8280 4218642 1081031 -8468415 -9462115 4337263 17489247 15787218 5882399 1087967
8272 1087967 930285 -2692276 -8275387 -6455869 5292810 19453858 27802431 27463012
8264 27463012 20160121 10879693 5357673 5079484 6733935 8382658 11965060 17391724
8256 17391724 19820816 17238210 15842040 21955542 31480697 33383813 22680706 4938251
8248D938251j7011779j4345439j3116172r100000K500913J6885000K0928769Q368724
8240D8267q902432j2091430J004832J2301515P427388n338546q234874P04528
8232a3080752O945104J724407o554422n517838N127733J5094724J6214487R455925
8224B9409368J146340m561060q055360r372766m748241O434779J3432152L554112
8216B7239324j7082778k4595718q138906J1596466Q911844j0174876j6668754
8209b8913398j227654J3598515Q496464n576167p069932M868801J3910814J1614181
8201I701624L528529m153394r194033p223271M580494J7207041J5958226j38142
8193C0267074j5027780j5040252l400617P314881R041245J451629j0462603j7652989
$$ plain form
8248 4938251 -12073528 -26418967 -39535139 -48635139 -46134226 -29249226 -8320457 48267
8240 48267 -8854165 -20945595 -19940763 -7639248 -211860 -5550406 -13785280 -13080752
8232 -13080752 -6135648 -4411241 -10965663 -16483501 -11355768 3738956 19953443 29409368
8224 29409368 30555708 25994648 17939288 8566522 3818281 10253060 23685212 27239324
8216 27239324 10156546 -14439172 -22578078 -10981612 -2069768 -12244644 -28913398
8209 -28913398 -30141052 -16542537 -8046073 -13622240 -20692172 -15823371 -1912557 9701624
8201 9701624 13230153 9076759 -117274 -7340545 -2760051 14446990 30405216 30267074
8193 30267074 15239294 199042 -3201575 4113306 13154551 14606180 4143577 -13509412
8185a3509412j2859593J60928R099640Q356519N125499O559865R192467P073705
8177A9199618K266586p62296m109984j0459748j4126408q669366Q49960M182110
8169a1629528J352695O70271L738071M453872J828821J350040L261262J801656
8161F827160k797426m028784k296384m876565j0044506o144068Q057603J6818348
8153A515378R354049m678416j0668139p885063l037649K985680J0178811J1652904
8145I417555L642386m914755m639668M33830K432470L510222P268648O641035
8137B3791723l556914j0974347j611105J4728268J5434386j058281j3271839r264828
8129A4217063q02172o38622m379711l029259J037812K17476n665829j0521567
$$ plain form
8185 -13509412 -26369005 -26208077 -17108437 -8751918 -3626419 2933446 12125913 19199618
8177 19199618 21466204 20703908 16593924 6134176 -7992232 -16661598 -15811638 -11629528
8169 -11629528 -10276833 -9606562 -5868491 -1414619 414202 1764242 5025504 6827160
8161 6827160 4029734 950 -2295434 -7171999 -17216505 -23360573 -15302970 1515378
8153 1515378 10869427 6191011 -4477128 -12362191 -15399840 -12414160 -2235349 9417555
8145 9417555 13059941 8145186 3505518 3939348 6371818 9882040 17150688 23791723
8137 23791723 20234809 9260462 7649357 22377625 37812011 36753730 23481891 14217063
8129 14217063 13414891 12776269 8396558 5367299 6405111 6622587 956758 -9564809
8121i564809r933067m047945K449630K966936k394545l421893O570247J7574827
8113A99381J4834399O58800q963352p044922n04337N187247R865195Q641431l480077
8104A9393765j6268839j3009477K780823R428656J61603p187604o50151P495970
8096B144746L979694l752007l281112J894386K359856J64825J463415K996388
8088G970191l96431m396866l380899q42750j261558j201054K052853L389594R3449
8079B026529k300378k166813o003581j2319157q041298Q293754J7960768J0212593
8071G662417L38735L264615Q239304P0130j2234225j1758467l570399k849319
8063a0837209n789493P56724J0851923Q669188j653461l554405Q84008l366123
$$ plain form
8121 -9564809 -19497876 -23545821 -21096191 -18129255 -20523800 -23945693 -17375446 199381
8113 199381 15033780 15692580 6729228 -315694 -820031 4367216 14232411 22873842 19393765
8104 19393765 3124926 -9884551 -7103728 2324928 2486531 -4701073 -5351224 2144746
8096 2144746 6124440 2372433 -908679 985707 3345563 3510388 4973803 7970191
8088 7970191 7573760 3176894 -204005 -1046755 -2308313 -3509367 -1456514 1933080 2026529
8079 2026529 -273849 -2440662 -8444243 -20763400 -28804698 -20510944 -2550176 7662417
8071 7662417 8001152 11265767 19505071 19575201 7340976 -4417491 -7987890 -10837209
8063 -10837209 -16626702 -15869978 -5018055 3651133 1997672 -1556733 -672725 -4038848
8055d038848j2391400q523869M453116M429968q367106p956754J2325053K4600854
8047D531014J0337926r897370r169743O927371J4629503P595448k147154o593828
8039A6213167o920531m193363P17652L647752L208694L670821N224195R79045
8031B2547432r450836j4502987p353906K220567J717424p228645j4029973j2882519
8023c8963443m358700P879984J5509023J0403242k138389n287316O681338J8164760
8015G890499J3413851k018171j1046937p791004J42290N509264O793148L770646
8007A6663586k740805q232256p994437k443249L830724O136178K402177l981606
7999C640312n061837J811419P322226K136539p410447p605582P64450L876473
$$ plain form
8055 -4038848 -16430248 -24954117 -20501001 -16071033 -24438139 -32394893 -20069840 4531014
8047 4531014 14868940 4971570 -4198173 2729198 17358701 24954149 22806995 16213167
8039 16213167 9292636 5099273 5816925 9464677 12673371 16344192 21568387 22547432
8031 22547432 13096596 -1406391 -8760297 -6539730 -4822306 -12050951 -26080924 -38963443
8023 -38963443 -43322143 -35442159 -19933136 -9529894 -11668283 -16955599 -10274261 7890499
8015 7890499 21304350 19286179 8239242 448238 590528 6099792 12892940 16663586
8007 16663586 13922781 5690525 -2303912 -4747161 -916437 5219741 7621918 3640312
7999 3640312 -1421525 389894 7712120 9848659 2438212 -5167370 -4402920 -526447
7991e26447j852187n190037j494766k28598n203640n956475J900427N315012m690384
7982a7927095j4969260q372847J0569569K2084387J6434943J572028r130269q239048
7974g977592K014946J1665578J2657506P515638K313728m840103j6006414j9843978
7966a2500691n333947J4304024J5827917L424210K913984J5851180J4037815j0458468
7958C8066024k7161543j6693231j630476l903482p442445N678921J5753454O07535
7950C274757j8333832q868016J5174024J6279344l915407j2152239k843554m83574
7942a1868497q288720m267166J1132591J2252700k087604l614711J2298773J5500616
7934B1057982m340519j7884342p889042L175167k011802n644064N364513J0025088
$$ plain form
7991 -526447 -2378634 -7568671 -9063437 -9292035 -14495675 -20452150 -18551723 -13236711 -17927095
7982 -17927095 -32896355 -41269202 -30699633 -8615246 7819697 9391725 261456 -7977592
7974 -7977592 -5962646 5702932 18360438 25876076 28189804 23349701 7343287 -12500691
7966 -12500691 -17834638 -3530614 12297303 15721513 18635497 34486677 48524492 38066024
7958 38066024 10904481 -5788750 -7419226 -11322708 -18765153 -13086232 2667222 3274757
7950 3274757 -15059075 -23927091 -8753067 7526277 3610870 -8541369 -11384923 -11868497
7942 -11868497 -20157217 -24424383 -13291792 -1039092 -3126696 -6741407 5557366 21057982
7934 21057982 16717463 -1166879 -9055921 -5880754 -7892556 -13536620 -8172107 1852981
7926A852981o398559j9450887o557195J1486650O813476o212281J696801K0998730
7918D229716K0035682J76369q893160p10968K393937p088251j1082691j838693
7910b778059N068907n4867p132690q219477q459570r106953k867204P580287Q747222
7901a7222404R52893J825362J6263848K3882141Q669298j6206142k6786657j8023374
7893b6645035k284662J0037367J4874183Q825913n993867j6255100r984249O397754
7885b1027696J4283686O329433n373432o340923K820343R994523P362162k018018
7877F030078j1252409j6792508j7148335j0274500K726444J4194629J6085582
7870a6431019R058397Q15338l546921m378435k422852J817617M129309J63081
$$ plain form
7926 1852981 -4545578 -23996465 -30553660 -19067010 -12253534 -18465815 -16769014 4229716
7918 4229716 24265398 24441767 15548607 14837639 17231576 10143325 -939366 -2778059
7910 -2778059 2290848 2235981 -4896709 -13116186 -21575756 -30682709 -33549913 -25969626 -17222404
7901 -17222404 -16269511 -14444149 1819699 25701840 34371138 18164996 -8621661 -26645035
7893 -26645035 -28929697 -18892330 -4018147 4807766 -1186101 -17441201 -27425450 -21027696
7885 -21027696 -6744010 -414577 -5788009 -12128932 -9308589 685934 8048096 6030078
7877 6030078 -5222331 -22014839 -39163174 -49437674 -46711230 -32516601 -16431019
7870 -16431019 -7372622 -6557284 -10104205 -14482640 -16905492 -15087875 -10958566 -10795485
7862a0795485o198469o313544J05921M323795K991207L176308R161268J4149501
7854A0600502J0888423K351182l990276n683499m424409k388393k837391p047166
7846b531027q683242p59820J0094382Q735121n562541j4959858p337433R033878
7838a1970540K0897853K4668603J8802133k51971k3568796k9579304j2746964
7831a3748986M644924M914594O39360Q402890J6396697N347788j3109243j1521724
7823A966300P136507J2114759o018387k1401614j4743656K4290L033423j897556
7815a9785934q59839M820136M265548k592208n745412j335970L807445K098368
7807a5327866o020279j1699845n126837J2572014K5742468J9453227j551507j6498402
$$ plain form
7862 -10795485 -16993954 -23307498 -23201577 -18877782 -15886575 -12710267 -3548999 10600502
7854 10600502 21488925 23840107 19849831 14166332 9741923 7353530 4516139 -2531027
7846 -2531027 -11214269 -11974089 -1879707 6855414 1292873 -13666985 -21004418 -11970540
7838 -11970540 8927313 33595916 52398049 52146078 28577282 -1002022 -13748986
7831 -13748986 -9104062 -4189468 -3550108 4852782 21249479 26597267 13488024 1966300
7823 1966300 9102807 21217566 15199179 -6202435 -20946091 -20921801 -17888378 -19785934
7815 -19785934 -20645773 -15825637 -11560089 -14152297 -19897709 -21233679 -17426234 -15327866
7807 -15327866 -21348145 -33047990 -38174827 -25602813 139655 19592882 18041375 1542973
7799A542973j2104236L971645J3844892Q042374o838354j5192685q217574N625431
7791i325534J0567505M672749J011931M888148M944751m904990j1759144n578922
7783e483506J903047k030561p245836N38977J1756301R198507l14729P92763O485414
7774A5600377j459079j5136788j0080961R156414J1577013q416489k0199171o796837
7766b5755521J1501487J5966057J5603590J7964626R252029j4230484k6477606
7759C824178r779359J3973265J6615472N084535J966457N719191M67924j0547968
7751B7323695j1803414m905436l132776m782165J719112J2112947J0728331k490975
7743B4769319j1366959q412432j877150P17717N07120M87640K863300R141512
$$ plain form
7799 1542973 -10561263 -6589618 7255274 15297648 8459294 -6733391 -14950965 -9325534
7791 -9325534 1241971 5914720 6926651 11814799 16759550 11854560 95416 -5483506
7783 -5483506 -3580459 -5611020 -12856856 -12317879 -561578 8636929 8322200 9114963 15600377
7774 15600377 14141298 -995490 -11076451 -1920037 9656976 1240487 -18958684 -25755521
7766 -25755521 -14254034 1712023 17315613 35280239 44532268 30301784 3824178
7759 3824178 -5955181 8018084 24633556 29718091 31684548 37403739 37871663 27323695
7751 27323695 15520281 10614845 7482069 2699904 4419016 16531963 27260294 24769319
7743 24769319 13402360 4989928 3112778 3830495 4337615 4825255 7688555 16830067
7735A6830067J3590771N395524j2536072j9545796n371806J1505535J0058408
7728A9926631k646496o405340o03602N13230m385088m244219J800866M049689
7720H005671P06201j861862k948963n136171m609321L76109O97084p363627r595039
7711b1729918K808084J2357532K308048j0800570k386158J5453273J1407563j0283150
7703h65296j3751601Q967671K3838682R309497j3101755j7291992q255651j402552
7695a2552997M672345J3981918J5370667Q43322j5460981j5802326l203847P489418
7687d662481R901953N199437n103684j3651231q723522P617574J7086475J0744293
7679A8408814J045871j287854l231251r786691r426269L295317J0343326k765735
$$ plain form
7735 16830067 30420838 35816362 23280290 3734494 -1637312 9868223 19926631
7728 19926631 17280135 10874795 10271193 10784423 6399335 2155116 3955982 8005671
7720 8005671 8711872 6850010 3901047 -1235124 -5844445 -5468336 -4771252 -12134879 -21729918
7711 -21729918 -18921834 -6564302 -4256254 -15056824 -17442982 -1989709 9417854 -865296
7703 -865296 -14616897 -5649226 18189456 27498953 14397198 -2894794 -11150445 -12552997
7695 -12552997 -7880652 6101266 21471933 22315255 6854274 -8948052 -12151899 -4662481
7687 -4662481 5239472 10438909 5335225 -8316006 -17039528 -9421954 7664521 18408814
7679 18408814 19454685 18166831 14935580 5148889 -4277380 -982063 9361263 6595528
7671F595528j9207395j4854187L224601R560772K290822K162649J2583572J2381876
7663A4738238n737700j8475563p473630J1055989J1136189l799625q547051L990016
7655c113137J3576924N773757o300761m620036M100518n08304j7741108k3290294
7647c2122441n453057J5275206J4712185j134354p484109K094352R243458Q92599
7639c976161j1455242q310511J2085494L0755977K7385324J809740k2667190k2302512
7631C324919j531943J1404311K643717q754755k441399J0577343Q105939m686176
7623A8641956n095641O428804O836831q880980j8596733r489451M756419J0413956
7615E015161J0850474R190935L28063j0337187o962614O967360O742658j2334573
$$ plain form
7671 6595528 -12611867 -27466054 -24241453 -14680681 -12389859 -10227210 2356362 14738238
7663 14738238 9000538 -9475025 -16948655 -5892666 5243523 1443898 -7103153 -3113137
7655 -3113137 10463787 16237544 9936783 5316747 9417265 8908961 -8832147 -32122441
7647 -32122441 -37575498 -22300292 -7588107 -8722461 -16206570 -14112218 -4868760 -3976161
7639 -3976161 -15431403 -23741914 -11656420 19099557 46484881 48294621 25627431 3324919
7631 3324919 1792976 13197287 15841004 7086249 4644850 15222193 23328132 18641956
7623 18641956 13546315 19975119 26811950 17930970 -665763 -10155214 -5398795 5015161
7615 5015161 15865635 25056570 25384633 15047446 8084832 15052192 21794850 9460277
7607I460277k1277884l187260J6604773J0335371q509994j0580507J550916L970769
7599a633539m559852l359860J1542881K0383888J1103918o475485j8566397k0107086
7591a1671532j0733088M298680J1426277L598550n596238J030295J7442858K2057965
7583C1853767Q739877p568938j4001559j1598307n362513J467700L637310j559361
7575E607976o691258l186897M939557Q054700O471012N908315L689919m903978
7567A9889346j1894324n647976Q242715J2075969R76525j2260756j6088150j0397513
7559a5104164L2224R175481R731835J706198l597404J05402K061326o824789j4261033
7550a6974924n376391Q697722N750193j0219364j3905425Q88852J3615248J2028222
$$ plain form
7607 9460277 -11817607 -15004867 1599906 11935277 3425283 -7155224 -5604308 -1633539
7599 -1633539 -6193391 -9553251 1989630 22373518 33477436 27001951 8435554 -11671532
7591 -11671532 -22404620 -18105940 -6679663 -3081113 -8677351 -7647056 9795802 31853767
7583 31853767 40593644 33024706 19023147 7424840 2062327 3530027 7167337 5607976
7575 5607976 -1083282 -4270179 669378 8724078 15195090 21103405 24793324 19889346
7567 19889346 7995022 2347046 10589761 22665730 23642255 11381499 -4706651 -15104164
7559 -15104164 -15071940 -5896459 3835376 5541574 1944170 2049572 4110898 -2713891 -16974924
7550 -16974924 -22351315 -13653593 -7903400 -18122764 -32028189 -31139337 -17524089 -5495867
7542e495867P504454R304238R346092K135433k806407N76366L430369l76611l006856
7533B0611211P95049L097779q14838k065031M643377R341618M381964j113994
7525C8877135K372273P173910J657345r624527j3699958r381360n864956o420889
7517E088973o153557l320772k181506m699211o570757k690898O012143J1502102
7509c013483O101206o362919j1366769k089372Q687324N664582n394745o030181
7501a3804357O034404J4259296J0158731L898384L728331L147318l801515j0303471
7493A3317121q778034k285412L456949P302691O368881l548575j5242656j3114658
7485a2523693L418104J4927746R095436k737024n846209k720960j573483l72214
$$ plain form
7542 -5495867 2008587 11312825 20658917 22794350 19987943 20564309 23994678 23618067 20611211
7533 20611211 21406260 24504039 23689201 21624170 26267547 35609165 39991129 38877135
7525 38877135 41249408 48423318 50080663 40456136 26756178 17374818 11509862 5088973
7517 5088973 -1064584 -4385356 -6566862 -11266073 -17836830 -20527728 -14515585 -3013483
7509 -3013483 3087723 -3275196 -14641965 -16731337 -8044013 -2379431 -7774176 -13804357
7501 -13804357 -7769953 6489343 16648074 20546458 24274789 27422107 23620592 13317121
7493 13317121 4539087 2253675 5710624 13013315 19382196 15833621 590965 -12523693
7485 -12523693 -9105589 5822157 14917593 12180569 6334360 3613400 2039917 1667703
7477A667703L323950J461813r131927j3638036l531J7685248J6538900j328290
7469A6575830j2341612n484569O306056Q955274M390627J099172M36722j920360
$$ plain form
7477 1667703 4991653 6453466 -2678461 -16316497 -16320028 1365220 17904120 16575830
7469 16575830 4234218 -1250351 5055705 14010979 18401606 19500778 19937500 18017140
$$ [...]
##END NTUPLES=NMR SPECTRUM
##END=
