##TITLE=31Pdec_SR158_k
 CDCl3, 64 sc
 16.1.2023
##JCAMPDX= 6.0         $$ Bruker NMR JCAMP-DX V2.0
##DATA TYPE= NMR SPECTRUM
##DATA CLASS= NTUPLES
##ORIGIN= UXNMR, Bruker Analytische Messtechnik GmbH
##OWNER= root
$$ XWIN-NMR		Version 3.5
$$ Mon Jan 16 15:32:28 2023 Russian Standard Time (UT+4h)  she@DPX200
##.OBSERVE FREQUENCY= 81.013821
##.OBSERVE NUCLEUS= ^31P
##.ACQUISITION MODE= SIMULTANEOUS
##.ACQUISITION SCHEME= undefined
##.AVERAGES= 64
##.DIGITISER RES= 16
##SPECTROMETER/DATA SYSTEM= spect
##.PULSE SEQUENCE= zgpg30
##.SOLVENT NAME= DMSO
##.SHIFT REFERENCE= (INTERNAL, DMSO, 0, 248.564)
##AUDIT TRAIL= $$ (NUMBER, WHEN, WHO, WHERE, WHAT)
$$ ##TITLE= Audit trail, XWIN-NMR		Version 3.5
$$ ##JCAMPDX= 5.01
$$ ##ORIGIN= Bruker BioSpin GmbH
$$ ##OWNER= she
$$ F:/spectra/data/she/nmr/P31/1/pdata/1/auditp.txt
$$ ##AUDIT TRAIL=  $$ (NUMBER, WHEN, WHO, WHERE, WHAT)
(   1,<2023-01-16 15:31:39.37 +0400>,<she>,<DPX200>,
      <continue with go, POWCHK disabled, PULCHK disabled
       configuration hash MD5:
       00 E9 B6 7A A2 85 ED C7 34 08 36 98 17 FE 4E 26
       data hash MD5: 32K
       42 DC 2B AB 74 88 80 D7 96 E2 56 4B F0 55 13 4D>)
(   2,<2023-01-16 15:31:41.12 +0400>,<she>,<DPX200>,
      <Start of raw data processing
       efp BC_mod = 2 LB = 1 FT_mod = 6 PKNL = 1 PHC0 = -10851.7 PHC1 = 661.0566 SI = 64K 
       data hash MD5: 64K
       7F 4B 17 56 3D D8 90 77 09 70 B8 40 F4 67 D7 B3>)
(   3,<2023-01-16 15:31:59.57 +0400>,<she>,<DPX200>,
      <pk PHC0 = -61.9977 PHC1 = 248.9998 
       data hash MD5: 64K
       98 6D 83 45 63 86 B7 08 50 FA BE 3E C0 E9 2A B8>)
(   4,<2023-01-16 15:32:02.96 +0400>,<she>,<DPX200>,
      <abs ABSG = 5 
       data hash MD5: 64K
       15 88 78 11 C5 6D 2B C7 60 B2 FA C4 BC A1 34 9E>)
$$ ##END=
$$ 
$$ hash MD5
$$ BD 92 FE B4 A1 CF B6 50 C6 D6 DC 91 76 56 CA 8C
##$RELAX= 
##$RELAX= 
##$RELAX= 
##$RELAX= 
##$RELAX= 
##$RELAX= 
##$RELAX= 
##$RELAX= 
##$RELAX= 
$$ Bruker specific parameters
$$ --------------------------
##$DU= <F:/spectra>
##$EXPNO= 1
##$NAME= <P31>
##$PROCNO= 1
##$TYPE= <nmr>
##$USER= <she>
##$AMP= (0..31)
100 100 100 100 100 100 100 100 100 100 100 100 100 100 100 100 100 100 
100 100 100 100 100 100 100 100 100 100 100 100 100 100 
##$AQSEQ= 0
##$AQ_mod= 1
##$AUNM= <au_zg>
##$AUTOPOS= <>
##$BF1= 81.014009
##$BF2= 200.13
##$BF3= 200.13
##$BF4= 200.13
##$BF5= 200.13
##$BF6= 200.13
##$BF7= 200.13
##$BF8= 200.13
##$BYTORDA= 1
##$CFDGTYP= 0
##$CFRGTYP= 5
##$CHEMSTR= <none>
##$CNST= (0..31)
1 1 145 1 1 1 1 1 1 1 1 1 1 1 1 1 1 1 1 1 1 1 1 1 1 1 1 1 1 1 1 1 
##$CPDPRG= <waltz16>
##$CPDPRG1= <>
##$CPDPRG2= <waltz16>
##$CPDPRG3= <>
##$CPDPRG4= <mlev>
##$CPDPRG5= <mlev>
##$CPDPRG6= <mlev>
##$CPDPRG7= <mlev>
##$CPDPRG8= <mlev>
##$CPDPRGB= <>
##$CPDPRGT= <>
##$D= (0..31)
0 1 0 0 0 0 0 0 0 0 0 0.03 2e-05 3e-06 0 0 0 0 0 0 0 0 0 0 0 0 0 0 0 0 
0 0 
##$DATE= 1673868618
##$DBL= (0..7)
120 120 120 11 120 120 24 19 
##$DBP= (0..7)
150 150 150 150 150 150 150 150 
##$DBP07= 0
##$DBPNAM0= <>
##$DBPNAM1= <>
$$ [...]
##$SUBNAM3= <"">
##$SUBNAM4= <"">
##$SUBNAM5= <"">
##$SUBNAM6= <"">
##$SUBNAM7= <"">
##$SUBNAM8= <"">
##$SUBNAM9= <"">
##$SW= 501.771253377433
##$SWIBOX= (0..15)
0 1 3 0 0 0 0 0 0 0 0 0 0 0 0 0 
##$SW_h= 40650.406504065
##$TD= 32768
##$TD0= 1
##$TE= 0
##$TE2= 300
##$TE3= 300
##$TEG= 300
##$TL= (0..7)
0 120 53 12 22 120 120 120 
##$TP= (0..7)
150 150 150 150 150 150 150 150 
##$TP07= 0
##$TPNAME0= <>
##$TPNAME1= <>
##$TPNAME2= <>
##$TPNAME3= <>
##$TPNAME4= <>
##$TPNAME5= <>
##$TPNAME6= <>
##$TPNAME7= <>
##$TPOAL= (0..7)
0.5 0.5 0.5 0.5 0.5 0.5 0.5 0.5 
##$TPOFFS= (0..7)
0 0 0 0 0 0 0 0 
##$TUNHIN= 0
##$TUNHOUT= 0
##$TUNXOUT= 0
##$USERA1= <user>
##$USERA2= <user>
##$USERA3= <user>
##$USERA4= <user>
##$USERA5= <user>
##$V9= 5
##$VALIST= <valist>
##$VCLIST= <CCCCCCCCCCCCCCC>
##$VD= 0
##$VDLIST= <DDDDDDDDDDDDDDD>
##$VPLIST= <PPPPPPPPPPPPPPP>
##$VTLIST= <TTTTTTTTTTTTTTT>
##$WBST= 1024
##$WBSW= 4
##$XGAIN= (0..3)
0 0 0 0 
##$XL= 0
##$YL= 0
##$YMAX_a= 1888
##$YMIN_a= -3727
##$ZGOPTNS= <>
##$ZL1= 120
##$ZL2= 120
##$ZL3= 120
##$ZL4= 120
##$ABSF1= 248.5645
##$ABSF2= -253.2056
##$ABSG= 5
##$ABSL= 3
##$ALPHA= 0
##$AQORDER= 0
##$ASSFAC= 0
##$ASSFACI= 0
##$ASSFACX= 0
##$ASSWID= 0
##$AUNMP= <proc_1d>
##$AZFE= 0.1
##$AZFW= 0.5
##$BCFW= 0
##$BC_mod= 2
##$BYTORDP= 0
##$COROFFS= 0
##$CY= -3
##$DATMOD= 1
##$DC= 0
##$DFILT= <>
##$DTYPP= 0
##$F1P= 0
##$F2P= 0
##$FCOR= 1
##$FTSIZE= 65536
##$FT_mod= 6
##$GAMMA= 0
##$GB= 0
##$INTBC= 1
##$INTSCL= 6.047779e-11
##$ISEN= 30
##$LB= 1
##$LEV0= 0
##$LPBIN= 0
##$MAXI= 10000
##$MC2= 0
##$MEAN= 0
##$ME_mod= 0
##$MI= 50
##$NCOEF= 0
##$NC_proc= -9
##$NLEV= 6
##$NOISF1= 182.463
##$NOISF2= 159.3651
##$NSP= 0
##$NTH_PI= 0
##$NZP= 0
##$OFFSET= 248.5645
##$PC= 4
##$PHC0= -10913.7
##$PHC1= 910.0564
##$PH_mod= 1
##$PKNL= yes
##$PPARMOD= 0
##$PSCAL= 0
##$PSIGN= 0
##$REVERSE= no
##$SF= 81.0140089999694
##$SI= 65536
##$SIGF1= 159.3651
##$SIGF2= -187.1042
##$SINO= 113.3802
##$SIOLD= 16384
##$SREGLST= <1H.CDCl3>
##$SSB= 0
##$STSI= 65536
##$STSR= 0
##$SW_p= 40650.406504065
##$SYMM= 0
##$S_DEV= 0
##$TDeff= 32768
##$TDoff= 0
##$TI= <>
##$TILT= no
##$TM1= 0
##$TM2= 0
##$TOPLEV= 0
##$USERP1= <user>
##$USERP2= <user>
##$USERP3= <user>
##$USERP4= <user>
##$USERP5= <user>
##$WDW= 1
##$XDIM= 65536
##$YMAX_p= 345921576
##$YMIN_p= -65743078
$$ End of Bruker specific parameters
$$ ---------------------------------
##NTUPLES= NMR SPECTRUM
##VAR_NAME=  FREQUENCY,     SPECTRUM/REAL,   SPECTRUM/IMAG
##SYMBOL=    X,             R,               I
##VAR_TYPE=  INDEPENDENT,   DEPENDENT,       DEPENDENT
##VAR_FORM=  AFFN,          ASDF,            ASDF
##VAR_DIM=   65536,         65536,           65536
##UNITS=     HZ,            ARBITRARY UNITS, ARBITRARY UNITS
##FACTOR=    0.620285442955139, 1,           1
##FIRST=     20137.2065510682, 0,            0
##LAST=      -20513.1999529968, 0,           0
##MIN=       -20513.1999529968, -65743078,   0
##MAX=       20137.2065510682, 345921576,    0
$$ Real data points
##PAGE= N=1
##DATA TABLE= (X++(R..R)), XYDATA
$$ [...]
$$ plain form
12861 -6013460 -6309409 -3847130 -8155475 -10521174 -835985 8811182 2427039 -10194319
12853 -10194319 -8977207 934973 -1655031 -14830132 -14304190 5465332 19501867 8900579
12845 8900579 -13716875 -24932521 -19407762 -8422572 -2112361 -1652874 -1559771 4491241
12837 4491241 14784590 18116124 9177568 770657 8337677 26357650 35660874 32034965
12829 32034965 29310216 32693827 29099104 11457239 -4872788 -2291414 13957219 23724612
12821 23724612 18675585 9933558 11434253 23710938 34394075 31297596 15391512 888304
12813 888304 -233606 7691287 10772202 4754082 -1062899 258750 3596331 2424180
12805 2424180 296234 4347449 12933528 17548336 14338047 6839001 -1605959 -11660372
$$ packed form
12861f013460k95949K462279m308345k365699R685189R647167o384143j2621358
12853a0194319J217112R912180k590004j3175101N25942J9769522J4036535j0601288
12845H900579k2617454j1215646N524759J0985190O310211M59487R3103O051012
12837D491241J0293349L331534q938556q406911P567020J8019973R303224l625909
12829C2034965k724749L383611l594723j7641865j6330027K581374J6248633R767393
12821B3724612n049027q742027J500695J2276685J0683137l096479j5906084j4503208
12813H88304j121910P924893L080915o018120n816981J321649L337581j172151
12805B424180k127946M051215Q586079M614808l210289p499046q444960j0054413
$$ plain form
12797 -11660372 -23147668 -31575065 -32833357 -29118408 -26570257 -27241422 -27283740 -24885064
12789 -24885064 -25316231 -32254170 -37097411 -26764966 -3938652 11138448 5691086 -7854432
12781 -7854432 -9199873 1820841 8169259 3357729 -42914 7018113 14313180 8929821
12773 8929821 -2707066 -2434544 13991752 31397787 36252946 32534030 31755609 34949490
12765 34949490 32555029 19378616 1720710 -11264293 -16936826 -17180490 -12476216 -2952622
12757 -2952622 7615687 14189947 15868886 14849498 11478943 5099225 -1343413 -3249199
12749 -3249199 -1143123 -218306 -2481287 -4458699 -3517990 -1210785 849335 3159252
12741 3159252 4829707 3049836 -2091827 -6894910 -9626131 -12018659 -13921575 -11730277
$$ packed form
12797a1660372j1487296q427397j258292L714949K548151o71165m2318K398676
12789b4885064m31167o937939m843241J0332445K2826314J5077100n447362j3545518
12781g854432j345441J1020714O348418m811530l400643P061027P295067n383359
12773H929821j1636887K72522J6426296J7406035M855159l718916p78421L193881
12765C4949490k394461j3176413j7657906j2985003n672533k43664M704274R523594
12757b952622J0568309O574260J678939j019388l370555o379718o442638j905786
12749c249199K106076R24817k262981j977412R40709K307205K060120K309917
12741C159252J670455j779871n141663m803083k731221k392528j902916K191298
$$ plain form
12733 -11730277 -4106461 5167767 11431919 12574960 8835762 3738866 2878179 5482228
12725 5482228 1544014 -12534394 -20453716 -4298062 24960140 35381166 17363643
12718 17363643 -1731942 3027941 19521599 19750481 588007 -16525538 -17730347 -9290731
12710 -9290731 -2297866 -1255234 -5605307 -9764214 -5286279 5748538 6456236 -12118166
12702 -12118166 -32203624 -30927788 -14214384 -7929009 -18021641 -23004559 -9190631
12695 -9190631 9202307 13851073 7886516 6072109 12513111 19984753 23387066 24184879
12687 24184879 25777001 29697809 32854116 28084516 13791880 1093624 1119641 7027745
12679 7027745 2656300 -10908497 -14841302 -2938517 6224288 -2461374 -16537357 -14482151
$$ packed form
12733a1730277P623816R274228O264152J143041l739198n096896q60687K604049
12725E482228l938214j4078408p919322J6155654K9258202J0421026j8017523
12718A7363643j9095585M759883J6493658K28882j9162474j7113545j204809Q439616
12710i290731O992865J042632m350073m158907M477935J1034817P07698j8574402
12702a2118166k0085458J275836J6713404O285375j0092632m982918J3813928
12695i190631J8392938M648766n964557j814407O441002P471642L402313P97813
12687B4184879J592122L920808L156307m769600j4292636j2698256K6017N908104
12679G027745m371445j3564797l932805J1902785R162805q685662j4075983K055206
$$ plain form
12671 -14482151 3120805 16404971 13479785 653333 -10890863 -16024972 -14422733
12664 -14422733 -8486223 -3239815 -2240756 -3956201 -5353884 -5694735 -3754701 2855455
12656 2855455 11011209 11409781 923568 -10577014 -12984387 -9742156 -10605671 -15617093
12648 -15617093 -15936425 -8072729 1918438 7911256 9736091 9185311 6038812 -55050
12640 -55050 -6420951 -7312162 1722459 16679210 24665261 17709272 5745135 5256887
12632 5256887 14432382 13972365 -2911217 -18334863 -17656066 -12215685 -17956798 -26658999
12624 -26658999 -20723931 -6056399 -3890522 -14131540 -14613115 1265796 13609784 9915935
12616 9915935 3605417 6186375 5173894 -11733708 -29822831 -27142473 -8353456 3805045
$$ packed form
12671a4482151J7602956J3284166k925186j2826452j1544196n134109J602239
12664a4422733N936510N246408R99059j715445j397683l40851J940034O610156
12656B855455Q155754L98572j0486213j1500582k407373L242231q63515n011422
12648a5617093l19332P863696R991167N992818J824835n50780l146499o093862
12640e5050o365901q91211R034621J4956751P986051o955989j1964137m88248
12632E256887R175495m60017j6883582j5423646O78797N440381n741113q702201
12624b6658999N935068J4667532K165877j0241018m81575J5878911J2343988l693849
12616I915935o310518K580958j012481j6907602j8089123K680358J8789017J2158501
$$ plain form
12608 3805045 2586680 222416 1500308 -2352659 -12388393 -15659786 -5889295 5979425
12600 5979425 8502121 3990690 132541 -843996 1294900 7920017 14554485 10870637
12592 10870637 -5042068 -21044940 -26469577 -24955625 -24873748 -25705949 -22705428 -17812063
12584 -17812063 -16278942 -17481619 -17623475 -17093877 -17544609 -16708642 -13787572 -14279878 -20899688
12575 -20899688 -25526906 -19800671 -8229024 -568560 2933542 6932034 7675361 -1134666
12567 -1134666 -13123519 -15721961 -10057749 -8326112 -12145765 -10851422 -2277137 3146286
12559 3146286 2143264 3603663 9112587 8667061 3354649 10572717 33980816 48843386
12551 48843386 34935935 7269214 -5722675 -742638 4878230 4369603 3973756 1864354
$$ packed form
12608C805045j218365k364264J277892l852967j0035734l271393R770491J1868720
12600E979425K522696m511431l858149r76537K138896O625117O634468l683848
12592A0870637j5912705j6002872n424637J513952Q1877q32201L000521M893365
12584a7812063J533121j202677j41856N29598m50732Q35967K921070m92306o619810
12575b0899688m627218N726235J1571647P660464L502102L998492P43327q810027
12567a134666j1988853k598442N664212J731637l819653J294343Q574285N423423
12559C146286j003022J460399N508924m45526n312412P218068K3408099J4862570
12551D8843386j3907451k7666721j2991889M980037N620868n08627l95847k109402
$$ plain form
12543 1864354 -9415208 -21528899 -16501285 3061664 12715758 1168440 -13629432
12536 -13629432 -12117793 324615 5845004 517273 -4251141 -182907 7979578 9176694
12528 9176694 -1724756 -16908139 -21328713 -9431069 6475037 10800885 3773506 -2596145
12520 -2596145 -2898169 -981036 1925979 7703491 12004782 9179759 4930719 7835922
12512 7835922 9805216 -5101444 -30958051 -41677672 -28785700 -14918225 -18832198
12505 -18832198 -28459726 -24092538 -9659951 -2014809 -3326793 -4196610 -3931867 -7677941
12497 -7677941 -10404557 -3213649 8454868 10821158 3695354 15157 4700925 9526595
12489 9526595 9118177 7331115 6037668 785620 -9277931 -17678736 -19577746 -16347179
$$ packed form
12543A864354j1279562j2113691N027614J9562949R654094j1547318j4797872
12536a3629432J511639J2442408N520389n327731m768414M068234Q162485J197116
12528I176694j0901450j5183383m420574J1897644J5906106M325848p027379o369651
12520b596145l02024J917133K907015N777512M301291k825023m249040K905203
12512G835922J969294j4906660k5856607j0719621J2891972J3867475l913973
12505a8832198r627528M367188J4432587P645142j311984q69817K64743l746074
12497g677941k726616P190908J1668517K366290p125804l680197M685768M825670
12489I526595m08418j787062j293447n252048j0063551q400805j899010L230567
$$ plain form
12481 -16347179 -10660276 -5259314 -5714971 -14517174 -22663325 -17949349 -2892512 6280124
12473 6280124 1034327 -9344209 -12817400 -9918409 -7808101 -6685442 -428542 12144029
12465 12144029 23500441 25398693 17290603 5798814 -2490069 -5840130 -5016769 157968
12457 157968 7881044 11060246 4542492 -5150595 -6864681 -2291701 -4029160 -12760663
12449 -12760663 -12142015 4106863 16104712 5096329 -15672174 -18416756 -2047141
12442 -2047141 7461330 -3093127 -17212531 -16480223 -4681867 4850456 9346067 12740399
12434 12740399 13837712 9845774 4054886 954040 -597796 -3236885 -6259436 -9289396
12426 -9289396 -13442555 -15210889 -8368312 3768772 8873609 4457555 4100428 15701538
$$ packed form
12481a6347179N686903N400962m55657q802203q146151M713976J5056837R172636
12473F280124n245797j0378536l473191K898991K110308J122659O256900J2572571
12465A2144029J1356412J898252q108090j1491789q288883l350061Q23361N174737
12457A57968P723076L179202o517754r693087j714086M572980j737459q731503
12449a2760663O18648J6248878J1997849j1008383k0768503k744582J6369615
12442b047141R508471j0554457j4119404P32308J1798356R532323M495611L394332
12434A2740399J097313l991938n790888l100846j551836k639089l022551l029960
12426i289396m153159j768334O842577J2137084N104837m416054l57127J1601110
$$ plain form
12418 15701538 25618449 18075581 1246769 -2915443 9004227 17169124 7785477 -8292105
12410 -8292105 -12796756 -4856514 833227 -4581345 -13894391 -15588439 -9578433 -6705837
12402 -6705837 -13218326 -20441744 -14456462 4949131 21110450 19293058 4375799 -4879972
12394 -4879972 2704371 19267873 27616778 19411377 3237410 -4249561 4763143 21382576
12386 21382576 30251270 26463198 18776770 16325007 17485688 14406742 4250231 -7972036
12378 -7972036 -15595793 -16191283 -12510778 -9811612 -11595018 -16927535 -22198641 -24535998
12370 -24535998 -22283524 -14855114 -5463838 -620096 -1331419 1699029 15771720 31676619
12362 31676619 32851035 19404858 10203675 17181242 30122963 33497004 26619637 18342905
$$ packed form
12418A5701538R916911p542868j6828812m162212J1919670Q164897r383647j6077582
12410h292105m504651P940242N689741n414572r313046j694048O010006K872596
12402f705837o512489p223418N985282J9405593J6161319j817392j4917259r255771
12394d879972P584343J6563502Q348905q205401j6173967p486971R012704J6619433
12386B1382576Q868694l788072p686428k451763J160681l078946j0156511j2222267
12378g972036p623757n95490L680505K699166j783406n332517n271106k337357
12370b4535998K252474P428410R391276M843742p11323L030448J4072691J5904899
12362C1676619J174416j3446177r201183O977567J2941721L374041o877367q276732
$$ plain form
12354 18342905 12344895 8307084 8671096 12712925 11946758 3638851 750064 13952984
12346 13952984 31201983 32921670 22496954 20791073 31136602 32895080 15431650
12339 15431650 -3687207 -5777111 2736822 6709426 9362476 22993759 41838189 46026348
12331 46026348 31079331 14399910 9438195 9157429 853820 -15052615 -28167853 -31099466
12323 -31099466 -22943153 -7566680 5389392 5306055 -6363533 -14495145 -9726605 -2606408
12315 -2606408 -7593329 -18842463 -17250169 -792287 9526207 -101712 -15806959 -16884099
12307 -16884099 -4478741 5480639 8542549 11910213 13065986 766664 -19862782 -25919388
12299 -25919388 -10458637 2236148 -9538719 -32378225 -38929313 -28820138 -23675723
$$ packed form
12354A8342905n998010m037811L64012M041829p66167q307907k888787J3202920
12346A3952984J7248999J719687j0424716j705881J0345529J758478j7463430
12339A5431650j9118857k089904Q513933L972604K653050J3631283J8844430M188159
12331D6026348j4947017j6679421m961715k80766q303609j5906435j3115238k931613
12323c1099466Q156313J5376473J2956072q3337j1669588q131612M768540P120197
12315b606408m986921j1249134J592294J6457882J0318494r627919j5705247j077140
12307a6884099J2405358R959380L061910L367664J155773j2299322k0629446o056606
12299b5919388J5460751J2694785j1774867k2839506o551088J0109175N144415
$$ plain form
12292 -23675723 -27969381 -23497855 -5357460 4661066 -8080353 -26823419 -28932941
12285 -28932941 -17439815 -8353720 -1224634 14482764 31628525 28949577 3088538
12278 3088538 -23554766 -31446126 -23857477 -13315871 -4192364 3076989 3895111 -3551905
12270 -3551905 -11863014 -14223945 -13831099 -15904645 -18099252 -17845356 -21412095 -33722851
12262 -33722851 -44434579 -38141255 -17465998 -2592021 -5384505 -15802857 -18763072
12255 -18763072 -13840318 -10398567 -11070544 -10428345 -6780796 -5160311 -7919773 -10511373
12247 -10511373 -9445255 -8150139 -10528546 -13081774 -9179390 507036 7373598 5171127
12239 5171127 -3282529 -10653432 -12702570 -10232104 -7105664 -7618900 -11869252 -12696354
$$ packed form
12292b3675723m293658M471526J8140395J0018526j2741419j8743066k109522
12285b8932941J1493126R086095P129086J5707398J7145761k678948k5861039
12278C088538k6643304p891360P588649J0541606R123507P269353Q18122p447016
12270c551905q311109k360931L92846k073546k194607K53896l566739j2310756
12262c3722851j0711728O293324K0675257J4873977k792484j0418352k960215
12255a8763072M922754L441751o71977O42199L647549J620485k759462k591600
12247a0511373J066118J295116k378407k553228L902384R686426O866562k202471
12239E171127q453656p370903k049138K470466L126440n13236m250352q27102
$$ plain form
12231 -12696354 -3067524 11195872 14202749 1397674 -10452491 -4919689 9745012
12224 9745012 12425774 858393 -7021181 -3994325 -4441939 -16427834 -23676126 -10822400
12216 -10822400 9507790 14452777 4589270 -1778472 -854413 -5679909 -17495071 -19586880
12208 -19586880 -5543461 7640860 4490398 -7716544 -13134245 -8520088 457025 10799507
12200 10799507 18088138 12713859 -6190867 -22454033 -22099303 -12722413 -9933057 -12748173
12192 -12748173 -8982077 717498 2884846 -6119538 -15130943 -17116612 -16620500 -15477536
12184 -15477536 -7666767 5725914 11647765 3687065 -7146763 -9433444 -7209352 -7807390
12176 -7807390 -5122860 9798216 28351319 31570755 16501157 8629 -5642663 -6619362
$$ packed form
12231a2696354R628830J4263396L006877j2805075j1850165N532802J4664701
12224I745012K680762j1567381p879574L026856m47614j1985895p248292J2853726
12216a0822400K0330190M944987r863507o367742R24059m825496j1815162k091809
12208a9586880J4043419J3184321l150462j2206942n417701M614157Q977113J0342482
12200A0799507P288631n374279j8904726j6263166L54730R376890K789356k815116
12192a2748173L766096R699575K167348r004384r011405j985669M96112J142964
12184a5477536P810769J3392681N921851p960700j0833828k286681K224092n98038
12176g807390K684530J4921076J8553103L219436j5069598j6492528n651292r76699
$$ plain form
12168 -6619362 -11762607 -16352314 -11631935 -1698688 1481261 -3541896 -6168279 -1182133
12160 -1182133 2819544 -3298858 -15143979 -20418492 -14823310 -6403001 -5321812 -13705368
12152 -13705368 -25140916 -31074162 -28206931 -21838863 -20705926 -26698220 -32389678 -31507753
12144 -31507753 -27833346 -28421957 -31453799 -28570917 -18347062 -9350342 -8570904 -13661241
12136 -13661241 -18128187 -17596405 -9573573 5355352 19368341 22012875 13010345 4114502
12128 4114502 4704677 12258525 20349352 27378037 31890930 28405704 16469781 6684936
12120 6684936 7803539 12849625 8319249 -5822418 -15227228 -9354484 7250231 21306033
12112 21306033 22587414 11200837 -1670678 -3327627 5248864 8915677 -872716 -12222513
$$ packed form
12168f619362n143245m589707M720379R933247L179949n023157k626383M986146
12160a182133M001677o118402j1845121n274513N595182Q420309J081189q383556
12152a3705368j1435548n933246K867231O368068J132937n992294n691458Q81925
12144c1507753L674407n88611l031842K882882J0223855Q996720P79438n090337
12136a3661241m466946N31782Q022832J4928925J4012989K644534r002530q895843
12128D114502N90175P553848Q090827P028685M512893l485226j1935923r784845
12120F684936J118603N046086m530376j4141667r404810N872744J6604715J4055802
12112B1306033J281381j1386577j2871515j656949Q576491L666813r788393j1349797
$$ plain form
12104 -12222513 -9495731 2966507 7227813 -1660683 -10121738 -7388973 1129107 4886844
12096 4886844 1785638 -3219099 -5373374 -3365450 -889325 -4479697 -13957481 -18692408
12088 -18692408 -11889390 -3395318 -6023741 -14055217 -11827721 -1512730 -2615014 -21023358
12080 -21023358 -38337845 -39144329 -30985213 -27412606 -27308133 -23345769 -17794117 -16327372
12072 -16327372 -15715739 -10148067 -2331872 2192286 4563392 7399860 8252410 6954095
12064 6954095 10188966 19366235 24109814 18219570 10990394 10632471 9037984 -1094627
12056 -1094627 -6572168 7206466 25848698 20428619 -8568994 -27154602 -13432170
12049 -13432170 14658410 26977299 18127719 3560383 -7178012 -16883213 -26980571
$$ packed form
12104a2222513K726782J2462238M261306q888496q461055K732765Q518080L757737
12096D886844l101206n004737k154275K007924K476125l590372r477784m734927
12088a8692408O803018Q494072k628423q031476K227496J0314991j102284j8408344
12080b1023358j7314487q06484Q159116L572607J04473L962364N551652J466745
12072a6327372O11633N567672P816195M524158K371106K836468Q52550j298315
12064F954095L234871R177269M743579n890244p229176l57923j594487j0132611
12056a094627n477541J3778634J8642232n420079k8997613j8585608J3722432
12049a3432170K8090580J2318889q849580j4567336j0738395r705201j0097358
$$ plain form
12042 -26980571 -32413312 -30066823 -22674407 -13304288 -2437104 7970945 12204845 5946581
12034 5946581 -6773112 -14435461 -9189865 2487834 5279850 -5153789 -13089115 -1084419
12026 -1084419 25363080 41518947 33303173 14167726 7073848 16682445 27398008 26075688
12018 26075688 17366137 13486466 15678299 14034481 4684414 -2674705 321656 6436842
12010 6436842 3624399 -4765122 -3979234 8695771 19439066 19957030 18341205 20688559
12002 20688559 17486758 442546 -19703159 -26690127 -20775419 -12922327 -5749031 3654273
11994 3654273 9455821 4197534 -4049914 -448442 12456012 17825796 11455487 6475806
11986 6475806 9069010 8948370 -89814 -7398701 -1483693 14653196 31192606 42428270
$$ packed form
12042b6980571n432741K346489P392416R370119J0867184J0408049M233900o258264
12034E946581j2719693p662349N245596J1677699K792016j0433639p935326J2004696
12026a084419K6447499J6155867q215774j9135447p093878R608597J0715563j322320
12018B6075688q709551l879671K191833j643818r350067p359119K996361O115186
12010F436842k812443q389521P85888J2675005J0743295N17964j615825K347354
12002B0688559l201801j7044212k0145705o986968N914708P853092P173296R403304
11994C654273N801548n258287q247448L601472J2904454N369784o370309m979681
11986F475806K593204j20640r038184p308887N915008J6136889J6539410J1235664
$$ plain form
11978 42428270 44522014 35421779 23250870 21703357 30169019 31373698 16230713 -2219482
11970 -2219482 -8325638 -4180132 -459757 441087 365845 -4207302 -14424911 -20397389
11962 -20397389 -13182122 1362510 11761228 16405778 18893123 16748644 8097773 1944177
11954 1944177 7289750 18030114 23019235 24634113 30519180 32377357 14052179 -18764276
11946 -18764276 -37655087 -26538364 -1118518 14245929 14564255 9777742 5338006 299058
11938 299058 -2804695 511103 7529620 10718557 8532507 5889716 4466129 731071
11930 731071 -5042912 -6010519 466921 5614739 266724 -9969492 -9810645 4402427
11922 4402427 17986789 17515662 8514868 4935717 8139509 9164307 8270272 16206236
$$ packed form
11978D2428270K093744r100235j2170909j547513Q465662J204679j5142985j8450195
11970b219482o106156M145506L720375R00844p5242m573147j0217609n972478
11962b0397389P215267J4544632J0398718M644550K487345k144479q650871o153596
11954A944177N345573J0740364M989121J614878N885067J858177j8325178l2816455
11946a8764276j8890811J1116723K5419846J5364447L18326m786513m439736n038948
11938B99058l103753L315798P018517L188937k186050k642791j423587l735058
11930G31071n773983r67607O477440N147818n348015j0236216J58847J4213072
11922D402427J3584362m71127r000794l579151L203792J024798q94035P935964
$$ plain form
11914 16206236 33627603 44488023 37070660 19839073 8126203 4833179 3024420
11907 3024420 -929629 -6105176 -11904192 -15738728 -12595997 -4438940 -1962350 -8900281
11899 -8900281 -13978734 -7965348 2007155 7093548 13894188 30437218 44816255 38125007
11891 38125007 13516009 -7724989 -15736753 -17305958 -14651282 -3261515 7544554
11884 7544554 -2013731 -29695286 -45031936 -28268316 2916114 19052307 15065155
11877 15065155 5982567 484793 -3785830 -7078204 -6308635 -3711979 -5200087 -12521634
11869 -12521634 -23597361 -34936771 -38548578 -26115684 -3861419 7156350 -4792589
11862 -4792589 -26964280 -39917776 -39269476 -30105330 -14149436 2836699 5007906 -12404291
$$ packed form
11914A6206236J7421367J0860420p417363j7231587j1712870l293024j808759
11907C024420l954049n175547n799016l834536L142731Q157057K476590o937931
11899h900281n078453O013386R972503N086393O800640J6543030J4379037o691248
11891C8125007k4608998k1240998q011764j569205K654676J1389767J0806069
11884G544554r558285k7681555j5336650J6763620L1184430J6136193l987152
11877A5065155r082588n497774m270623l292374P69569K596656j488108p321547
11869a2521634j1075727j1339410l611807J2432894K2254265J1017769j1948939
11862d792589k2171691j2953496O48300R164146J5955894J6986135K171207j7412197
$$ plain form
11854 -12404291 -26762830 -15440356 8488477 13742795 -123984 -971519 24596799
11847 24596799 47961088 40282731 13837270 1858222 12159144 22079917 13368284
11840 13368284 -6504374 -18447056 -14500173 -2905689 3325649 -390545 -7634585 -10915128
11832 -10915128 -11158264 -13429707 -17114567 -18467667 -20147216 -27023613 -33475775 -28549805
11824 -28549805 -15396872 -10140884 -16625276 -18887815 -7511735 3342763 -965160 -9978657
11816 -9978657 -4156508 13013653 19428142 7194834 -8490842 -13826226 -12167803 -11686170
11808 -11686170 -12504730 -12407351 -13551488 -16267806 -14681120 -5424005 5032753 7404369
11800 7404369 206867 -10139658 -16350503 -15180487 -8835647 -3340164 -2909790 -5673156
$$ packed form
11854a2404291j4358539J1322474K3928833N254318j3866779q47535K5568318
11847B4596799K3364289p678357k6445461j1979048J0300922R920773q711633
11840A3368284j9872658j1942682L946883J1594484O231338l716194p244040l280543
11832a0915128k43136k271443l684860j353100j679549o876397o452162M925970
11824b8549805J3152933N255988o484392k262539J1376080J0854498m307923r013497
11816i978657N822149J7170161O414489j2233308j5685676n335384J658423M81633
11808a1686170q18560R7379j144137k716318J586686R257115J0456758K371616
11800G404369p197502j0346525o210845J170016O344840N495483M30374k763366
$$ plain form
11792 -5673156 -7255478 -6418263 -3242743 4637774 17415179 27794066 28347520 21880088
11784 21880088 15932959 10140824 319344 -7349471 -1169772 15485272 23905943 15325304
11776 15325304 1874118 -4542584 -9260041 -20255642 -30203333 -27360601 -14766333 -3874722
11768 -3874722 3640088 12516137 18062569 10642712 -5757037 -15565240 -13401973 -9663038
11760 -9663038 -12306772 -16860295 -18383734 -20165308 -24227874 -24410443 -16769316 -8227634
11752 -8227634 -6687228 -9022885 -6792192 1089601 8889272 13406000 15421857 14373093
11744 14373093 8792813 1422422 -1981958 569671 5525813 8558465 7685071 2215048
11736 2215048 -7325119 -17233765 -21703455 -18096915 -10412672 -5922230 -7894831 -12625722
$$ packed form
11792e673156j582322Q37215L175520P880517J2777405J0378887N53454o467432
11784B1880088n947129n792135r821480p668815O179699J6655044Q420671q580639
11776A5325304j3451186o416702m717457j0995601r947691K842732J2594268J0891611
11768c874722P514810Q876049N546432p419857j6399749r808203K163267L738935
11760i663038k643734m553523j523439j781574m062566j82569P641127Q541682
11752h227634J540406k335657K230693P881793P799671M516728K015857j048764
11744A4373093n580280p370391l404380K551629M956142L032652q73394n470023
11736B215048r540167r908646m469690L606540P684243M490442j972601m730891
$$ plain form
11728 -12625722 -14947543 -15508097 -18773199 -23176982 -19408794 -3644220 12415767 13123245
11720 13123245 -1307150 -15611388 -19998333 -19566229 -20788927 -20003870 -12475853 -4082081
11712 -4082081 -4302386 -12478456 -19766945 -21101064 -17070130 -7843640 4993600 13009574
11704 13009574 8322224 -3494115 -8482929 -3679105 -428979 -5146268 -8679291 -1996352
11696 -1996352 8187380 10359462 7287944 10681070 19997819 21207254 8657110 -5019820
11688 -5019820 -6822474 -858138 205098 -6629691 -14635485 -20249557 -25171965 -27911405
11680 -27911405 -24283902 -16777348 -13109130 -13359814 -8566337 4166319 15224561 17119177
11672 17119177 16119115 20901328 27558749 26167215 16144036 3799317 -10035079 -26204677
$$ packed form
11728a2625722k321821n60554l265102m403783L768188J5764574J6059987P07478
11720A3123245j4430395j4304238m386945M32104j222698P85057P528017Q393772
11712d082081k20305q176070p288489j334119M030934R226490J2837240Q015974
11704A3009574m687350j1816339m988814M803824L250126m717289l533023O682939
11696a996352J0183732K172082l071518L393126R316749J209435j2550144j3676930
11688e019820j802654N964336J063236o834789q005794n614072m922408k739440
11680b7911405L627503P506554L668218k50684M793477J2732656J1058242J894616
11672A7119177j000062M782213O657421j391534j0023179j2344719j3834396j6169598
$$ plain form
11664 -26204677 -34491550 -21679800 5583526 22427408 16589605 3426621 1858024
11657 1858024 9051602 11131439 7581791 8916152 16308879 20131589 16833832 11875352
11649 11875352 5571428 -8298841 -25970399 -30898958 -16024295 2374130 3603684
11642 3603684 -11815595 -25682660 -26126264 -17232284 -7420334 106782 4083794 2623119
11634 2623119 -1726852 -1622903 5311968 11713657 10645681 5821588 5228124 8138852
11626 8138852 6827113 309194 -2898868 1578253 5849192 842918 -10425165 -17453676
11618 -17453676 -16120380 -10758941 -5247533 -75603 2984721 1786762 -295329 2191426
11610 2191426 6184858 2036660 -10932763 -20027288 -15506058 -3082927 6092338 9853708
$$ packed form
11664b6204677q286873J2811750K7263326J6843882n837803j3162984j568597
11657A858024P193578K079837l549648J334361P392727L822710l297757m958480
11649A1875352o303924j3870269j7671558m928559J4874663J8398425J229554
11642C603684j5419279j3867065m43604Q893980R811950P527116L977012j460675
11634B623119m349971J03949O934871O401689j067976m824093n93464K910728
11626H138852j311739o517919l208062M477121M270939n006274j1268083p028511
11618a7453676J333296N361439N511408N171930L060324j197959k082091K486755
11610B191426L993432m148198j2969423r094525M521230J2423131R175265L761370
$$ plain form
11602 9853708 11630833 10585466 5630940 3274269 9204487 15719771 10573628 -3392119
11594 -3392119 -11330500 -9262148 -8674274 -15029842 -17728521 -9211904 778256 1758337
11586 1758337 875840 9562668 20842632 18118054 2738875 -6089653 -65463 7408351
11578 7408351 4076479 -4262527 -8324032 -11478487 -18290904 -19162607 -3689182 17186163
11570 17186163 20998071 4993196 -9670906 -7646965 3063113 9175814 11571159 15723406
11562 15723406 16088555 5558509 -7427585 -8065069 1513234 4392352 -5195829 -13898807
11554 -13898807 -11168630 -4446132 -4882027 -10199249 -11903271 -10168238 -9930749 -8816871
11546 -8816871 -1684741 6457218 5339354 -3012364 -4266146 7700255 21207744 22951309
$$ packed form
11602I853708J777125j045367m954526k356671N930218O515284n146143j3965747
11594c392119p938381K068352N87874o355568k698679Q516617R990160R80081
11586A758337q82497Q686828J1279964k724578j5379179q828528O024190P473814
11578G408351l331872q339006m061505l154455o812417q71703J5473425K0875345
11570A7186163L811908j6004875j4664102K023941J0710078O112701K395345M152247
11562A5723406L65149j0530046j2986094o37484R578303K879118r588181q702978
11554a3898807K730177O722498m35895n317222j704022J735033K37489J113878
11546h816871P132130Q141959j117864q351718j253782J1966401J3507489J743565
$$ plain form
11538 22951309 14785980 7242196 3076882 -3518755 -13996899 -20662272 -16322376 -3499531
11530 -3499531 7651817 7525440 -6803514 -28982471 -45240852 -43391378 -24257016 -2699526
11522 -2699526 6122314 1232491 -5504121 -4045262 3633488 7787174 2243549 -9056306
11514 -9056306 -14869054 -6919256 9615690 18005095 8253652 -8030022 -10317276 2414501
11506 2414501 8719135 -3652843 -17384279 -10763534 7914796 11398230 -5588792 -19608113
11498 -19608113 -15509376 -6905022 -9532678 -14850875 -7131552 7731887 10907258 882911
11490 882911 -4673797 4060038 16804027 19942143 12691202 3175533 -2458790 -3894479
11482 -3894479 -5230417 -10372546 -16320110 -14778300 -5467465 -942263 -9431868 -20285353
$$ packed form
11538B2951309q165329p543784m165314o595637j0478144o665373M339896J2822845
11530c499531J1151348j26377j4328954k2178957j6258381J849474J9134362K1557490
11522b699526Q821840m889823o736612J458859P678750M153686n543625j1299855
11514i056306n812748P949798J6534946Q389405r751443j6283674k287254J2731777
11506B414501O304634j2371978j3731436O620745J8678330L483434j6987022j4019321
11498a9608113M098737Q604354k627656n318197P719323J4863439L175371j0024347
11490H82911n556708Q733835J2743989L138116p250941r515669n634323j435689
11482c894479j335938n142129n947564J541810R310835M525202q489605j0853485
$$ plain form
11474 -20285353 -18838671 -9462795 -8384559 -17520042 -22947631 -18475193 -12450604 -9403542
11466 -9403542 -3551109 5079369 6619973 231736 -1092889 6624568 9003598 -1373807
11458 -1373807 -8412513 2329163 17271145 13713951 -5509042 -17534027 -13186367 -3989613
11450 -3989613 1279064 5379624 7033692 -2420823 -20897358 -31579768 -25689124 -15867871
11442 -15867871 -17881932 -29768047 -38533540 -39038324 -36340574 -34982665 -35319194 -37439038
11434 -37439038 -40983733 -42584738 -39391744 -34072135 -31732240 -33033301 -34238868 -32770869
11426 -32770869 -28989650 -23732578 -18151523 -15506085 -18867515 -25948690 -29553528 -25540728
11418 -25540728 -18683810 -17819261 -25112790 -32645615 -30995348 -19225071 -4274032 7432044
$$ packed form
11474b0285353J446682R375876J078236r135483n427589M472438O024589L047062
11466i403542N852433Q630478J540604o388237j324625P717457K379030j0377405
11458a373807p038706J0741676J4941982l557194j9222993j2024985M347660R196754
11450c989613N268677M100560J654068r454515j8476535j0682410N890644R821253
11442a5867871k014061j1886115q765493n04784K697750J357909l36529k119844
11434c7439038l544695j601005L192994N319609K339895j301061j205567J467999
11426c2770869L781219N257072N581055K645438l361430p081175l604838M012800
11418b5540728O856918Q64549p293529p532825J650267J1770277J4951039J1706076
$$ plain form
11410 7432044 13963126 14969467 10685252 4983822 3630805 6561110 6829327 680653
11402 680653 -6288120 -7274042 -3561344 -361633 1634419 3762330 3059448 -2803814 -7304658
11393 -7304658 -1987839 9038460 12226423 4281318 -1486782 6379553 20561794 23648534
11385 23648534 9914383 -7726499 -11675596 2694717 22854524 31411591 23314123
11378 23314123 9967992 4567044 6543783 5652100 -1529278 -7655459 -7024238 -2801345
11370 -2801345 308228 1905604 1080866 -5390767 -14952350 -17691530 -9517151 249066
11362 249066 1635674 -2660545 -5268762 -8562729 -19548793 -34285383 -40048606 -32835393
11354 -32835393 -21780721 -15198541 -12241536 -9830599 -7689784 -4013977 3602333 9376103
$$ packed form
11410G432044O531082J006341m284215n701430j353017K930305K68217o148674
11402F80653o968773r85922L712698L199711J996052K127911p02882n863262m500844
11393g304658N316819J1026299L187963p945105n768100P866335J4182241L086740
11385B3648534j3734151j7640882l949097J4370313K0159807Q557067q097468
11378B3314123j3346131n400948J976739q91683p181378o126181O31221M222893
11370b801345L109573J597376q24738o471633r561583k739180Q174379R766217
11362B49066J386608m296219k608217l293967j0986064j4736590n763223P213213
11354c2835393J1054672O582180K957005K410937K140815L675807P616310N773770
$$ plain form
11346 9376103 2475038 -15201630 -25415111 -16750570 -1729534 1011649 -6149690 -5695408
11338 -5695408 5904086 12654076 5163831 -4182667 -235541 13042024 19853036 13191353
11330 13191353 -1627196 -16491105 -22769941 -11355427 15455978 36372481 31659697
11323 31659697 11069437 4359708 20676536 35515315 26998011 7684893 4382957
11316 4382957 18640404 27669709 19582523 6932921 3618095 6876149 8631540 9592829
11308 9592829 12610216 13178083 7410965 2310770 7511762 20714230 30330390 30354701
11300 30354701 25162120 21362341 21673427 25468341 28933717 25601879 13072486 -974618
11292 -974618 -5617591 -300826 4052287 -769768 -10045986 -13148410 -7234077 125152
$$ packed form
11346I376103o901065j7676668j0213481Q664541J5021036K741183p161339M54282
11338e695408J1599494O749990p490245r346498L947126J3277565O811012o661683
11330A3191353j4818549j4863909o278836J1414514K6811405K0916503m712784
11323C1659697k0590260o709729J6316828J4838779q517304j9313118l301936
11316D382957J4257447R029305q087186j2649602l314826L258054J755391R61289
11308I592829L017387N67867n767118n100195N200992J3202468R616160K4311
11300C0354701n192581l799779L11086L794914L465376l331838j2529393j4047104
11292i74618m642973N316765M353113m822055r276218l102424N914333P359229
$$ plain form
11284 125152 1027650 -3522876 -5884294 -1782324 4591489 6615420 4109247 2961996
11276 2961996 6747883 12859879 17528808 20209968 21173875 19108073 14147579 9877631
11268 9877631 9089516 10137169 10038844 8378860 6081351 3897833 4037068 8560414 13886999
11259 13886999 13079989 6882483 4662453 9087727 9240061 -1981461 -12835871 -8563728
11251 -8563728 4302403 5996133 -6695377 -16594380 -13405304 -6391026 -4178162 150352
11243 150352 13065423 24357104 21089749 8463933 2840548 9594222 19801276 24120974
11235 24120974 18659001 1689627 -22879682 -41038094 -39811779 -23113344 -7154521
11228 -7154521 -944518 -778814 -2807300 -9639195 -22315177 -34842453 -39862201 -34165407
$$ packed form
11284A25152R02498m550526k361418M101970O373813K023931k506173j147251
11276B961996L785887O111996M668929K681160R63907k065802m960494m269948
11268I877631p88115J047653r8325j659984k297509k183518J39235M523346N326585
11259A3886999q07010o197506k220030M425274J52334j1221522j0854410M272143
11251h563728J2866131J693730j2691510r899003L189076P014278K212864M328514
11243A50352J2915071J1291681l267355j2625816n623385O753674J0207054M319698
11235B4120974n461973j6969374k4569309j8158412J226315J6698435J5958823
11228g154521O210003J65704k028486o831895j2675982j2527276n019748N696794
$$ plain form
11220 -34165407 -18814834 -565361 8320770 733235 -14821187 -23037365 -20342206 -14790823
11212 -14790823 -8955193 3380662 21357966 32419583 29552814 20775831 14671555 8689388
11204 8689388 177217 -3285280 3963637 13248660 14033967 10596420 12605439 16252144
11196 16252144 10862158 271400 27950 12653761 22037152 16669862 4495951 -1860676
11188 -1860676 -3134242 -8229818 -18928696 -28610436 -32239671 -30827366 -28130568 -27543486
11180 -27543486 -30299177 -33131959 -29370299 -15444360 4085337 19065247 21042052 9558206
11172 9558206 -6341319 -14583364 -11705390 -6407176 -7506846 -11476993 -8782090 -182505
11164 -182505 3081260 -3602535 -10676737 -7868517 2648164 11334221 13431182 11431467
$$ packed form
11220c4165407J5350573J8249473Q886131p587535j5554422q216178K695159N551383
11212a4790823N835630J2335855J7977304J1061617k866769q776983o104276n982167
11204H689388q512171l462497P248917R285023P85307l437547K009019L646705
11196A6252144n389986j0590758k43450J2625811R383391n367290j2173911o356627
11188a860676j273566n095576j0698878r681740l629235J412305K696798N87082
11180b7543486k755691k832782L761660J3925939J9529697J4979910J976805j1483846
11172I558206j5899525q242045K877974N298214j099670l970147K694903Q599585
11164a82505L263765o683795p074202K808220J0516681Q686057K096961j999715
$$ plain form
11156 11431467 10352127 14237055 22641324 27997667 22371073 9533341 3204562 9542029
11148 9542029 19023480 20425020 14514648 7704576 1074454 -5798319 -8761336 -7765519
11140 -7765519 -13758464 -32958682 -49873160 -43049180 -16622628 1966595 -454227 -5268997
11132 -5268997 8358848 31262048 36821780 17945420 -4997280 -12574169 -8399066 -8094141
11124 -8094141 -16198018 -22557660 -18231204 -7144048 -118082 -1131500 -2548116 6332794
11116 6332794 27242874 49276069 56788964 42509742 15096245 -6973099 -12264645
11109 -12264645 -7842229 -10588512 -25793341 -38727478 -31489151 -5418211 18624759
11102 18624759 22256493 7641946 -7493088 -9813937 -2969394 -632148 -8829032 -18201560
$$ packed form
11156A1431467j079340L884928Q404269N356343n626594j2837732o328779O337467
11148I542029R481451J401540n910372o810072o630122o872773k963017R95817
11140g765519n992945j9200218j6914478O823980K6426552J8589223k420822m814770
11132e268997J3627845K2903200N559732j8876360k2942700p576889M175103L04925
11124h094141q103877o359642M326456J1087156P025966j013418j416616Q880910
11116F332794K0910080K2033195P512895j4279222k7413497k2069344n291546
11109a2264645M422416k746283j5204829j2934137P238327K6070940K4042970
11102A8624759L631734j4614547j5135034k320849O844543K337246q196884r372528
$$ plain form
11094 -18201560 -16086036 -3455721 6059142 3633815 -5873090 -14407594 -20831706 -24804623
11086 -24804623 -19725398 -2183014 17127696 23844519 19017310 16141927 19744520 19279399
11078 19279399 6927665 -9672750 -17403976 -12014909 1948098 17747322 28035650
11071 28035650 26862494 15962325 4417638 -1851978 -5335878 -9030125 -10192450 -6087800
11063 -6087800 867137 8369885 17518465 25451420 22764720 6355644 -11667873 -17213221
11055 -17213221 -11499054 -5616447 -2300317 5071328 16783361 22764041 17319473 7997732
11047 7997732 4648507 6526665 5964991 520372 -4383187 -3390978 2960348 10912092
11039 10912092 18622982 26124131 31331637 30120828 22388264 14225765 9680033 4175890
$$ packed form
11094a8201560K115524J2630315R514863k425327r506905q534504o424112l972917
11086b4804623N079225J7542384J9310710O716823m827209k875383L602593m65121
11078A9279399j2351734j6600415p731226N389067J3963007J5799224J0288328
11071B8035650j173156j0900169j1544687o269616l483900l694247j162325M104650
11063f087800O954937P502748R148580P932955k686700j6409076j8023517n545348
11055a7213221N714167N882607L316130P371645J1712033N980680n444568r321741
11047G997732l349225J878158n61674n444619m903559R92209O351326P951744
11039A0912092P710890P501149N207506j210809p732564q162499m545732n504143
$$ plain form
11031 4175890 -6361891 -13131630 -3561217 16148361 22457837 5427266 -15802997 -19685695
11023 -19685695 -11383438 -9040452 -11465092 -1777405 19659173 29835536 16334359 -3727177
11015 -3727177 -8036209 2821366 13463699 17883244 21096182 23304349 17100591 390219
11007 390219 -17927790 -27488874 -26692812 -22195679 -20618910 -21264049 -17522095 -7111704
10999 -7111704 1955084 1389234 -3875919 -1779524 7275739 9037357 -2412938 -13388029
10991 -13388029 -9453551 4457035 12529446 9101967 1213882 -3935690 -4236874 -81334
10983 -81334 4401274 1939925 -7802793 -14206160 -10295865 -4381472 -6554870 -11390333
10975 -11390333 -8000415 -375005 -249501 -4260981 909486 10796738 3739721 -24351068
$$ packed form
11031D175890j0537781o769739R570413J9709578O309476j7030571k1230263l882698
11023a9685695Q302257K342986k424640R687687K1436578J0176363j3501177k0061536
11015c727177m309032J0857575J0642333M419545L212938K208167o203758j6710372
11007C90219j8318009r561084P96062M497133J576769o45139L741954J0410391
10999g111704R066788n65850n265153K096395R055263J761618j1450295j0975091
10991a3388029L934478J3910586Q072411l427479p888085n149572l01184M155540
10983h1334M482608k461349r742718o403367L910295N914393k173398m835463
10975a1390333L389918P625410J25504m011480N170467R887252p057017k8090789
$$ plain form
10967 -24351068 -47556141 -44196228 -25309002 -13893582 -11352530 -3910933 8125615
10960 8125615 9835880 -2546718 -15671361 -20862975 -24348904 -30747339 -32131545 -22649215
10952 -22649215 -12023623 -12445198 -18968138 -15900594 -686517 11206566 8258464 -890518
10944 -890518 -926019 7244644 8478951 -2724185 -12875017 -9435806 571753 2459907
10936 2459907 -2901195 -2439559 4734597 3552870 -11587251 -23693816 -16441045 1355110
10928 1355110 8801301 2976318 -250182 7132948 14315979 10342987 61017 -5040278
10920 -5040278 -2442621 1856568 3039402 802388 -2140103 -330935 10418005 24548661
10912 24548661 27979834 14226286 -5132922 -13298068 -8288003 -2121049 -1990544 -2019692
$$ packed form
10967b4351068k3205073L359913J8887226J1415420K541052P441597J2036548
10960H125615J710265j2382598j3124643n191614l485929o398435j384206R482330
10952b2649215J0625592m21575o522940L067544J5214077J1893083k948102r148982
10944h90518l5501Q170663J234307j1203136j0150832L439211J0007559J888154
10936B459907n361102M61636P174156j181727j5140121j2106565P252771J7796155
10928A355110P446191n824983l226500P383130P183031l972992j0281970n101295
10920e040278K597657M299189J182834k237014k942491J809168J0748940J4130656
10912B4548661L431173j3753548j9359208q165146N010065O166954J30505k9148
$$ plain form
10904 -2019692 4442326 13216240 15326094 9323966 1965967 -502279 3004970 10036321
10896 10036321 15765971 14090783 3269589 -9475411 -14320080 -10681700 -7412035 -9722881
10888 -9722881 -12354449 -9628523 -5872490 -8606693 -15337543 -16241596 -9281603 -3271407
10880 -3271407 -3570110 -3478061 4733105 16920173 22766753 20820057 19663443 24413786
10872 24413786 29473869 27276701 18950702 12095688 10521645 10559711 7358165 1273075
10864 1273075 -3375170 -3556605 271955 5161762 6385398 -256936 -11897975 -15991333
10856 -15991333 -2264024 20743110 30051569 15122134 -7605734 -15751538 -9188433
10849 -9188433 -4580765 -6960579 -4215926 8679335 17939634 11639188 -2050619 -8418161
$$ packed form
10904b019692O462018Q773914K109854o002128p357999k468246L507249P031351
10896A0036321N729650j675188j0821194j2745000m844669L638380L269665k310846
10888i722881k631568K725926L756033k734203o730850r04053O959993O010196
10880c271407k98703R2049Q211166J2187068N846580j946696j156614M750343
10872B4413786N060083k197168q325999o855014j574043L8066l201546o085090
10864A273075m648245j81435L828560M889807J223636o642334j1641039m093358
10856a5991333J3727309K3007134R308459j4929435k2727868q145804O563105
10849i188433M607668k379814K744653J2895261R260299o300446j3689807o367542
$$ plain form
10841 -8418161 -7172281 -6902596 -6554178 2134704 16150101 19992315 6201733 -12990591
10833 -12990591 -19393214 -8481605 8580359 18601686 17806471 10783473 2366577 -5791944
10825 -5791944 -11340102 -10330660 -4476162 -3061495 -9616007 -12702465 -2268818 9884672
10817 9884672 3797916 -15645240 -21606089 -6092854 6534834 -1197224 -11574884 -2442953
10809 -2442953 14577719 12727972 -7239508 -21235244 -20267927 -16899099 -17846109 -17181535
10801 -17181535 -15103599 -17654215 -18489762 -6811910 6868169 773810 -20517929 -28117974
10793 -28117974 -13442673 -14321 -2207639 -4299323 5497144 11533452 801737 -11391330
10785 -11391330 -8543375 -1199906 -3653003 -5324366 6790275 17176277 4856543 -17540756
$$ packed form
10841h418161J245880K69685L48418Q688882J4015397L842214j3790582j9192324
10833a2990591o402623J0911609J7061964J0021327p95215p022998q416896q158521
10825e791944n548158J009442N854498J414667o554512l086458J0433647J2153490
10817I884672o086756j9443156n960849J5513235J2627688p732058j0377660R131931
10809b442953J7020672j849747j9967480j3995736R67317L368828r47010O64574
10801a7181535K077936k550616q35547J1677852J3680079o094359k1291739p600045
10793b8117974J4675301J3428352k193318k091684R796467O036308j0731715j2193067
10785a1391330K847955P343469k453097j671363J2114641J0386002j2319734k2397299
$$ plain form
10777 -17540756 -20889513 -5854820 1415470 -5619011 -7452957 2175924 3868331 -12577430
10769 -12577430 -28752630 -25368309 -8842208 1991966 564910 -6520766 -11896675 -12470565
10761 -12470565 -9991254 -10509844 -15975427 -17046424 -4670696 13109901 19415038 12553331
10753 12553331 6440477 6622671 3079990 -9341669 -20144895 -19926567 -14101549 -11829729
10745 -11829729 -12137471 -8847418 -1087865 7400724 13189470 13768362 9028900 3084639
10737 3084639 -1635886 -9783320 -23367004 -30647441 -18799336 3779524 13771194 2932774
10729 2932774 -13729290 -21704626 -22136325 -19487614 -11736526 -161691 6217700 3679233
10721 3679233 -1572883 -6725220 -15207046 -21627295 -12657703 8945911 21017837 14169191
$$ packed form
10777a7540756l348757J5034693P270290p034481j833946R628881J692407j6445761
10769a2577430j6175200L384321J6526101J0834174j427056p085676n375909n73890
10761a2470565K479311n18590n465583j070997J2375728J7780597O305137o861707
10753A2553331o112854J82194l542681j2421659j0803226K18328N825018K271820
10745a1829729l07742L290053P759553Q488589N788746N78892m739462n944261
10737C084639m720525q147434j3583684p280437J1848105K2578860R991670j0838420
10729B932774j6662064p975336m31699K648711P751088J1574835O379391k538467
10721C679233n252116n152337q481826o420249Q969592K1603614J2071926o848646
$$ plain form
10713 14169191 7340981 16179866 25887271 16131856 -3866833 -10164981 -2540355 -1318217
10705 -1318217 -11701161 -18161189 -13701438 -9026337 -8785378 -2585513 12131645 19272455
10697 19272455 8542745 -5380741 -2786268 12498256 19310739 8634891 -6470767
10690 -6470767 -9615720 429552 11847656 13760699 5133753 -6953100 -14756755 -15491411
10682 -15491411 -11006167 -4160339 2810758 7512304 7516008 1659426 -9334159 -21900889
10674 -21900889 -28296348 -20279444 941009 20634196 23265687 10308790 -841638
10667 -841638 1470290 8645309 4713862 -10567510 -20590527 -14493367 -1649159 1948018
10659 1948018 -5169308 -11313002 -10367681 -7919001 -8530238 -9057861 -8923077 -15357672 -30291473
$$ packed form
10713A4169191o828210Q838885R707405r755415j9998689o298148P624626J222138
10705a318217j0382944o460028M459751M675101K40959O199865J4717158P140810
10697A9272455j0729710j3923486K594473J5284524O812483j0675848j5105658
10690f470767l144953J0045272J1418104J913043q626946j2086853p803655p34656
10682a5491411M485244O845828O971097M701546L704n856582j0993585j2566730
10674b1900889o395459Q016904K1220453J9693187K631491j2956897j1150428
10667h41638K311928P175019l931447j5281372j0023017O097160J2844208L597177
10659A948018p117326o143694R45321K448680o11237n27623J34784o434595j4933801
$$ plain form
10650 -30291473 -41707508 -38599208 -27033504 -19582384 -15247492 -4084787 12199140
10643 12199140 20484005 17347580 14719607 21194752 30643305 33559696 28571569 19038111
10635 19038111 9059484 5891844 14281638 24535154 19465663 -732472 -13788986 -4050806
10627 -4050806 15973798 23035254 12284030 -2085029 -7449654 -2516542 7913638 16822737
10619 16822737 16874296 7648728 -1315441 -1624535 3152828 4135807 296829 -2390014 -1568006
10610 -1568006 -710428 -2417570 -5696139 -9208916 -13054042 -17744788 -22855957 -25064769
10602 -25064769 -19002385 -5383609 3501245 -4464404 -23445688 -33859946 -26329322 -10683289
10594 -10683289 1083745 7624832 9538876 2680550 -11096438 -19196386 -14458604 -5528566
$$ packed form
10650c0291473j1416035L108300J1565704P451120M334892J1162705J6283927
10643A2199140Q284865l136425k627973O475145R448553K916391m988127r533458
10635A9038111r978627l167640Q389794J0253516n069491k0198135j3056514R738180
10627d050806K0024604P061456j0751224j4369059n364625M933112J0430180Q909099
10619A6822737N1559r225568q964169l09094M777363R82979l838978k686843Q22008
10610a568006Q57578j707142l278569l512777l845126m690746n111169k208812
10602b5064769O062384J3618776Q884854p965649j8981284j0414258P530624J5646033
10594a0683289J1767034O541087J914044o858326j3776988q099948M737782Q930038
$$ plain form
10586 -5528566 -1854849 205248 5954257 9201275 3620028 -3234313 -1662129 3061122
10578 3061122 127783 -7375313 -7583102 992133 9836083 15389586 19676983 20074115
10570 20074115 12420069 1432485 -4804402 -7657686 -12967687 -17279780 -12600527 -1790788
10562 -1790788 4687965 5319674 7300108 11668241 12704032 11220190 14040271 19489199
10554 19489199 17322665 5546141 -5213124 -7565285 -6715689 -9909774 -15454054 -16656684
10546 -16656684 -10684271 -755799 6297511 4726721 -3303069 -7308492 -483862 10204253
10538 10204253 12336806 4331788 -3423005 -2411683 5293809 11531863 10421539 2669957
10530 2669957 -5689244 -9715392 -10576826 -11211945 -9927246 -5174266 -2367399 -4568175
$$ packed form
10586e528566L673717K060097N749009L247018n581247o854341J572184M723251
10578C061122k933339p503096k07789Q575235Q843950N553503M287397L97132
10570B0074115p654046j0987584o236887k853284n310001m312093M679253J0809739
10562a790788O478753O31709J980434M368133J035791j483842K820081N448928
10554A9489199k166534j1776524j0759265k352161Q49596l194085n544280j202630
10546a6656684N972413R928472P053310j570790q029790m005423O824630J0688115
10538A0204253K132553q005018p754793J011322P705492O238054j110324p751582
10530B669957q359201m026148q61434o35119J284699M752980K806867k200776
$$ plain form
10522 -4568175 -1195997 17122092 36027545 32361085 11461735 2385706 11798707 14048743
10514 14048743 -2900595 -16128246 -9343723 -733966 -5611682 -5889786 12773948 26073556
10506 26073556 10040953 -13638691 -11660065 6604169 11112858 3653110 3075033 1278414
10498 1278414 -16453456 -29347925 -13547342 5521493 -6366636 -22917695 -735758
10491 -735758 30856831 16060011 -1859813 83090457 254833946 345921576 252973488
10484 252973488 81327110 -4337958 10052974 22814484 -4511602 -18481515 4385243
10477 4385243 19495058 3192832 -10041150 2318874 13700407 2597071 -12328291
10470 -12328291 -12257394 -7799346 -10407127 -12675470 -11669959 -17210418 -25352222 -16870213
$$ packed form
10522d568175L372178J8318089J8905453l666460k0899350r076029R413001K250036
10514A4048743j6949338j3227651O784523Q609757m877716k78104J8663734J3299608
10506B6073556j6032603k3679644J978626J8264234M508689p459748n78077j796619
10498A278414j7731870j2894469J5800583J9068835j1888129j6551059K2181937
10491g35758L1592589j4796820j7919824Q4950270J71743489R1087630r2948088
10484B52973488j71646378q5665068J4390932J2761510k7326086j3969913K2866758
10477D385243J5109815j6302226j3233982J2360024J1381533j1103336j4925362
10470a2328291P0897M458048k607781k268343J005511n540459q141804Q482009
$$ plain form
10462 -16870213 7471133 22213631 17486942 12793327 20819609 28382004 24974978 21320456
10454 21320456 26164600 29822680 23862957 15560881 11786827 8035642 2110015 200748
10446 200748 2928101 3193042 1376494 3929325 6370499 -333413 -6930323 4462942
10438 4462942 26307299 29654402 6829351 -18299636 -28606093 -32864374 -38992079 -38993856
10430 -38993856 -31858153 -31386548 -37646456 -30142983 -4867835 11780839 4748849 -3664698
10422 -3664698 7498867 21117441 12079334 -9101797 -14286385 -2678435 3743780 -1532278
10414 -1532278 -6158044 -6750127 -11537321 -18159087 -14428418 -1118917 7856173 8439760
10406 8439760 10205480 16712190 20266688 17532207 13717191 9574391 -114978 -12687788
$$ packed form
10462a6870213K4341346J4742498m726689m693615Q026282P562395l407026l654522
10454B1320456M844144L658080n959723q302076l774054l751185n925627j909267
10446B00748K727353K64941j816548K552831K441174o703912o596910J1393265
10438D462942K1844357L347103k2825051k5128987j0306457m258281o127705j777
10430c8993856P135703M71605o259908P503473K5275148J6648674p031990q413547
10422c664698J1163565J3618574r038107k1181131n184588J1607950O422215n276058
10414a532278m625766n92083m787194o621766L730669J3309501Q975090N83587
10406H439760J765720O506710L554498k734481l815016m142800r689369j2572810
$$ plain form
10398 -12687788 -16963474 -10349467 -3994623 -6234599 -11083356 -7970429 4547248 18364645
10390 18364645 23576645 15189282 -2520227 -17716290 -21947268 -19071077 -18931134 -24231699
10382 -24231699 -29300357 -29569696 -25407844 -17583948 -5575540 9437947 24619987 37583881
10374 37583881 44377077 38384755 17907602 -6453433 -19078651 -15233961 -5106908
10367 -5106908 -1160079 -5147943 -8562854 -3437436 8175972 15083495 8430101 -7720488
10359 -7720488 -20272637 -22000980 -18140656 -16600683 -17083414 -13610540 -3478968 10675187
10351 10675187 24657930 34644800 37742850 33874579 25426972 13852178 -154147 -12610685
10343 -12610685 -17861299 -16017999 -12793252 -9708682 -2013401 9649190 14216822 4564281
$$ packed form
10398a2687788m275686O614007O354844k239976m848757L112927J2517677J3817397
10390A8364645N212000q387363j7709509j5196063m230978K876191J39943n300565
10382b4231699n068658k69339M161852P823896J2008408J5013487J5182040J2963894
10374C7583881O793196n992322k0477153k4361035j2625218L844690J0127053
10367e106908L946829l987864l414911N125418J1613408O907523o653394j6150589
10359g720488j2552149j728343L860324J539973m82731L472874J0131572J4154155
10351A0675187J3982743R986870L098050l868271q447607j1574794j4006325j2456538
10343a2610685n250614J843300L224747L084570P695281J1662591M567632r652541
$$ plain form
10335 4564281 -9729934 -13443674 -5485031 2036383 1838453 -2114032 -5910900 -11855050
10327 -11855050 -19550429 -20965078 -11954953 -2136522 -3909247 -14586508 -19506924 -13219556
10319 -13219556 -6648905 -8369279 -9228153 3865570 25315730 35742292 28065607 14700224
10311 14700224 7105497 3099296 -159948 3949286 18261062 31195879 32056995 26570100
10303 26570100 23908523 18886689 3810226 -10732142 -7330406 9837513 18300028 8603015
10295 8603015 -6348801 -13852742 -14541387 -10848691 -1497224 7745333 5684014 -5710424
10287 -5710424 -10695112 -4033542 576714 -6243893 -14361332 -11772254 -2674283 2691628
10279 2691628 3445389 2819911 -974512 -8312247 -12577120 -10157625 -6797753 -6894188 -6873002
$$ packed form
10335D564281j4294215l713740P958643P521414j97930l952485l796868n944150
10327a1855050p695379j414649R010125R818431j772725j0677261m920416O287368
10319a3219556O570651j720374q58874J3093723K1450160J0426562p676685j3365383
10311A4700224p594727m006201l259244M109234J4311776J2934817Q61116n486895
10303B6570100k661577n021834j5076463j4542368L401736J7167919Q462515r697013
10295H603015j4951816p503941o88645L692696R351467R242557k061319j1394438
10287e710424m984688O661570M610256o820607q117439K589078R097971N365911
10279B691628P53761o25478l794423p337735m264873K419495L359872r6435K1186
$$ plain form
10270 -6873002 -5337284 -7375009 -12188224 -10605429 -2814369 -3267365 -18345360 -34889265
10262 -34889265 -41640347 -44884732 -49679501 -44288811 -21610832 340769 1154515 -11140209
10254 -11140209 -14098774 -5462841 -519379 -2736339 -1632438 3801332 3280031 -3574800
10246 -3574800 -5468189 102971 3633948 1926844 1546678 2774973 -1932467 -11166388
10238 -11166388 -13573982 -7353251 -5138948 -15049050 -29907906 -38265185 -34300642 -16621188
10230 -16621188 8965714 25713051 20836275 5172775 1534504 12226010 16835432
10223 16835432 5749553 -4959808 -374709 11144599 15250588 14931231 21150382 31168427
10215 31168427 31910273 19552604 3476907 -6217679 -6485240 145359 7916011 11257881
$$ packed form
10270f873002J535718k037725m813215J582795P791060m52996j5077995j6543905
10262c4889265o751082l244385m794769N390690K2677979K1951601Q13746j2294724
10254a1140209k958565Q635933M943462k216960J103901N433770n21301o854831
10246c574800j893389N571160L530977j707104l80166J228295m707440r233921
10238a1166388k407594O220731K214303r910102j4858856q357279L964543J7679454
10230a6621188K5586902J6747337m876776j5663500l638271J0691506M609422
10223A6835432j1085879j0709361M585099J1519308M105989l19357O219151J0018045
10215C1168427P41846j2357669j6075697r694586k67561O630599P770652L341870
$$ plain form
10207 11257881 9825893 6772758 1509546 -8115522 -15565022 -9232413 9080252 21271624
10199 21271624 15850638 2726284 -3425024 -3275234 -5073785 -7144812 -2984628 2697707
10191 2697707 -957952 -12302949 -18585183 -15964617 -13691462 -16108254 -15006655 -5957052
10183 -5957052 757612 -4314522 -12615340 -8783072 5611372 13532029 7734571 209897
10175 209897 1137964 2150111 -7705219 -19496708 -15387150 1338646 7097722 -7264770
10167 -7264770 -21938384 -18394836 -6479505 -5150423 -10355806 -3910340 13399430 21969652
10159 21969652 15744423 10495628 15117745 17216839 7139923 -3400134 -658667 8897879
10151 8897879 11807153 10922386 17523731 28333816 29877818 22733666 22404452 34025392
$$ packed form
10207A1257881j431988l053135n263212r625068p449500O332609J8312665J2191372
10199B1271624n420986j3124354o151308J49790j798551k071027M160184N682335
10191B697707l655659j1344997o282234K620566K273155k416792J101599R049603
10183e957052O714664n072134q300818L832268J4394444P920657n797458p524674
10175B09897R28067J012147r855330j1791489M109558J6725796N759076j4362492
10167g264770j4673614L543548J1915331J329082n205383O445466J7309770Q570222
10159B1969652o225229n248795M622117K099094j0076916j0540057K741467R556546
10151H897879K909274q84767O601345J0810085J544002p144152l29214J1620940
$$ plain form
10143 34025392 43032973 37243071 24932485 21443411 25786882 21062291 -3355601 -36842492
10135 -36842492 -56133734 -47161336 -18471593 7002040 14611243 11114005 12498171 21493695
10127 21493695 24508885 11953025 -6958130 -15754474 -11508208 -5890139 -7714438 -13377926
10119 -13377926 -15824999 -14505922 -11849084 -6165869 5100725 17764786 22700818 14993101
10111 14993101 -1954607 -19473964 -27655604 -20530504 -3352106 8553461 5792859
10104 5792859 -2549456 -878814 10680606 17222920 11942210 4579641 3445632 2678808
10096 2678808 -5053940 -14738543 -17399810 -13179528 -6641342 2364974 13099006 17679212
10088 17679212 12114852 6401379 11174955 20599812 21816968 15700935 13184511 14924872
$$ packed form
10143C4025392R007581n789902j2310586l489074M343471m724591k4417892l3486891
10135c6842492j9291242Q972398K8689743K5473633P609203l497238J384166Q995524
10127B1493695L015190j2555860j8911155q796344M246266N618069j824299n663488
10119a3377926k447073J319077K656838N683215J1266594J2664061M936032p707717
10111A4993101j6947708j7519357q181640P125100J7178398J1905567k760602
10104E792859q342315J670642J1559420O542314n280710p362569j134009p66824
10096B678808p732748r684603k661267M220282O538186R006316J0734032M580206
10088A7679212n564360n713473M773576R424857J217156o116033k516424J740361
$$ plain form
10080 14924872 11216025 1295455 -3635607 1101606 6300881 3408812 -5163843 -12741904
10072 -12741904 -14846112 -8208796 4992269 11712609 625394 -18270518 -21614862 -4002305
10064 -4002305 13852064 14091882 3828223 -161186 4992598 11267764 15794319 21332699
10056 21332699 26689017 27276680 22497276 16095079 11984880 12764982 17447531 19333760
10048 19333760 13588683 7454234 12255019 24038370 26319051 16069128 10516584 19945204
10040 19945204 30611760 27343969 17719062 17173637 22473465 19611198 10148867 8949199
10032 8949199 18531982 24824358 19137104 8144789 118687 -4366339 -5285526 50410
10024 50410 8670619 10698833 786782 -16269986 -32601915 -42465668 -41034821 -28070772
$$ packed form
10080A4924872l708847r920570m931062M737213N199275k892069q572655p578061
10072a2741904k104208O637316J3201065O720340j1087215j8895912l344344J7612557
10064d002305J7854369K39818j0263659l989409N153784O275166M526555N538380
10056B1332699N356318N87663m779404o402197m110199P80102M682549J886229
10048A9333760n745077o134449M800785J1783351K280681j0249923n552544R428620
10040A9945204J0666556l267791r624907n45425N299828k862267r462331j199668
10032H949199R582783O292376n687254j0992315q026102m485026r19187N335936
10024E0410Q620209K028214r912051j7056768j6331929r863753J430847J2964049
$$ plain form
10016 -28070772 -13898352 -11623398 -20856575 -27895558 -24097134 -15072054 -9317233 -7257348
10008 -7257348 -5506661 -3626332 -2059207 4129 1293482 -434132 -1735770 3788707
10000 3788707 13031446 13332609 593248 -11649068 -9216906 3852093 12583201 11913374
9992 11913374 10203058 14439552 21654197 25533318 24389255 21394877 21479234 27470689
9984 27470689 35159430 34795394 23788185 15056084 23278940 43163812 52521729 40208684
9976 40208684 19770577 8626546 4818490 -3682759 -14814929 -14703954 -2991958 2105141
9968 2105141 -9617818 -23652070 -21867674 -9432329 -5930846 -15293608 -21215554 -13334598
9960 -13334598 -2465587 -2892657 -10728289 -10664884 518269 8235859 -239621 -17534199
$$ packed form
10016b8070772J4172420K274954r233177p038983L798424R025080N754821K059885
10008g257348J750687J880329J567125K063336J289353j727614j301638N524477
10000C788707R242739L01163j2739361j2242316K432162J3068999Q731108o69827
9992A1913374j710316M236494P214645L879121j144063k994378Q4357N991455
9984B7470689P688741l64036j1007209q732101Q222856J9884872R357917j2313045
9976D0208684k0438107j1144031l808056q501249j1132170J10975J1711996N097099
9968B105141j1722959j4034252J784396J2435345L501483r362762n921946P880956
9960a3334598J0869011m27070p835632O3405J1183153P717590q475480j7294578
$$ plain form
9952 -17534199 -23569775 -10197109 7827222 11053996 116677 -7493863 -5244107 -7734628
9944 -7734628 -24906210 -40320313 -32425384 -9257945 106981 -12195336 -22478371 -13178425
9936 -13178425 2130023 4113781 -2099062 -1070921 3182606 -5374533 -24575886 -34245121
9928 -34245121 -26374326 -15455685 -15314829 -21712393 -22984572 -15140927 -1467618 12125855
9920 12125855 17474335 10381678 155378 2273139 17509779 29202779 25683327 13660586
9912 13660586 3727045 -4054421 -10988671 -9389807 4840096 18764531 17311965 5941520
9904 5941520 2423114 9390673 12573159 6722868 4847546 15405135 26099168 20974936
9896 20974936 2885019 -12428535 -17595210 -18078217 -19883109 -23008608 -25185406 -24241798
$$ packed form
9952a7534199o035576J3372666J8024331L226774j0937319p610540K249756k490521
9944g734628j7171582j5414103P894929K3167439R364926j2302317j0283035R299946
9936a3178425J5308448J983758o212843J028141M253527q557139j9201353r669235
9928c4245121P870795J0918641J40856o397564j272179P843645J3673309J3593473
9920A2125855N348480p092657j0226300K117761J5236640J1693000l519452j2022741
9912A3660586r933541p781466o934250J598864J4229903J3924435j452566j1370445
9904E941520l518406O967559L182486n850291j875322J0557589J0694033n124232
9896B0974936j8089917j5313554n166675m83007j804892l125499k176798R43608
$$ plain form
9888 -24241798 -18524350 -11148169 -10361543 -18793888 -26712999 -24292243 -15609014 -9815014
9880 -9815014 -3726134 11515373 28596684 27827359 7025689 -10607576 -7564256 5060592
9872 5060592 7922104 2299694 2591474 10986808 18416284 23872468 32463437 36954125
9864 36954125 22924768 -4477873 -19064232 -7169565 13603517 19973913 13695855
9857 13695855 12646185 20470135 22025442 7537325 -13311594 -25210116 -24878599 -18797086
9849 -18797086 -10352133 1723056 13920388 16911127 8396218 37712 3718736 14780789
9841 14780789 18596764 12047148 6515942 8486800 11153553 10061633 11736896 17448466
9833 17448466 13888560 -5304233 -21872633 -15445486 5760625 17192748 13907266 11536578
$$ packed form
9888b4241798N717448P376181P86626q432345p919111K420756Q683229N794000
9880i815014O088880J5241507J7081311p69325k0801670j7633265L043320J2624848
9872E060592K861512n622410K91780Q395334P429476N456184Q590969M490688
9864C6954125j4029357k7402641j4586359J1894667K0773082O370396o278058
9857A3695855j049670P823950J555307j4488117k0848919j1898522L31517O081513
9849a8797086Q444953J2075189J2197332K990739q514909q358506L681024J1062053
9841A4780789L815975o549616n531206J970858K666753j091920J675263N711570
9833A7448466l559906j9192793j6568400O427147K1206111J1432123l285482k370688
$$ plain form
9825 11536578 15331951 13652579 3764457 -1083231 3470711 4004193 -5857434 -13027663
9817 -13027663 -8600379 -4416161 -12276581 -23028448 -21363257 -8776541 2101360 5503311
9809 5503311 2935827 -3867784 -9233513 -3384076 13227305 26011242 26430266 23733153
9801 23733153 26081078 24509885 9745810 -8494299 -15484183 -13677985 -14253355 -16682265
9793 -16682265 -14381926 -11773026 -16828065 -23281493 -19078658 -7672113 -2554514 -4358511
9785 -4358511 -1924710 5876814 7971603 1420804 -3013667 1246185 7095729 6530111
9777 6530111 2814032 5402702 17658415 30966692 30365263 11145436 -9693426 -9938741
9769 -9938741 6970897 14042163 513161 -11655102 -4536300 6109539 -91058 -11439300
$$ packed form
9825A1536578L795373j679372r888122m847688M553942N33482r861627p170229
9817a3027663M427284M184218p860420j0751867J665191J2586716J0877901L401951
9809E503311k567484o803611n365729N849437J6611381J2783937M19024k697113
9801B3733153K347925j571193j4764075j8240109o989884J806198n75370k428910
9793a6682265K300339K608900n055039o453428M202835J1406545N117599j803997
9785d358511K433801P801524K094789o550799m434471M259852N849544n65618
9777F530111l716079K588670J2255713J3308277o01429j9219827k0838862k45315
9769i938741J6909638P071266j3529002j2168263P118802J0645839o200597j1348242
$$ plain form
9761 -11439300 -6172766 6443864 2299149 -11961370 -8284844 12951623 22561594 12821189
9753 12821189 7648784 16225144 17214816 2297247 -3813458 13200961 28844580 19884563
9745 19884563 3203815 6201347 22337734 26540107 16692579 8837112 4082333 -8553318
9737 -8553318 -23510091 -22499166 -5324825 8623285 10655114 11860344 18750147 20714966
9729 20714966 9280220 -5945542 -10266679 -3499981 2000521 -1361917 -7416494 -4706571
9721 -4706571 8299825 19622302 18602509 11049369 11223373 19877976 22617750 12890924
9713 12890924 2454257 1716540 3540343 -2133329 -9645590 -8439008 -4140010 -11997219
9705 -11997219 -32079772 -46057491 -39787660 -18023357 4838267 19577366 25631624
$$ packed form
9761a1439300N266534J2616630m144715j4260519L676526K1236467R609971r740405
9753A2821189n172405Q576360R89672j4917569o110705J7014419J5643619q960017
9745A9884563j6680748K997532J6136387M202373r847528p855467m754779j2635651
9737h553318j4956773J010925J7174341J3948110K031829J205230O889803J964819
9729B0714966j1434746j5225762m321137O766698N500502l362438o054577K709923
9721d706571J3006396J1322477j019793p553140J74004Q654603K739774r726826
9713A2890924j0436667p37717J823803n673672p512261J206582M298998p857209
9705a1997219k0082553j3977719O269831K1764303K2861624J4739099O054258
$$ plain form
9698 25631624 26934938 27587423 28514320 26876311 19608039 6714353 -8821024 -21641611
9690 -21641611 -25357199 -18385940 -8261916 -3918289 -3754335 1315642 13052193 22893441
9682 22893441 24174020 17800414 5450697 -11820760 -27418478 -33809014 -34150600 -36099994
9674 -36099994 -34703592 -19418816 776238 2337356 -16130195 -26659694 -13575737
9667 -13575737 2042519 -2940405 -17490087 -17927099 -6587905 -1882933 -3462780 3839174
9659 3839174 19376919 28000141 27765798 29921745 33192481 24067978 3906963 -8610672
9651 -8610672 -5717928 553880 1765918 4257902 11307882 14103382 8583768 4571730
9643 4571730 9895231 19327186 26093330 31284118 35744278 35199613 29337977 24274954
$$ packed form
9698B5631624J303314O52485R26897j638009p268272j2893686j5535377j2820587
9690b1641611l715588O971259J0124024M343627J63954N069977J1736551R841248
9682B2893441J280579o373606j2349717j7271457j5597718o390536l41586j949394
9674c6099994J396402J5284776K0195054J561118j8467551j0529499J3083957
9667a3575737J5618256m982924j4549682m37012J1339194M704972j579847P301954
9659C839174J5537745Q623222k34343K155947L270736r124503k0161015j2517635
9651h610672K892744O271808J212038K491984P049980K795500n519614m012038
9643D571730N323501R431955O766144N190788M460160n44665n861636n063023
$$ plain form
9635 24274954 21493962 15984624 8639794 7234303 11299586 10357033 2072514 -2748399
9627 -2748399 655470 2458291 -2847947 -4419180 7018249 22563492 28878178 27306920
9619 27306920 26455937 25667964 19907772 13191191 12278365 12189921 2728471 -13136030 -21095329
9610 -21095329 -15169646 -3473524 5786710 12236825 15718540 12633060 4348662 -722427
9602 -722427 416142 -762993 -9991835 -16836655 -7191850 13443964 22482505 9292566
9594 9292566 -10464407 -17416054 -14673389 -18287751 -28694043 -29876581 -16808854 -4466853
9586 -4466853 -3314704 -3675296 4681898 13590113 12202913 7993939 13060764 19333242
9578 19333242 9405916 -12690677 -24159345 -16622192 -5100459 -1432971 -215107 3082603
$$ packed form
9635B4274954k780992n509338p344830j405491M065283r42553q284519m820913
9627b748399L403869J802821n306238j571233J1437429J5545243O314686j571258
9619B7306920q50983p87973n760192o716581r12826q8444r461450j5864501p959299
9610b1095329N925683J1696122R260234O450115L481715l085480q284398n071089
9602g22427J138569j179135r228842o844820R644805K0635814R038541j3189939
9594I292566j9756973o951647K742665l614362j0406292j182538J3067727J2342001
9586d466853J152149l60592Q357194Q908215j387200m208974N066825O272478
9578A9333242r927326k2096593j1468668P537153J1521733L667488J217864L297710
$$ plain form
9570 3082603 1263595 -7278696 -9399809 1135987 8607008 -2021926 -19377397 -20438795
9562 -20438795 -3787476 10015680 8978353 3571057 7176102 16378130 18306425 10243153
9554 10243153 3157385 6153217 13533287 11833534 -1732855 -14556391 -15759886 -11057121
9546 -11057121 -12143851 -16547017 -11143178 4711554 14378857 7564593 -3815024 -2278460
9538 -2278460 11466035 21382370 17792920 7044555 1056295 3661143 7871371 4711538
9530 4711538 -4943881 -9690480 -3088345 4340211 -1539677 -15704104 -18983639 -7223546
9522 -7223546 1807616 -2563533 -5921068 6959071 24973593 26315347 11633263 1165472
9514 1165472 3083719 5576596 1468572 687688 11267888 23760917 24961204 16827670
$$ packed form
9570C082603j819008q542291k121113J0535796P471021j0628934j7355471j061398
9562b0438795J6651319J3803156j037327n407296L605045R202028J928295q063272
9554A0243153p085768K995832P380070j699753j3566389j2823536j203495M702765
9546a1057121j086730m403166N403839J5854732R667303o814264j1379617J536564
9538b278460J3744495R916335l589450j0748365n988260K604848M210228l159833
9530D711538r655419m746599O602135P428556n879888j4164427l279535J1760093
9522g223546R031162m371149l357535J2880139J8014522J341754j4682084j0467791
9514A165472J918247K492877m108024p80884J0580200J2493029J200287q133534
$$ plain form
9506 16827670 11224011 12319949 14218999 12729956 10362065 9689750 8283663 1748337
9498 1748337 -11395371 -27810366 -39509133 -37233754 -18697928 5427735 18475434
9491 18475434 14043271 2522740 -1873740 2450092 5998746 3484569 -531031 -1979431
9483 -1979431 -4111973 -9380348 -12321476 -7673942 91540 3218800 2188908 2540370
9475 2540370 4200082 3365636 1910717 4468855 7969372 5171685 -1949060 -3968272
9467 -3968272 33715 223117 -7705882 -15484012 -15655860 -11840163 -10792312 -12823681 -14446301
9458 -14446301 -13082859 -6543977 4164418 10468928 4706321 -6246422 -8063653 -905426
9450 -905426 596703 -7978811 -13766543 -10007305 -7020612 -9877124 -5475413 12817409
$$ packed form
9506A6827670n603659J095938J899050j489043k367891o72315j406087o535326
9498A748337j3143708j6414995j1698767K275379J8535826K4125663J3047699
9491A8475434m432163j1520531m396480M323832L548654k514177m015600j448400
9483a979431k132542n268375k941128M647534P765482L127260j029892L51462
9475B540370J659712q34446j454919K558138L500517k797687p120745k019212
9467c968272M001987J89402p928999p778130j71848L815697J047851k031369j622620
9458a4446301J363442O538882J0708395O304510n762607j0952743j817231P158227
9450i05426J502129q575514n787732L759238K986693k856512M401711J8292822
$$ plain form
9442 12817409 26619829 19076879 4601641 8080542 25255814 30408163 18112128 9658385
9434 9658385 16732284 24581035 18313288 4504243 -3642149 -6339681 -11145415 -18025301
9426 -18025301 -20679782 -16247744 -7510043 -729376 -3444229 -16969447 -29940952 -28769122
9418 -28769122 -16377652 -10047641 -17455190 -25865189 -20758531 -5816944 2863083 -3534871
9410 -3534871 -18751514 -29805415 -29514439 -22952767 -21623939 -28520298 -32865399 -25956701
9402 -25956701 -16353294 -17901211 -27121293 -27757611 -16347161 -5942332 -2947152 732221
9394 732221 7457427 5941357 -6614346 -13401256 -3063783 10195426 8002430 -4211068
9386 -4211068 -8882608 -4666997 -2605282 -2310317 5144818 14145177 7774807 -14083639
$$ packed form
9442A2817409J3802420p542950j4475238L478901J7175272N152349j2296035q453743
9434I658385P073899P848751o267747j3809045q146392k697532m805734o879886
9426a8025301k654481M432038Q737701O780667k714853j3525218j2971505J171830
9418b8769122J2391470O330011p407549q409999N106658J4941587Q680027o397954
9410c534871j5216643j1053901K90976O561672J328828o896359m345101O908698
9402b5956701R603407j547917r220082o36318J1410450J0404829K995180L679373
9394G32221O725206j516070j2555703o786910J0337473J3259209k192996j2213498
9386d211068m671540M215611K061715K94965P455135R000359o370370k1858446
$$ plain form
9378 -14083639 -30957743 -30731305 -23229328 -18408136 -10101425 7017982 19832036 11885233
9370 11885233 -11513547 -26713881 -17597977 9885059 35379106 40194184 20647502
9363 20647502 -8052612 -24682211 -22562308 -12068704 -1226688 14422909 35783211
9356 35783211 47549436 35994100 11346270 -3298361 -1029583 6170603 10319047 15428746
9348 15428746 22037447 21388860 10176825 -3041215 -11523465 -17666957 -21908422 -18234838
9340 -18234838 -7349633 -656098 -3324680 -6882857 -6766582 -11463956 -22838686 -24625624
9332 -24625624 -7654671 8725826 2341027 -16151804 -18538441 -2980943 5241188 -4206895
9324 -4206895 -12586336 -5418665 6586934 10258946 10463225 14362802 14771802 5036141
$$ packed form
9378a4083639j6874104K26438P501977M821192Q306711J7119407J2814054p946803
9370A1885233k3398780j5200334R115904K7483036K5494047M815078j9546682
9363B0647502k8700114j6629599K119903J0493604J0842016J5649597K1360302
9356C5783211J1766225j1555336k4647830j4644631K268778P200186M148444N109699
9348A5428746O608701o48587j1212035j3218040q482250o143492m241465L673584
9340a8234838J0885205O693535k668582l558177J16275m697374j1374730j786938
9332b4625624J6970953J6380497o384799j8492831k386637J5557498Q222131r448083
9324d206895q379441P167671J2005599L672012K04279L899577M09000r735661
$$ plain form
9316 5036141 -4684442 -1873838 9361142 17853590 22642363 26467730 22790086 5213098
9308 5213098 -17659143 -31165058 -31990628 -24450492 -8207432 15513989 33297026 32156427
9300 32156427 18604160 9846493 9830194 9040963 3978636 -90436 -3895978 -14135976
9292 -14135976 -27429997 -30492903 -20223786 -10431445 -13977623 -28201617 -40929452 -41985160
9284 -41985160 -27538343 -2706053 18452295 24101659 17039076 9340051 6964387 8267538
9276 8267538 13668881 24276754 32713896 28652293 14079877 1825016 -624913 4875113
9268 4875113 16191183 30435726 37460084 29926529 18424219 19448692 29321245 29226972
9260 29226972 16317743 7822025 11038533 12823101 5797923 1004578 3788041 523583
$$ packed form
9316E036141r720583K810604J1234980Q492448M788773L825367l677644j7576988
9308E213098k2872241j3505915q25570P540136J6243060K3721421J7783037j140599
9300C2156427j3552267q757667j6299p89231n062327m069072l805542j0239998
9292a4135976j3294021l062906J0269117R792341l546178j4223994j2727835j055708
9284d1985160J4446817K4832290K1158348N649364p062583p699025k375664J303151
9276H267538N401343J0607873Q437142m061603j4572416j2254861k449929N500026
9268D875113J1316070J4244543P024358p533555j1502310J024473R872553r4273
9260B9226972j2909229q495718L216508J784568p025178m793345K783463l264458
$$ plain form
9252 523583 -16179151 -30513935 -28530754 -20537300 -20114751 -19765421 -8856489 1660414
9244 1660414 -2493017 -10086648 -1339266 16441318 19274191 6589056 812049 8252791
9236 8252791 10814237 814225 -5064464 3728150 12634151 7073567 -4061731 -5139581
9228 -5139581 2138772 6665571 7167239 8511100 8551818 2784540 -5310823 -10980961 -17924261
9219 -17924261 -28678827 -32411781 -17394266 7850964 20990350 13509325 -1438054
9212 -1438054 -10301015 -14617027 -19867268 -21206956 -11401049 2736837 4161368 -12403836
9204 -12403836 -30571232 -29521599 -7363917 18182324 31251950 33703070 37119031 44523974
9196 44523974 46845203 36898830 20329808 9422505 9409612 14521317 16211851 11917362
$$ packed form
9252E23583j6702734j4334784J983181P993454M22549L49330J0908932J0516903
9244A660414m153431p593631Q747382J7780584K832873j2685135n777007P440742
9236H252791K561446j0000012n878689Q792614Q906001n560584j1135298j077850
9228e139581P278353M526799N01668J343861M0718n767278q095363n670138o943300
9219a7924261j0754566l732954J5017515K5245230J3139386p481025j4947379
9212a438054q862961m316012n250241j339688R805907J4137886J424531j6565204
9204a2403836j8167396J049633K2157682K5546241J3069626K451120L415961P404943
9196D4523974K321229r946373j6569022j0907303j2893N111705J690534m294489
$$ plain form
9188 11917362 5426808 1287305 737990 2362073 4464088 5577112 4027430 -451237
9180 -451237 -4393594 -2490628 6215127 15056670 14807082 2861401 -12845422 -19838935
9172 -19838935 -12530385 1727385 9857810 7446001 2735122 3533304 4811433 -3674989
9164 -3674989 -19907756 -29349460 -23665728 -10774636 -2452239 39271 2324793 5489538
9156 5489538 5440098 411305 -6275863 -9005938 -3302678 9169992 17683215 11907687
9148 11907687 -2888338 -9567729 -3031890 1002793 -9942859 -23991089 -21960997 -6951954
9140 -6951954 608870 -6359492 -14148082 -12102600 -6468041 -5711964 -6827919 -3635430
9132 -3635430 2189385 5747747 6605653 6088653 3819448 1201644 1129336 681321 -7590256
$$ packed form
9188A1917362o490554m139503n49315J624083K102015J113024j549682m478667
9180d51237l942357J902966Q705755Q841543k49588j1945681j5706823o993513
9172a9838935P308550J4257770Q130425k411809m710879P98182J278129q486422
9164c674989j6232767r441704N683732J2891092Q322397K491510K285522L164745
9156E489538m9440n028793o687168k730075N703260J2472670Q513223n775528
9148A1907687j4796025o679391O535839M034683j0945652j4048230K030092J5009043
9140f951954P560824o968362p788590K045482N634559P56077j115955L192489
9132c635430N824815L558362Q57906n17000k269205k617804p2308m48015q271577
$$ plain form
9123 -7590256 -22735309 -32294835 -27573124 -14292700 -2553164 5642623 12066897 13611943
9115 13611943 7399506 -455561 -735478 6019220 9742928 3132750 -11122714 -23886805
9107 -23886805 -26661609 -17623980 -4200807 2881107 870079 -2882949 -1879227 1816152
9099 1816152 3820253 4947666 7493702 9724460 9720610 9405488 8808487 2063641 -13336660
9090 -13336660 -28159115 -31022304 -23321749 -16181762 -14920068 -15282997 -13751527 -12265741
9082 -12265741 -11694289 -8569894 -1019386 7051319 9535857 3074371 -10641816 -24130784
9074 -24130784 -28391332 -22964165 -18571549 -23145118 -28671471 -21141169 -1812261 12525602
9066 12525602 11960934 5483172 6640222 16361072 25672777 28268103 24076981 15684569
$$ packed form
9123g590256j5145053r559526M721711J3280424J1739536Q195787O424274J545046
9115A3611943o212437p855067k79917O754698L723708o610178j4255464j2764091
9107b3886805k774804R037629J3423173P081914k011028l753028J003722L695379
9099A816152K004101J127413K546036K230758l850l15122n97001o744846j5400301
9090a3336660j4822455k863189P700555P139987J261694l62929J531470J485786
9082a2265741N71452L124395P550508Q070705K484538o461486j3716187j3488968
9074b4130784m260548N427167M392616m573569n526353P530302J9328908J4337863
9066A2525602n64668o477762J157050R720850R311705K595326m191122q392412
$$ plain form
9058 15684569 7402279 4329278 7309534 11697243 14472520 18265863 24602272 28640052
9050 28640052 26221376 21170646 18627874 15391387 5600287 -6435736 -9289751 -1238216
9042 -1238216 5463155 941991 -8951568 -10769866 96747 16041892 26286185 24487008
9034 24487008 11442779 -3363641 -5767151 9413055 28606882 31300282 14019286
9027 14019286 -4699754 -7496543 821872 3097812 -4524357 -8246781 1512453 15505597
9019 15505597 19467029 14488557 13410830 19841552 22210009 11703091 -3194182 -7453304
9011 -7453304 244672 7015526 4502109 -1292821 -1831934 988812 757203 -708454 3303202
9002 3303202 10617530 11329406 4482186 1928009 10009127 18330142 16119036 10545435
$$ packed form
9058A5684569q282290l073001K980256M387709K775277L793343O336409M037780
9050B8640052k418676n050730k542772l236487r791100j2036023k854015Q051535
9042a238216O701371m521164r893559j818298J0866613J5945145J0244293j799177
9034B4487008j3044229j4806420k403510J5180206J9193827K693400j7280996
9027A4019286j8719040k796789Q318415K275940p622169l722424R759234J3993144
9019A5505597L961432m978472j077727O430722K368457j0506918j4897273m259122
9011g453304P697976O770854k513417n794930n39113K820746k31609j465657M011656
9002C303202P314328P11876o847220k554177Q081118Q321015k211106n573601
$$ plain form
8994 10545435 15510915 27834821 30462957 18685182 7036952 6337301 8864498 4017188
8986 4017188 -4139351 -5961229 -3659214 -6955746 -15982646 -20376150 -14299938 -3171315
8978 -3171315 4537250 5228967 260044 -6005765 -8610000 -6995016 -6188428 -9249132 -11835457
8969 -11835457 -9095733 -3790171 -1217517 -74688 4032470 9235925 9830930 5638135
8961 5638135 749318 -4535254 -11557649 -15650090 -11274102 -3691153 -3973706 -11692724
8953 -11692724 -14356120 -6666545 1148725 -1178051 -10262501 -16650964 -17626896 -15981718
8945 -15981718 -12500176 -6100997 2525138 11735119 20181893 25485445 25892758 23505792
8937 23505792 20284362 12177749 -4189629 -20027188 -21260391 -8457134 2426675 2170933
$$ packed form
8994A0545435M965480J2323906K628136j1777775j1648230o99651K527197m847310
8986D017188q156539j821878K302015l296532r026900m393504O076212J1128623
8978c171315P708565O91717m968923o265809k604235J614984Q06588l060704k586325
8969a1835457K739724N305562K572654J142829M107158N203455N95005m192795
8961E638135m888817n284572p022395m092441M375988P582949k82553p719018
8953a1692724k663396P689575P815270k326776r084450o388463r75932J645178
8945a5981718L481542O399179Q626135R209981Q446774N303552M07313k386966
8937B3505792l221430q106613j6367378j5837559j233203J2803257J0883809k55742
$$ plain form
8929 2170933 -1993718 -3027680 -5617455 -13622166 -20291514 -20620693 -20106958 -20865964 -13564278
8920 -13564278 3518073 12220393 -817231 -19231556 -17434780 2435385 16078918
8913 16078918 13951125 9117113 10143381 10567329 8207136 11498515 19478408 16550296
8905 16550296 -2364790 -19116653 -16721885 -1965022 8588035 12005768 14234699 12543080
8897 12543080 -252804 -18314914 -25186405 -14943842 -59335 4924799 351346 -2056753
8889 -2056753 4016941 11397372 9772554 641948 -4525272 -1695357 -612756 -7959612
8881 -7959612 -14039981 -7622224 3653488 2966059 -9777266 -18383820 -15065744 -7215596
8873 -7215596 420267 11144002 21252410 19600001 7774528 1324975 4400456 3803230
$$ packed form
8929B170933m164651j033962k589775q004711o669348l29179N13735p59006P301686
8920a3564278J7082351Q702320j3037624j8414325J796776J9870165J3643533
8913A6078918k127793m834012J026268M23948k360193L291379P979893k928112
8905A6550296j8915086j6751863K394768J4756863J0553057L417733K228931j691619
8897A2543080j2795884j8062110o871491J0242563J4884507M984134m573453k408099
8889b056753O073694P380431j624818r130606n167220K829915J082601p346856
8881g959612o080369O417757J1275712o87429j2743325q606554L318076P850148
8873g215596P635863J0723735J0108408j652409j1825473o449553L075481n97226
$$ plain form
8865 3803230 -3786127 -2476658 12144603 18039165 1965331 -13307593 -2659297 19319453
8857 19319453 20648817 3776865 841872 20995435 36209972 24666533 -160767
8850 -160767 -13772091 -12236093 -8242459 -11164604 -20874714 -30640858 -30350852 -16220045
8842 -16220045 647006 5608451 -196037 -4146968 -3380535 -5609902 -9928922 -5859632
8834 -5859632 6432317 14174897 13900988 15936646 22370070 21402155 10786228 5160712
8826 5160712 9691555 8324684 -7388210 -18589162 -7050211 14287405 19982066 8387320
8818 8387320 -2607722 -6115899 -9258736 -11560907 -4301441 8635153 10467757 -3891778
8810 -3891778 -19401019 -21726695 -13336324 -4439269 527898 2157375 784781 -2544897
$$ packed form
8865C803230p589357J309469J4621261N894562j6073834j5272924J0648296K1978750
8857A9319453J329364j6871952k934993K0153563J5214537j1543439k4827300
8850a60767j3611324J535998L993634k922145r710110r766144K90006J4130807
8842a6220045J6867051M961445n804488l950931P66433k229367m319020M069290
8834e859632J2291949P742580k73909K035658O433424r67915j0615927n625516
8826E160712M530843j366871j5712894j1200952J1538951K1337616N694661j1594746
8818H387320j0995042l508177l142837k302171P259466J2936594J832604j4359535
8810c891778j5509241k325676Q390371Q897055M967167J629477j372594l329678
$$ plain form
8802 -2544897 -4871022 -4021289 401938 7804577 14540888 14387302 6888577 1179602 3998071
8793 3998071 8310128 3544678 -6630120 -8963618 -1929873 1000502 -7675074 -17151854
8785 -17151854 -13438780 925580 9593657 1741791 -16450484 -29287228 -28337213 -20548268
8777 -20548268 -18121774 -21669379 -19559413 -5811270 9593565 13868881 7163766 -2248258
8769 -2248258 -10424391 -15576959 -11719575 2014071 11925579 5529613 -7024699 -5037221
8761 -5037221 10448498 16304859 2520053 -12512532 -10329416 2082784 7575325 5116380
8753 5116380 5682134 11773492 16491271 17380451 17433737 15967788 10998404 8070449 14461272
8744 14461272 25560295 28627951 20514764 10466451 3495915 -7372306 -26579212 -43093793
$$ packed form
8802b544897k326125Q49733M423227P402639O736311j53586p498725n708975K818469
8793C998071M312057m765450j0174798k333498P033745K930375q675576r476780
8785a7151854L713074J4364360Q668077p851866j8192275j2836744R50015P788945
8777b0548268K426494l547605K109966J3748143J5404835M275316o705115r412024
8769b248258q176133n152568L857384J3733646R911508o395966j2554312J987478
8761e037221J5485719N856361j3784806j5032585K183116J2412200N492541k458945
8753E116380N65754O091358M717779Q89180N3286j465949m969384k927955O390823
8744A4461272J1099023L067656q113187j0048313o970536j0868221j9206906j6514581
$$ plain form
8736 -43093793 -41369667 -21801767 -1703733 4817217 1486356 1051948 6677909 9386106
8728 9386106 4063436 -997973 2711393 7747866 -95787 -17401800 -22573491 -5783090
8720 -5783090 13647840 11885946 -6123557 -13515733 1540606 22069919 27522116 17632411
8712 17632411 4909946 -3435296 -6171066 -843100 11491252 20154835 16119542 6277887
8704 6277887 4280765 9502517 9286531 2098007 1575242 12213368 17968678 6282098
8696 6282098 -10824016 -15132634 -10816522 -15335370 -27764969 -28190643 -9609793 10241936
8688 10241936 14674654 7655349 -423277 -9706022 -22004613 -29045835 -23905917 -14626660
8680 -14626660 -12679756 -14989832 -10388477 1795277 12008264 14873099 12298602 6723426
$$ packed form
8736d3093793J724126J9567900K0098034O520950l330861m34408N625961K708197
8728I386106n322670n061409L709366N036473p843653j7306013n171691J6790401
8720e783090J9430930j761894j8009503p392176J5056339K0529313N452197r889705
8712A7632411j2722465q345242k735770N327966J2334352Q663583m035293r841655
8704F277887j997122N221752k15986p188524n22765J0638126N755310j1686580
8696F282098j7106114m308618M316112m518848j2429599m25674J8580850J9851729
8688A0241936M432718p019305q078626r282745j2298591p041222N139918R279257
8680a4626660J946904k310076M601355J2183754J0212987K864835k574497n575176
$$ plain form
8672 6723426 1349704 1669640 6897069 7015361 -970086 -3601153 8032073 18802721
8664 18802721 10812788 -4578698 -714849 21989842 34604183 22597572 3396147
8657 3396147 -5387194 -8938829 -15360363 -17428713 -9996674 -5037803 -11625929 -18155614
8649 -18155614 -12823769 -6099756 -12539559 -23783213 -22418583 -13025173 -15244602 -30601489
8641 -30601489 -39374123 -30151385 -12394150 1741017 10091577 12803629 8702929 3171125
8633 3171125 5362934 13568293 15524150 6141090 -6742352 -15858608 -20819797 -19146815
8625 -19146815 -6038608 11879736 17016990 3143864 -14086276 -17221534 -7843254 1006357
8617 1006357 3979038 4933539 5932018 5332820 3898434 4347775 5931148 5012885 -221138
$$ packed form
8672F723426n373722L19936N227429J18292p985447k631067J1633226J0770648
8664A8802721p989933j5391486L863849K2704691J2614341j2006611j9201425
8657C396147q783341l551635o421534k068350P432039M958871o588126o529685
8649a8155614N331845O724013o439803j1243654J364630R393410k219429j5356887
8641c0601489q772634R222738J7757235J4135167Q350560K712052m100700n531804
8633C171125K191809Q205359J955857r383060j2883442r116256m961189J672982
8625a9146815J3108207J7918344N137254j3873126j7230140l135258R378280Q849611
8617A006357K972681R54501R98479n99198j434386M49341J583373r18263n234023
$$ plain form
8608 -221138 -9032381 -19405991 -27322296 -28615449 -24354390 -20004001 -17035449 -11484840
8600 -11484840 -3555841 -172189 -2391548 694561 16336707 33687172 36501615 25524715
8592 25524715 15575704 13191091 11681101 8712573 12507806 24496205 30206132 18115707
8584 18115707 -2463541 -14122307 -14434933 -13236364 -12405937 -4386350 9700583 16860927
8576 16860927 11903701 6567691 11568424 21033631 24034242 21693480 21419432 21774723
8568 21774723 16413230 8733530 8880750 17210981 23039310 20253769 13350682 7751982
8560 7751982 4896892 6694326 12782552 13458643 -257617 -18073493 -19031812 -3629165
8552 -3629165 1641849 -17537944 -38706189 -32712467 -4455502 16662211 18134119 13846040
$$ packed form
8608b21138q811243j0373610p916305j293153M261059M350389K968552N550609
8600a1484840P928999L383652k219359L086109J5642146J7350465K814443j0976900
8592B5524715r949011k384613j509990k968528L795233J1988399N709927j2090425
8584A8115707k0579248j1658766l12626J198569Q30427Q019587J4086933P160344
8576A6860927m957226n336010N000733R465207L000611k340762k74048L55291
8568B1774723n361493p679700J47220Q330231N828329k785541o903087n598700
8560G751982k855090J797434O088226O76091j3716260j7815876r58319J5402647
8552c629165N271014j9179793k1168245N993722K8256965K1117713J471908m288079
$$ plain form
8544 13846040 14774946 12565304 -2310911 -22483410 -32358168 -25975430 -10679748 988919
8536 988919 638808 -8924817 -15068498 -9036387 3084281 9511637 9855412 13856033 24890582
8527 24890582 35033027 36455967 28483531 14083966 -779247 -5621549 4919352 19784612
8519 19784612 22030644 11485792 3929738 6203772 7210643 -1506111 -11236072 -10680288
8511 -10680288 -3021134 1318329 -3165 -2233774 -2817883 -2010880 -81297 724877 -1947352
8502 -1947352 -3342206 4231147 16273455 17739541 6145207 -1252516 6673458 16451999
8494 16451999 11590945 -536104 -1902298 5479788 3599252 -10584724 -19765219 -13480221
8486 -13480221 -1805438 2810437 1579999 1142522 2436020 4402635 7910908 9691181
$$ packed form
8544A3846040R28906k209642j4876215k0172499r874758O382738J5295682J1668667
8536I88919l50111r563625o143681O032111J2120668O427356L43775M000621J1034549
8527B4890582J0142445J422940p972436j4399565j4863213m842302J0540901J4865260
8519A9784612K246032j0544852p556054K274034J006871q716754r729961N55784
8511a0680288P659154M339463j321494k230609n84109Q07003J929583Q06174k672229
8502a947352j394854P573353J2042308J466086j1594334p397723P925974R778541
8494A6451999m861054j2127049j366194P382086j880536j4183976r180495O284998
8486a3480221J1674783M615875j230438m37477J293498J966615L508273J780273
$$ plain form
8478 9691181 2096456 -14734500 -29067274 -32037334 -28057120 -25045360 -22576370 -16836617
8470 -16836617 -9855952 -5301609 -676047 7396386 13821759 9917719 -3667703 -16389784
8462 -16389784 -20146536 -16626828 -12584988 -12664310 -16766259 -20361163 -17801390 -9147679
8454 -9147679 -2567305 -5072827 -11510799 -8915068 6611683 23171024 26896388 18157867
8446 18157867 8796545 5810994 4641675 -612377 -7413109 -10205047 -11146811 -17708169
8438 -17708169 -29675877 -36030847 -28049617 -10087951 6815829 17148983 21227251 18070688
8430 18070688 6748422 -6351231 -10567701 -3143349 8524232 18138993 26049546 31103149
8422 31103149 26855502 12716739 823837 2354008 12263915 17737228 17636212 21280504
$$ packed form
8478I691181p594725j6830956j4332774k970060L980214L011760K468990N739753
8470a6836617O980665M554343M625562Q072433O425373l904040j3585422j2722081
8462a6389784l756752L519708M041840p9322m101949l594904K559773Q653711
8454i147679O580374k505522o437972K595731J5526751J6559341L725364q738521
8446A8157867r361322k985551j169319n254052o800732k791938r41764o561358
8438a7708169j1967708o354970P981230J7961666J6903780J0333154M078268l156563
8430A8070688j1322266j3099653m216470P424352J1667581R614761P910553N053603
8422C1103149m247647j4138763j1892902J530171R909907N473313j01016L644292
$$ plain form
8414 21280504 29492450 31299263 22834600 15901063 20062327 26957337 22411413 6593541
8406 6593541 -8279750 -14577397 -12927866 -4426232 8219211 14757430 6748623 -6934021
8398 -6934021 -8012450 5152845 13374687 3527909 -14075348 -22929793 -22105833 -20360143
8390 -20360143 -19802261 -18233401 -18618386 -21886657 -17836371 256852 17097709 10406296
8382 10406296 -16217646 -34677741 -29937543 -17693219 -17606753 -26538139 -30174311 -27215474
8374 -27215474 -26808809 -30305944 -30467376 -24763189 -16982231 -8480440 549924 3313170
8366 3313170 -7566683 -25621603 -33783865 -25238460 -11429120 -5213645 -5254345 -3690204
8358 -3690204 -1306664 -4559868 -10914273 -9596652 158832 2932020 -12005062 -31320166
$$ packed form
8414B1280504Q211946J806813q464663o933537M161264O895010m545924j5817872
8406F593541j4873291o297647J649531Q501634J2645443O538219q008807j3682644
8398f934021j078429J3165295Q221842r846778j7603257q854445Q23960J745690
8390b0360143N57882J568860l84985l268271M050286J8093223J6840857o691413
8382A0406296k6623942j8460095M740198J2244324Q6466q931386l636172K958837
8374b7215474M06665l497135j61432N704187P780958Q501791R030364K763246
8366C313170j0879853j8054920q162262Q545405J3809340O215475m0700J564141
8358c690204K383540l253204o354405J317621R755484K773188j4937082j9315104
$$ plain form
8350 -31320166 -32654658 -16655544 -7060279 -14031716 -15957398 7457700 38561188 41554004
8342 41554004 13734917 -8712695 186991 25375915 38756417 35751160 27835883 17025568
8334 17025568 -35600 -13205907 -7522768 12362330 26383592 27025420 24653034 24144043
8326 24144043 15843408 -3965048 -20458266 -18744831 -4173636 5781062 2657964 -8430264
8318 -8430264 -19247380 -24451214 -20539580 -7474045 8130839 16798766 15082517 8939284
8310 8939284 7241572 11860001 14639655 6138987 -11856012 -25667242 -23900136 -9144524
8302 -9144524 6859312 14909432 11539244 -2430936 -18783256 -23216478 -10327926 5965584
8294 5965584 7832279 -3077804 -9517719 -4138652 3067770 3505109 497816 -3037851
$$ packed form
8350c1320166j334492J5999114R595265o971437j925682K3415098L1103488K992816
8342D1554004k7819087k2447612Q899686K5188924J3380502l005257p915277j0810315
8334A7025568j7061168j3170307N683139J9885098J4021262O41828k372386n08991
8326B4144043q300635j9808456j6493218J713435J4571195R954698l123098j1088228
8318h430264j0817116n203834L911634J3065535J5604884Q667927j716249o143233
8310H939284j697712M618429K779654q500668j7994999j3811230J767106J4755612
8302i144524J6003836Q050120l370188j3970180j6352320m433222J2888552J6293510
8294E965584J866695j0910083o439915N379067P206422M37339l007293l535667
$$ plain form
8286 -3037851 -11472871 -22857386 -23002824 -5050349 16256536 23138488 18802201 18267599
8278 18267599 21997323 16406263 -574851 -12406106 -7600299 3699062 5718626 -113333
8270 -113333 501134 12177610 23342675 23354862 16569109 13950328 16731422 16611941 10501544
8261 10501544 5687979 7244831 8778574 3021214 -4252577 -1240520 10780062 16458494
8253 16458494 6792315 -8939002 -16251780 -12842270 -6941705 -4110590 -2951139 -1329921
8245 -1329921 -227646 -1173506 -3903001 -7663963 -13247707 -22556452 -35000673 -44216394
8237 -44216394 -42010910 -28730995 -15698830 -11774959 -11444558 -4211417 7779377 12647250
8229 12647250 7923100 3673539 5002844 5428132 2060568 3118150 12637008 20500816
$$ packed form
8286c037851q435020j1384515j45438J7952475K1306885O881952m336287n34602
8278A8267599L729724n591060j6981114j1831255M805807J1299361K019564n831959
8270a13333O14467J1676476J1165065J2187o785753k618781K781094j19481o110397
8261A0501544m813565J556852J533743n757360p273791L012057J2020582N678432
8253A6458494r666179j5731317p312778L409510N900565K831115J159451J621218
8245a329921J102275r45860k729495l760962n583744r308745j2444221r215721
8237d4216394K205484J3279915J3032165L923871L30401P233141J1990794M867873
8229A2647250m724150m249561J329305M25288l367564J057582R518858P863808
$$ plain form
8221 20500816 17293262 8084471 1684290 -2695106 -7167595 -5378170 5284045 12427055
8213 12427055 5703440 -4207700 -1973187 4985905 -2799254 -23034813 -32759347 -24353100
8205 -24353100 -16404775 -22606744 -32271972 -32023214 -26876302 -25951240 -23629489 -11233608
8197 -11233608 4274790 9695535 5907225 4105397 7850850 12447014 16680514 21347645
8189 21347645 20515406 8692263 -5817697 -8997220 -1464481 3448712 1759981 2963004
8181 2963004 8628629 3521919 -21945019 -52036199 -61106903 -43368154 -16725735 -81025
8173 -81025 2924483 -2014395 -11474660 -24446105 -35558506 -34980549 -17516900 9376118
8165 9376118 29127246 29734053 14120739 -3965376 -13192049 -11762362 -3600408 6710602
$$ packed form
8221B0500816l207554r208791o400181m379396m472489J789425J0662215P143010
8213A2427055o723615r911140K234513O959092p785159k0235559r724534Q406247
8205b4353100P948325o201969r665228K48758N146912R25062K321751J2395881
8197a1233608J5508398N420745l788310j801828L745453M596164M233500M667131
8189B1347645q32239j1823143j4509960l179523P532739M913193j688731J203023
8181B963004N665625n106710k5466938l0091180r070704J7738749K6642419J6644710
8173h1025L005508m938878r460265j2971445j1112401N77957J7463649K6893018
8165I376118J9751128O06807j5613314j8086115r226673J429687Q161954J0311010
$$ plain form
8157 6710602 13891173 12908046 4735991 -2008043 -301720 5788867 5527738 -5081981
8149 -5081981 -18807397 -26278695 -24892058 -17422132 -6925671 3008183 6207028 -1943608
8141 -1943608 -17359834 -28182595 -25600923 -12633637 -263056 4355675 3464061 2579623
8133 2579623 2402012 -346836 -6273991 -12109885 -15941072 -18538101 -18291808 -11141888 557006
8124 557006 5705763 -1510309 -10268411 -6319222 5801776 6982448 -8190549 -21860357
8116 -21860357 -18750761 -7975688 -6609121 -12192215 -8890148 4060893 9771934 1464326
8108 1464326 -5734120 1132294 11607939 6984649 -12040505 -26007264 -21952075 -7152408
8100 -7152408 2883893 2614184 222000 6268611 20083467 28422604 20457574 2914293
$$ packed form
8157F710602P180571r83127q172055o744034J706323O090587k61129j0609719
8149e081981j3725416p471298J386637P469926J0496461R933854L198845q150636
8141a943608j5416226j0822761K581672J2967286J2370581M618731q91614q84438
8133B579623j77611k748848n927155n835894l831187k597029K46293P149920J1698894
8124E57006N148757p216072q758102L949189J2120998J180672j5172997j3669808
8116b1860357L109596J0775073J366567n583094L302067J2951041N711041q307608
8108A464326p198446O866414J0475645m623290j9025154j3966759M055189J4799667
8100g152408J0036301k69709k392184O046611J3814856Q339137p965030j7543281
$$ plain form
8092 2914293 -6289355 -513321 8006182 6673337 -1021312 -5002858 -5793899 -11071660
8084 -11071660 -20342088 -25281958 -23546003 -20926696 -19784699 -15859365 -7910002 -721694
8076 -721694 3938538 10258567 18796140 22478738 17382964 10791863 12240757 20655469
$$ packed form
8092B914293r203648N776034Q519503j332845p694649l981546p91041n277761
8084a1071660r270428m939870J735955K619307J141997L925334P949363P188308
8076g21694M660232O320029Q537573L682598n095774o591101J448894Q414712
$$ [...]
##END NTUPLES=NMR SPECTRUM
##END=
