##TITLE=31Pdec_SR158H3W
 D2O, 64 sc
 13.4.2023
##JCAMPDX= 6.0         $$ Bruker NMR JCAMP-DX V2.0
##DATA TYPE= NMR SPECTRUM
##DATA CLASS= NTUPLES
##ORIGIN= UXNMR, Bruker Analytische Messtechnik GmbH
##OWNER= root
$$ XWIN-NMR		Version 3.5
$$ Thu Apr 13 15:39:02 2023 Russian Standard Time (UT+4h)  she@DPX200
##.OBSERVE FREQUENCY= 81.013821
##.OBSERVE NUCLEUS= ^31P
##.ACQUISITION MODE= SIMULTANEOUS
##.ACQUISITION SCHEME= undefined
##.AVERAGES= 73
##.DIGITISER RES= 16
##SPECTROMETER/DATA SYSTEM= spect
##.PULSE SEQUENCE= zgpg30
##.SOLVENT NAME= CDCl3
##.SHIFT REFERENCE= (INTERNAL, CDCl3, 0, 248.564)
##AUDIT TRAIL= $$ (NUMBER, WHEN, WHO, WHERE, WHAT)
$$ ##TITLE= Audit trail, XWIN-NMR		Version 3.5
$$ ##JCAMPDX= 5.01
$$ ##ORIGIN= Bruker BioSpin GmbH
$$ ##OWNER= she
$$ F:/spectra/data/she/nmr/P31/1/pdata/1/auditp.txt
$$ ##AUDIT TRAIL=  $$ (NUMBER, WHEN, WHO, WHERE, WHAT)
(   1,<2023-04-13 15:38:02.59 +0400>,<she>,<DPX200>,
      <continue with go, POWCHK disabled, PULCHK disabled
       configuration hash MD5:
       00 E9 B6 7A A2 85 ED C7 34 08 36 98 17 FE 4E 26
       data hash MD5: 32K
       0D CD DE 06 1C 87 32 01 A2 D9 12 F9 C2 E3 F3 92>)
(   2,<2023-04-13 15:38:06.40 +0400>,<she>,<DPX200>,
      <Start of raw data processing
       efp BC_mod = 2 LB = 1 FT_mod = 6 PKNL = 1 PHC0 = -10968.85 PHC1 = 75.48538 SI = 64K 
       data hash MD5: 64K
       2C BE 37 30 FA DC 2F 98 97 D5 FA 82 82 81 D8 EB>)
(   3,<2023-04-13 15:38:27.76 +0400>,<she>,<DPX200>,
      <pk PHC0 = -45.69297 PHC1 = 29.2 
       data hash MD5: 64K
       E2 F1 0F 88 FC 0E 11 36 E5 B4 C0 D7 05 BA 05 10>)
$$ ##END=
$$ 
$$ hash MD5
$$ DD EF F4 1E 99 24 3E E1 68 67 E7 38 88 A4 10 9F
##$RELAX= 
##$RELAX= 
##$RELAX= 
##$RELAX= 
##$RELAX= 
##$RELAX= 
##$RELAX= 
##$RELAX= 
##$RELAX= 
$$ Bruker specific parameters
$$ --------------------------
##$DU= <F:/spectra>
##$EXPNO= 1
##$NAME= <P31>
##$PROCNO= 1
##$TYPE= <nmr>
##$USER= <she>
##$AMP= (0..31)
100 100 100 100 100 100 100 100 100 100 100 100 100 100 100 100 100 100 
100 100 100 100 100 100 100 100 100 100 100 100 100 100 
##$AQSEQ= 0
##$AQ_mod= 1
##$AUNM= <au_zg>
##$AUTOPOS= <>
##$BF1= 81.014009
##$BF2= 200.13
##$BF3= 200.13
##$BF4= 200.13
##$BF5= 200.13
##$BF6= 200.13
##$BF7= 200.13
##$BF8= 200.13
##$BYTORDA= 1
##$CFDGTYP= 0
##$CFRGTYP= 5
##$CHEMSTR= <none>
##$CNST= (0..31)
1 1 145 1 1 1 1 1 1 1 1 1 1 1 1 1 1 1 1 1 1 1 1 1 1 1 1 1 1 1 1 1 
##$CPDPRG= <waltz16>
##$CPDPRG1= <>
##$CPDPRG2= <waltz16>
##$CPDPRG3= <>
##$CPDPRG4= <mlev>
##$CPDPRG5= <mlev>
##$CPDPRG6= <mlev>
##$CPDPRG7= <mlev>
##$CPDPRG8= <mlev>
##$CPDPRGB= <>
##$CPDPRGT= <>
##$D= (0..31)
0 1 0 0 0 0 0 0 0 0 0 0.03 2e-05 3e-06 0 0 0 0 0 0 0 0 0 0 0 0 0 0 0 0 
0 0 
##$DATE= 1681385791
##$DBL= (0..7)
120 120 120 11 120 120 24 19 
##$DBP= (0..7)
150 150 150 150 150 150 150 150 
##$DBP07= 0
##$DBPNAM0= <>
##$DBPNAM1= <>
##$DBPNAM2= <>
##$DBPNAM3= <>
##$DBPNAM4= <>
##$DBPNAM5= <>
##$DBPNAM6= <>
##$DBPNAM7= <>
##$DBPOAL= (0..7)
0.5 0.5 0.5 0.5 0.5 0.5 0.5 0.5 
##$DBPOFFS= (0..7)
$$ [...]
##$SUBNAM2= <"">
##$SUBNAM3= <"">
##$SUBNAM4= <"">
##$SUBNAM5= <"">
##$SUBNAM6= <"">
##$SUBNAM7= <"">
##$SUBNAM8= <"">
##$SUBNAM9= <"">
##$SW= 501.771253377433
##$SWIBOX= (0..15)
0 1 3 0 0 0 0 0 0 0 0 0 0 0 0 0 
##$SW_h= 40650.406504065
##$TD= 32768
##$TD0= 1
##$TE= 0
##$TE2= 300
##$TE3= 300
##$TEG= 300
##$TL= (0..7)
0 120 53 12 22 120 120 120 
##$TP= (0..7)
150 150 150 150 150 150 150 150 
##$TP07= 0
##$TPNAME0= <>
##$TPNAME1= <>
##$TPNAME2= <>
##$TPNAME3= <>
##$TPNAME4= <>
##$TPNAME5= <>
##$TPNAME6= <>
##$TPNAME7= <>
##$TPOAL= (0..7)
0.5 0.5 0.5 0.5 0.5 0.5 0.5 0.5 
##$TPOFFS= (0..7)
0 0 0 0 0 0 0 0 
##$TUNHIN= 0
##$TUNHOUT= 0
##$TUNXOUT= 0
##$USERA1= <user>
##$USERA2= <user>
##$USERA3= <user>
##$USERA4= <user>
##$USERA5= <user>
##$V9= 5
##$VALIST= <valist>
##$VCLIST= <CCCCCCCCCCCCCCC>
##$VD= 0
##$VDLIST= <DDDDDDDDDDDDDDD>
##$VPLIST= <PPPPPPPPPPPPPPP>
##$VTLIST= <TTTTTTTTTTTTTTT>
##$WBST= 1024
##$WBSW= 4
##$XGAIN= (0..3)
0 0 0 0 
##$XL= 0
##$YL= 0
##$YMAX_a= 2213
##$YMIN_a= -2475
##$ZGOPTNS= <>
##$ZL1= 120
##$ZL2= 120
##$ZL3= 120
##$ZL4= 120
##$ABSF1= 0
##$ABSF2= 0
##$ABSG= 0
##$ABSL= 0
##$ALPHA= 0
##$AQORDER= 0
##$ASSFAC= 0
##$ASSFACI= 0
##$ASSFACX= 0
##$ASSWID= 0
##$AUNMP= <proc_1d>
##$AZFE= 0.1
##$AZFW= 0.5
##$BCFW= 0
##$BC_mod= 2
##$BYTORDP= 0
##$COROFFS= 0
##$CY= -3
##$DATMOD= 1
##$DC= 0
##$DFILT= <>
##$DTYPP= 0
##$F1P= 0
##$F2P= 0
##$FCOR= 1
##$FTSIZE= 65536
##$FT_mod= 6
##$GAMMA= 0
##$GB= 0
##$INTBC= 1
##$INTSCL= 6.047779e-11
##$ISEN= 30
##$LB= 1
##$LEV0= 0
##$LPBIN= 0
##$MAXI= 10000
##$MC2= 0
##$MEAN= 0
##$ME_mod= 0
##$MI= 50
##$NCOEF= 0
##$NC_proc= -8
##$NLEV= 6
##$NOISF1= 182.463
##$NOISF2= 159.3651
##$NSP= 0
##$NTH_PI= 0
##$NZP= 0
##$OFFSET= 248.5645
##$PC= 4
##$PHC0= -11014.54
##$PHC1= 104.6854
##$PH_mod= 1
##$PKNL= yes
##$PPARMOD= 0
##$PSCAL= 0
##$PSIGN= 0
##$REVERSE= no
##$SF= 81.0140089999694
##$SI= 65536
##$SIGF1= 159.3651
##$SIGF2= -187.1042
##$SINO= 113.3802
##$SIOLD= 16384
##$SREGLST= <1H.CDCl3>
##$SSB= 0
##$STSI= 65536
##$STSR= 0
##$SW_p= 40650.406504065
##$SYMM= 0
##$S_DEV= 0
##$TDeff= 32768
##$TDoff= 0
##$TI= <>
##$TILT= no
##$TM1= 0
##$TM2= 0
##$TOPLEV= 0
##$USERP1= <user>
##$USERP2= <user>
##$USERP3= <user>
##$USERP4= <user>
##$USERP5= <user>
##$WDW= 1
##$XDIM= 65536
##$YMAX_p= 423756956
##$YMIN_p= -35629220
$$ End of Bruker specific parameters
$$ ---------------------------------
##NTUPLES= NMR SPECTRUM
##VAR_NAME=  FREQUENCY,     SPECTRUM/REAL,   SPECTRUM/IMAG
##SYMBOL=    X,             R,               I
##VAR_TYPE=  INDEPENDENT,   DEPENDENT,       DEPENDENT
##VAR_FORM=  AFFN,          ASDF,            ASDF
##VAR_DIM=   65536,         65536,           65536
##UNITS=     HZ,            ARBITRARY UNITS, ARBITRARY UNITS
##FACTOR=    0.620285442955139, 1,           1
##FIRST=     20137.2065510682, 0,            0
##LAST=      -20513.1999529968, 0,           0
##MIN=       -20513.1999529968, -35629220,   0
##MAX=       20137.2065510682, 423756956,    0
$$ Real data points
##PAGE= N=1
##DATA TABLE= (X++(R..R)), XYDATA
$$ [...]
40104C045515K344006k147919l977228k652399j240410p75366O68304L246999
$$ 3045515 5389521 3241602 -735626 -3388025 -4628435 -5403801 -4735497 -1488498
40096a488498L791799P99651k260010j463544J783561K734306K34780j744539
$$ -1488498 2303301 3102952 842942 -620602 1162959 3897265 4132045 2387506
40088B387506j80447K362237J460255k278593l312834J173929O666395O827942
$$ 2387506 2207059 4569296 6029551 3750958 438124 1612053 8278448 15106390
40080A5106390J694473l182676m821880n333925n817897l379099K744885P160853
$$ 15106390 16800863 13618187 8796307 3462382 -2355515 -5734614 -2989729 4171124
40072D171124N314250P09524n75514N69383q24809l672785k253066K416190K167009
$$ 4171124 9485374 10194898 9619384 10188767 9363958 5691173 3438107 5854297 8021306
40063H021306m850626r497505n233993J836235L032763O3258k72797J372272m94656
$$ 8021306 3170680 -6326825 -11560818 -9724583 -6691820 -6628562 -6901359 -5529087 -6023743
40054f023743m431314l452650K624635O268754M482518K534790L579985L854703
$$ -6023743 -10455057 -13907707 -11283072 -5014318 -531800 2002990 5582975 9437678
40046I437678J445454P94814L778753M823129R65876j282516L094056P002371
$$ 9437678 10883132 11677946 15456699 20279828 21245704 19963188 23057244 30059615
40038C0059615J485352q596709j0476746k569771M027648K952467k32268m33797
$$ 30059615 31544967 22948258 12471512 9901741 13929389 16881856 16649588 16215791
40030A6215791j084634m762347n953578p39922M173942J157823n079406l900339
$$ 16215791 15131157 10368810 4415232 3675310 7849252 9007075 3927669 27330
40022B7330M422881Q684487L748131k263917j026397L787622L099730l781166
$$ 27330 4450211 13134698 16882829 14618912 13592515 17380137 20479867 16698701
40014A6698701q676534o186090J21287L794637L154487P79375j330404k762863
$$ 16698701 8022167 1836077 1957364 5752001 8906488 9685863 8355459 5592596
40006E592596k449228P16687M656330M968765O85219l615306l778686j640087
$$ 5592596 3143368 3860055 8516385 13485150 14170369 10555063 6776377 5136290
39998E136290j390704k627190j657551J263011J529307k134660m851468k688710
$$ 5136290 3745586 1118396 -539155 723856 2253163 118503 -4732965 -7421675
39990g421675J840917M244050M173484L701837K730634R0332k937424l881814
$$ -7421675 -5580758 -1336708 2836776 6538613 9269247 9359579 6422155 2540341
39982B540341k323504J046178O386041J2158557J2885418M436978q724235j5955739
$$ 2540341 216837 1263015 7649056 19807613 32693031 37130009 28405774 12450035
39974A2450035j1221267Q79301J0164307J0140541K700921m263275m109447K086542
$$ 12450035 1228768 2108069 12272376 22412917 25113838 20850563 16741116 18827658
39966A8827658O765666M616903j451592m602418k361139J684208K920566O5150
$$ 18827658 25593324 30210227 28758635 24156217 21795078 23479286 26399852 26465002
39958B6465002m421638o482562m136559J57339K723173M034180O716977Q168861
$$ 26465002 22043364 15560802 11424243 11581582 14304755 18338935 25055912 33224773
39950C3224773K212048r201592j4145466o507891L785475M363287k263005m785074
$$ 33224773 35436821 26235229 12089763 5581872 9367347 13730634 11467629 6682555
39942F682555j072853J726791J485075K301470K834488k438715r264062n643555
$$ 6682555 5609702 7336493 8821568 11123038 13957526 11518811 2254749 -3388806
39934c388806Q059880J5219668O210467o972549q611714j109169K410010o07066
$$ -3388806 4671074 19890742 26101209 19128660 10516946 9407777 11817787 11210721
39926A1210721j267207L910009P510853L246053n232535r626764o230878J239113
$$ 11210721 9943514 13853523 21364376 24610429 19377894 9751130 3520252 4759365
39918D759365N494867K833208k384997k892591J235932K511194k060954n750426
$$ 4759365 10254232 13087440 10702443 7809852 9045784 11556978 9496024 3745598
39910C745598k756374K673608L473437K15946k071564k324884j926296L32428
$$ 3745598 989224 3662832 7136269 7352215 5280651 2955767 1029471 1361899
39902A361899M588788N801607R45496l962394k126955K810728K672710j809607
$$ 1361899 5950687 11752294 12697790 8735396 6608441 9419169 12091879 10282272
39894A0282272l311342j027932q59556l646108l926611p31398O22772j262812
$$ 10282272 6970930 5942998 5083442 1437334 -2489277 -3220675 -2597903 -3860715
39886c860715j617677P21785Q62552k141218k199828K973857O453971K535304
$$ -3860715 -5478392 -4756607 -3894055 -6035273 -8235101 -5261244 1192727 3728031
39878C728031m393713o596982l063055J779004M527587L847523l86867n024153
$$ 3728031 -665682 -7262664 -10325719 -8546715 -4019128 -171605 -558472 -5582625
39870e582625m805367Q56511O077869O355873L957151K626436J761873l84624
$$ -5582625 -10387992 -9531481 -3453612 2902261 6859412 9485848 11247721 10863097
39862A0863097k112021j283871L26419k07124k298101l260254k288128o01256
$$ 10863097 8751076 7467205 7793624 7586500 5288399 2028145 -259983 -861239
39854h61239K23249j333576m990838o538864j833933N925427Q504531M311366
$$ -861239 -637990 -1971566 -6962404 -13501268 -15335201 -9409774 -905243 3406123
39846C406123J192397L838108N574872p38813r465523q826965J629976R281867
$$ 3406123 4598520 8436628 14011500 13272687 3807164 -5019801 -3389825 5892042
39838E892042N106396n058191q961165l187617L927419L463231l058774n823966
$$ 5892042 10998438 5940247 -3020918 -6208535 -2281116 1182115 -1876659 -7700625
39830g700625J02272P045173M235037o584205j1815669l976099P911872J0433698
$$ -7700625 -7598353 -553180 3681857 -2902348 -14718017 -18694116 -10782244 -348546
39822c48546K760905m661682m737912j61738L212665L091445P23148j063430M81720
$$ -348546 2412359 -2249323 -6987235 -7148973 -3936308 -844863 -121715 -1185145 -703425
39813g03425M724690O445079J615181o190622r119759m653738J890273M682480
$$ -703425 4021265 10466344 12081525 5890903 -3228856 -7882594 -5992321 -1309841
39805a309841L556568J997449J932453K039580L8705l879311n865844k300635
$$ -1309841 2246727 4244176 6176629 8216209 8254914 4375603 -1490241 -3790876
39797c790876M243595N916300p61993q868852q817799n35469O654503N855929
$$ -3790876 452719 6369019 5607026 -3261826 -12079625 -12615094 -5960591 -104662
39789a04662j17101l824848j796278L206025N928532L549208j598297m093752
$$ -104662 -221763 -4046611 -5842889 -2636864 3291668 6840876 5242579 1148827
39781A148827j535450K386476K886250N92170j57180J577173K181652k04492k391381
$$ 1148827 -386623 1999853 4886103 5478273 5321093 6898266 9079918 8875426 6484045
39772F484045r83992K414387L314545K66188l568796m701799l568092l195275
$$ 6484045 5500053 7914440 11228985 11495173 7926377 3224578 -343514 -3538789
39764c538789l872811j656760N324609J1033648P169187m747260j2770974q949064
$$ -3538789 -7411600 -9068360 -3743751 7289897 14459084 9711824 -3059150 -12008214
39756a2008214J029018O841443O755570N504901L703883j577881p529531o768174
$$ -12008214 -10979196 -4137753 2617817 8122718 11826601 10248720 2719189 -4048985
39748d048985P78236N803470K716433k420301j483256M022608O332483K621067
$$ -4048985 -3270749 2532721 5249154 2828853 1345597 5368205 11700688 14321755
39740A4321755k727761n088258m002025j285690J400047K729661J916232n26401
$$ 14321755 11593994 6505736 2503711 1218021 2618068 5347729 7263961 6737560
39732F737560l024396l958897k481414O98789L249234L116341N39435k750101
$$ 6737560 3713164 -245733 -2727147 -2028358 1220876 4337217 4876652 2126551
39724B126551n416961o087259k887782L406828P308524M220803k347193m182963
$$ 2126551 -3290410 -9377669 -12265451 -8858623 -1550099 2670704 323511 -3859452
39716c859452N96355N221887M176124k84499l839888o496202r298624r611702
$$ -3859452 -3263097 1958790 6134914 5850415 2010527 -4485675 -13784299 -23396001
39708b3396001m896527J898349N549773N057847L090436J459928J048408L276041
$$ -23396001 -28292528 -26394179 -20844406 -15786559 -12696123 -11236195 -10187787 -6911746
39700f911746O951163O547726o58721q022539o798134J196188N602320K402542
$$ -6911746 39417 6587143 5928422 -2094117 -8892251 -7696063 -2093743 308799
39692C08799j305542L70391L264130J629167j465641L03766M882366M454040j703559
$$ 308799 -996743 -626352 2637778 4266945 2801304 3105070 7987436 12441476 10737917
39683A0737917n741913l742349j206685k385652k078129M919168J1966156Q124633
$$ 10737917 4996004 1253655 46970 -2338682 -4416811 502357 12468513 20593146
39675B0593146m183889r875164k101759P410200N080054n280821r088056k354114
$$ 20593146 16409257 6534093 4432334 11842534 16922588 11641767 2553711 199597
39667A99597M391312L191540r32117l17227K986506J631623m912891r370163o461313
$$ 199597 4590909 7782449 6850332 6533105 9519611 11151234 6238343 -3131820 -9593133
39658i593133J248955P357942Q172866M825564J027342m58625K06141R58459J51814
$$ -9593133 -8344178 -986236 7186630 12012194 13039536 12580911 12787052 13745511 13897325
39649A3897325k603453o412497q291931m468061M258534J0224259O677653k932248
$$ 13897325 11293872 4881375 -3410556 -7878617 -3620083 6604176 13281829 10349581
39641A0349581q657347o680036k217841K02325J788945L186945J554118k340434
$$ 10349581 1692234 -4987802 -7205643 -7003318 -5214373 -2027428 -473310 -2813744
39633b813744k253416L104410N663498N31680m862492k479152K719522J255479
$$ -2813744 -5067160 -1962750 3700748 4232428 -630064 -3109216 -389694 865785
39625H65785m605275n260615p12125K19252l640074l850377J814449M872181J115053
$$ 865785 -3739490 -9000105 -9712230 -9492978 -13133052 -16983429 -15168980 -10296799 -9181746
39616i181746k095532J152088N847383N975086M159621M173026K712542k955072
$$ -9181746 -11277278 -10125190 -4277807 1697279 5856900 10029926 12742468 9787396
39608I787396o814526k980683L252779L053366j887104l148743j86044j66180
$$ 9787396 2972870 -7813 3244966 6298332 4411228 1262485 1076441 910261
39600I10261m176462m641557J444491O253302K639354m733554n444695K702184
$$ 910261 -3266201 -7907758 -6463267 -209965 2429389 -2304165 -7748860 -5046676
39592e046676J0739112R345128k68571p715798n469395K293880N380554J017868
$$ -5046676 5692436 15037564 14768993 7053195 1583800 3877680 9258234 10276102
39584A0276102l448832k383862J55916j434587m243544k046135L367364M491697
$$ 10276102 6827270 4443408 4599324 3164737 -1078807 -3124942 242422 4734119
39576D734119K55046k457464J27082L603017L154474N4410k015119k112664j222244
$$ 4734119 4989165 2531701 2658783 6261800 9416274 9470684 7455565 5342901 4120657
39567D120657l64718j143203m309431o770599m311357J708983N030822L035144
$$ 4120657 3755939 2612736 -1696695 -8467294 -12778651 -11069668 -6038846 -3003702
39559c003702l71089j801970k610858l619553j691414M126099P984811M276567
$$ -3003702 -3374791 -5176761 -7787619 -11407172 -13098586 -8972487 -987676 3288891
39551C288891l688280p369207l828427J742580L652190J847062Q6694P59556K454636
$$ 3288891 -399389 -7768596 -11597023 -9854443 -6202253 -4355191 -4268497 -3508941 -1054305
39542a054305J918688j596179m465477k930740J300624K999670J231723P04096
$$ -1054305 864383 -731796 -5197273 -8128013 -6827389 -3827719 -2595996 -1891900
39534a891900L525967M759497K68464n222372l921068L151083O692487K185742
$$ -1891900 1634067 6393564 6662028 1439656 -2481412 669671 7362158 9547900
39526I547900l532725j948081M856135O660977p09042q812857p375860J430578
$$ 9547900 6015175 4067094 8923229 15584206 14875164 6062307 -1313553 117025
39518A17025N341101j009174q288047n983499K236545M563017q89785m169892
$$ 117025 5458126 4448952 -3839095 -9822594 -7586049 -3023032 -3912817 -8082709
39510h082709R3951M849601K934044k029411l197575j604047k104337l483646
$$ -8082709 -7988758 -3139157 -205113 -2234524 -5432099 -7036146 -9140483 -12624129
39502a2624129q60063M905926P781461N316720Q04916k242404k731324n86706
$$ -12624129 -13484192 -8578266 -796805 4519915 5324831 3082427 351103 -235603
39494b35603K546386L053167K97612q77069K419984M807603L64085o690946p342038
$$ -235603 2310783 5363950 5661562 4784493 7204477 12012080 12376165 5685219 -1656819
39485a656819j733861J435749j041557l043424m82767K816109L237411K776469
$$ -1656819 -3390680 -1954931 -2996488 -6039912 -6522679 -3706570 -469159 2307310
39477B307310K735906n1017o146095r557568n990606N52549M170630M843549N155181
$$ 2307310 5043216 4992199 -1153896 -10711464 -16702070 -16149521 -11978891 -7135342 -1980161
39468a980161M404516J228101k154669l237774k974373k202908R07948N494958
$$ -1980161 2424355 3652456 1497787 -1739987 -4714360 -6917268 -6009320 -514362
39460e14362N844888L06446l656361n72520K897390j548733q282525m946492O844453
$$ -514362 5330526 5636972 1980611 1408091 4305481 2756748 -5525777 -10472269 -3627816
39451c627816J1710128L285954o389558n575781P17561J265925l482593m641135
$$ -3627816 8082312 11368266 4978708 -597073 120488 1386413 -2096180 -6737315
39443f737315n74251J855841k177q89011K267454N018289L064941j009160k240120
$$ -6737315 -7311566 -5455725 -5457902 -6346913 -4079459 938830 4003771 2994611 754491
39434G54491j45392K310930L392678K999780P48138l163161o330816n909803j748495
$$ 754491 609099 2920029 6312707 9312487 10060625 6897464 566648 -5343155 -7091650
39425g091650L295486N624731L529042q23191k322955J424193N576071L216887
$$ -7091650 -3796164 1828567 5357609 4534418 2211463 3635656 9211727 12428614
39417A2428614m441771q393988m421182Q90136P82209j594713l14966K202524
$$ 12428614 7986843 -407145 -4828327 -3938191 -3155982 -4750695 -5065661 -2863137
39409b863137N26520j879211K112125Q197108M576517p527777j1908944j450810
$$ -2863137 -2336617 -4215828 -2103703 6093405 10669922 3142145 -8766799 -10217609
39401a0217609R790189P735856r53640j882705L315627K056822o175852r214470
$$ -10217609 -427420 7308436 6354796 4472091 7787718 9844540 3668688 -5545782
39393e545782l527804N75808k152569l101507L883166J0205037N583754n414696
$$ -5545782 -9073586 -8497778 -10650347 -13751854 -9868688 336349 5920103 505407
39385E05407r622298l141579N431132P378766L056325p43542R79967N642157N304146
$$ 505407 -9116891 -12258470 -6827338 551428 3607753 2864211 3844178 9486335 14790481
39376A4790481k889614j0162820o181198N001841Q314832p53272q540538l279302
$$ 14790481 11900867 1738047 -4443151 558690 8873522 8120250 -420288 -3699590
39368c699590P099680P012031l930779j1914343r469846l047508R1222J488149
$$ -3699590 3400090 10412121 6481342 -5433001 -14902847 -17950355 -17859133 -16370984
39360a6370984M531741O464653L183201k586427l745433J639031P392259O854466
$$ -16370984 -11839243 -5374590 -2191389 -4777816 -8523249 -6884218 508041 7362507
39352G362507J293534j757380J224362M402311P60620o912092r189547l720303
$$ 7362507 8656041 6898661 8123023 12525334 13285954 6373862 -2815685 -6535988
39344f535988J608851J112685r88311M87728K759386J618631K25722L024612N880479
$$ -6535988 -4927137 -3814452 -4802763 -4315035 -1555649 62982 288704 3313316 9193795
39335I193795J812412o420543r248017m600978N9265q1570k037727k804673l288000
$$ 9193795 11006207 4585664 -4662353 -9263331 -9204066 -9285636 -11323363 -14128036 -17416036
39326a7416036k600523K675146J0224459J1283558K981320n543159n037053J427739
$$ -17416036 -20016559 -17341413 -7116954 4166604 7147924 1604765 -3432288 -2004549
39318b004549M218617J168656j274316Q87787L910121L007883p14848k631544
$$ -2004549 2214068 3382724 2108408 2996195 6906316 9914199 9199351 6567807
39310F567807j310452J91364m24302r48431J545931M642466K651435m308210q399956
$$ 6567807 5257355 5448719 5024417 4075986 5621917 10264383 12915818 8607608 207652
39301B07652m715588J088588J552111n65379K382136P864061M643294q565064
$$ 207652 -4507936 -3419348 -1867237 -2432616 -50480 7813581 12456875 3891811
39293C891811j6963413q835982P255608J3422389N984602j860987p355N719168
$$ 3891811 -13071602 -21907584 -14651976 -1229587 4755015 2894028 2886673 8605841
39285H605841M262468m120180q813673m205874K880750L401915j405966l218028
$$ 8605841 12868309 8748129 -65544 -4271418 -1390668 2011247 605281 -2612747
39277b612747j642J434921k265302m401496N17200N839988K154222o541424p110836
$$ -2612747 -2614389 -1179468 -3444770 -7846266 -7329066 -1489078 665144 -5876280 -12987116
39268a2987116K940326J1289477Q617050o0004n922802p780969o870571n32848
$$ -12987116 -10046790 1242687 9859737 9799733 3876931 -3904038 -10774609 -11307457
39260a1307457R732371J2675291J825970j0380798p041609P489253J2046199J56202
$$ -11307457 -1575086 11100205 12926175 2545377 -4496232 2993021 15039220 15195422
39252A5195422r778641l140313P672293K886025j2235375j3947627L100352J5808505
$$ 15195422 5416781 2276468 9948761 12834786 599411 -13348216 -10247864 5560641
39244E560641O187848j1981378j3623215J674520J1893492O457542j532673P078
$$ 5560641 11748489 -232889 -13856104 -12181584 -288092 6169450 4636777 4643855
39236D643855L542530j901805j0018114p393900L619594Q088352J610343m867330
$$ 4643855 8186385 6284580 -3733534 -11127434 -7507840 580512 2190855 -2676475
39228b676475l992837j699079m052137o566459l221604K845628M971785L138804
$$ -2676475 -6669312 -8368391 -12420528 -18986987 -22208591 -19362963 -14391178 -11252374
39220a1252374J862650K294327K137233L36525k320178m369873k926159L940491
$$ -11252374 -9389724 -7095397 -4958164 -4621639 -6941817 -11311690 -14237849 -10297358
39212a0297358J1677924J1677792K610031o386906p657966m012374j376336M40043
$$ -10297358 1380566 13058358 15668389 9281483 1623517 -2388857 -3765193 -3325150
39204c325150L381357M349886Q17489k223758L19386L844641J197325m159880
$$ -3325150 56207 4406093 5223582 2999824 3319210 7163851 8361176 4201296
39196D201296k905668M215020O679638O99172n541478n251907j614275K99708
$$ 4201296 1295628 5510648 12190286 12889458 7347980 2096073 481798 781506
39188G81506J047018J904437N39957l247114m330866k77807L376263J514032k255966
$$ 781506 1828524 3732961 4272918 1025804 -3305062 -3582869 -206606 1307426 -948540
39179i48540j830350J461867K004649l60374q39603J916583M594728N454106N552038
$$ -948540 -2778890 -1317023 687626 327252 -512351 1404232 5998960 11453066 17005104
39170A7005104M218561l45459n604557o302175k996583k498632o962120r020027
$$ 17005104 21223665 20878206 15273649 8971474 5974891 3476259 -3485861 -12505888
39162a2505888k815571N559228N931776p35939l635599J548048O639625M380838
$$ -12505888 -15321459 -9762231 -3830455 -4566394 -8201993 -6653945 -14320 4366518
39154D366518n48134j88546L440143K497431k793356m439240m23712K051213n70726
$$ 4366518 3818384 3629838 7069981 9567412 6774056 2334816 1911104 3962317 3391591
39145C391591j943589K469097O209292K053125n296167o162490j205778O06570
$$ 3391591 1448002 3917099 10126391 12179516 6883349 720859 -484919 121651
39137A21651k603230l231635J879667N660001K627891k407207k796294n1604Q38432
$$ 121651 -2481579 -5713214 -3833547 1826454 4454345 2047138 -749156 -800760 37672
39128C7672K85182J095482R45888l837986r130368o436705L945430J1268616Q629962
$$ 37672 322854 1418336 2364224 -1473762 -10604130 -17040835 -13095405 -1826789 6803173
39119F803173K084256Q66659L934092K971402l804931q592766n807432k67466
$$ 6803173 8887429 9754088 13688180 16659582 12854651 4261885 -1545547 -1813013
39111a813013L75535k944799k457352M544982J0969096Q556283k059332j1892284
$$ -1813013 -1437478 -4382277 -6839629 -2294647 8674449 17230732 15171400 3279116
39103C279116j2650397m293759N087542O711757M5559o125960l993357L072786
$$ 3279116 -9371281 -13665040 -8577498 -1865741 -1820182 -7946142 -11939499 -8866713
39095h866713N228165P52117j164862M850790J0403344N009990p444142j3011277
$$ -8866713 -3638548 -2886431 -4051293 799497 11202841 16212831 8768689 -4242588
39087d242588o584259K615524N030634J695657j408202k375483k372000j200999
$$ -4242588 -10826847 -8211323 -3180689 -1485032 -2893234 -5268717 -7640717 -8841716
39079h841716J179787K342642Q06564j058475q99417r8624m12904m37846P40834
$$ -8841716 -7661929 -5319287 -4512723 -5571198 -6470615 -6569239 -6982143 -7419989 -6679155
39070f679155J35096l866588o102413r53718P724987J0096324L856538k666735
$$ -6679155 -6544059 -10410647 -16513060 -17466778 -9741791 354533 4211071 1544336
39062A544336k648791N15018J93689l109030l720363l04069K291539N13881l028100
$$ 1544336 -1104455 -589437 -395748 -3504778 -7225141 -7529210 -5237671 -4723790 -7751890
39053g751890l574022l49591L206335M128168K979013K106335K184978J703091
$$ -7751890 -11325912 -11675503 -8469168 -4341000 -1361987 744348 2929326 4632417
39045D632417l98855l106656m822388m836200k500377K607447P699999P051051
$$ 4632417 4233562 1126906 -3695482 -8531682 -11032059 -8424612 -724613 6326438
39037F326438n89119p303336m806283L289444N884740J568124J189925R036260
$$ 6326438 5737319 -1566017 -6372300 -3082856 2801884 4370008 5559933 14596193
39029A4596193J2691817J472134j3979283j4602133q26582Q389373L929749l088545
$$ 14596193 27288010 28760144 14780861 178728 -647854 7741519 11671268 8582723
39021H582723l091030k663476q056973r859171J099535J3720713J0255869n751114
$$ 8582723 5491693 2828217 -5228756 -15087927 -13988392 -267679 9988190 4237076
39013D237076j3150204l659243Q315165Q692319J215321l350513k653973k73480
$$ 4237076 -8913128 -12572371 -4257206 4435113 5650434 2299921 -354052 -627532
39005f27532K333731M082471J951263l173196m711895J67955N587845O146668
$$ -627532 1706199 5788670 7739933 4566737 -145158 22797 5610642 11757310
38997A1757310M124396K519616j281158q312201j1957624p097938P12288L418409
$$ 11757310 15881706 18401322 17120164 8807963 -3149661 -10247599 -9535311 -6116902
38989f116902K353722L291586M787361J641285l357402k069538N245601Q667103
$$ -6116902 -3763180 -471594 4315767 5957052 2599650 530112 5775713 14442816
38981A4442816K503542p182242j0977905o724612j64793J690430k376502n818134
$$ 14442816 16946358 9764116 -1213789 -7938401 -8103194 -6412764 -8789266 -14607400
38973a4607400j911899N674424O179179j479194m608170L634604J0956826M086974
$$ -14607400 -16519299 -10844875 -4665696 -6144890 -10753060 -7118456 3838370 7925344
38965G925344q705579r123371K711686R486029M492204r65527K36235O98572m107492
$$ 7925344 -780235 -9903606 -7191920 2294109 6786313 5820786 6057021 6755593 2648101
38956B648101o182126j272415J368709m007462p357813K31752R980199R363237
$$ 2648101 -3534025 -4806440 -3437731 -7445193 -14803006 -14571254 -4591055 4772182
38948D772182K052077m78815J603566O54479j969066L05280L908805K9023p766048
$$ 4772182 6824259 6345444 7949010 8603489 6634423 6939703 10848508 10877531 3111483
38939C111483p144475K224854P306980K405029l861019m951269m932792o111131
$$ 3111483 -4032992 -1808138 5498842 7903871 4042852 -908417 -5841209 -11952340
38931a1952340k628645O464091J0572660L215036n943546m812283L276898N913573
$$ -11952340 -14580985 -8116894 2455766 5670802 -272744 -5085027 -1808129 4105444
38923D105444J48928n744692n774574j971980J906475M350847M171417J098483
$$ 4105444 4254372 -1490320 -7264894 -9236874 -7330399 -2979552 1191865 2290348
38915B290348j741536r17665K299715M070046L519349K011931o89022m481945
$$ 2290348 548812 -368853 1930862 6000908 9520257 11532188 10843166 6361221
38907F361221n526785p58345N763934P127214L085374q29134k533204m618883
$$ 6361221 834436 76091 5840025 12967239 16052613 15223479 12690275 8071392
38899H071392o697691m488369J978450O607977O002895L285170R71090k565273
$$ 8071392 1373701 -3114668 -1136218 5471759 11474654 14759824 15730914 13165641
38891A3165641o344872m581202L471232Q704992M015983m867309p819907m649693
$$ 13165641 6820769 2239567 5710799 14415791 18431774 13564465 5744558 1094865
38883A094865k856952m901196o404648m720769j035188M189263R782020J0089930
$$ 1094865 -1762087 -6663283 -13067931 -17788700 -18823888 -14634625 -4852605 5237325
38875E237325J763730p425993o857956O99050K658373l144992n046705K347485
$$ 5237325 7001055 -424938 -7282894 -6583844 -3925471 -7070463 -12117168 -9769683
38867i769683Q472795M116772l860579m460376Q22524L707057L249881L215112
$$ -9769683 -1296888 2819884 -1040695 -5501071 -4678547 -971490 2278391 5493503
38859E493503K006057l234077p549874m704370J134095J423641k503114k586969
$$ 5493503 7499560 4265483 -3284391 -7988761 -6854666 -5431025 -7934139 -10521108
38851a0521108J693241M112586M024498N170901M590645k878230j0280206n227108
$$ -10521108 -8827867 -4715281 -690783 4480118 9070763 6192533 -4087673 -9314781
38843i314781P830354J0015939k525230j0261232n26898J1781858P959321m967915
$$ -9314781 -1484427 8531512 6006282 -4254950 -4781848 7000010 14959331 9991416
38835I991416o946347K599642N762777l749378j1774487p404202J710987M066791
$$ 9991416 3045069 5644711 11407488 7658110 -4116377 -11520579 -9809592 -5742801
38827e742801R19137j43218J368181R49076j340004j896535p44076n01174m94938
$$ -5742801 -4823664 -4966882 -3598701 -2649625 -3989629 -5886164 -6630240 -7131414 -7626352
38818g626352J491674L237601Q15898l084483j163064O403251R609921K932823
$$ -7626352 -6134678 -2897077 -2081179 -5165662 -6328726 74525 9684446 12617269
38810A2617269m913276l032960M822403N624116k761323q726630n913853k337445
$$ 12617269 7703993 4671033 9493436 15117552 12356229 3629599 -2284254 -4621699
38802d621699m793881o446089M7494P223888L952067n152834o528827J84367K928992
$$ -4621699 -9415580 -15861669 -15814175 -8590287 -4638220 -9791054 -16319881 -16135514 -13206522
38793a3206522j205495k289268K775820M195046j930742n145568J089522P550315
$$ -13206522 -14412017 -16701285 -13925465 -9730419 -11661161 -16806729 -15717207 -8166892
38785h166892N506043J178419K376693L308194l344171r903870n338345M420838
$$ -8166892 -2660849 -1482430 894263 4202457 858286 -9045584 -14383929 -9963091
38777i963091M943858k815628m660677K884774Q298487N646817K513429L496001
$$ -9963091 -5019233 -7834861 -12495538 -9610764 -1312277 4334540 6847969 10343970
38769A0343970J514828p386687j3738820q480703K353784O446391K269982j761998
$$ 10343970 11858798 4472111 -9266709 -17747412 -15393628 -8947237 -6677255 -8439253
38761h439253r36509J683181K818345K903662K458146N89487j709090j287469
$$ -8439253 -9375762 -7692581 -4874236 -1970574 487572 1077059 -632031 -1919500
38753a919500K235329M495692J964123k379351k382459K360749M894094M24046
$$ -1919500 315829 4811521 6775644 4396293 2013834 4374583 9268677 9692723
38745I692723o211366p133770k861170n63285j842903p02143M488486O134636
$$ 9692723 3481357 -3652413 -6513583 -7076868 -8919771 -9621914 -5133428 1001208
38737A001208l51370p371561n572519K284166N978629K464558k181517k979857
$$ 1001208 649838 -6721723 -12294242 -10010076 -4031447 -1566889 -3748406 -6728263
38729f728263p98756J620233K129759p97022n224858n419170M49804N817728M838091
$$ -6728263 -7527019 -5906786 -3777027 -4574049 -9798907 -15218077 -14768273 -8950545 -4112454
38720d112454J574608K746281N854037L795815k090595m008031r73209M26719
$$ -4112454 -2537846 208435 6062472 9858287 7767692 3759661 2786452 3213171
38712C213171j856693k764315m29506O15995j780963l848063k781529J52014M032299
$$ 3213171 1356478 -1407837 -1837343 -1221348 -3002311 -6850374 -9631903 -9479889 -5447590
38703e447590Q355626Q850069J586338q559393j2014569p174747o07042M275891
$$ -5447590 2908036 11758105 13344443 4785050 -7229519 -14404266 -15011308 -10735417
38695a0735417Q732847J0164746M373111l325163k560287M697341N212796l880334
$$ -10735417 -2002570 8162176 12535287 9210124 6649837 11347178 16559974 12679640
38687A2679640r574912m545221J261811j129118m629925l12654O046433M610895
$$ 12679640 3104728 -1440493 -178682 -1307800 -5937725 -6250379 -203946 4406949
38679D406949j377665k389832J419157L790947M761494O623365M252853o485995
$$ 4406949 3029284 639452 2058609 5849556 10611050 17234415 21487268 15001273
38671A5001273j5953531j1353875K760617R287068K747217n475623o266973l095105
$$ 15001273 -952258 -12306133 -9545516 -258448 2488769 -2986854 -9253827 -12348932
38663a2348932r60732J744292N868266O968442L368007l1749m93570j708972m902393
$$ -12348932 -13309664 -11565372 -5697106 1271336 4639343 4607594 4114024 2405052 -2497341
38654b497341m254433K850300Q624051N374269k384154m370866L82803L183727
$$ -2497341 -6751774 -3901474 4722577 10096846 7712692 3341826 3724629 6908356
38646F908356o01136n261354l964070J513383L820750j23866n883228p290483
$$ 6908356 6307220 1045866 -2918204 -1404821 2415929 2292063 -3591165 -10881648
38638a0881648k810511L974725Q006671O210646m48068o729273o741845j20956
$$ -10881648 -13692159 -9717434 -1710763 4499883 4051815 -2677458 -9419303 -9540259
38630i540259O594995P022941J942691l296149o017844o646479m226334K067065
$$ -9540259 -2945264 4077677 6020368 2724219 -3293625 -9940104 -14166438 -12099373
38622a2099373P685616O438293M17021j537104K612151M524342n89631n229445
$$ -12099373 -4413757 2024536 2441557 904453 3516604 8040946 7451315 2221870
38614B221870j433645O041571O865741L26909n479784o253214m513572k076009
$$ 2221870 788225 6829796 13695537 14022446 8542662 2289448 -2224124 -4300133
38606d300133J923022N914144O176749K484258k236432p009980j1700803j2400217
$$ -4300133 -2377111 3537033 9713782 12198040 9961608 2951628 -8749175 -21149392
38598b1149392n254501N422392J0234261O668607J341264n06647q43171k565878
$$ -21149392 -26403893 -20981501 -10747240 -4078633 -2737369 -3244016 -4087187 -6653065
38590f653065m231609l977539l074544k375792R0067M867367Q474713Q007555
$$ -6653065 -10884674 -14862213 -17936757 -20312549 -20222482 -15355115 -6880402 1127153
38582A127153M778687R01943l758160q238411q285691j972005N363546O732156
$$ 1127153 5905840 6807783 3049623 -5188788 -13474479 -15446484 -10082938 -3350782
38574c350782K608335l99880N67074J389972j148195l585839j687653J782789
$$ -3350782 -742447 -1142327 -575253 814719 -333476 -3919315 -5606968 -3824179
38566c824179J089616k329260j126295N278052P381408j96295q602350p025651
$$ -3824179 -2734563 -5063823 -6190118 -912066 6469342 6273047 -2329303 -9354954
38558i354954N72853K013960k982394k758937N592265J0204514M114393l015125
$$ -9354954 -8782101 -6768141 -9750535 -12509472 -6917207 3287307 7401700 4386575
38550D386575j530764K272778j319694p144402m006029M914532O563952j07379
$$ 4386575 2855811 5128589 3808895 -3335507 -7341536 -2427004 4136948 4029569
38542D029569l021315J939661M527280j356322o905938l068835N199238P631792
$$ 4029569 1008254 2947915 7475195 6118873 -787065 -3855900 1343338 8975130
38534H975130L451660r78715l308277n373299o022356k390269K739400K379017
$$ 8975130 12426790 11448075 8139798 2766499 -3255857 -5646126 -2906726 -527709
38526e27709m518495r764777n572960N343361J2333806Q832857p39723o942628
$$ -527709 -5046204 -14810981 -20383941 -15040580 -2706774 6126083 5386360 -1556268
38518a556268n918112j533913J522617K510991K223897N91593j349773j256896
$$ -1556268 -7474380 -9008293 -7485676 -4974685 -2750788 -2159195 -3508968 -4765864
38510d765864N00340P10906p68513j12420K913000K867913j902759m758757j331555
$$ -4765864 -4265524 -3554618 -4323131 -4435551 -1522551 1345362 -557397 -5316154 -6647709
38501f647709K627713J213160j123399J714366N007765R19762o551118p150371
$$ -6647709 -4019996 -2806836 -3930235 -2215869 2791896 3711658 -2839460 -9989831
38493i989831j444008J303964K23341K914628Q323839N431420p183485j5107428
$$ -9989831 -11433839 -10129875 -9906534 -6991906 1331933 6763353 -420132 -15527560
38485a5527560q099035N346430J0812251O137448k33221j712880J781053N969848
$$ -15527560 -23626595 -18280165 -7467914 -1330466 -1563687 -3276567 -1495514 4474334
38477D474334N007237k343895p919579l232344O214821O504462l168575p991065
$$ 4474334 9481571 7137676 -781903 -4014247 2200574 8705036 5536461 -2454604
38469b454604j070770N282686L14758p153549l876266N702326P235157n96573
$$ -2454604 -3525374 1757312 2072070 -5081479 -8957745 -3255419 3979738 3383165
38461C383165n830476k645144K415557L124270J386474J209554K822646M011493
$$ 3383165 -2447311 -5092455 -2676898 447372 1833846 3043400 5866046 9877539
38453I877539K423218k721068p715448o348570J344866O980134N032408M40821
$$ 9877539 12300757 9579689 1864241 -4484329 -3139463 3840671 8873079 9313900
38445I313900l61875P39845m94198k059864j322464j970625n766196n006719M835932
$$ 9313900 8952025 9691870 9197672 7137808 5815344 3844719 -1921477 -6928196 -2092264
38436b092264J2257564M613629r252457r056624N589998J2965547J822296j2062207
$$ -2092264 10165300 14778929 5526472 -3530152 2059846 15025393 16847689 4785482
38428D785482j0135564L194448J0387478N642555k253141n443443m076108j132297
$$ 4785482 -5350082 -2155634 8231844 13874399 11621258 6177815 2101707 969410
38420I69410P57263p33451m032335k674672N531978J1714667O526384m729980
$$ 969410 1726673 993222 -3039113 -5713785 -181807 11532860 18059244 13329264
38412A3329264p565496N65328N537593k234636j1869053p102302Q683293J5617890
$$ 13329264 5763768 6329096 11866689 9632053 -2237000 -9339302 -656009 14961881
38404A4961881N398761p341581p195475N64659J227117n518503p469283j650050
$$ 14961881 20360642 13019061 5823586 6388245 7615362 2096859 -5372424 -7022474
38396g022474J905461j054744k204307K745888N383279K09987m361064o55255
$$ -7022474 -5117013 -6171757 -8376064 -5630176 -246897 -36910 -4397974 -5053229
38388e053229M309940J449458l933830k049251L316920K029766l075894p64018
$$ -5053229 -743289 706169 -3227661 -5276912 -1959992 69774 -3006120 -3770138
38380c770138P781563R650869J626142n158929m000181j146230j967835k359608
$$ -3770138 4011425 13662294 15288436 10129507 6129326 4983096 3015261 655653
38372F55653J018033L837806K851556J275792P87599j923443o374197o325100
$$ 655653 1673686 5511492 8363048 9638840 10426439 8502996 2128799 -4196301
38364d196301j069866J795722l38935j74992N318368P405411O9113q608782q537239
$$ -4196301 -5266167 -3470445 -3809380 -3984372 1333996 8739407 8808520 199738 -8337501
38355h337501j917979L439673O152217P284697L499242n042919q461588r95732
$$ -8337501 -10255480 -6815807 -663590 6621107 10120349 5077430 -3384158 -4379890
38347d379890O512110J524383r154101q670244L348626J0090060L149587o986098
$$ -4379890 2132220 3656603 -5497498 -14167742 -10819116 -729056 2420531 -4565567
38339d565567q857535m462409q96479Q02460K450385L261574L179435M687727
$$ -4565567 -13423102 -17885511 -18781990 -17979530 -15529145 -12267571 -9088136 -4400409
38331d400409P151531O119385J596620m11457J833865K091037k654660n546875
$$ -4400409 2751122 8870507 10467127 10055670 11889535 13980572 11325912 5779037
38323E779037r09131N305205M137595k531898n235259q51809M627614N524890
$$ 5779037 4869906 10175111 14312706 11780808 6545549 5693740 10321354 15846244
38315A5846244J641009m870894j1216598j2995682p672508O24156M865568L818634
$$ 15846244 17487253 12616359 1399761 -11595921 -19268429 -18644273 -13778705 -9960071
38307i960071K147306K129524J159286j569215k066487J828871N597253L780065
$$ -9960071 -7812765 -5683241 -4523955 -6093170 -8159657 -6330786 -733533 3046532
38299C046532k134432n203412j354469O053900R493492M406422n722410j1610913
$$ 3046532 912100 -4291312 -5645781 408119 9901611 14308033 8585623 -3025290
38291c025290p797021M51207L475367J18870j449022K844710O107991J842364
$$ -3025290 -10822311 -10371104 -6895737 -6776867 -8225889 -5381179 726812 2569176
38283B569176m650692m250738J201856K227915j950444j806594N863472J0955259
$$ 2569176 -2081516 -6332254 -5130398 -2902483 -4852927 -6659521 -796049 10159210
38275A0159210N401659l711337m704646J408736L921837o34052m654307k405904
$$ 10159210 15560869 11849532 7144886 8553622 12475459 11841407 7187100 4781196
38267D781196K205521L058756O8964l129386m658433m463056k789281j209500
$$ 4781196 6986717 10045473 10114437 6985051 2326618 -2136438 -4925719 -6135219
38259f135219j773712l089483j106725L827916N196308n14836o753568m416567
$$ -6135219 -7908931 -10998414 -12105139 -8277223 -3080915 -3595751 -10349319 -14765886
38251a4765886N647155J3239899J1359063K929531n202377r483553r086680l497739
$$ -14765886 -9118731 4121168 15480231 18409762 13207385 3723832 -5362848 -8860587
38243h860587N123925J0285015O793710k467312q985424p903958k137989K579169
$$ -8860587 -3736662 6548353 13342063 10874751 1889327 -6014631 -8152620 -5573451
38235e573451L610517J881460m45966j344019j63754J251398M89638j833220k808791
$$ -5573451 -1962934 -81474 -527440 -1871459 -2035213 -783815 -294177 -2127397 -4936188
38226d936188j962915j801005k688564j633190J712667K899312J35858j324695
$$ -4936188 -6899103 -8700108 -11388672 -13021862 -11309195 -8409883 -8274025 -9598720
38218i598720K564734P076990O191708K890203L175668L745950k992933j3107966
$$ -9598720 -7033986 43004 6234712 9124915 12300583 16046533 13053600 -54366
38210e4366j3381203j441066Q947948P404881K10586k329206r90359j504792k349796
$$ -54366 -13435569 -14876635 -5928687 1476194 1686780 -642426 -1632785 -3137577 -5487373
38201e487373J065832O008205O024940J197663l103646m252429k824836N77905
$$ -5487373 -4421541 1586664 7611604 8809267 5705621 1453192 -1371644 -793739
38193g93739L260671Q13592m821314m926288K090595N654006M3139m566476N10592
$$ -793739 2466932 3280524 -1540790 -6467078 -4376483 1277523 1320662 -3245814 -2735222
38184b735222N705606o20805r769760o075922N084765N339095m682082o084540
$$ -2735222 2970384 2349579 -7420181 -13496103 -8411338 -3072243 -7754325 -13838865
38176a3838865N207597J1464775M070338l198047m47725K063392l935508p635177
$$ -13838865 -8631268 2833507 6903845 3705798 3258073 5321465 1385957 -6249220
38168f249220M89912R410201N778385l512104m657640j80003o69789l861373p41576
$$ -6249220 -5759308 3650893 9429278 5917174 1259534 1079531 409742 -3451631 -4193207
38159d193207N414880M659309p73548r71006K714536O22921o223148p076385l50739
$$ -4193207 1221673 5880982 5107434 4136428 6850964 7473885 1250737 -5825648 -6176387
38150f176387M195281K294260p0292O48457J124705J81266M60468P75790k156906
$$ -6176387 -1981106 313154 242862 891319 2016024 2197290 2657758 3433548 1276642
38141A276642m941950j697251M108441L878796j228971k201954J993041L782940
$$ 1276642 -3665308 -5362559 -1254118 2624678 1395707 -806247 1186794 4969734
38133D969734J791267K189473M743143K199288m571902n615499Q86321M901147
$$ 4969734 6761001 8950474 13693617 15892905 11321003 5705504 6591825 11492972
38125A1492972J826624r65374O60305O89254k984504k630915L706399N438585
$$ 11492972 13319596 12354222 13014527 13703781 10719277 8088362 11794761 17233346
38117A7233346k397356q257964k670941N167188K719653m833069m147662L346306
$$ 17233346 14835990 6578026 3907085 9074273 11793926 6960857 2813195 6159501
38109F159501M305613m196205j0297707n639466L931894Q139318M340272k495049
$$ 6159501 10465114 6268909 -4028798 -9668264 -5736370 2402948 6743220 4248171
38101D248171o376657n149952j490224Q03521J755442L491215M152631Q8596n279339
$$ 4248171 -2128486 -7278438 -8768662 -7965141 -6209699 -2718484 1434147 1522743 -3756596
38092c756596l957342K668115L378896m289895p318132K395605J2990131J0054143
$$ -3756596 -7713938 -5045823 -1666927 -5956822 -13274954 -10879349 2110782 12164925
38084A2164925j195908n610272j907857m34074k430114P30680Q980508J1216649
$$ 12164925 10969017 5358745 3450888 3016814 586700 1317380 10297888 21514537
38076B1514537L422645n244152p202956m807200j722501J841020L050532j937130
$$ 21514537 24937182 19693030 12490074 7682874 5960373 7801393 10851925 8914795
38068H914795p675462l731229P410351J0799243K331371l590767K229756P748486
$$ 8914795 1239333 -2491896 4918455 15717698 18049069 14458302 16688058 24436544
38060B4436544j97632j2752435j2239188J04358P308563L380916j121264q7331
$$ 24436544 24238912 11486477 -752711 -648353 6660210 10041126 8919862 8832531
38052H832531o88887o635115q485617J67443Q914825M975672o124884p754155
$$ 8832531 8143644 1508529 -6977088 -6809645 2105180 7080852 955968 -6798187
38044f798187K918513J0941542O272276k345226k647715K387123J743735l956823
$$ -6798187 -3879674 7061868 13334144 10988918 8341203 10728326 12472061 8515238
38036H515238l630048M195683O740206k707228j2305757q762437K491788O290275
$$ 8515238 4885190 9080873 15821079 13113851 808094 -7954343 -5462555 827720
38028H27720P16594l002207r18621r60576n227350l624400P642821J4860746N559982
$$ 827720 1544314 -1457893 -2376514 -3337090 -8564440 -12188840 -4546019 10314727 15874709
38019A5874709j0845581j4530297k554878Q558890O350399l749598r866968q351606
$$ 15874709 5029128 -9501169 -12056047 -3497157 2853242 -896356 -10763324 -19114930
38011a9114930k879331K970195O930248P166516M873777L968588M769249K288723
$$ -19114930 -21994261 -19024066 -12093818 -4927302 -53525 3915063 8684312 10973035
38003A0973035n206697j0485059o073130M101609Q577374L414649l190694l037831
$$ 10973035 5766338 -4718721 -10791851 -6690242 1887132 5301781 2111087 -926744
37995i26744J212238J462097l234770n390660l09852O681421P324969J854493
$$ -926744 285494 1747591 -1487179 -6877839 -7187691 -506270 6818699 8673192
37987H673192j451798J692338N055332R94755p352939r286229j743764N803329
$$ 8673192 7221394 8913732 13969064 14963819 7610880 -1675349 -3419113 2384216
37979B384216M816159m82857r25843K955568L101772j374624k434383K278079
$$ 2384216 7200375 6717518 5791675 8747243 11849015 10474391 8040008 10318087
37971A0318087M025045k425186q620645n481651J262504L1379p068683o925908
$$ 10318087 14343132 11917946 3297301 -2184350 -921846 -890467 -7959150 -14885058
37963a4885058L250483J0725864O376968k802176n912677l085293r82912r03226
$$ -14885058 -11634575 -908711 5468257 2666081 -3246596 -6331889 -7314801 -8218027
37955h218027M82699L290200M646058L679735Q61603m047985q549660o616788
$$ -8218027 -7735328 -4445128 200930 3880665 4742268 694283 -7855377 -14472165
37947a4472165K786586J0961693R745768K320518k848294m092705m758248m242561
$$ -14472165 -11685579 -723886 9021882 11342400 8494106 4401401 -356847 -4599408
37939d599408n56124J889093j941112o450675j875606Q811944J2315301N502825
$$ -4599408 -5155532 -3266439 -5207551 -11658226 -13533832 -4721888 7593413 13096238
37931A3096238L7927K867418N546306j89163q188156q529351l085288j82465o15792
$$ 13096238 13134165 16001583 21547889 21358726 13170570 4641219 1555931 1373466 757674
37922G57674N24052K934465K355323k00455O5471K780230L406518J794333J547912
$$ 757674 1281726 4216191 6571514 6371059 6436530 9216760 12623278 14417611 15965523
37913A5965523J870311j540044p362920q680682l587660J529249J541782r85761
$$ 15965523 17835834 16295790 8932870 252188 -3335472 -1806223 -264441 -1250202
37905a250202j628482o57676k97683R791J639048L080537J881418j387612l886280
$$ -1250202 -2878684 -3536360 -3834043 -3824252 -2185204 895333 2776751 1389139 -2497141
37896b497141m137318k878283j177680N81675K203848L284489L419800K715911
$$ -2497141 -6634459 -9512742 -10690422 -10108747 -7904899 -4620410 -1200610 1515301
37888A515301K149820K731228L764001L082379J55171k280987j384510J883748
$$ 1515301 3665121 6396349 10160350 13242729 13397900 11116913 9732403 11616151
37880A1616151L776871K076792k034144n586554o017066k987626N00251K73539
$$ 11616151 15393022 17469814 15435670 9849116 3832050 844424 1344675 1618214
37872A618214m018221p616046o100591l77794N371902Q138188O447449l0080p585390
$$ 1618214 -2400007 -10016053 -16116644 -16494438 -11122536 -2984348 3463101 3433021 -4152369
37863d152369q870551j501884O524479O247702M40546n92233N057446Q197216
$$ -4152369 -13022920 -14524804 -8000325 -1752623 -1312077 -1904310 3153136 11350352
37855A1350352L411339k647461k588005Q6184j947543o570514n161030K928195
$$ 11350352 14761691 12114230 9526225 9612409 7664866 1094352 -4066678 -1138483
37847a138483P758358K637268o139400p558118j79088O745503N732727J44055
$$ -1138483 6619875 9257143 3117743 -4440375 -4619463 2126040 7858767 8002822
37839H002822j521450K137243L518690k488370r628401p806042K285667Q615554
$$ 8002822 6481372 8618615 12137305 9648935 20534 -7785508 -5499841 3115713
37831C115713L582614n708337p381025n65832N223646M501879J922043K617306
$$ 3115713 6698327 989990 -6391035 -6956867 -1733221 2768658 4690701 7308007
37823G308007L731186M67374m259231l183623L717860P977988M273355k756860
$$ 7308007 11039193 11506567 7247336 4063713 7781573 15759561 20032916 17276056
37815A7276056o283110o382069o496942n361922L11888P096411P041188m06400
$$ 17276056 10992946 4610877 -1886065 -7247987 -6936099 160312 7201500 6795100
37807F795100o184983m083144J278690K893248J529396J788763L032454J299624
$$ 6795100 610117 -3473027 -2194337 698911 2228307 4017070 7049524 8349148
37799H349148k658409m378650l325957k904734l445122j711762K219587L872841
$$ 8349148 5690739 1312089 -2013868 -4918602 -8363724 -10075486 -7855899 -3983058
37791c983058J625265m31664R44554L284009K743500j12566j634188k18940J928405
$$ -3983058 -2357793 -2789457 -1844903 1439106 4182606 4070040 2435852 2216912 4145317
37782D145317J415861k424436n771511l828857K576239O567972M158095K92453
$$ 4145317 5561178 3136742 -2634769 -6463626 -3887387 2680585 6838680 7131133
37774G131133J410558N146477L937081k936404q296004p715908l934010j87759
$$ 7131133 8541691 13688168 17625249 14688845 6392841 -1323067 -5257077 -5444836
37766e444836L495700O118346N042466J450497n7863J083065J017217m81607M40681
$$ -5444836 -1949136 4169210 9211676 10662173 10604310 11687375 12704592 12222985 12663666
37757A2663666K696457K54162n971080o614592R22389O338882K330753l702381
$$ 12663666 15360123 15614285 9643205 3028613 3951002 10289884 12620637 8918256
37749H918256k708652Q68420j888138q041713q178683k628338P06744R17586L180596
$$ 8918256 6209604 7078024 5189886 -2851827 -11030510 -13658848 -12952104 -12034518 -8853922
37740h853922N731229J811536n618248n293816M021167R939351N272074j877188
$$ -8853922 -3122693 -1311157 -6929405 -12223221 -8202054 1737297 7009371 5132183
37732E132183k600297m33008k226787n105378k279395M118657N895297J659615
$$ 5132183 2531886 2098878 -127909 -5233287 -7512682 -3394025 2501272 4160887
37724D160887j792522k68121K728109K658930N22830M74064L353377M962248J249891
$$ 4160887 2368365 2100244 4828353 7487283 8010113 8484177 11837554 16799802 18049693
37715A8049693n494456p859203k483747M379602M376025j505337m531050j096793
$$ 18049693 12555237 4696034 2212287 6591889 10967914 9462577 4931527 3834734
37707C834734K623917J041276k197533m84670N107281P097488K091512m724516
$$ 3834734 6458651 7499927 5302394 4817724 9925005 17022493 19114005 14389489
37699A4389489o276864k052434J842478O83646k651934j895067K696666L588018
$$ 14389489 8112625 6060191 7902669 8586315 5934381 4039314 6735980 10323998
37691A0323998k329428p113256k943770M930364N391588j246235m231538n33820
$$ 10323998 7994570 881314 -2062456 2867908 8259496 7013261 2781723 2247903
37683B247903N49108n441967q750596q37014J0765324J3007827N872094k34030
$$ 2247903 2797011 -2644956 -11395552 -12232566 -1467242 11540585 17412679 17178649
37675A7178649r72853p37829r81170K440601Q796942R530652L50499j0505454
$$ 17178649 16205796 15467967 14486797 16927398 25724340 35254992 35605491 25100037
37667B5100037j1651915k818277N105789L325530n084029r493001m114389N819606
$$ 25100037 13448122 10629845 15735634 19061164 13977135 4484134 369745 6189351
37659F189351J0845905Q276607L586366J695840J499936M84579l9397J988965
$$ 6189351 17035256 25311863 28898229 30594069 32094005 32578584 32539187 34528152
37651C4528152M442799L694099N21755r05825Q04562K869345K953127J971565
$$ 34528152 38970951 42665050 43186805 42280980 43085542 45954887 48908014 50879579
37643E0879579J906434L440202O533144J1272295J6586024J8999874J5096155
$$ 50879579 52786013 56226215 62759359 74031654 90617678 109617552 124713707
37636A24713707O974529L617234J2297663K7616651L4886129K8413417K0169394
$$ 124713707 131688236 135305470 147603133 175219784 210105913 238519330 258688724
37629B58688724K2868214L0236596K5804488Q506052n074678n580502k800872
$$ 258688724 281556938 311793534 337598022 346104074 341029396 335448894 332648022
37622C32648022p188205j4211321j6511915j8521635k6246888l2726090k8330244
$$ 332648022 325459817 311248496 294736581 276214946 249968058 217241968 188911724
37615A88911724j8606516j6780518k2836872k4966010j9362138j3685474j1350137
$$ 188911724 170305208 153524690 130687818 105721808 86359670 72674196 61324059
37608F1324059p132379k59557J795533l536862q436100o800311k414206j050585
$$ 61324059 54191680 53932123 55727656 52190794 43754694 36954383 34540177 33489592
37600C3489592k649964m632817n565139l495653J822657M439485j092215q472884
$$ 33489592 30839628 26206811 20641672 17146019 18968676 23408161 22315946 13843062
37592A3843062o326533L003127M821426m504262j0394113l071872O839839N963190
$$ 13843062 7516529 10519656 15341082 10836820 442707 -2629165 4210674 10173864
37584A0173864j322092k862797Q21003O69882l085577k380763K676845L550075
$$ 10173864 8851772 5988975 6809978 7479860 4394283 2013520 4690365 8240440
37576H240440j468057m287378n86394M226481M693942K074019q53697l936495
$$ 8240440 6772383 2485005 1898611 6125092 10819034 12893053 12039356 8102861
37568H102861n951580l560084K784895P078373N105662j25941k883565j956097
$$ 8102861 2151281 -1408803 1376092 8454465 13560127 13434186 10550621 8594524
37560H594524j124513l545744o972009n256024L850441J2950008J1357196j249373
$$ 8594524 7470011 3924267 -3047742 -8303766 -4453325 8496683 19853879 18604506
37552A8604506j2657328j2755592m847381K070737N927537R287427R986442L919894
$$ 18604506 5947178 -6808414 -11655795 -9585058 -3657521 5629906 15616348 19536242
37544A9536242n301868r317376p107915n167124n648706l661774K343329O705517
$$ 19536242 14234374 4916998 -2190917 -7358041 -13006747 -16668521 -14325192 -7619675
37536g619675N880536L449576K423738L18904l844862n011639k14980M772347
$$ -7619675 -1739139 1710437 4134175 4453079 608217 -4403422 -4618402 153945
37528A53945L355494j714499k729811J389794M614884L525806J078569K92280
$$ 153945 3509439 1794940 -934871 454923 5069807 8595613 9674182 9966462
37520I966462k73176k685939n089796l966892N52887M214988L586996j06259k927555
$$ 9966462 9693286 7007347 1917551 -2049341 -1496454 2718534 6305530 6199271 3271716
37511C271716l105709k569496l736691o327210p824263n820431K52332P913904
$$ 3271716 166007 -2403489 -6140180 -12467390 -20291653 -26112084 -25859752 -17945848
37503a7945848J1992534Q807741Q30531n340514o110535k898414K525732R042294
$$ -17945848 -5953314 2854427 3684958 -1655556 -7766091 -10664505 -8138773 903521
37495I03521J1818417M952808p817463j3357608o178829K812691K537085j726151
$$ 903521 12721938 17674746 9857283 -3500325 -9679154 -6866463 -4329378 -6055529
37487f055529R18343P300298N894226k426109n918567k771653k916210p737664
$$ -6055529 -5137186 2163112 8057338 5631229 -287338 -3058991 -5975201 -13712865
37479a3712865o216399M050636J0085557N427155J223264N022684N822115n284769
$$ -13712865 -19929264 -15878628 -5793071 -365916 857348 5880032 11702147 6417378
37471F417378j5144972p863097P592852J0092567p10185o169838j42596L933161
$$ 6417378 -8727594 -16590691 -8997839 1094728 384543 -5785295 -5927891 -1994730
37463a994730r48784l937047K529524Q630242M146363m575932n658571M35388
$$ -1994730 -2943514 -6880561 -4351037 4279205 8425568 3849636 -1808935 -1373547
37455a373547M539335L078781n05895l339511m404700k471962J185011K044438
$$ -1373547 3165788 6244569 5738674 2399163 -2005537 -4477499 -3292488 -1248050
37447a248050j044624l269595j788569j36479m01340J552016P075977Q753432
$$ -1248050 -2292674 -5562269 -7350838 -7487317 -7888657 -6336641 739336 9492768
37439I492768J594419o493983n179248K419086M912409K25384l323683j974332
$$ 9492768 11087187 4593204 -586044 1833042 6745451 6970835 3647152 1672820
37431A672820q16683k264922j593749K615265L602238k386579p789691l623004
$$ 1672820 856137 -1408785 -3002534 -387269 3214969 828390 -6961301 -10584305
37423a0584305O998551J2122655N885135n206041j0655315o979588K96930L747444
$$ -10584305 -3585754 8536901 14422036 9215995 -1439320 -8418908 -8121978 -4374534
37415d374534J999421j679J445457L647006K403149q03496j464207k39770j899880
$$ -4374534 -2375113 -2376792 -931335 2715671 5118820 4315324 2851117 2611347 711467
37406G11467n922040n696952M47809M958995K459101j315394J243228O680044
$$ 711467 -5210573 -10907525 -10459716 -5500721 -3041620 -4357014 -3113786 3566258
37398C566258N555002k022420n521222L53237P625156O431596j667983o868000
$$ 3566258 9121260 7098840 1577618 1930855 9556011 15987607 14319624 7451624
37390G451624m187233J738732L810056K35020n223179p845735n621432p5800M831628
$$ 7451624 3264391 5003123 8813179 9048199 3825020 -4020715 -9642147 -9717947 -4886319
37381d886319N129575J42136n616543n529780J692454Q548541O463805k638092
$$ -4886319 243256 385392 -5231151 -10760931 -9068477 -519936 5943869 3305777
37373C305777p479540k621596L281364J60671p482610o613057L980462J0610730
$$ 3305777 -4173763 -6795359 -3513995 -3353324 -10835934 -17448991 -13468529 -2857799
37365b857799M774000m432427m593132K176555N216775K999973L072648O806095
$$ -2857799 1916201 -2516226 -7109358 -4932803 283972 3283945 6356593 13162688
37357A3162688O686150K96876m440581k349975N19171k177668o016595l946425
$$ 13162688 19848838 20145714 15705133 13355158 13874329 11696661 5680066 1733641
37349A733641R15638N81882l583060k924946L169833N254367o57669n954888k854263
$$ 1733641 2649279 3231161 -351899 -3276845 -107012 5147355 4489686 -1465202 -4319465
37340d319465L663299M422987Q8412j834133N9756L48663k428666l344344m99485
$$ -4319465 -656166 3766821 3855233 2021100 2080856 2429519 853 -3343491 -3842976
37331c842976J140293j777329n053546l274701K530339P117467P285273L167884
$$ -3842976 -2702683 -4480012 -9533558 -12808259 -10277920 -3160453 4124820 7292704
37323G292704k809250n684063j387447O297804P588736K0943o076689k074269
$$ 7292704 4483454 -1200609 -2588056 3709748 11298484 11319427 5242738 3168469
37315C168469M901502K129168q388867j1964808l319209O067646O033710J384299
$$ 3168469 8069971 10199139 1810272 -10154536 -13473745 -7406099 -1372389 11910
37307A1910J103163L752908K322097l017708n921398l714962J037967N413900
$$ 11910 1115073 4867981 7190078 4172370 -1749028 -5463990 -4426023 987877
37299I87877O540366J460390p052274r524121j998225N996051M300882k471552
$$ 987877 7528243 8988633 1936359 -7587762 -9585987 -3589936 710946 -1760606
37291a760606l072598J668999J507081m407251o119656o19298L782835L221274
$$ -1760606 -4833204 -3164205 -1657124 -6064375 -12184031 -12803329 -9020494 -5799220
37283e799220L744492O987399N370293k231073n019439J067630L970073m204043
$$ -5799220 -2054728 4932671 10302964 8071891 3052452 4120082 8090155 3886112
37275C886112j1577171n298350O229490O613215k376890o067385j741278P83419
$$ 3886112 -7691059 -12989409 -6759919 -146704 -2523594 -8590979 -10332257 -9548838
37267i548838l74307K425352Q360970P636694M57159j620710L639053M752691
$$ -9548838 -9923145 -7497793 863177 8499871 8957030 7336320 10975373 15728064
37259A5728064k717298q336781n804519k730287l735363q26349R221765J4131771
$$ 15728064 13010766 4673985 -1130534 -3860821 -7596184 -8422533 799232 14931003
37251A4931003N546017n104171m477811J523824K70577m959458k763411M001727
$$ 14931003 20477020 15372849 10895038 12418862 12689439 7729981 4966570 8968297
37243H968297K696414o414904j0204581m137455K759865M508806M680182N249594
$$ 8968297 11664711 5249807 -4954774 -9092229 -6332364 -1823558 2856624 8106218
37235H106218K967444j236589j874435J62643j845194p335437p844873j528562
$$ 8106218 11073662 9837073 7962638 8125281 6280087 -1055350 -8900223 -10428785
37227a0428785L453328K513819K64899J00735n63793k075541p94645J997283Q23598
$$ -10428785 -6975457 -4461638 -4196739 -4096004 -4659797 -6735338 -7529983 -5532700 -4709102
37218d709102k473658m26440N210243M758910q93199r134P498006O652047n563472
$$ -4709102 -7182760 -7609200 -2398957 2359953 1466754 1457620 8955626 15607673 10044201
37209A0044201j0600589J322207J1633121K279942j3645332j2687026J466767
$$ 10044201 -556388 765819 12398940 14678882 1033550 -11653476 -10186709
37202a0186709O913306O84237p71207N754175N590798l964022o392095M529598
$$ -10186709 -3273403 -2589166 -3360373 2393802 7984600 4020578 -2371517 2158081
37194B158081J2314146N257387m962878m981981j375661n240095j0448509m883762
$$ 2158081 14472227 19729614 14766736 9784755 8409094 3168999 -7279510 -12163272
37186a2163272P112655J1069929M869030r86907j681749k006617l769044k679007
$$ -12163272 -5050617 6019312 10888342 9901435 8219686 6213069 2444025 -234982
37178b34982J805878M608754M043680L424277K934939j109390p436434q887780
$$ -234982 1570896 6179650 10223330 13647607 16582546 15473156 8036722 -851058
37170h51058l204784K484842J700081k526879l037097J191316M669571L418785
$$ -851058 -4055842 -1571000 129081 -2397798 -5434895 -4243579 425992 3844777
37162C844777n36372k723054j705390K65562J067450J058713Q53737p69574l898926
$$ 3844777 3308405 585351 -1120039 -854477 212973 1271686 2125423 1355849 -2543077
37153b543077m444456J157527Q837681J0298221M275209j854340l342234l691359
$$ -2543077 -6987533 -5830006 3007675 13305896 17581105 15726765 12384531 8693172
37145H693172n789234n486934L4038M650309J943775m058273n376082k654277
$$ 8693172 2903938 -2582996 -2548958 2101351 4045126 -13147 -5389229 -8043506
37137h043506j696085j376991L554624R465330O435829m669170j0205159l373674
$$ -8043506 -9739591 -11116582 -7561958 1903372 8339201 3670031 -6535128 -9908802
37129i908802N121697L069021n291842o271030L491363J3344351J3064508L774225
$$ -9908802 -4787105 -1718084 -7009926 -13280956 -9789593 3554758 16619266 20393491
37121B0393491n766782q789779n514110j297837n36146j967675j280971J921368
$$ 20393491 14626709 5836930 322820 -975017 -1511163 -3478838 -4759809 -2838441
37113b838441L431528J590928J64403J315485R78291l837360p572794k992776
$$ -2838441 593087 2184015 2348418 3663903 4642194 804834 -6767960 -9760736
37105i760736O595599R834639K659903o038516o855905j839830P96581m58630
$$ -9760736 -3165137 6669502 9329405 3290889 -3565016 -5404846 -4608265 -5066895
37097e066895K67567N038024P579126K959940l711914l989631J330473L510526
$$ -5066895 -4799328 238696 7817822 10777762 7065848 3076217 4406690 7917216
37089G917216l05084k733052J079229M453328M5935o708382n275609K384667M198854
$$ 7917216 7612132 4879080 5958309 10411637 10457572 3749190 -1526419 858248 5057102
37080E057102k195178n440700Q4049M438044m78041o234722k444687M086065K58565
$$ 5057102 2861924 -2578776 -2494727 1943317 1465276 -4769446 -7214133 -3128068 -2869503
37071b869503r464079q072046O097565J4706133O760053n837684p849203j668018
$$ -2869503 -12333582 -20405628 -14308063 398070 7158123 1320439 -6528764 -8196782
37063h196782J838141J864571M072647O585236L596565j719232j553123J877773
$$ -8196782 -6358641 -4494070 -421423 6163813 9760378 8041146 6488023 8365796
37055H365796m67227p512026q337124p60744M569886K571529J870732P372010
$$ 8365796 7898569 386543 -7950581 -8711325 -4141439 -1569910 300822 7672832
37047G672832Q547720l151060j6083440j2872366K984431J1317430M529083l784373
$$ 7672832 16220552 13069492 -3013948 -15886314 -12901883 -1584453 2944630 -839743
37039h39743k254280J999949j488831p828857n351342M476109R082944M418322
$$ -839743 -3094023 -1094074 -2582905 -10411762 -15763104 -11286995 -2204051 2214271
37031B214271o7517K303387N334354J381166n585852o254668n33048K994659Q49817
$$ 2214271 2146754 4450141 9784495 11165661 5579809 -674859 -1207907 1786752 2636569
37022B636569r16132J922112L923229j082401q530086q115586J440734R980001
$$ 2636569 1720437 3642549 7565778 6483377 -2046709 -10162295 -8721561 1258440
37014A258440R189560K016336l515895m287260k229570O97538K662789N26605
$$ 1258440 10448000 12464336 8948441 4661181 2431611 3129149 5791938 6318543
37006F318543n927500j0229635n824863L948663Q462469L354552l987016m618080
$$ 6318543 391043 -9838592 -15663455 -11714792 -3252323 102229 -3884787 -8502867
36998h502867J006588N446248M205400l97332l414130k152920K266902O006684
$$ -8502867 -7496279 -2050031 2155369 1758037 -1656093 -3809013 -1542111 4464573
36990D464573N753709K250011m64198m12986l70705l154376o162053m202852K420938
$$ 4464573 10218282 12468293 12004095 11591109 11220404 8066028 1903975 -2298877 122061
36981A22061O596819L227779l390698m715092L99115L965878N78334l996992j042670
$$ 122061 6718880 9946659 6555961 1840869 2239984 6205862 6784196 2787204 1744534
36972A744534P267016R817969K668090m927988m089562J461136K751676o83745
$$ 1744534 9011550 18829519 21497609 16569621 12480059 13941195 16692871 16009126
36964A6009126k362577q00256j245518n937147r872085p436483J236614J0403744
$$ 16009126 13646549 12846293 11600775 5663628 -4208457 -11644940 -10408326 -4582
36956d582J2081906K214092j2120958j6312782n692022N972507M599058l491362
$$ -4582 12077324 14291416 2170458 -14142324 -19834346 -13861839 -9262781 -12754143
36948a2754143k107789Q001276J0260597J36039p374357l128495K112463j671730
$$ -12754143 -14861932 -6860656 3399941 3535980 -3838377 -6966872 -4854409 -6526139
36940f526139o316955j636362N504638L680708k849785k804778J914696J628518
$$ -6526139 -12843094 -14479456 -8974818 -5294110 -8143895 -10948673 -9033977 -7405459
36932g405459j967485M53105O860504O098400k191349o424888k531893Q58654
$$ -7405459 -9372944 -8919839 -2059335 4039065 1847716 -4577172 -7109065 -6250411
36924f250411j083504j985295K642052P060641N053156j088847n328982m828921
$$ -6250411 -7333915 -9319210 -6677158 383483 5436639 4347792 -981190 -5810111
36916e810111n30218L078519l2758q580021j0812462M1383J2029222R473724k540625
$$ -5810111 -6340329 -3261810 -3294568 -11874589 -22687051 -22645668 -10616446 -1142722 -3683347
36907c683347n474129L038383O726756n93152n388218K05929M483784j631506
$$ -3683347 -9157476 -6119093 607663 14511 -5373707 -5167778 -683994 -2315500
36899b315500p463217j669838P377716O122842j879759m482863j659743j342506
$$ -2315500 -9778717 -11448555 -4070839 2052003 172244 -4310619 -5970362 -7312868
36891g312868k638393M31462M566383K525167j900260J16027N211486K638614
$$ -7312868 -9951261 -9519799 -4953416 -2428249 -4328509 -4212482 999004 3637618
36883C637618n797729o933545K223655R638210P405886J612600j056283l576207
$$ 3637618 -2160111 -9093656 -6870001 2768209 10174095 11786695 10730412 7154205
36875G154205r166089j2200901o595294L314116P661709L483633l002745m721163
$$ 7154205 -2011884 -14212785 -20808079 -17493963 -9832254 -6348621 -9351366 -14072529
36867a4072529q54188L658101M087998J116940q90183p20719j800496n243760
$$ -14072529 -14926717 -11268616 -7180618 -6063678 -6953861 -7674580 -9475076 -14718836
36859a4718836o533507k909421J219174J526387J164614M259971P160274M488441
$$ -14718836 -21252343 -24161764 -22942590 -21416203 -20251589 -15991618 -8831344 -4342903
36851d342903l29452j74053L144229J832110l832348n390398n33305L188994J163049
$$ -4342903 -4672355 -4846408 -1702179 129931 -3702417 -9092815 -9626120 -6437126 -5274077
36842e274077j559515R8152L172280K692165n19648k350984j204830J807688M862832
$$ -5274077 -6833592 -6735440 -3563160 -870995 -1390643 -3741627 -4946457 -3138769 1724063
36833A724063N789544L791982J407947J242338J450005j042822m235657l836833
$$ 1724063 7513607 11305589 12713536 13955874 15405879 14363057 10127400 6290567
36825F290567j052060o11229j841077K42087M752292M665205j484297o197687
$$ 6290567 5238507 4627278 2786201 3028288 7780580 12445785 10961488 4763801
36817D763801m346777n5041J529154J970382M191305N567218K110199m389767
$$ 4763801 417024 361983 1891137 3861519 8052824 13620042 15730241 11340474
36809A1340474q290271o688844j008226N293035Q248037N588229l71046m486068
$$ 11340474 3050203 -3638641 -4646867 646168 8894205 14482434 14111388 9625320
36801I625320m565072k705199p46651J669250L944741L620619j99965n606203
$$ 9625320 5060248 2355049 1608398 3277648 7222389 10843008 10643043 5036840
36793E036840j0068146j0943161n680097L809749R295170N185596k368692k772747
$$ 5036840 -5031306 -15974467 -21654564 -17844815 -8549645 -3364049 -5732741 -8505488
36785h505488L949540Q019350N288285J881242K304515L050697R42197j542414
$$ -8505488 -4555948 3463402 8751687 10632929 12937444 15988141 16930338 15387924
36777A5387924k907418n826321r768176q994742k340631L119480K764700R73344
$$ 15387924 12480506 6654185 -3113991 -12108733 -14449364 -11329884 -8565184 -7591840
36769g591840K444156M875784N028518M160275K696556k135875q387453q281106
$$ -7591840 -5147684 -271900 4756618 8916893 11613449 9477574 1090121 -7190985
36761g190985r05865L654778j20690l705343O23597N725653J809736o050660o095909
$$ -7190985 -8096850 -4442072 -4562762 -8268105 -7644508 -1918855 -109119 -6159779 -12255688
36752a2255688N40689K663102j936800m215700R0794M790810M705234K240004
$$ -12255688 -11714999 -9051897 -10988697 -15204397 -15113603 -10322793 -5617559 -3377555
36744c377555O88907l19155r05499L38465K431774K735587J833370K280891L369963
$$ -3377555 -2688648 -3007803 -3913302 -3574837 -1143063 1592524 3425894 5706785 9076748
36735I076748K680079J242193J355840J491285m55965j754173M03111K224077
$$ 9076748 11756827 12999020 14354860 15846145 15390180 13636007 14039118 16263195
36727A6263195n56246l709959j299950K239464j473075q642002p237344K796672
$$ 16263195 15706949 11996990 10697040 12936504 11463429 2821427 -4415917 -1619245
36719a619245P731474J560297m744609j381732N540645N609802M3265l408133
$$ -1619245 6112229 7672526 2927917 1546185 7086830 12696632 12739897 9331764
36711I331764l453273l450874k813755O246P03780m611954r470124l983021Q885275
$$ 9331764 5878491 2427617 -386138 -379892 323888 -4288066 -13758190 -17741211 -8855936
36702h855936J4333354N306469p602312j0279118k579972M355775M151092J012994
$$ -8855936 5477418 10783887 3181575 -7097543 -9677515 -5321740 -1170648 -157654
36694a57654J28456K0242k035807k927628J459609P327868O730118o765l899956
$$ -157654 -29198 -8956 -2044763 -4972391 -3512782 3815086 10545204 10538439 6638483
36685F638483j250308Q04929k948244o358387k614901L278525K603845k146633
$$ 6638483 5388175 6193104 3244860 -3113527 -5728428 -2449903 153942 -1992691
36677a992691j841844L305154M657620P37478q53209K037105K282297k814449
$$ -1992691 -3834535 -529381 4128239 4865717 4012508 6049613 8331910 5517461
36669E517461n804466j748118L878589N141007L766506J907988l102738j0008852
$$ 5517461 -287005 -2035123 1843466 6984473 10750979 12658967 9556229 -452623
36661d52623r652329J455721J2107287J0718342J552267l510147k753401k599019
$$ -452623 -10104952 -8649231 3458056 14176398 15728665 12218518 9465117 6866098
36653F866098l217811M16474N593373L679380m656507q587567l827643J237521
$$ 6866098 3648287 4064761 9658134 13337514 8681007 93440 -3734203 -2496682
36645b496682k07177l636169k980191q30547j823022l118602M41230O378227P673087
$$ -2496682 -2703859 -6340028 -9320219 -10150766 -11973788 -15092390 -14651160 -8272933 -599846
36636e99846L314952j073626j837192o34762J74180L11985k41452j574881k238886
$$ -599846 2715106 1641480 -195712 -830474 -656294 -344309 -585761 -2160642 -4399528
36627d399528r00824O43216l13455k603025k585815n7811J717046J995732L357481
$$ -4399528 -5300352 -4657136 -4970591 -7573616 -10159431 -10217242 -8500196 -6504464 -3146983
36618c146983N407102L535357l068971p564008m203791L120604O297861L899056
$$ -3146983 2260119 5795476 2726505 -4837503 -9041294 -5920690 377171 4276227
36610D276227J084758Q94170J654358J815138J409109n65836m335582n774141
$$ 4276227 5360985 6255155 7909513 9724651 11133760 10567924 6232342 458201
36602D58201j273351M439999L222218l455931n464421J60015M359781J054208
$$ 458201 -815150 3624849 6847067 3391136 -2073285 -1913270 2446511 3500719
36594C500719l281044j549008K044893P27003k387844p97458L134531L542952
$$ 3500719 219675 -1329333 715560 1442563 -945281 -1742739 1391792 4934744
36586D934744K956892O506750Q955697J738276r565576j0376749j98507N289773
$$ 4934744 7891636 14398386 23354083 25092359 15526783 5150034 4951527 10241300
36578A0241300j378855q465960m943330K743884L319349j355267k177754J482340
$$ 10241300 8862445 396485 -4546845 -1802961 1516388 161121 -2016633 -534293
36570e34293L319675J937948P36131k91226l205967n379448k766561K181896L794425
$$ -534293 2785382 4723330 5459461 5168235 1962268 -3417180 -6183741 -4001845 -207420
36561b07420K389821K459869L526173J225292l240132l486202J187732L489314
$$ -207420 2182401 4642270 8168443 9393735 6153603 2667401 3855133 7344447
36553G344447n59866m974322k833440K983660L636032k977894q594587n009024
$$ 7344447 6784581 1810259 -1023181 1960479 5596511 2618617 -5975970 -10984994
36545a0984994N004414J0563333O248992j198721k479895J564470K490508k272375
$$ -10984994 -5980580 4582753 10831745 9633024 7153129 8717599 11208107 8935732
36537H935732o105344m382346j084734r15054j990759j107196J66922J58596J761419
$$ 8935732 2830388 -1551958 -2636692 -3551746 -5542505 -6649701 -6482779 -6324183 -4562764
36528d562764O087173P335504J648874m094589j289634O423887P851045N72380
$$ -4562764 1524409 8859913 10508787 6414198 5124564 11548451 19399496 19971876
36520A9971876p130152r351955p675477l643945L314690R058521O281946l602782
$$ 19971876 12841724 3489769 -4185708 -7829653 -4514963 4543558 10825504 7222722
36512G222722r195518m212992L972833N913553K996302K397881M624629L625073
$$ 7222722 -1972796 -6185788 -2212955 3700598 6696900 9094781 13719410 17344483
36504A7344483k812009r067214q601629j735492M305283K914576l941146p143461
$$ 17344483 14532474 5465260 -3136369 -4871861 -566578 2347998 -1593148 -8736609
36496h736609k091733M387955L987672L9265J731420P200456M775499o779940
$$ -8736609 -10828342 -6440387 -2452715 -2413450 -682030 6518426 11293925 4513985
36488D513985j2787442m203968P490300P208068j781952n541455j949138o86273
$$ 4513985 -8273457 -12477425 -4987125 2220943 438991 -5102464 -7051602 -7737875
36480g737875m152587l904820L017987Q266776O317685K517836K073214J566229
$$ -7737875 -11890462 -15795282 -12777295 -4510519 1807166 4325002 6398216 7964445
36472G964445k271882m577879r06581L492566J523458l800962m090607R25604
$$ 7964445 5692563 1114684 208103 3700669 5224127 1423165 -2667442 -1741838
36464a741838L448920J35051l493930k178627J915501L408387R00182k331818
$$ -1741838 1707082 1842133 -1651797 -3830424 -1914923 1493464 2393646 61828
36456F1828k652352K38617L018517K320708q49457k045586J24219J344536k082029
$$ 61828 -2590524 -2351907 666610 2987318 2137861 92275 216494 1561030 -520999
36447e20999p190714q096600l490220K966256P364416P497842L287211j108711
$$ -520999 -7711713 -15808313 -19298533 -16332277 -8967861 -1470019 1817192 708481
36439G08481K69367O146019O816593j644445q512728l499759N473016L344435
$$ 708481 977848 7123867 13940460 12296015 3783287 283528 5756544 9100979
36431I100979p069378q376470K739484R349059K142952n751794k119297M032931
$$ 9100979 2031601 -6344869 -3605385 5743674 7886626 2134832 15535 4048466
36423D048466L54880n828261j100729Q613650P345244k873153n325221K433932
$$ 4048466 4403346 -1424915 -2525644 6088006 13433250 10560097 5234876 7668808
36415G668808N058383l330091r400793l860533M153324M219371L42734j85228
$$ 7668808 12727191 9397100 -3693 -3864226 289098 4508469 4851203 4665975
36407D665975k85899m731102q818386o124393J70583K863825J220567j273055
$$ 4665975 4380076 -351026 -9169412 -15293805 -15123222 -12259397 -11038830 -12311885
36399a2311885k879441j383359O004375J4407652J2295524j837240j3309574j0282914
$$ -12311885 -15191326 -16574685 -10570310 3837342 16132866 14295626 986052 -9296862
36391i296862N14690O399385O893707P746172O610088q59867p895410n209852
$$ -9296862 -8782172 -2382787 4510920 12257092 18867180 18007313 10111903 4902051
36383D902051K013051J274057o205340p460676L76340O121441L586979m05379
$$ 4902051 6915102 8189159 1983819 -5476857 -5100517 1020924 4607903 4202524
36375D202524j39118L90573k561745n414808m885363l173270j889017K49095J247373
$$ 4202524 4063406 4453979 1892234 -3522574 -8407937 -11581207 -13470224 -13221129 -11973756
36366a1973756k763896p646816l898316P333404J2558886N361633l979738m716510
$$ -11973756 -14737652 -22384468 -26282784 -18949380 -6390494 -1028861 -5008599 -9725109
36358i725109k54362J446442J401145L541611M303479k38405l995914O6100N861923
$$ -9725109 -9979471 -8533029 -7131884 -3590273 713206 474801 -3521113 -3455013 2406910
36349B406910K422174o952698p993955J848650Q099981Q97633j0144407j0405880
$$ 2406910 4829084 -2123614 -10117569 -8268919 -168938 728695 -9415712 -19821592
36341a9821592r80112M953783K197359o63822L709619R685709P293890k482439
$$ -19821592 -20801704 -15847921 -13650562 -14314384 -10604765 -919056 6374834 3892395
36333C892395q364251m131972L515028N064336O76472k335916r53668R88364O19760
$$ 3892395 -4471856 -8603828 -5088800 -24464 652008 -1683908 -2637576 -1649212 -1029452
36324a029452l4833Q86533J431001l17042k438795j817199J684512N444497O848087
$$ -1029452 -1064285 -177752 1253249 936207 -1502588 -3319787 -1635275 3809222 10657309
36315A0657309N031369J533754o01347q1683Q17365l68914k554454l491923l805782
$$ 10657309 15688678 17222432 16621085 16539402 17356767 16987853 14433399 10941476 7135694
36306G135694m661854l668146J414768O450878N005225j725610n890027m307195
$$ 7135694 2473840 -1194306 220462 6671340 11676565 9950955 4060928 -246267
36298b46267j751499j751621j548807J221896L694890L070432J001612n77282
$$ -246267 -1997766 -3749387 -5298194 -4076298 -381408 2689024 3690636 3113354
36290C113354k664637n162052m957954j298202J861603J857155Q06655N49592
$$ 3113354 448717 -4713335 -9671289 -10969491 -9107888 -7250733 -6444078 -5894486
36282e894486n24192k858851l552743j699372k99005k11418J617186N292106O363788
$$ -5894486 -6418678 -9277529 -12830272 -14529644 -14828649 -15040067 -13422881 -8130775 -1766987
36273a766987M010027K952910L859347J052584n589723o968507J31620N151528
$$ -1766987 2243040 5195950 9055297 10107881 4518158 -2450349 -2318729 2832799
36265B832799L34563n481159j843687M298504K43014q801316o314061P512575
$$ 2832799 3167362 -2313797 -4157484 141020 384034 -8417282 -14731343 -7218768
36257g218768J3735724L697519p668161n110588M807046N710222m027073j0729091
$$ -7218768 6516956 10214475 2546314 -2564274 2242772 7952994 3925921 -6803170
36249f803170n403340N799076J1009063O015799l190579q057412n995222j295464
$$ -6803170 -12206510 -6407434 4601629 10617428 7426849 -630563 -6625785 -7921249
36241g921249J825224M191646P300746P682118J518442o832122q282278j659095
$$ -7921249 -6096025 -1904379 5396367 13078485 14596927 7764805 -517473 -2176568
36233b176568M146572K794338j370206j334410K162688L189121j72145m337600
$$ -2176568 1970004 4764342 3394136 2059726 4222414 7411535 7239390 2901790
36225B901790o046708n207809k706759P66349L403564K857165n01161k673690
$$ 2901790 -3144918 -8352727 -11059486 -10293137 -6889573 -4032408 -4533569 -7207259
36217g207259l32983M391009N554530O68223n792678q054815n972077l032756
$$ -7207259 -7540242 -3149233 2405297 3073520 -2719158 -10773973 -16746050 -19778806
36209a9778806J46546M888063Q381066N866555m50659k608646Q43901K246818
$$ -19778806 -19632260 -14744197 -6363131 -496576 -947235 -3555881 -2711980 -465162
36201d65162j997417m905584j155937L434927K245112j103440j004396n61742
$$ -465162 -2462579 -7368163 -8524100 -5089173 -2844061 -3947501 -4951897 -5513639
36193e513639l313058k736142O691381J5126293R657750l924654q476402j729502
$$ -5513639 -8826697 -11562839 -4871458 10254835 19912585 15987931 7511529 5782027
36185E782027K638573p97074l042469m92247j139884o002067l802689P658374
$$ 5782027 8420600 7623526 4581057 4088810 2948926 -3053141 -6855830 802544
36177H02544J3120928L602340q041424p873200k045550k653248n963202j857818
$$ 802544 13923472 17525812 9484388 1611188 -434362 -3087610 -9050812 -10908630
36169a0908630N376193M123681l284294m256002K764551P146924M254317k53220
$$ -10908630 -5532437 -1408756 -4693050 -8949052 -6184501 962423 5216740 4963520
36161D963520l017091n623977n573669J123665Q456327N968808l216302m637900
$$ 4963520 1946429 -3677548 -9251217 -8127552 328775 6297583 3081281 -1556619
36153a556619M694953J0592399L730761o512350p582226j314274K671751J787726
$$ -1556619 3138334 13730733 17461494 10949144 3366918 2052644 4724395 6512121
36145F512121l26700k357149m539941m635470j994990r15438l514028m383868
$$ 6512121 6185421 3828272 -711669 -5347139 -7342129 -8257567 -11771595 -16155463
36137a6155463Q53462O748654N526505p44254l822027k181880j433251l280142
$$ -16155463 -15302001 -8553347 -3026842 -3771096 -7593123 -9775003 -11208254 -14488396
36129a4488396l092442Q05764L625381K296826M08161J532843K983568N95787
$$ -14488396 -17580838 -16775074 -13149693 -10852867 -10444706 -8911863 -5928295 -5332508
36121e332508l719829l943605J610613P503115P341420Q25059o216840q150402
$$ -5332508 -9052337 -12995942 -11385329 -3882214 3459206 4284265 -1932575 -10082977
36113a0082977m963771r02215J283038K355689K698427L68001m048053m399719
$$ -10082977 -15046748 -15948963 -14665925 -12310236 -9611809 -9243808 -13291861 -17691580
36105a7691580L465895J2836717J2124973P43807q470709o177073J243748K441437
$$ -17691580 -14225685 -1388968 10736005 11479812 3009103 -3167970 -1924222 517215
36097E17215j901317j835870M908168R115483M503522l113092m977070r50413
$$ 517215 -1384102 -3219972 1688196 10803679 15307201 12194109 7217039 6266626
36089F266626K735152K278428j658061o587706q654094m415308L563617O991897
$$ 6266626 9001778 11280206 9622145 3034439 -5619655 -10034963 -6471346 520551
36081E20551K330960l493868l397154j175297m474467j0641544r526301O64230
$$ 520551 2851511 -642357 -4039511 -5214808 -9689275 -20330819 -29857120 -29192890
36073b9192890J0280486J2036551Q629007M398722j239199p738631r220183k791588
$$ -29192890 -18912404 -6875853 1753154 6151876 4912677 -2825954 -12046137 -14837725
36065a4837725M741285N187553K30286j810533J985928O198228N378681O08614
$$ -14837725 -10096440 -4908887 -4678601 -6489134 -4503206 1695022 7073703 7682317
36057G682317k926258k361553j06468l24742k488173r62246O068037J0486789
$$ 7682317 4756059 2394506 2288038 1963296 -524877 -1487123 4580914 15067703
36049A5067703L670662r225467j3163515l274172P761881O814486k870580q162978
$$ 15067703 18738365 9512898 -3650617 -6924789 837092 7651578 4780998 -3381980
36041c381980l625654M268454P015771K295546n475014q709299l263258N797221
$$ -3381980 -7007634 -2739180 4276591 6572137 1097123 -7612176 -10875434 -5078213
36033e078213Q675436L139785k939030l534517j738888j540343q44070J643640
$$ -5078213 3597223 6737008 3797978 263461 -1475427 -3015770 -3859840 -2216200
36025b216200J314557l061668l624986L680025Q917204K504317p547091o644853
$$ -2216200 -901643 -3963311 -7588297 -3908272 5008932 7513249 -33842 -6678695
36017f678695L248559O973079L99883m770285j397347L230282J741509k375866
$$ -6678695 -3430136 3542943 3942826 -827459 -2224806 1005476 2746985 371119
36009C71119l552178k884601k411132J37663N201053P606717L968652k317641
$$ 371119 -3181059 -6065660 -8476792 -8339129 -3138076 4468641 8437293 6119652
36001F119652o792862q291028n633049K144908R873737R229803R49372m432984
$$ 6119652 -673210 -8964238 -14597287 -12452379 -2578642 6651161 7600533 3167549
35993C167549j560996K872608K207666o18540q08489P3647k05235R44158M111626
$$ 3167549 1606553 4479161 6686827 6068287 5259798 5333445 5128210 6072368 10183994
35984A0183994L639420k640313p122712l715259J740289Q03640m207591n270158
$$ 10183994 13823414 11183101 4060389 345130 2085419 2889059 -1318532 -6588690
35976f588690j778799O28285L27628M1451J33987n52980l45366J634379J440375
$$ -6588690 -8367489 -7739204 -7411576 -7370125 -7236138 -7789118 -8134484 -6500105 -5059730
35967e059730k724572m309188K061044R480285P587166p85859l296846K774428
$$ -5059730 -7784302 -12093490 -10032446 -552161 7035005 6249146 2952300 5726728
35959E726728O854261J898274n748728o800860j111850M803010O486707M085158
$$ 5726728 12580989 14479263 8730535 1929675 817825 5620835 12107542 16192700
35951A6192700p620l396622n456944p086078p366651l245925M485243R057288
$$ 16192700 16185080 12788458 7331514 245436 -7121215 -10367140 -5881897 3175391
35943C175391O400761J500678J16998m85022m472442o854629j200331O132022
$$ 3175391 9576152 11076830 11193828 10708806 6236364 -618265 -1818596 4313426
35935D313426L064291q181486j2539915m866126L318755L427902J544254M226468
$$ 4313426 7377717 -803769 -13343684 -18209810 -14891055 -11463153 -9918899 -5692431
35927e692431O430046K861724l17693L701581Q915086N647034l551345q767472
$$ -5692431 737615 3599339 3281646 6983227 15898313 21545347 17994002 9226530
35919I226530q143551o657972l914616L796636J1310942Q234232l847779j0396933
$$ 9226530 1082979 -5574993 -9489609 -5692973 5617969 13852201 10004422 -392511
35911c92511m089996M918631M670154k000788m525981j420047r6686k816517l134045
$$ -392511 -4482507 436124 5106278 3105490 -1420491 -2840538 -2937224 -5753741 -8887786
35902h887786K228330O632115L430601l141039l663871K526432O553970L424492
$$ -8887786 -6659456 -27341 3403260 262221 -3401650 -875218 5678752 9103244
35894I103244j341511j635233k61517k421404n158053j956062M733006N278765
$$ 9103244 7761733 6126500 5864983 3443579 -1714474 -3670536 1062470 6341235
35886F341235k370624q875041o884318p0838M597063N865026N108414J663149
$$ 6341235 3970611 -4904430 -11788748 -11859586 -7262523 -1397497 3710917 5374066
35878E374066l169256m020621M62443L510755P53763j635143K501621O903211
$$ 5374066 2204810 -1815811 -1353368 2157387 2911150 1276007 3777628 10680839
35870A0680839J868871q509214j0553037j443704O921781O125784J636202J174693
$$ 10680839 12549710 4040496 -6512541 -7956245 -1034464 5091320 6727522 7902215
35862G902215L115779K424291p2905j175137k015098m614516o339641m128205
$$ 7902215 11017994 13442285 13369380 12194243 10179145 5564629 -775012 -4903217
35854d903217o02999J03149m59687J669254M674125K929393l223998o117407q81773
$$ -4903217 -5506216 -5403067 -5862754 -4193500 480625 3410018 186020 -5931387 -6813160
35845f813160P630711J0600344N389590k399609n950976m274455j680249j396358
$$ -6813160 817551 11417895 16807485 14407876 8456900 4182445 2502196 1105838
35837A105838j969649j025205J05237j055755k734507j175425K092775J506162
$$ 1105838 -863811 -1889016 -1783779 -2839534 -5574041 -6749466 -4656691 -3150529
35829c150529k752305l278454K736227P244882K929143m706088m804373K791305
$$ -3150529 -5902834 -9181288 -6445061 799821 3728964 -977124 -5781497 -2990192
35821b990192P689765L939832l533701p930032q216680n982433j601618L430677
$$ -2990192 4699573 8639405 5105704 -2824328 -11041008 -17023441 -18625059 -15194382
35813a5194382N687410M443567L040494L351316L048396N74937j575965j302960
$$ -15194382 -9506972 -5063405 -2022911 1328405 4376801 4951738 3375773 2072813
35805B072813n24026j230738j607237L34906K231160M20301m065447n864481j345218
$$ 2072813 1548787 318049 -1289188 -954282 1276878 1697179 -2368268 -8232749 -9577967
35796i577967P009588J1752899O731009n384224j3119807q234821L076701P073527
$$ -9577967 -2568379 9184520 15915529 10531305 -2588502 -10823323 -7746622 -673095
35788f73095M89891o126169m575980P59928K865739K659440L005257J155553m021612
$$ -673095 -183204 -6309373 -10885353 -10125425 -7259686 -4600246 -1594989 -439436 -4461048
35779d461048n247947K005410Q290932K789985p734503p089836N271290J2691085
$$ -4461048 -9708995 -7703585 587347 3377332 -4357171 -11447007 -6175717 6515368
35771F515368O201624l718231m563072J914673O869172P065240L829211j794520
$$ 6515368 12716992 8998761 4435689 6350362 13219534 20284774 24113985 22319465
35763B2319465o556192n388479L71186K785640k54219j426052K353356L347649
$$ 22319465 15763273 10374794 10745980 13531620 13277401 11851349 14204705 17552354
35755A7552354k882419p845185m152801J112426j194890n563203j499778O823539
$$ 17552354 14669935 6824750 2671949 3784375 2589485 -2973718 -4473496 2350043
35747B350043O233854l487716q802178l217038N027521P264786M061169j077306
$$ 2350043 8583897 5096181 -3705997 -6923035 -1895514 5369272 9430441 8353135
35739H353135o235679p449024j471019N745259M093435m948108q751312k539459
$$ 8353135 2117456 -5331568 -6802587 -1057328 3036107 -1912001 -10663313 -13202772
35731a3202772L811341K346393j369431L21791M646022N142829K428001L27324
$$ -13202772 -9391431 -7045038 -8414469 -8092678 -3446656 1696173 4124174 4451498
35723D451498j635303m523581n306300k790249j652137l792782k971952M165527
$$ 4451498 2816195 -1707386 -7013686 -9803935 -11456072 -15248854 -18220806 -14055279
35715a4055279R371347M805338k936923k149979N569563Q545688L698528q64023
$$ -14055279 -4683932 121406 -2815517 -4965496 604067 9149755 12848283 11984260
35707A1984260j209393k534704o752459p239939p57225N156749K970123l601835
$$ 11984260 10774867 8240163 1487704 -5752235 -6509460 -1352711 1617412 -1984423
35699a984423n478235p20362M471377M384449r33218o935275q009059j838661
$$ -1984423 -7462658 -8183020 -3711643 672806 -260412 -7195687 -15204746 -17043407
35691a7043407P024401J0192536M584914l493072n768829j463282L288355L771130
$$ -17043407 -10019006 173530 4758444 1265372 -4503457 -5966739 -2678384 1092746
35683A092746J245881m71470j05720O07844K43050l22485J45009N65309j040189
$$ 1092746 2338627 1867157 1761437 2369281 2612331 2289846 2434855 3000164 1959975
35674A959975l523773k949224J645883N768630N229672J708118n78952r87565
$$ 1959975 -1563798 -4513022 -2867139 2901491 8131163 9839281 9260329 8272764
35666H272764r72184Q07884N830358R446506M645624o750581j3695773r731835
$$ 8272764 7300580 8108464 13938822 23385328 28030952 21280371 7584598 -2147237
35658b147237j106286K945087K329462K723669M524781K916882k435681n509103
$$ -2147237 -3253523 -308436 2021026 4744695 9269476 12186358 9750677 4241574
35650D241574l121055K71071k24140k966315l866390l406165m350851m796396
$$ 4241574 1120519 1391590 1167450 -1798865 -5665255 -9071420 -13422271 -18218667
35642a8218667N5330Q782026J2666204O785056k553474n924150k992706j031655
$$ -18218667 -18163337 -9381311 3284893 10069949 7516475 1592325 -1400381 -2432036
35634b432036l106889m528350j728359J957317K327971P93607O21342P37882j677800
$$ -2432036 -5538925 -10067275 -11795634 -9838317 -7510346 -6716739 -6095397 -5357515 -7035315
35625g035315m853050l903853K036789Q323829J0249678O863087P4518o699924
$$ -7035315 -11888365 -15792218 -13755429 -5431600 4818078 11681165 11755683 5055759
35617E055759r519338o954015k200093M03890M44196N45159J739873L047549M398612
$$ 5055759 -4463579 -11417594 -13617687 -13213797 -12769601 -12224442 -10484569 -7437020 -3038408
35608c038408N963850N509024J031728m335253n055266j118073J880730J286321
$$ -3038408 2925442 8434466 9466194 5130941 75675 -1042398 838332 2124653
35600B124653L74489J256493R87042k058790l819711j404174N98720k995499p976513
$$ 2124653 2499142 3755635 4742677 2683887 -1135824 -2539998 -1941278 -4936777 -12913290
35591a2913290n096284O043100J4466178J1239392K75756p404558o777649k352405
$$ -12913290 -18009574 -11966474 2499704 13739096 14014852 6610294 -167355 -2519760
35583b519760j42387l33586O18063L083566K913788k040655o781076m177166M980460
$$ -2519760 -2662147 -2995733 -2377670 705896 3619684 1579029 -5202047 -9379213 -4398753
35574d398753J1077414P110768k250428o867386m253420j255370k793789m975955
$$ -4398753 6678661 13789429 11539001 4671615 418195 -837175 -3630964 -8606919
35566h606919k288778L246123N220962K548042R9373J32422p14874m122064n586666
$$ -8606919 -10895697 -7649574 -2428612 119430 218803 351225 -363649 -4485713 -10072379
35557a0072379j235903N098324O839696M112580K479690L482122K738087j850275
$$ -10072379 -11308282 -6209958 629738 4742318 7222008 10704130 13442217 11591942
35549A1591942n856098m607789N70655M771518M911951J167707l613434m880855
$$ 11591942 5735844 1128055 1698710 6470228 11382179 12549886 8936452 4055597
35541D055597q25289L331705P90179n894042o319421K431663R954812P268406
$$ 4055597 3230308 6562013 7352192 1458150 -4861271 -2429608 7525204 14793610
35533A4793610m99000l549537k055262j672751j032890L844214P024144p22696
$$ 14793610 14294610 10745073 8689811 7017060 5984170 9828384 16852528 16129832
35525A6129832j3655188j4932697j582070R389897N841491k587342j736386N011561
$$ 16129832 2474644 -12458053 -14040123 -4650226 1191265 -1396077 -3132463 1879098
35517A879098M707945l293458p914330n318483l256993n778117n889450K169919
$$ 1879098 6587043 3293585 -4620745 -9939228 -13196221 -18974338 -24863788 -22693869
35509b2693869J2185311J3811979O530151l62496n33252J624005j872201j0090597
$$ -22693869 -10508558 3303421 9833572 9471076 8937824 10561829 8689628 -1400969
35501a400969j2466741k866897R637114J0414941j159557r790382m473521P239617
$$ -1400969 -13867710 -16734607 -7097493 3317448 2157891 -7632491 -12106012 -4866395
35493d866395J0799461M100890k490605j875581K493823M320275K289189q09754
$$ -4866395 5933066 10033956 7543351 5667770 8161593 12481868 14771057 13961303
35485A3961303k016983n80170O41149k604353r211184j1196735l912042N440927
$$ 13961303 11944320 11364150 12005299 9400946 189762 -11006973 -14919015 -9478088
35477i478088O523072Q78567n17740N396555Q668671J752961q560303j0400409
$$ -9478088 -2955016 -2076449 -2594189 2802366 11471037 13223998 4663695 -5736714
35469e736714k228976P101651R961660N862879j695956q473297j0322681n799406
$$ -5736714 -7965690 -864039 9097621 14960500 13264544 4791247 -5531434 -11330840
35461a1330840J291078N065313L846782J057930j16630k51342j088713j909939
$$ -11330840 -10039762 -4974449 -1127667 -69737 -186367 -437709 -1526422 -3436361
35453c436361n71311K732382M899925L624280J70666k599363l658401l420229
$$ -3436361 -4007672 -1275290 3624635 7248915 7419581 4820218 1161817 -2258412
35445b258412j164516L692290P663256N103485l456299q957192m243872N631859
$$ -2258412 -3422928 269362 7932618 13036103 9579804 622612 -3621260 2010599
35437B010599Q828910J615226p542804r432288m494682M62682J815537J641472
$$ 2010599 10839509 12454735 4911931 -4520357 -9015039 -8552357 -6736820 -5095348
35429e095348K456539L117500Q98814l700731n917750j911357N343934Q197291
$$ -5095348 -2638809 478691 1377505 -2323226 -8240976 -10152333 -4808399 3388892
35421C388892L874293j308423n64225L539604L159318k628897o461269m033565
$$ 3388892 7263185 5954762 5390537 8930141 12089459 9460562 2999293 -1034272
35413a034272J54818J020937M04724J824983L053066J86184m140887l675810J339515
$$ -1034272 -879454 141483 546207 2371190 5424256 5610440 1469553 -2206257 -866742
35404h66742L932076J175788j405469Q42345L773785J082513m939068o196425
$$ -866742 3065334 4241122 2835653 3677998 7451783 8534296 3595228 -2601197
35396b601197j326825K092417k09378k138618K344066P744784M430023n299123
$$ -2601197 -3928022 -1835605 -2044983 -4183601 -1839535 5905249 10335272 5036149
35388E036149q603937n49426Q724564R174031L999068J096235l96949n424301
$$ 5036149 -3567788 -4117214 4607350 13781381 17780449 18876684 18479735 13055434
35380A3055434j0602052q144738j4809L581545K40311j526335K357469M582182
$$ 13055434 2453382 -5691356 -5706165 -2124620 -1884309 -3410644 -1053175 3529007
35372C529007J86292l318896J947650R836437Q263537k484182r875918o416207
$$ 3529007 3715299 396403 2344053 12180490 20444027 17959845 8083927 1667720
35364A667720K276592P309349O544162K721036j926878n891175p544697o990387
$$ 1667720 3944312 11253661 17797823 20518859 18591981 12700806 5156109 -1834278
35356a834278n860106l855523P54156N665782M613619l435913r674095n819873
$$ -1834278 -7694384 -11549907 -10795751 -5129969 -516350 -3952263 -13626358 -19446231
35348a9446231L535477O017690j300462p376801k713568P480986J1284278O334708
$$ -19446231 -15910754 -9893064 -11193526 -18570327 -21283895 -13802909 -2518631 3816077
35340C816077O03126p13640n27516j677597j891868Q6181P08517j571773k158462
$$ 3816077 4419203 3705563 3178047 1500450 -391418 -305237 403280 -1168493 -3326955
35331c326955J498776L589633j043423o635689m128832M120303P178386K089070
$$ -3326955 -1828179 1761454 718031 -5917658 -10046490 -5926187 1252199 3341269
35323C341269k595369r74011K363026J764605j077957k624117l633552m526937
$$ 3341269 745900 -228111 2134915 3899520 2821563 197446 -3436106 -7963043
35315g963043j589869N764035R774670L891738o386765r845216m379205J814423
$$ -7963043 -9552912 -3788877 5985793 9877531 3490766 -6354450 -10733655 -8919232
35307h919232K696981P34248K01771P44800K23416m49583J288263N134645P235387
$$ -8919232 -6222251 -5488003 -5286232 -4541432 -4318016 -4767599 -3479336 1655309 8890696
35298H890696M150059k852754p757143n394419K172555O670076K859209m615555
$$ 8890696 13040755 10188001 2430858 -2963561 -791006 5879070 8738279 4122724
35290D122724o184942J057639R237527Q580828o33577p532305l791561M749392
$$ 4122724 -2062218 -1004579 8232948 16813776 16180199 8647894 4856333 9605725
35282I605725M639473o318124j3893354o372514P945216J1763241L354641k497237
$$ 9605725 14245198 7927074 -5966280 -12338794 -4393578 7369663 10724304 8227067
35274H227067J818827O132624N57892q550019r585952l136389J827242K350690
$$ 8227067 10045894 16178518 16736410 8186391 -1399561 -4535950 -2708708 -358018
35266c58018J614189k25943m530834o864466j853912O303425Q092179K666189
$$ -358018 1256171 1030228 -3500606 -10365072 -12218984 -5915559 2176620 4842809
35258D842809j724884j004239L70705q64736j677206K77185J907133j56113m788863
$$ 4842809 3117925 2113686 2484391 1619655 -57551 219634 2126767 1970654 -2818209
35249b818209q416971p786798j179499Q266863J2135335O065781k269691k283972
$$ -2818209 -11235180 -19021978 -20201477 -11934614 200721 6266502 3996811 1712839
35241A712839M072842N450741r30162n618119k968012P08608p23109l589193k916589
$$ 1712839 5785681 11236422 10306260 4688141 1720129 2428737 1705628 -1883565 -4800154
35232d800154j268133k001612j670445L091955P717759O706073K929433J965359
$$ -4800154 -6068287 -8069899 -9740344 -6648389 1069370 7775443 10704876 12670235
35224A2670235K121815j308888n870849n308077p78177N39944k634120l931346
$$ 12670235 14792050 13483162 7612313 2304236 1526059 2066003 -568117 -4499463
35216d499463l50788K966516J392921k289986l109134j259966k78076o46844P72326
$$ -4499463 -4850251 -1883735 -490814 -2780800 -5889934 -7149900 -7427976 -8074820 -7302494
35207g302494N327088R284936P356417o44163p966645p596747p09649M094303
$$ -7302494 -1975406 7309530 14665947 14021784 6055139 -1541608 -2251257 1843046
35199A843046J129144n371865o742636m82282P240221Q851543L038528m619617
$$ 1843046 2972190 -2399675 -9142311 -9624593 -2384372 6467171 9505699 4886082
35191D886082p429258m056647O08082J510477o79747j592873K35679K224490K685705
$$ 4886082 -2543176 -6599823 -5991741 -4481264 -5161011 -6753884 -6518205 -4293715 -1608010
35182a608010K620711K113405m95034m367738n410443j906325K583067L910336
$$ -1608010 1012701 3126106 2631072 -1736666 -7147109 -9053434 -6470367 -2560031
35174b560031J881470j199436l239364k729356O38J596386o5621j080956L048477
$$ -2560031 -678561 -1877997 -5117361 -7846717 -7846079 -6249693 -6315314 -7396270 -4347793
35165d347793P951526M910036m266946p216002N61848P922807M860832l005514
$$ -4347793 3603733 8513769 4246823 -2969179 -2407331 5515476 10376308 7370794
35157G370794n066218k060473j714238m693198n401075k211163K390906P441310
$$ 7370794 2304576 244103 -1470135 -6163333 -11564408 -13775571 -11384665 -3943355
35149c943355J0792253O554216n063494j1650127m039382P784113P759607j790171
$$ -3943355 6848898 13403114 8339620 -3310507 -7349889 434224 8193831 6403660
35141F403660m486891L299418P199292j400863j2351242j2973585m485969L985197
$$ 6403660 1916769 5216187 12415479 11014616 -1336626 -14310211 -18796180 -14810983
35133a4810983P578895O281480J887716j138925P95539L674675Q56796m575741
$$ -14810983 -7232088 -950608 937108 -201817 593722 4268397 5125193 549452
$$ [...]
##END NTUPLES=NMR SPECTRUM
##END=
