##TITLE=31Pdec_SR158H3HCl
 D2O, 24 sc
 11.4.2023
##JCAMPDX= 6.0         $$ Bruker NMR JCAMP-DX V2.0
##DATA TYPE= NMR SPECTRUM
##DATA CLASS= NTUPLES
##ORIGIN= UXNMR, Bruker Analytische Messtechnik GmbH
##OWNER= root
$$ XWIN-NMR		Version 3.5
$$ Tue Apr 11 16:07:49 2023 Russian Standard Time (UT+4h)  she@DPX200
##.OBSERVE FREQUENCY= 81.013821
##.OBSERVE NUCLEUS= ^31P
##.ACQUISITION MODE= SIMULTANEOUS
##.ACQUISITION SCHEME= undefined
##.AVERAGES= 24
##.DIGITISER RES= 16
##SPECTROMETER/DATA SYSTEM= spect
##.PULSE SEQUENCE= zgpg30
##.SOLVENT NAME= CDCl3
##.SHIFT REFERENCE= (INTERNAL, CDCl3, 0, 248.564)
##AUDIT TRAIL= $$ (NUMBER, WHEN, WHO, WHERE, WHAT)
$$ ##TITLE= Audit trail, XWIN-NMR		Version 3.5
$$ ##JCAMPDX= 5.01
$$ ##ORIGIN= Bruker BioSpin GmbH
$$ ##OWNER= she
$$ F:/spectra/data/she/nmr/P31/1/pdata/1/auditp.txt
$$ ##AUDIT TRAIL=  $$ (NUMBER, WHEN, WHO, WHERE, WHAT)
(   1,<2023-04-11 16:06:53.07 +0400>,<she>,<DPX200>,
      <created by zg, POWCHK disabled, PULCHK disabled
       configuration hash MD5:
       00 E9 B6 7A A2 85 ED C7 34 08 36 98 17 FE 4E 26
       data hash MD5: 32K
       1F EB E4 B4 94 9B 10 10 B7 6D 83 DF D7 3F 70 C5>)
(   2,<2023-04-11 16:06:55.65 +0400>,<she>,<DPX200>,
      <Start of raw data processing
       efp BC_mod = 2 LB = 1 FT_mod = 6 PKNL = 1 PHC0 = -11205.9 PHC1 = 557.0854 SI = 64K 
       data hash MD5: 64K
       D3 86 15 A6 19 DD B2 81 78 5A E2 68 7E 7C BB D6>)
(   3,<2023-04-11 16:07:17.00 +0400>,<she>,<DPX200>,
      <pk PHC0 = -0.5809062 PHC1 = 0 
       data hash MD5: 64K
       2C 2D E4 2C DE 9E DF BC 00 D4 F9 C8 73 02 3D 98>)
(   4,<2023-04-11 16:07:20.43 +0400>,<she>,<DPX200>,
      <abs ABSG = 5 
       data hash MD5: 64K
       8D 71 78 4E 16 5C 00 BE F3 A9 D7 7E B9 38 33 AF>)
$$ ##END=
$$ 
$$ hash MD5
$$ BD B4 E1 2C C2 E5 68 22 9D 9A 83 3C 94 76 04 F3
##$RELAX= 
##$RELAX= 
##$RELAX= 
##$RELAX= 
##$RELAX= 
##$RELAX= 
##$RELAX= 
##$RELAX= 
##$RELAX= 
$$ Bruker specific parameters
$$ --------------------------
##$DU= <F:/spectra>
##$EXPNO= 1
##$NAME= <P31>
##$PROCNO= 1
##$TYPE= <nmr>
##$USER= <she>
##$AMP= (0..31)
100 100 100 100 100 100 100 100 100 100 100 100 100 100 100 100 100 100 
100 100 100 100 100 100 100 100 100 100 100 100 100 100 
##$AQSEQ= 0
##$AQ_mod= 1
##$AUNM= <au_zg>
##$AUTOPOS= <>
##$BF1= 81.014009
##$BF2= 200.13
##$BF3= 200.13
##$BF4= 200.13
##$BF5= 200.13
##$BF6= 200.13
##$BF7= 200.13
##$BF8= 200.13
##$BYTORDA= 1
##$CFDGTYP= 0
##$CFRGTYP= 5
##$CHEMSTR= <none>
##$CNST= (0..31)
1 1 145 1 1 1 1 1 1 1 1 1 1 1 1 1 1 1 1 1 1 1 1 1 1 1 1 1 1 1 1 1 
##$CPDPRG= <waltz16>
##$CPDPRG1= <>
##$CPDPRG2= <waltz16>
##$CPDPRG3= <>
##$CPDPRG4= <mlev>
##$CPDPRG5= <mlev>
##$CPDPRG6= <mlev>
##$CPDPRG7= <mlev>
##$CPDPRG8= <mlev>
##$CPDPRGB= <>
##$CPDPRGT= <>
##$D= (0..31)
0 1 0 0 0 0 0 0 0 0 0 0.03 2e-05 3e-06 0 0 0 0 0 0 0 0 0 0 0 0 0 0 0 0 
0 0 
##$DATE= 1681214812
##$DBL= (0..7)
120 120 120 11 120 120 24 19 
##$DBP= (0..7)
150 150 150 150 150 150 150 150 
##$DBP07= 0
##$DBPNAM0= <>
##$DBPNAM1= <>
$$ [...]
##$SUBNAM3= <"">
##$SUBNAM4= <"">
##$SUBNAM5= <"">
##$SUBNAM6= <"">
##$SUBNAM7= <"">
##$SUBNAM8= <"">
##$SUBNAM9= <"">
##$SW= 501.771253377433
##$SWIBOX= (0..15)
0 1 3 0 0 0 0 0 0 0 0 0 0 0 0 0 
##$SW_h= 40650.406504065
##$TD= 32768
##$TD0= 1
##$TE= 0
##$TE2= 300
##$TE3= 300
##$TEG= 300
##$TL= (0..7)
0 120 53 12 22 120 120 120 
##$TP= (0..7)
150 150 150 150 150 150 150 150 
##$TP07= 0
##$TPNAME0= <>
##$TPNAME1= <>
##$TPNAME2= <>
##$TPNAME3= <>
##$TPNAME4= <>
##$TPNAME5= <>
##$TPNAME6= <>
##$TPNAME7= <>
##$TPOAL= (0..7)
0.5 0.5 0.5 0.5 0.5 0.5 0.5 0.5 
##$TPOFFS= (0..7)
0 0 0 0 0 0 0 0 
##$TUNHIN= 0
##$TUNHOUT= 0
##$TUNXOUT= 0
##$USERA1= <user>
##$USERA2= <user>
##$USERA3= <user>
##$USERA4= <user>
##$USERA5= <user>
##$V9= 5
##$VALIST= <valist>
##$VCLIST= <CCCCCCCCCCCCCCC>
##$VD= 0
##$VDLIST= <DDDDDDDDDDDDDDD>
##$VPLIST= <PPPPPPPPPPPPPPP>
##$VTLIST= <TTTTTTTTTTTTTTT>
##$WBST= 1024
##$WBSW= 4
##$XGAIN= (0..3)
0 0 0 0 
##$XL= 0
##$YL= 0
##$YMAX_a= 2390
##$YMIN_a= -1627
##$ZGOPTNS= <>
##$ZL1= 120
##$ZL2= 120
##$ZL3= 120
##$ZL4= 120
##$ABSF1= 248.5645
##$ABSF2= -253.2056
##$ABSG= 5
##$ABSL= 3
##$ALPHA= 0
##$AQORDER= 0
##$ASSFAC= 0
##$ASSFACI= 0
##$ASSFACX= 0
##$ASSWID= 0
##$AUNMP= <proc_1d>
##$AZFE= 0.1
##$AZFW= 0.5
##$BCFW= 0
##$BC_mod= 2
##$BYTORDP= 0
##$COROFFS= 0
##$CY= -3
##$DATMOD= 1
##$DC= 0
##$DFILT= <>
##$DTYPP= 0
##$F1P= 0
##$F2P= 0
##$FCOR= 1
##$FTSIZE= 65536
##$FT_mod= 6
##$GAMMA= 0
##$GB= 0
##$INTBC= 1
##$INTSCL= 6.047779e-11
##$ISEN= 30
##$LB= 1
##$LEV0= 0
##$LPBIN= 0
##$MAXI= 10000
##$MC2= 0
##$MEAN= 0
##$ME_mod= 0
##$MI= 50
##$NCOEF= 0
##$NC_proc= -8
##$NLEV= 6
##$NOISF1= 182.463
##$NOISF2= 159.3651
##$NSP= 0
##$NTH_PI= 0
##$NZP= 0
##$OFFSET= 248.5645
##$PC= 4
##$PHC0= -11206.48
##$PHC1= 557.0854
##$PH_mod= 1
##$PKNL= yes
##$PPARMOD= 0
##$PSCAL= 0
##$PSIGN= 0
##$REVERSE= no
##$SF= 81.0140089999694
##$SI= 65536
##$SIGF1= 159.3651
##$SIGF2= -187.1042
##$SINO= 113.3802
##$SIOLD= 16384
##$SREGLST= <1H.CDCl3>
##$SSB= 0
##$STSI= 65536
##$STSR= 0
##$SW_p= 40650.406504065
##$SYMM= 0
##$S_DEV= 0
##$TDeff= 32768
##$TDoff= 0
##$TI= <>
##$TILT= no
##$TM1= 0
##$TM2= 0
##$TOPLEV= 0
##$USERP1= <user>
##$USERP2= <user>
##$USERP3= <user>
##$USERP4= <user>
##$USERP5= <user>
##$WDW= 1
##$XDIM= 65536
##$YMAX_p= 297859695
##$YMIN_p= -182521529
$$ End of Bruker specific parameters
$$ ---------------------------------
##NTUPLES= NMR SPECTRUM
##VAR_NAME=  FREQUENCY,     SPECTRUM/REAL,   SPECTRUM/IMAG
##SYMBOL=    X,             R,               I
##VAR_TYPE=  INDEPENDENT,   DEPENDENT,       DEPENDENT
##VAR_FORM=  AFFN,          ASDF,            ASDF
##VAR_DIM=   65536,         65536,           65536
##UNITS=     HZ,            ARBITRARY UNITS, ARBITRARY UNITS
##FACTOR=    0.620285442955139, 1,           1
##FIRST=     20137.2065510682, 0,            0
##LAST=      -20513.1999529968, 0,           0
##MIN=       -20513.1999529968, -182521529,  0
##MAX=       20137.2065510682, 297859695,    0
$$ Real data points
##PAGE= N=1
##DATA TABLE= (X++(R..R)), XYDATA
$$ [...]
40493C882739j711231J087083J608437n79298k152436k350715l476536m505262
40485h197219j252644N194538P423223K443438l042766k469877J308908J786170
40477C193771j093194k657232j749979q98943m75764J184165L016422K251332
40469B770578k99686j128082N7245K81913q82537o63258J198226J367729j040278
40460A661850k376225n14439J669294J536958J002622K228269K954717L59077
40452H522123l365667l840229j064646J074932N98444j110696k541480l084804
40444d812023j873667Q31134K270337Q61168l27789J870937M423045J994052l765933
40435A471261n457336r59232L545984L282191R43549K51666q6354j904446k719506
$$ plain form
40493 3882739 2171508 3258591 4867028 4287730 2135294 -215421 -3691957 -8197219
40485 -8197219 -9449863 -4255325 3167898 5611336 2568570 98693 1407601 3193771
40477 3193771 2100577 -556655 -2306634 -3205577 -3681341 -2497176 519246 2770578
40469 2770578 2470892 1342810 1400055 1681968 799431 136173 1334399 2702128 1661850
40460 1661850 -714375 -1228814 440480 1977438 2980060 5208329 8163046 8522123
40452 8522123 5156456 1316227 251581 1326513 1924957 814261 -1727219 -4812023
40444 -4812023 -6685690 -5854556 -3584219 -2723051 -3050840 -1179903 3243142 5237194 1471261
40435 1471261 -3986075 -4945307 -1399323 1882868 2826417 3078083 2991729 1087283 -1632223
40426a632223l14024K276612J385545j351916k425862k217965k456593j505872
40418h242298K324520N836434N021797J527876m55867r72833k038348j721402
40410A279879K307374N787002K732923l915008n294985k80854K951931L27503
40402E895765k494318r78713P10516j928630n209638l397153J881100M550127
40394i70944K772463o26052l356071m439379k516040J966836N068500L942177
40386A841490R75807k25724k44671j182337j527724J163765M440911L398472j658769
40377F981220n108828l833842o90279O37267L16522L93465J116059J222276L60843
40368A394703m36908l49659J9845n64675j833569j575584J241703L782034K494574
$$ plain form
40426 -1632223 -1946247 330365 1715910 363994 -2061868 -4279833 -6736426 -8242298
40418 -8242298 -5917778 -81344 4940453 6468329 6012462 5039629 3001281 1279879
40410 1279879 3587253 9374255 12107178 8192170 2897185 2616331 5568262 5895765
40402 5895765 3401447 2422734 3133250 1204620 -4005018 -7402171 -5521071 -970944
40394 -970944 1801519 1175467 -2180604 -6619983 -9136023 -7169187 -2100687 1841490
40386 1841490 2817297 2591573 2346902 1164565 -363159 800606 5241517 8639989 6981220
40377 6981220 1872392 -1961450 -2651729 -2014462 -1697940 -1304475 -188416 1033860 1394703
40368 1394703 957795 608136 627981 63306 -1770263 -3345847 -2104144 1677890 4172464
40359D172464j237372k257498P65562L086238J147392k198932k773861j338027
40351f34034p79970o04300R31661K054457L67367j534577N95516M701084M243949
40342I341153j626293n982770l993620O01171J726262p13323k307624r46164J544152
40333b357056L054291L324580K749667J182923j652641n130460p181641n464982
40325a1475319k33270M676969N662244L689816K401956K313724M00066l868969
40317C567217o098657l038886J975093L118450m3345k422714p56505K374627K752862
40308A428142J38583k027412j203013J630452L494952K374383j220445m697258
40300h1616n373513k843912N25473K146370K089986K267538K873847J803117j407535
$$ plain form
40359 4172464 2935092 677594 1443156 4529394 5676786 3477854 703993 -634034
40351 -634034 -1414004 -2018304 -1086643 967814 1335181 -199396 396120 5097204 9341153
40342 9341153 7714860 1732090 -2261530 -1660359 65903 -647420 -2955044 -3901208 -2357056
40333 -2357056 697235 4021815 6771482 7954405 6301764 1171304 -6010337 -11475319
40325 -11475319 -11708589 -7031620 -1369376 2320440 4722396 7036120 7436186 3567217
40317 3567217 -2531440 -5570326 -3595233 -476783 -520128 -2942842 -3699347 -1324720 1428142
40308 1428142 1566725 -460687 -1663700 -33248 3461704 5836087 4615642 -81616
40300 -81616 -5455129 -8299041 -7773568 -5627198 -3537212 -1269674 1604173 3407290 1999755
40291A999755l470780j575831K014483K780980M13264j191383j81931J011899
40283A800456L72506q40329j337538j930657k402889k84939M393818O922277M126255
40274A0818960m66155j763413n20393r18266l103407l528182j461438K43575M66440
40265b32279Q35349J457168N66008j232362j191104M82798N33752j489523k151432
40256b421625j11297J762073J841967K138730L067691J298606l827935o909141
40248c160931l980677R25044J852438p3758L67660L150235L398144K01043j826735
40239H52463o83594l76301l617686o283715l204482L627057P092399M213405m23571
40230A195975j062625K151482M171645J889591k123411l275163q86530J377041
$$ plain form
40291 1999755 -1471025 -3046856 -1032373 1748607 2161871 970488 788557 1800456
40283 1800456 2172962 1332633 -4905 -1935562 -4338451 -4623390 -229572 6692705 10818960
40274 10818960 10352805 8589392 8068999 7150733 4047326 519144 -942294 -698719 -232279
40265 -232279 603070 2060238 2626246 1393884 202780 685578 1219330 -270193 -2421625
40256 -2421625 -2532922 -770849 1071118 3209848 6277539 7576145 3748210 -3160931
40248 -3160931 -7141608 -6216564 -4364126 -4437884 -4070224 -919989 2478155 2679198 852463
40239 852463 168869 -207432 -3825118 -10108833 -13313315 -9686258 -2593859 1619546 1195975
40230 1195975 133350 2284832 6456477 8346068 6222657 2947494 2060964 3438005
40222C438005Q72394n04043L87226K771642K733625r42755m300507k988665J926138
40213C393060M902419K603783k092329l820714j471510P43625o65003l507707
40205H5624l096612P23320K893239K27724l744448l347665J556090N519266M875248
40196E691786J995840R25947J391321M4373l305129m422933r56368L060010K153158
40187F578005k721049n270361k700297R69773J707505R32902J254801J159716
40179A910995j300463k902632M99928N902522O135678P17065l245579k056075
40171E661439j67886j374588k410179J59172K800146P81853l341157l513173M20705
40162i83668L397440L327135K531249K173001J116065j99179k23762k89036k689481
$$ plain form
40222 3438005 4310399 3806356 4193582 6965224 9698849 8756094 4455587 1466922 3393060
40213 3393060 8295479 10899262 8806933 4986219 3514709 4258334 3593331 85624
40205 85624 -3010988 -2287668 605571 833295 -2911153 -6258818 -4702728 816538 5691786
40196 5691786 7687626 8613573 10004894 10049267 6744138 2321205 1364837 4424847 6578005
40187 6578005 3856956 -1413405 -4113702 -3143929 -1436424 -503522 751279 1910995
40179 1910995 610532 -2292100 -1792172 4110350 10246028 10963093 7717514 5661439
40171 5661439 5493553 4118965 1708786 1867958 4668104 5449957 2108800 -1404373 -983668
40162 -983668 2413772 5740907 8272156 10445157 11561222 11362043 11138281 10849245 8159764
40153H159764n030796k441180M006679P160540L692842j419524k480748k241K470416
40144A4115752L484208K544348j422210o616698p537336k151494L387900K182610
40136G987080l619823n790233j494903L717235M600956K675309K106035L119002
40128A3300658K778496N41795m00681K053853M911588L068543l704866r078018
40120A3471368p321203o65554L434065J842181j180296j123021P17028P85224
40112I959792n61410k41163J973705K960290J017217j929453l205468k286174
40104G687336m15408J081441J617790J297328K90275j645977m194786n231630
40096D86369k564480K368875M771069J956896l187552n693660l822001L97825
$$ plain form
40153 8159764 3128968 687788 4694467 11855007 15547849 14128325 11647577 11645336 14115752
40144 14115752 17599960 20144308 18722098 12105400 4568064 2416570 5804470 7987080
40136 7987080 4367257 -1422976 -2917879 799356 5400312 8075621 10181656 13300658
40128 13300658 16079154 16620949 16220268 18274121 23185709 26254252 22549386 13471368
40120 13471368 6150165 5484611 8918676 10760857 9580561 8457540 9174568 9959792
40112 9959792 9398382 9157219 11130924 14091214 15108431 13178978 9973510 7687336
40104 7687336 7271928 8353369 9971159 11268487 11558762 9912785 5717999 486369
40096 486369 -2078111 290764 5061833 7018729 3831177 -1862483 -5684484 -5286659
40088e286659L959152M691061K349814m29492l41984J962005K133581j287223
40080G750255m015160k493673L92818j1622k802175l440224p51727K656184N095691
40071B380367O253936M797351N19912k770492j785728M46827r07659l863911k442241
40062B628362K751929M718781J496506p25428J890714M953880L953480J311739
40054B2979963Q87005J267900m86846l012736l410970k298018j854023j947172
40046A2125103j763077k093535k835265j712234J479946L230936J970561J037783
40038A1440218K699754M046672K703684J335157J725222j9315o262178j1039955
40030F629259p802204J61630M730194M779365M650697L962786j207181q185545
$$ plain form
40088 -5286659 -1327507 3363554 5713368 5283876 4941892 6903897 9037478 7750255
40080 7750255 3735095 1241422 1634240 1622618 -1179557 -4619781 -5371508 -2715324 2380367
40071 2380367 8634303 13431654 13951566 11181074 9395346 9842173 8934514 5070603 2628362
40062 2628362 5380291 10099072 11595578 10870150 12760864 17714744 21668224 22979963
40054 22979963 23866968 25134868 24648022 21635286 18224316 15926298 14072275 12125103
40046 12125103 10362026 8268491 5433226 3720992 5200938 8431874 10402435 11440218
40038 11440218 14139972 18186644 20890328 22225485 23950707 23931392 17669214 6629259
40030 6629259 -1172945 -1011315 3718879 8498244 13148941 17111727 15904546 7719001
40022G719001q944472k493804L057497K734188N72124O95980P55001j703102l414973
40013a022560j095949K307512K185135p02733k352755j771313r10727m73526M14523
40004c422393J484061J276957m61225j972366j046450K619457N991612M882350
39996I352003o09514m690027k999580Q86257N69007l281220m083132J19278L910354
39987h26574L269454P03075l34104l35852o46477o49230m02921j268755k073213
39978b564597J00060L681724L385804p54631k300360N95164J167972m056135p490000
39969h234999j881382P249262R246233L573061j552432k326332j926738j922641
39961B224032l62956J846667J021100k129810k626633N86776L173082K957100
$$ plain form
40022 7719001 -1225471 -3719275 -661778 2072410 2644534 3340514 4095515 2392413 -1022560
40013 -1022560 -2118509 189003 2374138 1671405 -681350 -2452663 -3363390 -3836916 -3422393
40004 -3422393 -1938332 -661375 -1122600 -3094966 -4141416 -1521959 4469653 9352003
39996 9352003 8742489 4052462 1052882 1939139 2508146 -773074 -4856206 -4736928 -826574
39987 -826574 2442880 3145955 2811851 2475999 1829522 1180292 777371 -491384 -2564597
39978 -2564597 -2464537 1217187 4602991 3848360 1548000 2143164 3311136 -744999 -8234999
39969 -8234999 -10116381 -2867119 6379114 9952175 8399743 6073411 4146673 2224032
39961 2224032 1861076 3707743 4728843 2599033 -27600 559176 3732258 6689358
39953F689358K362561K130582o15184n798259q109149m465344J192037L660587
39945b952811K826740J396687L14264l86014L46601K272615K455250n21760l307458
39936B444114k201397R99243J314508k018741m202919j680585K630763L065284
39928C50270r65235l665850n47319M814902N019685o72966m667176j703862L426616
39919A389065L080628j860449l865379n08970K438882N52840k821725k425508
39911d020616J275642L780980K852963j10200k968351m326591l531494j399798
39903h447465J11013M32446J147618K919779L635805J562711j415924k202645
39895b256662r83291o34896k031507k622941k92680L432923N255939L997101J283277
$$ plain form
39953 6689358 9051919 11182501 10567317 4769058 -3340091 -7805435 -6613398 -2952811
39945 -2952811 -126071 1270616 1584880 1198866 1545467 3818082 6273332 5751572 2444114
39936 2444114 242717 1241960 2556468 537727 -3665192 -5345777 -2715014 350270
39928 350270 -614965 -4280815 -4828134 -13232 5006453 4333487 -333689 -2037551 1389065
39919 1389065 4469693 2609244 -1256135 -1765105 673777 1226617 -1595108 -4020616
39911 -4020616 -2744974 1036006 3888969 3778769 810418 -3516173 -7047667 -8447465
39903 -8447465 -8336452 -7904006 -6756388 -3836609 -200804 1361907 -54017 -2256662
39895 -2256662 -3239953 -3874849 -5906356 -8529297 -8821977 -5389054 -133115 3863986 5147263
39886E147263j031040k566807l408451l014697j254305N59964J234302J597273
39878b736498K960356M158716K620706j416865m442548m191164k029987J14372
39870d962912K253150M239416M268903J770518q09847j454181j255441j369747
39862B679859l29626K643197M695473L308507N09139o07547q02990k125120l392763
39853F578129k872780k448360l849986l852207N35588N090596M032808J78377
39845C392165P12659M362749K958608l887078o664152j306178M017363K391818
39837E977954j246237K23959M010168L194566j272699k858898l5410L016833L777650
39828A4787886K932527O93392k594440m178389k460168n78407j531448k665742
$$ plain form
39886 5147263 4116223 1549416 -1859035 -4873732 -6128037 -5568073 -4333771 -2736498
39878 -2736498 223858 4382574 7003280 5586415 1143867 -3047297 -5077284 -4962912
39870 -4962912 -2709762 1529654 5798557 7569075 6759228 5305047 4049606 2679859
39862 2679859 2350233 4993430 9688903 12997410 13506549 12899002 12096012 9970892 6578129
39853 6578129 3705349 1256989 -2592997 -6445204 -5909616 -819020 3213788 3392165
39845 3392165 4104824 8467573 11426181 7539103 874951 -431227 3586136 5977954
39837 5977954 4731717 4955676 8965844 12160410 10887711 8028813 7993403 11010236 14787886
39828 14787886 17720413 18413805 15819365 11640976 9180808 8602401 7070953 4405211
39820D405211n04652K167916O47468k959006k837280L59115N19201l057421m122603
39811e382051j86958L116018J435014j287511L12318M088704L652626j888438
39803C859722o316471m266182K307942O566296M539570o46278k895510p65168
39795B383921J347611J44775j896850j238251O62787R4281k394294k990866r19174
39786d806060R79259J282447J013691J57668k063077l682748j788999K008377
39778f899442L000364P04649n46240Q92335J623322j11751j270825L136Q30719
39769a773733p43168j719522L19371K255803N00893k788170l265947j132547L58306
39760g988714N95476J154741J709282J030583M67233J901297L547374K336083
$$ plain form
39820 4405211 3900559 6068475 6715943 3756937 919657 1278772 1797973 -1259448 -5382051
39811 -5382051 -5569009 -2452991 -1017977 -2305488 -1993170 2095534 5748160 3859722
39803 3859722 -2456749 -6722931 -4414989 2151307 6690877 6044599 3149089 2383921
39795 2383921 3731532 3876307 1979457 741206 1403993 1498274 -896020 -3886886 -4806060
39786 -4806060 -3826801 -2544354 -1530663 -1372995 -3436072 -7118820 -8907819 -6899442
39778 -6899442 -3899078 -3194429 -3740669 -2848334 -1225012 -1336763 -2607588 -2604452 -1773733
39769 -1773733 -2516901 -4236423 -3917052 -1661249 -1160356 -3948526 -7214473 -8347020 -7988714
39760 -7988714 -7393238 -6238497 -4529215 -3498632 -3031399 -1130102 2417272 4753355
39752D753355m92353q12964J858731L838712L214759J798741P48568j214202m053764
39743I639583n081313l216873j122430j027718j434396k49091J462749J561987
39735E32498O53222Q03576J652498R67320j130458j558370J121406L845498K747031
39726I634221j453864m068377k476246P16588J642196K92298m79185K45382O20135
39717D673148k80904j161601j428468k195717l239450k288279Q43273K760323
39709b317675J526049k14715j68180o74338l715335n300798j003440N295000N617982
39700i55450K68478j985151K514746O517618L254236l300795m976554j254395
39692H2733J530253l7716l123276l784727j123176K819143M355382J071263m007421
$$ plain form
39752 4753355 4261002 3448038 5306769 9145481 12360240 14158981 14907549 13693347 9639583
39743 9639583 4558270 1341397 218967 -808751 -2243147 -2492238 -1029489 532498
39735 532498 1185720 1989296 3641794 4609114 3478656 1920286 3041692 6887190 9634221
39726 9634221 8180357 4111980 1635734 2352322 3994518 4286816 3807631 4053013 4673148
39717 4673148 4392244 3230643 1802175 -393542 -3632992 -5921271 -5077998 -2317675
39709 -2317675 -791626 -1006341 -1174521 -1848859 -5564194 -10864992 -11868432 -6573432 -955450
39700 -955450 -686972 -2672123 -157377 6360241 9614477 6313682 1337128 82733
39692 82733 1612986 1575270 -1548006 -5332733 -6455909 -3636766 718616 1789879 -2217542
39683b217542m116587K069264O676534K863911m736582o223118n89766L859137
39675b414749K388404r00000j623140j162523j494247p56237K203748M187643
39667D28899K592990j61305p50269K78107J068115J884833K622503R77723l043756
39658E897840m831929j780201J684794O97639k095541j138463K490273L048866
39650C973278k3576j482445P20937K751005K070202Q61788N83047r17152m287484
39641D249600n925503l527724j15082P98146L74307J239813K233012M74073l150011
39632c349369m518152j822881K267993M027011K478600j91420j107415K12928
39624b002705J247191j29878k283022k043477K22376J161431K80008R20675L840995
$$ plain form
39683 -2217542 -6334129 -4264865 2411669 5275580 538998 -5684120 -6273886 -2414749
39675 -2414749 -26345 -926345 -2549485 -3712008 -5206255 -5962492 -3758744 428899
39667 428899 3021889 2860584 2110315 2388422 3456537 5341370 7963873 8941596 5897840
39658 5897840 1065911 -714290 970504 1668143 -427398 -1565861 924412 3973278
39650 3973278 3949702 2467257 3188194 5939199 8009401 8871189 9454236 8537084 4249600
39641 4249600 -1675903 -5203627 -5318709 -4520563 -4146256 -2906443 -673431 -199358 -3349369
39632 -3349369 -7867521 -9690402 -7422409 -3395398 -916798 -1108218 -2215633 -2002705
39624 -2002705 -755514 -885392 -3168414 -5211891 -4989515 -3828084 -3548076 -2627401 1213594
39615A213594M484250o7981n391716n436611j121509J798489J594858J688531
39607a238095L439804L736461J124959q67391O26927K740748J096005l312676
39599G346742n422574l332076l86512L13466o671J064216K556892J679262j181969
39590B630776k470270r00414M69350o37151j617846P18962M002051L061052j727902
39581C528608m053852r33443K605237J163267k770689k790030J507375L816342
39573B072815K73315n191591o176135j603749L692933M785253J588239j615850
39565b174770j021139K395350M041036J569759j925453k155577L62257J314075
39557B405538q41682k628350q87831K497656L370293J012049j515525k105059
$$ plain form
39615 1213594 5697844 5629863 238147 -5198464 -6319973 -4521484 -2926626 -1238095
39607 -1238095 2201709 5938170 7063129 6195738 6822665 9563413 10659418 7346742
39599 7346742 1924168 -1407908 -1794420 -1480954 -1487625 -423409 2133483 3812745 2630776
39590 2630776 160506 -739908 -270558 -907709 -2525555 -1806593 2195458 5256510 3528608
39581 3528608 -525244 -1458687 1146550 2309817 -460872 -3250902 -1743527 2072815
39573 2072815 2346130 -2845461 -9021596 -10625345 -6932412 -2147159 -558920 -2174770
39565 -2174770 -3195909 -800559 3240477 4810236 2884783 729206 1091463 2405538
39557 2405538 1563856 -1064494 -1952325 545331 3915624 4927673 3412148 1307089
39549A307089j957272k591515k862678q82070K280470L346620J408839p16700
39541f67217p88137l32469j369926k166922J29015L724775L613309p23171l703887
39532b284630j692648J680371J444509j174922j528274P59022K025673J320072
39524E49173J510386L363465L545120J19076l995601n187850l655577j636120
39516e387928P4303J440191J438318j65689r65483J168792M244485M177832N23285
39507F548106k533169j529712K028170L906408K289452o56681j916527j117940
39499G018107m06691j271715k501323k077188m51031j50878j682807j934743J439091
39490b019178N451581M583716j680150p022041n553800J057263N845271M838552
$$ plain form
39549 1307089 -650183 -3241698 -6104376 -6986446 -4705976 -1359356 49483 -667217
39541 -667217 -1455354 -1787823 -3157749 -5324671 -5195656 -1470881 2142428 1419257 -2284630
39532 -2284630 -3977278 -2296907 -852398 -2027320 -3555594 -2796572 -770899 549173
39524 549173 2059559 5423024 8968144 9087220 5091619 -96231 -3751808 -5387928
39516 -5387928 -5313625 -3873434 -2435116 -2600805 -3566288 -2397496 1846989 6024821 6548106
39507 6548106 4014937 2485225 4513395 8419803 10709255 10052574 8136047 7018107
39499 7018107 6611416 5339701 2838378 761190 310159 159281 -1523526 -3458269 -2019178
39490 -2019178 3432403 8016119 6335969 -686072 -6239872 -5182609 662662 5501214
39482E501214P27998j580173p36769O90480J95273j770805k767426j479581O20543
39473e99246J023987o46617k237961k141927j314155j201656j279218m35279O95333
39464h136739J116933J661262K815054K136462j835589m577421n93993O669007
39456g45024P382945j84376n744436j897538M824853M548369j114095l616596
39448C454102j737973j020859k054493l70989K967330J877742k865531l263028
39440c013699K153980M979957J010171k802350n96866L003908K156703m95821
39432F395983o90119q92535l656630m301147N76148M231139j16496o193085l496967
39423h143709N003812O895529R4402m737513k177071O12220k038400m477294M7878
$$ plain form
39482 5501214 6229212 4649039 3912270 4602750 4798023 3027218 259792 -1219789 -599246
39473 -599246 424741 -221876 -2459837 -4601764 -5915919 -7117575 -8396793 -8832072 -8136739
39464 -8136739 -7019806 -5358544 -2543490 -407028 -2242617 -6820038 -7414031 -745024
39456 -745024 6637921 6453545 709109 -1188429 3636424 8184793 7070698 3454102
39448 3454102 1716129 695270 -1359223 -1730212 1237118 3114860 249329 -3013699
39440 -3013699 -859719 4120238 5130409 2328059 1731193 4735101 6891804 6395983
39432 6395983 5705864 4813329 1156699 -3144448 -2568300 1662839 1546343 -4646742 -8143709
39423 -8143709 -3139897 3755632 3850034 -887479 -3064550 -2452330 -4490730 -8968024 -8920146
39414h920146P969042J0855973O687549J46616m188275m572293j580316J486965
39406G885115O76342l449673n690641l149291J156030L278742K978597J460782
39398E146003j278747m303747m757813j853990J248168J880050J149821Q40459
39390a929796M25744n98753p50835O50002J794963J775255K528692M950047O142279
39381A4987598L394292j593233n141058o126453n698691m446903k210586O15464
39373f219570L152488M305569K752443j167191l807615j918612J920886J975674
39365I94072j819849k989346J552040O197374M786622o71092l785502k652675
39357A611644l16311R48110J226536N40892j128621k364542j850726l87024O77652
$$ plain form
39414 -8920146 -951104 9904869 16592418 16739034 12550759 7978466 6398150 7885115
39406 7885115 8561457 5111784 -578857 -3728148 -2572118 706624 3685221 5146003
39398 5146003 3867256 -436491 -5194304 -7048294 -5800126 -3920076 -2770255 -1929796
39390 -1929796 -1504052 -2102805 -2853640 -2203638 -408675 1366580 3895272 8845319 14987598
39381 14987598 18381890 16788657 11647599 5521146 -177545 -4624448 -6835034 -6219570
39373 -6219570 -3067082 1238487 3990930 2823739 -983876 -2902488 -981602 994072
39365 994072 -825777 -3815123 -2263083 3934291 8720913 8049821 4264319 1611644
39357 1611644 1295333 2243443 3469979 4010871 2882250 517708 -1333018 -1720042 -1042390
39348a042390J295255J286851l21787k525962k149685R78002K298018n93600l103096
39339c878394l07682M696696M805411m90870m423330k649880J659704L385842
39331B797497J881978J48642K66074J305629Q00727k164729n117456m547077o77075
39322e305790K186711J355244p19251o20863R70491J162267m49994k028910k635982
39313f086077k169211Q0000L730447N725099L570532r33597l759954l228592n52640
39304c623993K202978K694729m77725m699298m666806K93220L919657J746116
39296b611122j950445r51099K994776L504953J51449j462476Q40449L103294K070779
39287E690558j064191l947485n080687k957397J774750M234459R95371l348726
$$ plain form
39348 -1042390 252865 1539716 1217929 -1308033 -3457718 -2479716 -181698 -775298 -3878394
39339 -3878394 -4186076 510620 5316031 4825161 401831 -2248049 -588345 2797497
39331 2797497 4679475 4828117 5094191 6399820 7200547 5035818 -81638 -4628715 -5305790
39322 -5305790 -3119079 -1763835 -2483086 -3103949 -2133458 -971191 -1421185 -3450095 -6086077
39313 -6086077 -8255288 -8175288 -4444841 1280258 4850790 3917193 157239 -3071353 -3623993
39304 -3623993 -1421015 1273714 795989 -3903309 -8570115 -8276895 -4357238 -2611122
39296 -2611122 -4561567 -5512666 -2517890 987063 1138512 -323964 516485 3619779 5690558
39287 5690558 4626367 678882 -4401805 -7359202 -5584452 -1349993 -354622 -3703348
39279c703348j867680L464101M060180j596892n252773j865955L150943L350646
39271b60778M84045m32470P84370J462014J460291J727305J183453p36500j704285
39262C967445k32829J440880J229099L86375P2693j109914l132971k736827P49632
39253F33583K537138l77384l712167k511196J179404K664789K365482L010831
39245E790480K874465j018984n583043n076590m19179K060529M23577j301234
39237b249979j031902j049599j975440j193690J351177K071596K39955k30268
39229d068150K404590M524805L149804K83524j107490j007689j91898J313899
39221E301395J777453j185722n102677l987748K043544M953098O68246l903045
$$ plain form
39279 -3703348 -5571028 -2106927 1953253 356361 -4896412 -6762367 -3611424 -260778
39271 -260778 223267 -209203 575167 2037181 3497472 5224777 6408230 5671730 3967445
39262 3967445 3734616 5175496 6404595 6790970 6863663 5753749 2620778 -116049 633583
39253 633583 3170721 2793337 -918830 -3430026 -2250622 414167 2779649 5790480
39245 5790480 8664945 7645961 2062918 -3013672 -3432851 -1372322 -948745 -2249979
39237 -2249979 -3281881 -4331480 -6306920 -7500610 -6149433 -4077837 -3837882 -4068150
39229 -4068150 -1663560 2861245 6011049 6294573 5187083 4179394 3987496 5301395
39221 5301395 7078848 5893126 790449 -3197299 -1153755 3799343 4467589 564544
39213E64544j652343L149509J986067l811930n439417p83745L303085K606811
39205g7419L88140m56790j489694k743130p85788L852705M923125M86448k463568
39196A634029J063674N182161K353987l984187m732089L53417K968615L6483k388106
39187B487984k99806K028184M76672j671144o671K948465J922036k220146l801163
39178A864411j180958J179327k19117l124048l244814J5984L305489L549512J134847
39169C280633q83568k38705K060959K993288J179136j581519k745135j990331
39161B074758r79714q90686j209126q88378L2430M37833k04631q02886j90918
39152b621318O78960j9031j381042k98349L095013M034524J11355l900117k781733
$$ plain form
39213 564544 -1087799 2061710 4047777 235847 -5203570 -5987315 -2684230 -77419
39205 -77419 310721 -146069 -1635763 -4378893 -5164681 -1311976 3611149 4097597 1634029
39196 1634029 2697703 7879864 10233851 6249664 1517575 1870992 4839607 4876090 2487984
39187 2487984 2188178 4216362 4693034 3021890 3015219 5963684 7885720 5665574 1864411
39178 1864411 683453 1862780 1643663 -1480385 -4725199 -4709215 -1403726 2145786 3280633
39169 3280633 2397065 2158360 4219319 7212607 8391743 6810224 4065089 2074758
39161 2074758 1095044 204358 -1004768 -1893146 -1860716 -1422883 -1627514 -2430400 -2621318
39152 -2621318 -1942358 -1961389 -3342431 -3640780 -545767 3488757 3600112 -300005 -3081738
39143c081738O22829r3048l847877l324884K688399O607671L855194o63847j521596
39134A241103o38535j287023j303083J402581K641744j377873n948988m205979
39126i476053K068696N659457M740786K608194k70188m980582p286324k111176
39118i047190N805368O172149j099560m938233k85604M367368J134876n261746
39110c152572o111395j549526K517741M328868N552253N075166J041910l634760
39102D067685m458574k164257o71744k18465J725315M276060L857753N78249j579299
39093E412723j101467o07447j518466j495451J274606M494099M403668M54759
39085A1317024l891062m582251j142863K534665K558324K408q42968P15559O52260
$$ plain form
39143 -3081738 -2458909 -2551957 -6399834 -9724718 -7036319 -428648 3426546 2762699 1241103
39134 1241103 602568 -684455 -1987538 -584957 2056787 678914 -5270074 -9476053
39126 -9476053 -7407357 -1747900 2992886 5601080 5330892 350310 -6936014 -9047190
39118 -9047190 -3241822 2930327 1830767 -3107466 -3393070 974298 2109174 -3152572
39110 -3152572 -9263967 -10813493 -8295752 -3966884 1585369 6660535 7702445 4067685
39102 4067685 -390889 -2555146 -3226890 -3445355 -1720040 2556020 6413773 6992022 5412723
39093 5412723 4311256 3703809 2185343 689892 1964498 6458597 10862265 11317024
39085 11317024 7425962 2843711 1700848 4235513 6793837 6796245 5953277 6668836 7321096
39076G321096k543720m235136q16010L655175L079364j406890l586054j814890
39068c47065l33003j327666j782980O65471L800392M547859K873224M30317j584138
39059F942411k136273q12477O22633r6401k098335k438225r35297l03363j057946
39050b313273n36051J828771K649536J38667k436255j671540Q03563J188318q51562
39041a199826k432150j706818N86140K535821K359457q7186k017986m38444K741675
39032C40683J980915l442169o622163k380434M646446O430426K886385N19489
39024D359578J676454K270994J48060j381693p5588J269608r790k270518l187804
39015B799301l047237j961707J336811M969297L497694l699534q690082n192809
$$ plain form
39076 7321096 4777376 542240 -273770 3381405 6460769 5053879 1467825 -347065
39068 -347065 -680068 -2007734 -3790714 -3125243 675149 5223008 8096232 8526549 6942411
39059 6942411 4806138 3993661 4616294 4519893 2421558 -16667 -951964 -1255327 -2313273
39050 -2313273 -2849324 -1020553 1628983 1767650 -668605 -2340145 -1536582 -348264 -1199826
39041 -1199826 -3631976 -5338794 -4752654 -2216833 142624 55438 -1962548 -2400992 340683
39032 340683 2321598 -1120571 -7742734 -10123168 -5476722 953704 3840089 4359578
39024 4359578 6036032 8307026 8455086 7073393 6997805 8267413 8257623 5987105 2799301
39015 2799301 -247936 -2209643 -872832 4096465 7594159 3894625 -4795457 -9988266
39007i988266J765586L045893j117937k696506Q36007L503254J694200l97707
38999c355476J052951L011896J407358j896334k526573l96906J045280m7835k639687
38990d345326m589591l667064O71431M976692M577546J82309k362813o73597R21809
38981d308604n58057j361604J854506N149032L531433o23926k073733j530244
38973G8803k576707l330047K48759N067623M231980j207324l297304k82409J082219
38964A5593j935868l119514J274637N231837K742782k448633l277797k8059J900563
38955C55541Q58942n56878j114239j640112j946468j297387l14431N97450K329596
38946b727986L999845K299339k841907n797194k633192K514204L178315k23856
$$ plain form
39007 -9988266 -8222680 -5176787 -6294724 -8991230 -8155223 -4651969 -2957769 -3355476
38999 -3355476 -2302525 709371 2116729 220395 -2306178 -2703084 -1657804 -1705639 -4345326
38990 -4345326 -8934917 -12601981 -11930550 -6953858 -2376312 -2194003 -4556816 -5230413 -4308604
38981 -4308604 -4866661 -6228265 -4373759 775273 4306706 3682780 1609047 78803
38973 78803 -2497904 -5827951 -5579192 -511569 3720411 2513087 -784217 -1066626 15593
38964 15593 -1920275 -5039789 -3765152 1466685 4209467 1760834 -1516963 -1545022 355541
38955 355541 1214483 657605 -456634 -2096746 -4043214 -5340601 -5655032 -5057582 -2727986
38946 -2727986 1271859 3571198 729291 -5067903 -7701095 -5186891 -2008576 -2232432
38938b232432j949016M41112L937447N140345L146403j254528n382639n293090
38930c446398m57242L948247L294301p2724r52122M95553J5114k769784l597627
38921c542682p56514K289398K310041J23352j864477k466614j452005N48939J578888
38912c231674L59119j482136j604151m47857J85654N97154J815835K291731J61916
38903a354409k237705q27917L476592N101883J416238l961227o137977l911336
38895h435858N96474M135152M057077Q46490j327773M36373L114143J651437l363311
38886A710204o212519l925331O58980L694387M007477J927426j314843k787824
38878b242043n97417K339314J323130l226390o080693m434772m95734L043185
$$ plain form
38938 -2232432 -4181448 -3740336 197111 5337456 8483859 7229331 1846692 -3446398
38930 -3446398 -3903640 44607 3338908 3266184 2314062 2809615 2824729 54945 -3542682
38921 -3542682 -4299196 -2009798 300243 423595 -1440882 -3907496 -5359501 -4810562 -3231674
38912 -3231674 -2872555 -4354691 -5958842 -6406699 -6221045 -5623891 -3808056 -1516325 -1354409
38903 -1354409 -3592114 -4420031 -943439 4158444 5574682 1613455 -4524522 -8435858
38895 -8435858 -7839384 -3704232 352845 1199335 -128438 307935 3422078 5073515 1710204
38886 1710204 -4502315 -8427646 -7768666 -4074279 -66802 1860624 545781 -2242043
38878 -2242043 -2839460 -500146 822984 -2403406 -8484099 -12918871 -13414605 -10371420
38870a0371420N369488N351119K063234j967500k838314q94850M41230R34648
38862a912365K767702M079719O71345n203312n831730J14700M713242K792765
38854B192066j035758j284939J21892m93822j499646k63933J225546N60002m53740
38845i32332j69153m61738j149538K009026Q112575P831768k814856j2840122
38837d14370j0232069N97408O172872L646091Q77818M85883k339112o891168n845882
38828a3942529Q74030L949440n291k804822Q20702M435459K105716r35870J801365
38819c701800O000672M053556j574236k665861J033891K516336o5541j393891
38811D203126O07168J267003k077577n193007l832707M2062K179439J947969J128817
$$ plain form
38870 -10371420 -5001932 349187 2412421 444921 -2393393 -3288243 -2847013 -1912365
38862 -1912365 855337 4935056 5606401 403089 -5428641 -5313941 -600699 2192066
38854 2192066 1156308 -128631 -6739 -500561 -2000207 -2264140 -1038594 -478592 -932332
38845 -932332 -1101485 -1563223 -2712761 -703735 7408840 15240608 12425752 -414370
38837 -414370 -10646439 -10049031 -3876159 -230068 647750 1133633 -1205479 -8096647 -13942529
38828 -13942529 -13068499 -9119059 -9124350 -11929172 -11108470 -6673011 -4567295 -5503165 -3701800
38819 -3701800 2298872 6352428 4778192 2112331 3146222 5662558 5597017 4203126
38811 4203126 4810294 6077297 3999720 -1193287 -5025994 -4983932 -2804493 -856524 272293
38802B72293J69752j008768r06457J478020L924863L451181P19581q27641N4938
38793G327762J058389K68880j183327j568968j382650j831948k157840r26500
38785c96202Q75789Q33224q45983j134886J160766L240127K300328n52842k313231
38776C167090k226552j804922j955979k143610j566338L28172L357703N410192
38768B565756L684739j102062m109832k519369J74850n65164l098793k262641
38760g232516K140533M820404L018444M766n27253P75402J363943M94615j089221
38751C769117k456236k471154r08641L06615k46841l84893K169818M289066J172271
38742E239122m721814n605800m49538K763251j60208k811373P06531N598325M465152
$$ plain form
38802 272293 442045 -566723 -1473180 4840 3929703 7380884 8100465 7272824 7327762
38793 7327762 8386151 8655031 7471704 5902736 4520086 2688138 530298 -396202
38785 -396202 479587 1312811 466828 -668058 492708 3732835 6033163 5480321 3167090
38776 3167090 940538 -864384 -2820363 -4963973 -6530311 -6202139 -2844436 2565756
38768 2565756 6250495 5148433 1038601 -1480768 -1305918 -1871082 -4969875 -7232516
38760 -7232516 -5091983 -271579 2746865 2751631 2224378 2999780 4363723 4858338 3769117
38751 3769117 1312881 -1158273 -2066914 -1760299 -2007140 -2392033 -222215 4066851 5239122
38742 5239122 517308 -5088492 -5538030 -2774779 -2934987 -5746360 -5039829 558496 5023648
38733E023648p23009k983822j716557r30301j22435L405194O055789K305283l995505
38724F318285l860598J548156K019025l755298m646659L671615R236869K235065
38716A2766460q373418q336321J02746L435717j098291l375733Q86135L745502
38708b47203J61348l207200o5047M686417L519740j623980l688323j917551r85237
38699c367036j807936j010278J614137K228761l133r71102J754886N019008M888339
38690H345646J935262n48810j275607j615159k656296l439982k237599Q63171
38682f29374L059146J604554k174601l629120r81583J641476J41065k898958j831806
38673e699201K992763N165944J712864k735437l177652p46338R27552J433248
$$ plain form
38733 5023648 4300639 1316817 -399740 -1330041 -1452476 1952718 8008507 10313790 6318285
38724 6318285 2457687 4005843 6024868 2269570 -2377089 1294526 10531395 12766460
38716 12766460 4393042 -3943279 -3840533 -404816 -1503107 -4878840 -3992705 -247203
38708 -247203 -85855 -3293055 -3358102 1328315 4848055 3224075 -464248 -2381799 -3367036
38699 -3367036 -5174972 -6185250 -4571113 -2342352 -2345485 -3316587 -1561701 3457307 8345646
38690 8345646 10280908 9732098 8456491 6841332 4185036 745054 -1492545 -629374
38682 -629374 2429772 4034326 1859725 -1769395 -2750978 -1109502 -968437 -3867395 -5699201
38673 -5699201 -2706438 2459506 4172370 1436933 -1740719 -2487057 -1559505 -126257
38665a26257J793249P01221k628696m508365j125744M463879N286242L70212l667587
38656E58154k135539J616550K044541o78731k121249m85046J710636J934817M45572
38647B889705j290945k522959k921259k164498q15306m23360j499475k023389
38639a0771486M56444N111362P918478O435024K895947P76319j80337k449963
38631A0191788n110380m132479P77582M190366K364393j373984k201762j075476
38623C630048j707738l229287j843771J653129K443853j36419j230490J388649
38615I67974L511921J261735l073238m906470l408717q92726R29344J590570J155704
38606b863903P67448J798197L449198L667618K673137K142303J057686k754055
$$ plain form
38665 -126257 1666992 2368213 -260483 -4768848 -5894592 -1430713 3855529 4225741 558154
38656 558154 -1577385 39165 2083706 1404975 -716274 -1201320 509316 2444133 2889705
38647 2889705 1598760 -924199 -3845458 -6009956 -6825262 -7248622 -8748097 -10771486
38639 -10771486 -10315042 -5203680 2714798 9149822 12045769 12822088 12641751 10191788
38631 10191788 5081408 948929 1726511 5916877 8281270 6907286 4705524 3630048
38623 3630048 1922310 -1306977 -3150748 -1497619 946234 809815 -420675 967974
38615 967974 4479895 5741630 2668392 -2238078 -5646795 -6539521 -5610177 -4019607 -2863903
38606 -2863903 -2096455 -298258 3150940 6818558 9491695 11633998 12691684 9937629
38598I937629o709277n345567N02158L418058Q47348q71252K101411M001778n2027
38589G830259m440398k283563K401017J708581k177097j171735L839150M188573
38581I894787j518563n062316k147954K155748L155114K113465K53827l446656
38573E397452o310284l217796L486243M731721j426898o178365l931755q3787
38565g533469k9689m61006K074380L496821O65845j157879K273699N232998J599208
38556F160908l791389l288997M45268J63561k499315q37567L539716L111053j913310
38547A089928l968542j314185J93874j428015j570974J265389K787303J430074
38539a515148P32600J644993P47442k303974l354684j158361J066710K115457
$$ plain form
38598 9937629 3228352 -2117215 -1615057 1803001 2650349 1779097 3880508 7882286 7830259
38589 7830259 3389861 1106298 3507315 5215896 3038799 1867064 5706214 9894787
38581 9894787 8376224 3313908 1165954 3321702 6476816 8590281 8844108 5397452
38573 5397452 -912832 -4130628 -644385 4087336 2660438 -3517927 -7449682 -7533469
38565 -7533469 -7563158 -8024164 -5949784 -2452963 -1787118 -2944997 -671298 4561700 6160908
38556 6160908 2369519 -919478 -474210 -310649 -2809964 -3647531 -107815 3003238 1089928
38547 1089928 -2878614 -4192799 -3998925 -5426940 -6997914 -5732525 -2945222 -1515148
38539 -1515148 -782548 862445 1609887 -694087 -4048771 -5207132 -4140422 -2024965
38531b024965L415018L403571l01166l659186q87242L950289J408379o648444
38523a343746p853096N66387O477890K705241j903307J042167N298282K521187
38515G511005k640827j882865J816626J137147j563824j43803K007071j840164
38507D400366p367223n189428K205492L902729q43116k052236K846496M885714
38499B788794l0194m218131k107945J062099J07060j193047J203181L048172l01119
38490C58870m446227k534186L451582N644580J746634l014327l830626r12937
38482c536637K990866N362358M452563L10997m386802o203958l745317J571245
38474c184685O402178P172509K878873l287881o715944n895281k841359P3615
$$ plain form
38531 -2024965 1390053 4793624 4492458 833272 -53970 3896319 5304698 -1343746
38523 -1343746 -9196842 -8630455 -2152565 552676 -1350631 -308464 4989818 7511005
38515 7511005 4870178 2987313 4803939 5941086 4377262 4233459 6240530 4400366
38507 4400366 -2966857 -8156285 -5950793 -2048064 -2891180 -4943416 -2096920 2788794
38499 2788794 2758600 -1459531 -3567476 -2505377 -2398317 -3591364 -2388183 659989 358870
38490 358870 -4087357 -6621543 -3169961 2474619 4221253 1206926 -2623700 -3536637
38482 -3536637 -545771 4816587 9269150 9580147 5193345 -1010613 -4755930 -3184685
38474 -3184685 3217493 10390002 13268875 9980994 3265050 -2630231 -5471590 -5397975
38466e397975J635310J384241L59439Q93101K847765K214221k748135o645376
38458e457409l623916L271542O036584L619256K211567L828807L169227k276817
38450A0778841p107284o408217k519738K49059J727979L066414L188249J574277
38442D549580j50894j898982n049911o931327k504267N647798P353001m24143
38434E90855p266311m163857L194380M135222q02932l050074m87118J502781P05937
38425e641117J22247O58695L35421j14950J437036K806035P15336j819176L95681
38416a104792M603827L320219k793768n203142j490859J176547j034202k453262
38408d979432J108809M592125K716773j112368j496116p0710q75294k155973k10515
$$ plain form
38466 -5397975 -3762665 -2378424 -2018985 -1125884 1721881 3936102 1187967 -5457409
38458 -5457409 -9081325 -5809783 226801 3846057 6057624 9886431 13055658 10778841
38450 10778841 3671557 -2736660 -5256398 -5007339 -3279360 -212946 2975303 4549580
38442 4549580 4398686 2499704 -2550207 -9481534 -11985801 -6338003 1014998 590855
38434 590855 -6675456 -10839313 -7644933 -3509711 -4312643 -7362717 -7849835 -6347054 -5641117
38425 -5641117 -5518870 -4860175 -4524754 -4639704 -3202668 -396633 318703 -1500473 -1104792
38416 -1104792 3499035 6819254 4025486 -1177656 -2668515 -1491968 -2526170 -4979432
38408 -4979432 -3870623 721502 3438275 2325907 829791 759081 -116213 -2272186 -2482701
38399b482701K743882K044021j041555j683112j17954o85955l452632l936023
38391h612029j033624J484940J904790K531962L655584K106088j968951l263534
38383c194774K67658K952100J01637l891372k387723K322402K396643k555708
38375c989137m372376N54511N315144L479436r86305q13534K789943L038089p20130
38366D295641k538028n07202N43153j464739j647738K865996O549134L437535
38358A1533752l422482o446574m160125j418752j072395j345591p59912k83848
38350g375927l43209j0234M57871j53451j165377p15720P87018J188024L30814
38341g000191R371N71598R54697J487291K867012L084696q8433l918513l259638
$$ plain form
38399 -2482701 261181 2305202 1263647 -419465 -537419 -1223374 -4676006 -8612029
38391 -8612029 -9645653 -8160713 -6255923 -3723961 -68377 2037711 68760 -3194774
38383 -3194774 -2927116 24984 126621 -3764751 -6152474 -3830072 -1433429 -3989137
38375 -3989137 -8361513 -7807002 -2491858 987578 1273 -812261 1977682 5015771 4295641
38366 4295641 1757613 1250411 1793564 328825 -1318913 1547083 8096217 11533752
38358 11533752 8111270 1664696 -2495429 -3914181 -4986576 -6332167 -7092079 -7375927
38350 -7375927 -7719136 -7729370 -7271499 -7424950 -8590327 -9306047 -8519029 -7331005 -7000191
38341 -7000191 -6990820 -6419222 -5464525 -3977234 -1110222 1974474 1886041 -2032472 -5292110
38332e292110J298554L464292P59277j849478l32986K133948J235354j058079
38324C58772k56890K825151L522159P92034j848944k116813j238293o53837m25430
38315I57909j073211l233312m870137k474897L496628P464287N238426l86127
38307E119566l132079j204406J126904J7360k758677k871400J72343K588053J967638
38298A025302K52090p1364J08228j222855l080012k756143k81360J547051J393681
38289c085382P47310R01579J270915J109754M98245o74790k318594k653405R7455
38280d106913M255077N931406M204537J862338M54028j543314m364953n010841
38272A681365k166117N88160l01230l063263l584120j378323Q61473J819384K122885
$$ plain form
38332 -5292110 -3993556 -529264 230013 -1619465 -1952451 181497 1416851 358772
38324 358772 101882 2927033 6449192 7241226 5392282 3275469 2037176 1383339 957909
38315 957909 -115302 -3348614 -8218751 -10693648 -7197020 267267 5505693 5119566
38307 5119566 1987487 783081 1909985 1927345 -831332 -3702732 -3530389 -942336 1025302
38298 1025302 1277392 1206028 1314256 91401 -2988611 -5744754 -6026114 -4479063 -3085382
38289 -3085382 -2338072 -1436493 -165578 944176 1442421 767631 -1550963 -4204368 -4106913
38280 -4106913 148164 6079570 10284107 12146445 12600473 11057159 6692206 1681365
38272 1681365 -484752 103408 -197822 -3261085 -6845205 -8223528 -7362055 -5542671 -3419786
38263c419786J706941J30684j233379n14281J535674K386959J262270m87735j790317
38254d22970k282721j282020J084944K616019J603637k69730m98574m1362j396808
38245h89585l308339j995437K117772L831145Q77457k357639j464730J553523
38237a635833K065134P8899o20126R39280J749066K63346j067250n5821J415341
38228C132036L5590l909156o179308l222804L616743Q657738O986253k37940o045733
38219B833419m748278J421063M909857K350379j629477j716436M80257o0657l074342
38210G65785l316342O54103L766327K290971p61815j189812p4204n21913j542008
38201G1092k87496J999358J785049l40130n92752J189122J307142r11726j637067
$$ plain form
38263 -3419786 -1712845 -1582161 -2815540 -3329821 -1794147 592812 1855082 1367347 -422970
38254 -422970 -2705691 -3987711 -2902767 -286748 1316889 1047159 548585 507223 -889585
38245 -889585 -4197924 -6193361 -4075589 -244444 633013 -1724626 -3189356 -1635833
38237 -1635833 429301 508200 -111926 827354 2576420 2839766 1772516 1716695 3132036
38228 3132036 3167626 -741530 -6920838 -10143642 -6526899 2130839 9117092 8879152 2833419
38219 2833419 -1914859 -493796 4416061 6766440 5136963 3420527 3900784 3840127 765785
38210 765785 -2550557 -1896454 1869873 4160844 3399029 2209217 2135013 1613100 71092
38201 71092 -216404 1782954 3568003 3227873 2635121 3824243 5131385 4219659 2582592
38192B582592P79805K889777J898008l20408j228733j410748j904991j719535
38184A565767n86134m63571j698880j439176J357300L152141J226951j793174
38176A321224k185949m21944J156216K268037K746224P23889l072597l563034
38168a027934J149529M946289K483503j632332j41200M143298K435441m941450
38160G415144q025664k612503L746223L913557N11888q99478l02715J682P20984
38151D469118K428775K224845j370651m442713l306881k74118N29720p31598j887627
38142b361130l062223m168470k356266K865531O105981L601919L52154K860325
38134C837821Q001535P148680l57708o284564n886144l081515k167124k025249
$$ plain form
38192 2582592 3362397 6252174 8150182 7829774 6601041 5190293 3285302 1565767
38184 1565767 979633 516062 -1182818 -2621994 -1264694 1887447 3114398 1321224
38176 1321224 -864725 -1286669 -130453 2137584 4883808 5607697 2535100 -1027934
38168 -1027934 121595 5067884 7551387 5919055 5777855 9921153 12356594 7415144
38160 7415144 -610520 -3223023 523200 4436757 4948645 4049167 3746452 3748134 4469118
38151 4469118 6897893 9122738 7752087 3309374 2493 -271625 258095 -473503 -2361130
38142 -2361130 -5423353 -9591823 -11948089 -9082558 -2976577 625342 977496 3837821
38134 3837821 11839356 18988036 18630328 12345764 6459620 3378105 1210981 -814268
38126h14268q96052j70205m20591O42839L248422L811618J096900r80534O6128
38117E584257J072438o40089k048374q5406K133749L92358l041015l079104k96024
38108g210P43142k85132K37487K156654J212390k923560m862575j609338L053216
38099b284926M481948K738765J44804k161426k996941r70008K051274J861050
38091B864540j196958j471964K602205M372465o41683o125991m112637J940349
38083a769674K491123k355746l174956K637652O209992J891046l672526k885845
38075f28934J106680J637495L09744K324010M936370J102365p331598j0516619
38067g060487n243827P69136J390838J20513J844464M363597L641648J451462
$$ plain form
38126 -814268 -1710320 -1880525 -2301116 -1658277 1590145 5401763 6498663 5518129 5584257
38117 5584257 6656695 6016606 3968232 3882826 6016575 6408933 3367918 288814 -7210
38108 -7210 735932 450800 688287 2844941 4057331 1133771 -3728804 -5338142 -2284926
38099 -2284926 2197022 4935787 5080591 2919165 -77776 -1047784 1003490 2864540
38091 2864540 1667582 195618 2797823 7170288 6528605 402614 -3710023 -1769674
38083 -1769674 721449 -1634297 -4809253 -2171601 4038391 5929437 2256911 -628934
38075 -628934 477746 2115241 2424985 4748995 9685365 10787730 3456132 -7060487
38067 -7060487 -12304314 -11535178 -10144340 -10023827 -8179363 -3815766 -174118 1277344
38059A277344J438772J925288o35909l902451k378141L171286N764718K309265
38051H970172k132958k096619Q32353J228945k255876n268730l365703K577188
38043a511228O950167N312880n31450m545131l842365j737633j915599k611609
38035d431968j13975M237129N452786K538112l47661p06408o64627j882448k319053
38026A761887l15352K103616K538468J563958N72479n17473j351804l80970J835258
38017G810067K218799L04863l84410J325377J526406j535997k970730P63026M579013
38008A3636414K289798k977002l898815j064827p91581l006775j621641L254650
38000E820221M261931k57474k841711J8248J697830k212384n032570j81906O616263
$$ plain form
38059 1277344 2716116 4641404 4005495 103044 -2275097 896189 6660907 8970172
38051 8970172 6837214 4740595 5572948 6801893 4546017 -722713 -4088416 -1511228
38043 -1511228 5438939 10751819 10220369 5675238 1832873 95240 -1820359 -4431968
38035 -4431968 -4545943 -308814 5143972 7682084 7334423 6628015 5963388 4080940 1761887
38026 1761887 1446535 3550151 6088619 7652577 8225056 7707583 6355779 5974809 7810067
38017 7810067 10028866 10333729 9949319 11274696 12801102 11265105 8294375 9057401 13636414
38008 13636414 15926212 12949210 9050395 7985568 7193987 4187212 2565571 5820221
38000 5820221 10082152 9824678 6982967 7001215 8699045 6486661 1454091 1272185 7888448
37991G888448N637363j612661n129768j502690K879487K819965M31044m39624
37983A0971564M43652J345190J233324r5827j684317j477409Q59985K545437J562649
37974A5704248k63308q00181j186965k522221k593799j57531J361640m76990j761243
37965G303650J449046N397224M447123J076245J672218N046109M473332k85829
37957C0579118k754623j126922j3840m06898J908965O483091P067179K876267
37949D4612337Q72214L569753M752790J444054k32339L568671P416154P386455
37941G3390089Q685487J4679608J8218889J3669130Q849287J3523235K2881587
37934A73897312K4894250J9185330J5700400J7510254J7891546J3687748R214001
$$ plain form
37991 7888448 13525811 11913150 6783382 5280692 8160179 10980144 11411188 10971564
37983 10971564 11415216 12760406 13993730 13897903 12213586 10736177 11596162 14141599 15704248
37974 15704248 15440940 14640759 13453794 10931573 8337774 8180243 9541883 9064893 7303650
37965 7303650 8752696 14149920 18597043 19673288 21345506 26391615 30864947 30579118
37957 30579118 27824495 26697573 26683733 26276835 28185800 34668891 41736070 44612337
37949 44612337 45484551 49054304 53807094 55251148 55018809 58587480 66003634 73390089
37941 73390089 82075576 96755184 114974073 128643203 137492490 151015725 173897312
37934 173897312 198791562 217976892 233677292 251187546 269079092 282766840 291980841
37927B91980841N878854q32310j1704707k0806345k4797191k6708972k8043540
37920A84966630k5580630j9124793j4404473j4401287j4827979j2185313r677066
37913G4765089j0609372j1880354r243904m454580k071073k588006l304319l255775
37905B7357706l195208k867957j834819j218615j834146k378700j756521j158786
37897A1112954j719459k285137j608245n81528k65155J03147J111802J444231
37889G312610L05874n40368N23912K051106J642952m16248j795067j370754q0066
37880G633951P15336M10249o61001j485881j458575j200416j276219p97790Q10755
37871B690409J624031k95755k885310k219202J461873L923290L374580K157681
$$ plain form
37927 291980841 297859695 297027385 285322678 264516333 239719142 213010170 184966630
37920 184966630 159386000 140261207 125856734 111455447 96627468 84442155 74765089
37913 74765089 64155717 52275363 43031459 38576879 36505806 33917800 30613481 27357706
37905 27357706 24162498 21294541 19459722 18241107 16406961 14028261 12271740 11112954
37897 11112954 9393495 7108358 5500113 4918585 4653430 4756577 5868379 7312610
37889 7312610 7618484 7078116 7602028 9653134 11296086 10879838 9084771 7714017 7633951
37880 7633951 8349287 8759536 8098535 6612654 5154079 3953663 2677444 1879654 2690409
37871 2690409 4314440 4018685 1133375 -1085827 376046 4299336 7673916 9831597
37863I831597J326625j068271m486165m483623j15710K682967k85501m258853
37855h56934k703081K082025K636053j390388k491887K583524P264841M758393
37847A1882546k091111m933239j083161L840017L768100q74069m927564m952020
37839F29499k201709J37165Q44332J024780J614705J990010J140100p47079k193051
37830B238752j609271J066330L519180K923882l18943k190340k51954K402107
37822G779743J339377k373823l569388q21782J782677J430282K15848J82036l87987
37813E576983k734932m076207k141637M65373P25843N58465K623835L913834P9503
37804D991060n562208m940003K344666P021083L197014l365944m454985j184330
$$ plain form
37863 9831597 11158222 10089951 5603786 1120163 1004453 3687420 3401919 -856934
37855 -856934 -3560015 -1477990 1158063 -232325 -2724212 -140688 7124153 11882546
37847 11882546 9791435 4858196 3775035 7615052 11383152 10509083 5581519 629499
37839 629499 -1572210 -1435045 -590713 434067 2048772 4038782 5178882 4431803 2238752
37830 2238752 629481 1695811 5214991 8138873 7819930 5629590 5377636 7779743
37822 7779743 9119120 6745297 3175909 2354127 4136804 5567086 5782934 5964970 5576983
37813 5576983 2842051 -1234156 -3375793 -2910420 -2184577 -1626112 997723 4911557 4991060
37804 4991060 -571148 -5511151 -3166485 3854598 7051612 3685668 -769317 -1953647
37796a953647k52130k267636j752756K138639L288647p39318l286112J015900
37788c808413O221939L063893n965475q588729m99667P723995N516269l148880
37780E14932o581043j748471L942685M767588K505705L11583j709431l151539
37772a147991j866969J552900K933697P73830j174015j70810J203563J82909j074371
37763A212743M45362K874464K301079r19925k938439k065483j0448J426753J725864
37754D051970P08010j012418j725987j158070j635513m030049m654621n8485O459474
37745c055689P699092K042623m040438m193781L62785L508378K235326m79570
37737D078726m79987J865263K203537j647817n903872n050486Q73616N859995
$$ plain form
37796 -1953647 -2205777 -4473413 -6226169 -4087530 -798883 -1538201 -4824313 -3808413
37788 -3808413 2413526 5477419 -488056 -9076785 -9576452 -1852457 3663812 514932
37780 514932 -6066111 -7814582 -3871897 895691 3401396 3712979 2003548 -1147991
37772 -1147991 -3014960 -1462060 1471637 2245467 1071452 900642 2104205 2287114 1212743
37763 1212743 1658105 4532569 6833648 5913723 2975284 909801 899353 2326106 4051970
37754 4051970 4759980 3747562 2021575 863505 -772008 -4802057 -9456678 -9515163 -3055689
37745 -3055689 4643403 6686026 2645588 -1548193 -1185408 2322970 4558296 4078726
37737 4078726 3598739 5464002 7667539 6019722 115850 -4934636 -4061020 1798975
37729A798975N126058J90149m052640m822710k779701j11850J179520P00175K79528
37720b492496J580872L104989K127020o12968j814577j234306j689001k884731
37712c915198j143409K946405L352420j501691m609666j259883K770861Q42512
37704b517649k908735n52129N502682N785943q34516n572196l591114M53144K075143
37695b159427K703552L252220R88497l310445l299820K793788P102409L144300
37687A1215074l922762m747687P73205M459938J836493l290216n383777l071044
37679b130776J425218M759807M324470N81393k683357k570101n03350N93915O76048
37670D473267J174389J083798j516180m801073m412961N0566L554074K257171
$$ plain form
37729 1798975 6925033 7115182 3062542 -1760168 -4539869 -4651719 -3472199 -2772024 -2492496
37720 -2492496 -911624 2193365 4320385 3707417 1892840 658534 -1030467 -3915198
37712 -3915198 -5058607 -2112202 1240218 -261473 -4871139 -6131022 -3360161 -2517649
37704 -2517649 -5426384 -5978513 -475831 5310112 4475596 -1096600 -4687714 -4234570 -2159427
37695 -2159427 544125 3796345 4784842 1474397 -1825423 968365 8070774 11215074
37687 11215074 7292312 2544625 3317830 7777768 9614261 6324045 940268 -2130776
37679 -2130776 -705558 4054249 8378719 8960112 6276755 3706654 3203304 3797219 4473267
37670 4473267 5647656 6731454 5215274 414201 -3998760 -3948194 -394120 1863051
37662A863051j278091j864201J103198L097181J012340k375698k193143J587298
37654I51935L723256Q36783l702302m324246q60488J827567J207903L3827J020351
37645G14586K397359J120163k214327m470734m291382k674000m56585K144923
37637g729997M133852M284109K959821J550467L52719j219909k610923k337766
37629f17627m92978P62228p1483j805485k043991j6727K658413L728027K520584
37620D620961N25004k87305K67256N30308n04021j606328j255900l57758j182766
37611G49451l545096m154619j031679L018604L487498J77159k317733o98131K833084
37602a481462M094129K734815J753754K021867Q27093l065567n980537l655356
$$ plain form
37662 1863051 584960 -1279241 -176043 2921138 3933478 1557780 -635363 951935
37654 951935 4675191 5511974 1809672 -2514574 -3375062 -1547495 -339592 -305765 714586
37645 714586 3111945 4232108 2017781 -2452953 -6744335 -9418335 -9874920 -7729997
37637 -7729997 -3596145 687964 3647785 5198252 5550971 4331062 1720139 -617627
37629 -617627 -1110605 -348377 -419860 -2225345 -4269336 -4286063 -1627650 2100377 4620961
37620 4620961 5145965 4858660 5125916 5656224 5152203 3545875 2289975 1932217 749451
37611 749451 -2795645 -6950264 -7981943 -4963339 -1475841 -1298682 -3616415 -4314546 -1481462
37602 -1481462 2612667 5347482 7101236 9123103 9950196 6884629 904092 -2751264
37594b751264K390351N809699K972955k783753n570648l962316j641024j521440
37586g057440j828461M34305L959193M281735M83938k780011j690384J403297
37578b793828J952026j2749r61270l5476M57010K6775N74128J748341P48999k121796
37568d17840k621161P72211L852988K832807m69760k215220j700131k84950J392430
37559A141374K517554J723596n8442L9567J562695L33343m164604o334165l073156
37550f312238O46488l91298l421381k980537K98994K500481L778563O005283O756211
37541F880566L043193j846080k595285m27407k38336j895244k002374j496111
37533e77078l059776l627342J136499O940099N698781r29395l655244p52405M81199
$$ plain form
37594 -2751264 -360913 5448786 8421741 5637988 67340 -3894976 -5536000 -7057440
37586 -7057440 -8885901 -8451596 -4492403 -210668 273270 -2506741 -4197125 -2793828
37578 -2793828 -841802 -854551 -1815821 -1851297 -1394287 -1367512 -793384 954957 1703956 -417840
37568 -417840 -3039001 -2266790 1586198 4419005 3949245 1734025 33894 -251056 1141374
37559 1141374 3658928 5382524 5324082 5363649 6926344 7259687 3095083 -3239082 -6312238
37550 -6312238 -5665750 -6057048 -9478429 -12458966 -12159972 -9659491 -5880928 124355 6880566
37541 6880566 9923759 8077679 5482394 5054987 4816651 2921407 919033 -577078
37533 -577078 -3636854 -7264196 -6127697 812402 6511183 5581788 1926544 1174139 1655338
37524A655338j934573j447829L368346M747197j8467k448185K486312O701562
37516A3109701K106990o050301q010695m149863j512184j515977l07360K569832
37508c759857M056426L483857K169810j67905l338567m378828k128415j92929
37500d256408p96377m44500L271758N847359K836774k212665l185575m22048J869127
37491B507445K774649K917301K21586n533228q280165l322923M240905O175791
37483A701361K694552n8691n08349j530916k851502j934358k95724j017221k051527
37474e852375K88385L520897K719220l37822k75246J807007N24522l193293l346722
37465d145427J62581J592504J62077Q58912L999289M053678K34621j637927J13059
$$ plain form
37524 1655338 -279235 -1727064 1641282 6388479 6370012 3921827 6408139 13109701
37516 13109701 15216691 9166390 1155695 -2994168 -4506352 -6022329 -6329689 -3759857
37508 -3759857 296569 3780426 5950236 5782331 2443764 -1935064 -4063479 -4256408
37500 -4256408 -5052785 -5497285 -2225527 3621832 6458606 4245941 1060366 638318 2507445
37491 2507445 5282094 8199395 8420981 2887753 -5392412 -8715335 -4474430 1701361
37483 1701361 4395913 4337222 3828873 2297957 -553545 -2487903 -2783627 -3800848 -5852375
37474 -5852375 -5563990 -2043093 676127 338305 63059 1870066 2394588 -798705 -4145427
37465 -4145427 -3982846 -2390342 -2228265 -1369353 2629936 6683614 6918235 5280308 5393367
37456E393367J17932l462797m949887j307041K584532K811417K160392K694053
37448F041968J017286l844472n753348q63700M963407M682546M24343j230976
37440E437054L38553Q60117p09142j527768m66939P61876Q76948j61055k134947
37431C274697l819666l308267j025983L13766K79699J495895M081792L987537
37423E279470l07354m087159l090805J20332N44131j829343l051912j197572K194451
37414e425761M577971L680086j221274o927328p882710k427939M859168Q505151
37406b262636P020242J895846m058701o556187l123522K145577K669549o60832
37398b930664n16467M208499N526960j06080m871420k399464J612540n5653l248797
$$ plain form
37456 5393367 5511299 2048502 -2901385 -4208426 -1623894 1187523 3347915 6041968
37448 6041968 7059254 3214782 -2538566 -3402266 1561141 6243687 6668030 5437054
37440 5437054 5775607 6635724 5926582 4398814 3931875 4693751 5570699 5409644 3274697
37431 3274697 -544969 -3853236 -4879219 -4565453 -4285754 -2789859 1291933 5279470
37423 5279470 4972116 884957 -2205848 -2085516 -1541385 -3370728 -6422640 -7620212 -5425761
37414 -5425761 -847790 2832296 1611022 -5316306 -13199016 -15626955 -10767787 -2262636
37406 -2262636 4757606 6653452 2594751 -3961436 -7084958 -4939381 -2269832 -2930664
37398 -2930664 -3447131 761368 6288328 6182248 1310828 -1088636 523904 468251 -2780546
37389b780546n43156M365978K567924l910010m699195J685561N674283K309404
37381D670243k355324k592950m80504R00774K525631M203293K624831j591488
37373G904506k595828J011666K688755j400888n600825m046768O6357R18084k25251
37364a280192Q17268K075389r33760n406234m086517K693457O298218K485685
37356B663314k632754k248512J718326L100918Q62638j164362j372279j798508
37348h71219k954523k180428J529090M791727M167926O98607k279986l719513
37340h18319m264149k881503J617655O053016M831087j921828o609882l628535
37332g622458K910255M863979Q87961l140106l097636p75114J040851K479395
$$ plain form
37389 -2780546 -3323702 1042276 3610200 -299810 -4999005 -3313444 2360839 4670243
37381 4670243 2314919 -278031 -758535 142239 2667870 6871163 9495994 7904506
37373 7904506 5308678 6320344 9009099 7608211 2007386 -2039382 -1973025 -1054941 -1280192
37364 -1280192 -462924 1612465 678705 -4727529 -8814046 -6120589 177629 2663314
37356 2663314 30560 -2217952 -499626 2601292 3463930 2299568 927289 -871219
37348 -871219 -3825742 -6006170 -4477080 314647 4482573 5181180 2901194 -818319
37340 -818319 -5082468 -7963971 -6346316 -293300 4537787 2615959 -3993923 -7622458
37332 -7622458 -4712203 151776 1039737 -2100369 -5198005 -5973119 -4932268 -2452873
37324b452873L854811L254692k74130l810138l805233q27884J420933R89565o05893
37315b256150j168504l24049J043694K297580L074202K612475L77428k405522
37307C251154l086891p00499K029783J747156o87670j110593J491799K796959
37299E731198l56245m475216m205953m26033J233125r39087k837455j883714q41301
37290i000681j994001k279801J809872P526269Q599514L541215k694688n199666
37282C08033l961841j740345L8486J793841L780794N108937M504101J561391k475735
37273H917662n186398m887971k324742K5523N20664j52604j92841J018349K192340
37264g0018J680003m51805k148085j477296R71215K301444M41660l094832m345628
$$ plain form
37324 -2452873 1401938 4656630 4382500 572362 -3232871 -4060755 -2639822 -1650257 -2256150
37315 -2256150 -3424654 -3748703 -2705009 -407429 2666773 5279248 5656676 3251154
37307 3251154 164263 -536236 1493547 3240703 2553033 1442440 2934239 5731198
37299 5731198 5374953 899737 -3306216 -3732249 -2499124 -3438211 -6275666 -8159380 -9000681
37290 -9000681 -10994682 -13274483 -11464611 -3938342 4661172 8202387 5507699 308033
37282 308033 -3653808 -5394153 -5355667 -3561826 218968 5327905 9832006 11393397 8917662
37273 8917662 3731264 -1156707 -3481449 -3455926 -2935262 -3087866 -3280707 -2262358 -70018
37264 -70018 1609985 1158180 -989905 -2467201 -1495986 805458 1247118 -1847714 -6193342
37255f193342j304287L291647M635038J507498k040612j791469J022643J517868
37247F44984j590691l666612p31323M324225N285851J055727l176175l210638
37239a064652n57940J260034J574609J402820L55336j882989k824783M5235M300612
37230B608282M469930m35711n065507m932856k009393p00551j284509q73609J052487
37221g171437K134976J482660P11750N65331P568q58993m41907R02727N33669
37212b133656j997761l449281j663127J293716K800543L291808L737277K866584
37204D746103J85764j320328M76070K378919L45530l515763l580477O41714L778353
37195D135885K550633m69765j818793j505713j179928j388033j820430j807088
$$ plain form
37255 -6193342 -7497629 -4205982 429056 1936554 -104058 -1895527 -872884 644984
37247 644984 -945707 -4612319 -5343642 -1019417 4266434 5322161 2145986 -1064652
37239 -1064652 -1622592 -362558 1212051 2614871 2970207 1087218 -1737565 -1692330 2608282
37230 2608282 7078212 6642501 1576994 -3355862 -5365255 -6065806 -7350315 -8223924 -7171437
37221 -7171437 -5036461 -3553801 -2842051 -2276720 -2269152 -3128145 -3570052 -2667325 -2133656
37212 -2133656 -4131417 -7580698 -9243825 -7950109 -5149566 -1857758 1879519 4746103
37204 4746103 4931867 3611539 4087609 6466528 6812058 3296295 -284182 357532 4135885
37195 4135885 6686518 6216753 4397960 2892247 1712319 324286 -1496144 -3303232
37187c303232l91909J799816J899112r20624k543420K15788L237326R11788l648430
37178b743785k512867L484599M902515q70974m834019j212846L225237J337603
37170G75463k297285l50322L814326K239302l299886m275803J22388K458613L7077
37161g76127j899215m64335Q66662J55572L44480K356868K522918k84645j835588
37152I86590N0525J632893J68576j282685O9698J317003p83646l422798j958486
37143c222330K421517M312764J727939k201829m199031l778950j690032J198469
37135e431483L151678K413755k28125j439871P77757L937484L423036j434474
37127E169757n217871k559800M219740O997196K209946m460720o004539k864468
$$ plain form
37187 -3303232 -3695141 -1895325 3787 -916837 -3460257 -3244469 -7143 904645 -2743785
37178 -2743785 -5256652 -1772053 3130462 2259488 -2574531 -3787377 -562140 775463
37170 775463 -1521822 -1872144 1942182 4181484 881598 -3394205 -3271817 -813204 -776127
37161 -776127 -2675342 -3139677 -2273015 -2117443 -1772963 583905 3106823 2822178 986590
37152 986590 1037115 2670008 2838584 1555899 1625597 2942600 2158954 -1263844 -3222330
37143 -3222330 -800813 3511951 5239890 3038061 -1160970 -4939920 -6629952 -5431483
37135 -5431483 -2279805 133950 -94175 -1534046 -756289 3181195 6604231 5169757
37127 5169757 -48114 -2607914 1611826 8609022 10818968 6358248 353709 -2510759
37119b510759j99435K43882N96526J371127Q36242r90754k319645k739328k362055
37110h074199L61188N117591O425346M28725o720308n300319L403356P754822
37102C396202K519925m016388l192571K097203L956319J270055j331426j598328
37094C100991p58851L16086J076143K9597k583178l662400j978246m96863r06668
37085e863389l13696K761286M127757Q24138k499258m85123L581216K688495k333531
37076B487895m169779q78183J692126J03816j512022R22359M559026M131891l05330
37067G031799l840669l281066n12121N04989j320973k952311j246838K459808
37059c157382L768273J255974j902743l261111m170079n372736l911331J591992
$$ plain form
37119 -2510759 -2710194 -2466312 -1869786 -498659 337583 -653171 -2972816 -5712144 -8074199
37110 -8074199 -7713011 -2595420 3829926 4258651 -2461657 -7761976 -4358620 3396202
37102 3396202 5916127 1899739 -1292832 804371 4760690 6030745 4699319 3100991
37094 3100991 2342140 2658226 3734369 3763966 1180788 -2481612 -4459858 -4956721 -5863389
37085 -5863389 -6177085 -3415799 711958 1536096 -963162 -1448285 2132931 4821426 2487895
37076 2487895 -1681884 -2560067 -867941 -764125 -2276147 -1353788 3205238 7337129 7031799
37067 7031799 3191130 -89936 -602057 -97068 -1418041 -4370352 -5617190 -3157382
37059 -3157382 610891 1866865 -35878 -3296989 -7467068 -12839804 -16751135 -15159143
37051a5159143O224429M517155j421490m688155k843412P74021L585721N899835
37043c111039O933173M532881k08673k851202j450021J147164J699437N5125k154467
37034D592378l264499k060861O00135J484308m97451j254079K522181O467849
37026H589961L913048l104225n849758k168867P19781j295273k904273J16595
37018a983011K616960q46716n479547l449529K844947M230836m31365k569621
37010e067046K153647P098443N246695m57578k524796j18952J146986j264970
37002F212429l329904j271898K565887L222676J28996k482493j620981R02209
36994D326921J715716K92828j547429k714146l100801j999679Q76195L238116
$$ plain form
37051 -15159143 -8934714 -4417559 -5839049 -10527204 -13370616 -12596595 -9010874 -3111039
37043 -3111039 3822134 8355015 8146342 5295140 3845119 4992283 6691720 6746845 4592378
37034 4592378 1327879 -732982 -132847 1351461 854010 -400069 2122112 8589961
37026 8589961 12503009 9398784 3549026 1380159 2099940 804667 -2099606 -1983011
37018 -1983011 633949 -212767 -5692314 -9141843 -6296896 -2066060 -2497425 -5067046
37010 -5067046 -2913399 4185044 9431739 8974161 6449365 6330413 7477399 6212429
37002 6212429 2882525 1610627 4176514 7399190 7528186 5045693 3424712 4326921
36994 4326921 6042637 6335465 4788036 2073890 -1026911 -3026590 -2150395 1087721
36986A087721K202522j209395k591365j83553K488838J676311j376962k559719
36978d65602n71469J961636K294200M42927j642561k473821k317583k291648k151878
36969g215799o9724L921670N711627J725281m669590n958658q47412L212321P34056
36960c456228l579525k252138L279085N107995J180203k218173q72462J432205
36952a379038J11996k701265k018822K179752N297099M481655J085324k185835
36944D870866l622367k640485o5191J907011J765244L87643m83646n79776o39995
36935H99304p73983q36212j309936k226063k402660j353693m29857k59586Q77489
36926g815197L557977M471191J012011l283716k829549J465944L399511J227261
$$ plain form
36986 1087721 3290243 2080848 -510517 -694070 1794768 3471079 2094117 -465602
36978 -465602 -1037071 924565 3218765 3661692 2019131 -454690 -2772273 -5063921 -7215799
36969 -7215799 -7285523 -3363853 2347774 4073055 -596535 -6555193 -7402605 -4190284 -3456228
36960 -3456228 -7035753 -9287891 -6008806 -900811 279392 -1938781 -2811243 -1379038
36952 -1379038 -1267042 -3968307 -5987129 -3807377 1489722 5971377 7056701 4870866
36944 4870866 1248499 -1391986 -1457177 449834 2215078 2602721 2119075 1539299 899304
36935 899304 125321 -710891 -2020827 -4246890 -6649550 -8003243 -8433100 -8692686 -7815197
36926 -7815197 -4257220 213971 1225982 -2057734 -4887283 -3421339 -21828 1205433
36918A205433j39595J912867L287092Q35040j982523j681761j117400l327632
36910a008479m316492L87895N943793M069583l222870n564949j38937M281012
36902D30556J651401k512674j412677K189730K097515n72323m71760K091099K117992
36893E608859j143495l290759k243858n41738j75N69676J565466J159801j071989
36884F11788k730397k085454k18345J203765J861050J881765J269169P55350J276719
36875C825410K278001K227985Q18836r00985k186263k794499k270180p70620L39375
36866E67060M39376P63367J660054R70661k036155l665614q39393K990224K130554
36857B980134k368994l837626l8472L827813L283527K16964j552276j501045r13354
$$ plain form
36918 1205433 1065838 2978705 6265797 7100837 5118314 3436553 2319153 -1008479
36910 -1008479 -5324971 -4937076 1006717 5076300 1853430 -3711519 -3850456 430556
36902 430556 2081957 -430717 -1843394 346336 2443851 1871528 1399768 3490867 5608859
36893 5608859 4465364 1174605 -1069253 -1610991 -1611166 -1041490 523976 1683777 611788
36884 611788 -2118609 -4204063 -4422408 -3218643 -1357593 524172 1793341 2548691 3825410
36875 3825410 6103411 8331396 9150232 8249247 6062984 3268485 998305 227685 567060
36866 567060 1006436 1769803 3429857 4400518 2364363 -1301251 -2140644 849580 2980134
36857 2980134 611140 -3226486 -3264958 562855 3846382 4063346 2511070 1010025 96671
36848I6671k92821l41218j687338k070876J777284P708633Q762198K831319l538150
36839A3245702m412347k119366j264157p32564K065539L636936r00956p971758
36831A547029q688028j579542N315486N886993K548505k01958k042854l662947
36823h77316l233050j75875J950024O13661j160009K29769K567020J458246j842597
36814d70127k057388J285150K620827q01401m189253k231831L109240N644093
36806B909310L348707l14082k218976k608142k341603j032396Q90664J362931
36798c587k86670j746969r90404P55737J222218N85411N02001R43302M33673j256785
36788A57927k839120l371642k492106K84349M144922N796602K805481k091504
$$ plain form
36848 96671 -196150 -537368 -2224706 -4295582 -2518298 5190335 13952533 16783852 13245702
36839 13245702 8833355 6713989 5449832 4717268 6782807 10419743 9518787 1547029
36831 1547029 -7140999 -8720541 -3405055 2481938 5030443 4828485 2785631 -877316
36823 -877316 -4110366 -4286241 -2336217 -1722556 -2882565 -2652796 -85776 1372470 -470127
36814 -470127 -2527515 -1242365 1378462 577061 -3612192 -5844023 -2734783 2909310
36806 2909310 6258017 5943935 3724959 1116817 -1224786 -2257182 -1366518 -3587
36798 -3587 -290257 -2037226 -3027630 -2271893 -1049675 -464264 37737 981039 1414712 157927
36788 157927 -2681193 -6052835 -8544941 -8260592 -4115670 1680932 4486413 2394909
36780B394909l318438L31619L963641L235574j67548j687071l51888N02273j699635
36771C203436n091494n389220j075252M130704M934696P49529l411047l407768
36763e356416j089579n73548j699694j066467J731671L515623K948059J924234
36755C33883J199126n90168k646893j770793J954654M070482K405027N9123m99985
36746D514456j087083k633856k047050J684772L801626J309518j165090P15757
36738E093050K486259j711536p436815n539775K576931N993048J060480l477383
36730i55741j036677L119557K051925j391060n78900L269218L564903n95861l448985
36721C998379j716444J572701K683612J589164r178j163871j259648j35562O78531
$$ plain form
36780 2394909 -923529 -591910 3371731 6607305 6439757 4752686 4400798 4903071 3203436
36771 3203436 -1888058 -7277278 -8352530 -4221826 712870 1462399 -1948648 -5356416
36763 -5356416 -6445995 -7019543 -8719237 -9785704 -8054033 -4538410 -1590351 333883
36755 333883 1533009 942841 -1704052 -3474845 -1520191 2550291 4955318 5014441 4514456
36746 4514456 3427373 793517 -1253533 431239 4232865 5542383 4377293 5093050
36738 5093050 7579309 5867773 -1569042 -7108817 -4531886 1461162 2521642 -955741
36730 -955741 -1992418 1127139 3179064 1788004 1209104 4478322 8043225 7447364 3998379
36721 3998379 2281935 3854636 6538248 8127412 8118234 6954363 5694715 5559153 6237684
36712F237684n50849k635890k538739j05297J203784m88551k356109j055604K078661
36703b10910K876679M58538j526591j92126K694003L538164J697298o80239k324587
36694F330229l584354l830645j439439K519788L683740o0433m612329m387036
36686e380479J69267L197983J339757k349249l141934m35958K593525L112672
36678h94416R61225j803922k663203r88744Q84837K78017j967930k214592Q77969
36669g530759M329062M990318L307344J314753o52016k731901l059167L3954M078830
36660D080418M257650l36820n017151n174787j556651J427021J085016j384003
36652b619307l141708k572800j06758K663238M313908M320063K737595j55413
$$ plain form
36712 6237684 5686835 3050945 512206 406909 1610693 1122142 -1233967 -2289571 -210910
36703 -210910 2665769 3124307 1597716 1405590 4099593 7637757 9335055 8654816 6330229
36694 6330229 2745875 -1084770 -2524209 -4421 3679319 3618886 -993443 -5380479
36686 -5380479 -5211212 -2013229 -673472 -3022721 -6164655 -6600613 -4007088 -894416
36678 -894416 66809 -1737113 -4400316 -5389060 -4504223 -4226206 -6194136 -8408728 -7530759
36669 -7530759 -3201697 1788621 5095965 6410718 5758702 3026801 -32366 1588 4080418
36660 4080418 8338068 8001248 2984097 -2190690 -3747341 -2320320 -1235304 -2619307
36652 -2619307 -5761015 -8333815 -8440573 -5777335 -1463427 2856636 5594231 5438818
36644E438818l156628l883375j223982J890639R16374l711353n374442K60202
36636h843747P937495Q727660K329191k504884r87629R28628l137440q880303
36628d431029p533500K16335M964971K685777l85330J151125L791730K383653
36620B843732r56603j041149J444792J473708j902278m328493k805752Q32115
36612d439928L113698K480016j20832j935247o29362K346425K536996j271272
36604B080494m369389k615968J552581L404301K856797K308920R00976k767535
36596C351177m830714p18471N570128M982257l131217r019957o044129J064374
36588h776552M385985K744337j67028j982220k019973N5905K417504J884695p60904
$$ plain form
36644 5438818 2282190 -1601185 -2825167 -934528 -18154 -3729507 -9103949 -8843747
36636 -8843747 -906252 7821408 10150599 7645715 6658086 7586714 4449274 -4431029
36628 -4431029 -11964529 -11748194 -6783223 -4097446 -4482776 -3331651 460079 2843732
36620 2843732 1887129 845980 2290772 3764480 1862202 -2466291 -5272043 -4439928
36612 -4439928 -1326230 1153786 1032954 -902293 -1531655 814770 3351766 2080494
36604 2080494 -2288895 -4904863 -3352282 52019 2908816 5217736 6118712 3351177
36596 3351177 -1479537 -2198008 3372120 8354377 5223160 -3796797 -9840926 -8776552
36588 -8776552 -4390567 -1646230 -1813258 -3795478 -5815451 -5759546 -3342042 -1457347 -2218251
36579b218251p52017K862743M714998J636122k006926j708509J7047r31941k747432
36570a134166j715900N10596K02801j190744J51765K732502J641446l045080n854979
36561g701759l427326K327166P528813Q658031L726225m273091p765963l622009
36553d549913J469811P24574j713632K077111Q984859Q287997o72806o215932
36545H392069k278563K700259J8337o123748o987774l058142q74234j323007k1335
36536i556138L183359L430888n54280l656059j495072L913508P102584N335323
36528G704113Q94575j761599r58441L06699j236157l672649k285162K579122M876741
36519F447242J739698k229819k594025j817814l756643n953216l612766J594720
$$ plain form
36579 -2218251 -2970268 -107525 4607473 6243595 4236669 2528160 2545207 1613266 -1134166
36570 -1134166 -2850066 -2339470 -2136669 -3327413 -3175648 -443146 1198300 -1846780 -7701759
36561 -7701759 -11129085 -8801919 -1273106 7384925 11111150 6838059 -927904 -4549913
36553 -4549913 -3080102 -2355528 -4069160 -1992049 6992810 15280807 14608001 8392069
36545 8392069 6113506 8813765 8832102 2708354 -4279420 -7337562 -8211796 -9534803 -9556138
36536 -9556138 -6372779 -2941891 -3496171 -7152230 -8647302 -4733794 2368790 7704113
36528 7704113 8598688 6837089 5878648 6185347 4949190 1276541 -1008621 1570501 6447242
36519 6447242 8186940 5957121 3363096 1545282 -2211361 -8164577 -11777343 -10182623
36511a0182623L439109P99416r47426J390982M349510L577604k21806l204810
36503a000044l369902j740692k76813P1608j7575P14058K066456K351514J130201
36494g1189J48959J87921n57417k674771k919080J023929N446327M826949j08169
36485E303459l261059j653530J632944L107664K721466J280541j308474l556112
36477D266899k395324J908905M303021J284307l792267m791456p49179L133123
36469C168029K177436k270778m810954k636967J030502J178603k013759l121645
36461g299533O19258M699603L581764j255792l844775k452999o19054k09808Q52020
36452e929316L227020L988107J715045p35981p52454M68948Q09747J98304r34582
$$ plain form
36511 -10182623 -6743514 -5944098 -6891524 -5500542 -1151032 2426572 2204766 -1000044
36503 -1000044 -4369946 -6110638 -6387451 -6315843 -6333418 -5619360 -3552904 -1201390 -71189
36494 -71189 77770 265691 -291726 -2966497 -5885577 -4861648 584679 5411628 5303459
36485 5303459 2042400 388870 2021814 5129478 7850944 9131485 7823011 4266899
36477 4266899 1871575 3780480 8083501 9367808 5575541 784085 34906 3168029
36469 3168029 5345465 3074687 -1736267 -4373234 -3342732 -2164129 -4177888 -7299533
36461 -7299533 -6680275 -1980672 1601092 345300 -3499475 -5952474 -6571528 -6781336 -5929316
36452 -5929316 -2702296 1285811 3000856 2264875 1512421 1981369 2791116 2989420 2054838
36443B054838k561883l059283m40840L004304K311553j904213k666071K528467
36435g33128O362938K461198m225344m841491r2071K006900p36077k766893j406037
36426c970005l37646j102870K00245M336947M886076j795536q594343o510584
36418a2887716K130480O692485L089017j755180j337317J451434O74067k368027
36410d310757j408815L942822O382264J602377m791712n089844l54108J981741
36402b046032n85885l082527j891782L88956R74971J685262L980126M421677K04973
36393D049739m606506m172946K33549K328941L86853j271758l1172J592241J145738
36384c45321j40991m79770l28701n50368q98142j395032k374987k597264l52028
$$ plain form
36443 2054838 -507045 -3566328 -4007168 -1002864 1308689 -595524 -3261595 -733128
36435 -733128 5629810 8091008 3865664 -975827 -1067898 939002 202925 -2563968 -3970005
36426 -3970005 -4307651 -5410521 -5210276 -873329 4012747 2217211 -6377132 -12887716
36418 -12887716 -10757236 -4064751 -975734 -2730914 -4068231 -2616797 -1942730 -4310757
36410 -4310757 -5719572 -1776750 4605514 6207891 1416179 -3673665 -4027773 -2046032
36402 -2046032 -2631917 -5714444 -7606226 -7217270 -6242299 -4557037 -576911 3844766 4049739
36393 4049739 -556767 -4729713 -4496164 -2167223 -1780370 -3052128 -3083300 -1491059 -345321
36384 -345321 -486312 -966082 -1294783 -1845151 -2743293 -4138325 -6513312 -9110576 -9462604
36375i462604L146877M631794L310879J246829o43372k870531l646617m4032N891178
36366A560401P473090K243547m140700n726468l608670k124419j857676p23483
36358f904378J057595J617870J192491J299313J649562J217689P88572J209767
36350C128481Q78763j558023l757822k823661m28252m48855k350413j684927K601923
36341f442786N972071M703972O86485k014164k267805j387405k4244J736691K568055
36332C530870R73139j938080k919313n92175K350391K186149j064615l451524
36324i25158k206246N08258O71675j702353k431030P05075M469359M490752J076221
36315D656553j608392j150846O63083Q90459j037671l359513m301674l486788
$$ plain form
36375 -9462604 -6315727 -1683933 1626946 2873775 2230403 -640128 -4286745 -4330777 1560401
36366 1560401 9033491 11277038 7136338 1409870 -2198800 -4323219 -6180895 -6904378
36358 -6904378 -5846783 -4228913 -3036422 -1737109 -87547 1130142 1918714 3128481
36350 3128481 4007244 2449221 -1308601 -4132262 -4560514 -5009369 -7359782 -9044709 -6442786
36341 -6442786 -470715 4233257 4919742 2905578 637773 -749632 -773876 962815 3530870
36332 3530870 4504009 2565929 -353384 -945559 1404832 3590981 2526366 -925158
36324 -925158 -3131404 -2623146 -1951471 -3653824 -6084854 -5379779 -910420 3580332 4656553
36315 4656553 3048161 1897315 2560398 3450857 2413186 -946327 -5248001 -8734789
36307h734789j432611J439878M624253O613397N553249J682709k064090l238622
36299D443374k526001j640373k87703K050499K980861K8830m049596l792349N41104
36290b251354K458016r27977m041905j424330L648857M240098J99092k269152
36282c68655j09099L055279L136920P83272r31317q54647j43728L2323j61101
36273D439247J39655Q24618K60847k404560m740023l266047J307221M021271K143037
36264B725266j306235k287734r44662K35856N19130N03394K09416J30065J501524
36255A286020L236089K014087j907107l238479K96287L162177L86243l854839
36247A380478k786478J564339J801220k110069k746336K023285N297835K424029
$$ plain form
36307 -8734789 -10167400 -8727522 -4103269 2510128 8063377 9746086 7681996 4443374
36299 4443374 1917373 277000 -10703 2039796 5020657 5049487 999891 -2792458 -2251354
36290 -2251354 206662 -721315 -4763220 -6187550 -2538693 1701405 1900497 -368655
36282 -368655 -477754 2577525 5714445 6497717 5566400 4711753 4568025 4600348 4439247
36273 4439247 4578902 5403520 5664367 3259807 -1480216 -4746263 -3439042 582229 2725266
36264 2725266 1419031 -868703 -1813365 -1577509 -1058379 -554985 -345569 -215504 1286020
36255 1286020 4522109 6536196 4629089 1390610 1686897 4849074 5235317 1380478
36247 1380478 -1406000 158339 1959559 -150510 -2896846 -873561 4424274 6848303
36239F848303k028680k349417j29669J24693j173392n93336J576259J618582j586964
36230B306379m745520m587841j769105L93624J10717r08768k23909J386585R84823
36221g053015j323044j761081Q65043K440227L19095j506028J003182M113361
36213b902260J810633l597273m239454R39743M689912K940189m7512N3169J291958
36204I39105L92938j658397k228860r92257J129523L312340L760749J190584j892797
36195C952928j717504O81521Q56916j575554k668946j494343j093353j494054
36187d552389P82080M822128M809295j93297l709914k066661N53078N55572M57556
36178A457448J976499J643855j916879m034603k279163r17923k033979q51289
$$ plain form
36239 6848303 4819623 2470206 2340537 2465230 1291838 698502 2274761 3893343 2306379
36230 2306379 -2439141 -7026982 -8796087 -8402463 -8291746 -9200514 -9424423 -8037838 -7053015
36221 -7053015 -8376059 -10137140 -9272097 -6831870 -6512775 -8018803 -7015621 -2902260
36213 -2902260 -1091627 -4688900 -8928354 -7988611 -3298699 -358510 -406022 -352853 939105
36204 939105 1332043 -326354 -2555214 -3547471 -2417948 894392 4655141 5845725 3952928
36195 3952928 2235424 2916945 3773861 2198307 -470639 -1964982 -3058335 -4552389
36187 -4552389 -3770309 1051819 5861114 5667817 1957903 -108758 444320 999892 1457448
36178 1457448 3433947 5077802 3160923 -873680 -3152843 -4070766 -6104745 -6956034
36170f956034M019478N118639j132039n600856l56107P067532N165493k772573
36162D553533m786290j44030J352099k479785l464503J180812M187708J848636
36154B248180l4425K237568L471837n29143n164619m639230n43563K140003K162167
36145A348775J085262j8666J49310K537540M257859R31095n401484o801583q18521
36136b730413M877172L314390k034975l440032k14099K024436M78487k160965
36128A14001k921974j733659K23366J803348J703262k49241j791597n65717K331748
36119a086463L313848J095837j433179j081020J326052K248227O87810k29347
36111D841765J832936M183751K657801j945650m824694m161258k709643k104998
$$ plain form
36170 -6956034 -2936556 2182083 1050044 -4550812 -4906919 2160613 7326106 4553533
36162 4553533 -232757 -376787 975312 -1504473 -4968976 -3788164 399544 2248180
36154 2248180 2213755 4451323 7923160 7394017 2229398 -2409832 -2953395 -813392 1348775
36145 1348775 2434037 2415371 2564681 5102221 9360080 10291175 4889691 -1911892 -2730413
36136 -2730413 2146759 5461149 3426174 -13858 -227957 1796479 2274966 114001
36128 114001 -2807973 -4541632 -4318266 -2514918 -811656 -1060897 -2852494 -3418211 -1086463
36119 -1086463 2227385 3323222 1890043 809023 2135075 4383302 5071112 4841765
36111 4841765 6674701 10858452 13516253 11570603 6745909 2584651 -124992 -2229990
36103b229990p28816J483293J718204J4342M45419L538746L866279o31694l682375
36094C793408p22744K805853N32105l648956k416106J955959J664335k842011
36086A121843l922757n5621K392099N04315j737716j717763j013121K45602L189611
36077i93508M602556O24722m332040k466617L714132L936182k659019n396513
36069b970105l59M273021O15341m456430l344122L54429K50389j345456N12488
36060f110804L293404K172228n69221r8878J880970Q88963j689353j675960l08942
36051b217593j690830m655613m260852K76358M846641O106801L650089j095179
36043I59822m653140l509286O05270J860954m43863j03813M701572O266405j20808
$$ plain form
36103 -2229990 -2958806 -1475513 242691 257033 702452 4241198 8107477 7475783 3793408
36094 3793408 3070664 5876517 6408622 2759666 343560 2299519 3963854 1121843
36086 1121843 -2800914 -2856535 -464436 39879 -1697837 -3415600 -4428721 -4183119 -993508
36077 -993508 3609048 4233770 -98270 -2564887 1149245 5085427 2426408 -2970105
36069 -2970105 -2970464 1302557 1917898 -2538532 -5882654 -5528225 -5277836 -6623292 -6110804
36060 -6110804 -2817400 -645172 -1214393 -1313271 567699 1456662 -232691 -1908651 -2217593
36051 -2217593 -3908423 -8564036 -12824888 -12548530 -7701889 -1595088 2055001 959822
36043 959822 -3693318 -7202604 -6597334 -4736380 -5180243 -5284056 -582484 5683921 5563113
36034E563113o367900l156900M938011O182988o62328o042483m735068j104925
36026e385492K03755k38446r19071j611893q60189K402327M896017K665647k036132
36017h83477l621420j803650q44945j346465o2343K555130K277682p59938j156159
36008e645585K842147N993825L963116p73135l391764k843540j189737m6733L29846
35999g61560M27445R34161J698080J797704J614010K621012L576296N87855o115893
35990F379110r752218n679906J475508M477207L273815K297391J972303q9715
35982D353495k643597k914591k436296l506446k920781K586462P775090N306707
35974E600043j570582l219204Q19045J860119k220774l533843J222550M528248
$$ plain form
36034 5563113 -804787 -3961687 976324 7159312 6496984 454501 -4280567 -5385492
36026 -5385492 -5181737 -5420183 -6339254 -7951147 -8811336 -6409009 -1512992 1152655 -883477
36017 -883477 -4504897 -6308547 -7153492 -8499957 -8562300 -6007170 -3729488 -4489426 -5645585
36008 -5645585 -2803438 3190387 7153503 6380368 2988604 145064 -1044673 -1091406 -761560
35999 -761560 -334115 600046 2298126 4095830 5709840 8330852 11907148 12495003 6379110
35990 6379110 -3373108 -9053014 -7577506 -3100299 173516 2470907 4443210 4353495
35982 4353495 1709898 -1204693 -3640989 -7147435 -10068216 -7481754 293336 5600043
35974 5600043 4029461 810257 1629302 3489421 1268647 -2265196 -1042646 3485602
35966C485602Q78621m460127m987441k444800j080410k45256J454263J504483
35958e895065j221309k621748k56137J789073K56722j014842J872084N105160
35950a986062L159998j794885l428909j133553K70996j106749k172481n86114
35942h777759K085163L098034J612351p95456j430620N98113K520509J361130
35934B71465j053790n15786K225584J977997k120359m549363k221776R86692J483626
35925c515710J364918K755899K995940K26800j913111n15872Q11310j842498n230737
35916d863061l898308R71880L741337K632787L88324r88375j220896J65808K366041
35907g04463K434093k37658j840603l18542O37100j796376l870667j742909J354013
$$ plain form
35966 3485602 4364223 -95904 -5083345 -7528145 -8608555 -8853811 -7399548 -5895065
35958 -5895065 -7116374 -9738122 -9994259 -8205186 -7948464 -8963306 -7091222 -1986062
35950 -1986062 1173936 -620949 -4049858 -5183411 -4912415 -6019164 -8191645 -8777759
35942 -8777759 -6692596 -3594562 -1982211 -2777667 -4208287 -3610174 -1089665 271465
35934 271465 -782325 -1298111 927473 2905470 785111 -3764252 -5986028 -4999336 -3515710
35925 -3515710 -2150792 605107 3601047 3827847 1914736 1398864 2210174 367676 -4863061
35916 -4863061 -8761369 -7789489 -4048152 -1415365 -1027041 -2015416 -3236312 -3070504 -704463
35907 -704463 1729630 1491972 -348631 -667173 -30073 -1826449 -5697116 -7440025 -6086012
35898f086012J092281L33292L459890O706697L564374k990566l910740J316986
35890C486202L818189k65928m520070l658697j017480j034701k112472j363507
35882f668464m3215K24921J224347L819831M715793J931013q76490j86509J255592
35873E396819o56448l525716j670038M069297N976537N5031p794373q846411k182487
35864i177789M699904N107754K89813l421685k605083K96014J472468N46101j99542
35855b992045N40392J891302K257493Q02392j654438k670102o72411K102645J630151
35846A235379j951924l602669n89857K997447K153303j664508l203864j234822
35838e861515R49958J526118J827898K366924J583200r29018l368458m303249
$$ plain form
35898 -6086012 -4993731 -4660439 -1200549 5506148 9070522 6079956 2169216 3486202
35890 3486202 7304391 7038463 2518393 -1140304 -2157784 -3192485 -5304957 -6668464
35882 -6668464 -6711679 -6486758 -5262411 -1442580 3273213 5204226 4327736 4141227 5396819
35873 5396819 4740371 1214655 -455383 3613914 9590451 9645482 1851109 -6995302 -9177789
35864 -9177789 -4477885 629869 919682 -2502003 -5107086 -4811072 -3338604 -2792503 -2992045
35855 -2992045 -2451653 -560351 1697142 2499534 845096 -1825006 -2497417 -394772 1235379
35846 1235379 -716545 -4319214 -4909071 -1911624 241679 -1422829 -4626693 -5861515
35838 -5861515 -4911557 -3385439 -1557541 809383 2392583 1463565 -1904893 -6208142
35830f208142l628960j292757K111195M132271K987552O38513J41036Q55827j723
35821b65188j959319j849604M92929J708936N29301n09910R8982M53812q51605
35812b151666k019056r68007J694200L864614L929571J150179l445018o409924
35804d355107m860216k47143L354425M198175L247022R17203k408017l681230
35796c834888k59045M498446M367880l94048k832534J17140L071395J016099l100043
35787B650402l593245l65572K302775K028391m09075l366074m615059j967428
35779g334885L249982N847919K931260j922139l460304j404925N41962K08192
35771a342938j353483k095477p98961J814710K779458J14754l181581k214470
$$ plain form
35830 -6208142 -9837102 -11129859 -9018664 -4886393 -1898841 -1260328 -1119292 -263465 -265188
35821 -265188 -2224507 -4074111 -3581182 -1872246 -1342945 -1852855 -1753873 -1300061 -2151666
35812 -2151666 -4170722 -5138729 -3444529 420085 4349656 5499835 2054817 -4355107
35804 -4355107 -9215323 -9462466 -6108041 -1909866 1337156 2254359 -153658 -3834888
35796 -3834888 -4093933 404513 4772393 4378345 1545811 1662951 4734346 5750445 2650402
35787 2650402 -942843 -1308415 994360 3022751 2613676 -752398 -5367457 -7334885
35779 -7334885 -4084903 1763016 4694276 2772137 -688167 -2093092 -1551130 -1342938
35771 -1342938 -2696421 -4791898 -5590859 -3776149 -996691 -881937 -4063518 -6277988
35763f277988K022255L206049k99263k456963J06532J966358j285625m001156
35755g019801N96909P694921P015264j076212n972837k928294J339703P67553
35747D17206j662084j152527J029207J476700O11495K41988k90408j566958j710343
35738b605724j07279M00211j516447k580318n07836J549385O10680l10042K393684
35729b673686N316094K779017k997370m229460K02970K797154n85121m304465
35721c694867k303950K473718L516496J037922L35388K358928K762416m4959k316549
35712D124543j645963n84425j212570j025374K214740N358702M003794o85446
35704A0548001l776173l674030k858438k329648l40063K823394L667120R74914
$$ plain form
35763 -6277988 -4255733 -1049684 -1348947 -3805910 -3699378 -1733020 -3018645 -7019801
35755 -7019801 -6422892 1272029 8287293 7211081 1238244 -1690050 -350347 417206
35747 417206 -1244878 -2397405 -1368198 108502 719997 961985 671577 -895381 -2605724
35738 -2605724 -2713003 -2312792 -3829239 -6409557 -6917393 -5368008 -4757328 -5067370 -2673686
35729 -2673686 2642408 5421425 2424055 -1805405 -1602435 1194719 609598 -3694867
35721 -3694867 -5998817 -3525099 -8603 1029319 1364707 3723635 6486051 6441092 4124543
35712 4124543 2478580 1894155 681585 -343789 1870951 7229653 11233447 10548001
35704 10548001 6771828 3097798 239360 -2090288 -2430351 393043 4060163 5035077
35696E035077j548028p29513J147266M3556l431122m869786k424371R46442J837828
35687c992651N67312m4026J207756K348248J045908j764875k634368n82150P92378
35678c056468j468223m166500j757600M740912P659522L020681l682098m925682
35670c635456o09784L432842L405209K34615l443959n179323l259280J089044
35662g966092L537004J885525m24245N22798K774779J832510j605915k627417
35654b071053m8473K116470J312192n31623j295448j286986p66658N99639J027570
35645i44370j860142n722226m849373J336200O180829M780353M08519j150136
35637a820346N06604J835979J306033J21078o32136m62510Q26486J710571q6328
$$ plain form
35696 5035077 3487049 2757536 3904802 3948358 517236 -4352550 -6776921 -5830479 -3992651
35687 -3992651 -3425339 -3469365 -2261609 86639 1132547 -632328 -3266696 -3848846 -3056468
35678 -3056468 -4524691 -8691191 -10448791 -5707879 1951643 4972324 1290226 -3635456
35670 -3635456 -4245240 -812398 2592811 2827426 -616533 -5795856 -9055136 -7966092
35662 -7966092 -4429088 -2543563 -2967808 -2445010 329769 2162279 556364 -2071053
35654 -2071053 -2119526 -3056 1309136 777513 -517935 -1804921 -2571579 -1971940 -944370
35645 -944370 -2804512 -8526738 -13376111 -12039911 -5859082 -1078729 -670210 -1820346
35637 -1820346 -1313742 522237 1828270 1949348 1317212 854702 1681188 3391759 3305431
35628C305431l235353l003311J701048N579558M479511J289890J58662n70585
35620I704851l962406o986517m554424J197299L141718l1682k426121p00190J656531
35611b960941J228022l94271q68002j010964j808091j853980l87089P43722L90826
35602f920768Q3874Q46963J420856J344229K137247L564889K704876q54030k863046
35593A465090n19361K875637K854814K04722j435230j693241k780926m410259
35585c438754l890500q44941J857172K052416N62195n18029O1506J936042L082660
35576H59767J521949j667750k741492l26504K142717J346859r44807j037393O06634
35567b40020N27697j574559k237984O4179K509621K168603l20860k438465k896731
$$ plain form
35628 3305431 70078 -2933233 -1232185 4347373 8826884 10116774 10275436 9704851
35620 9704851 5742445 -1244072 -5798496 -4601197 -1459479 -1491161 -3917282 -4617472 -2960941
35611 -2960941 -1732919 -2127190 -2995192 -4006156 -5814247 -7668227 -8055316 -7311594 -6920768
35602 -6920768 -6836894 -5989931 -4569075 -3224846 -1087599 2477290 5182166 4328136 1465090
35593 1465090 945729 3821366 6676180 6880902 5445672 3752431 971505 -3438754
35585 -3438754 -7329254 -8174195 -6317023 -4264607 -3702412 -4220441 -4158935 -2222893 859767
35576 859767 2381716 713966 -2027526 -2354030 -211313 1135546 190739 -846654 -240020
35567 -240020 287677 -1286882 -3524866 -3460687 -951066 1217537 896677 -1541788 -4438519
35558d438519k061258r17286l44407k49736P00565L270277N813565N764451K918972
35549A0456624j35119r50383L24166J336020R624k873472l903750j377043J316814
35540D203481k55872m458837n232357j600481N87847j160340j324313L234527
35532f006345N831894P61933n170814k464182M647707M319139k831284m309246
35524e221198K754466O062863j031785p705529l231705N763069O630911J74845
35516D195937l297512j111713Q34643M59130J044018K209082J53205l533088k987059
35507b033357J787182M641807L388589J671448M86728l048815p225674n576714
35499e908806J796306N643773Q79920n242885l947301K390605M981211J635933
$$ plain form
35558 -4438519 -6499777 -7417063 -7761470 -8011206 -7310641 -4040364 1773201 7537652 10456624
35549 10456624 10321505 9371122 9695288 11031308 11040932 8167460 4263710 2886667 4203481
35540 4203481 3947609 -511228 -5743585 -7344066 -6756219 -7916559 -9240872 -6006345
35532 -6006345 -174451 587482 -4583332 -7047514 -2399807 1919332 -911952 -5221198
35524 -5221198 -2466732 3596131 2564346 -5141183 -8372888 -2609819 4021092 4195937
35516 4195937 898425 -213288 621355 1080485 2124503 4333585 4486790 953702 -2033357
35507 -2033357 -246175 4395632 7784221 9455669 9942397 6893582 -332092 -5908806
35499 -5908806 -4112500 1531273 2411193 -2831692 -6778993 -4388388 592823 2228756
35491B228756j926519j668401K25560L88488r12219j389659o20638n88525k578748
35482f841905m451136k550654K942615O796219N131770Q33333q58875K0783l67834
35473F54316k268334k260888J9869J334199J083872J646876K162645o68953m537875
35464b834273k651087M554049P633376K264799l628293k669744O71228o87360
35456B652695l740692j751417K687052K081056k185070k049482K838145M331587
35448D863874k46965m082099k701989j00696j41653o92412N8102m49990k666808
35439f160636j921141L223118O467752L224106j565955j323963J746375J216287
35431D905943k633543m081159j764799L26933O81255J883901M068017L341519
$$ plain form
35491 2228756 302237 -1366164 -1140604 -752116 -1664335 -3053994 -3674632 -4263157 -6841905
35482 -6841905 -11293041 -13843695 -10901080 -4104861 1026909 1860242 1001367 1022150 654316
35473 654316 -1614018 -3874906 -3855037 -2520838 -1436966 209910 2372555 1703602 -2834273
35464 -2834273 -5485360 -931311 6702065 8966864 5338571 2668827 3340055 2652695
35456 2652695 -1087997 -2839414 -152362 1928694 -256376 -2305858 532287 4863874
35448 4863874 4616909 534810 -2167179 -2267875 -2409528 -3101940 -3043838 -3493828 -6160636
35439 -6160636 -8081777 -4858659 1609093 4833199 3267244 1943281 3689656 4905943
35431 4905943 2272400 -1808759 -3573558 -3246625 -2565370 -681469 3386548 6728067
35423F728067j469286n718861m971714m60031L456869M243709J971204j849380
35415A930577m272541k376723K960877O567613M487067j200944m956056m155928
35407a016058r93530J273476J785122J575818J351539P79559n93689k459986l774186
35398b071935l443498j137629K236544M755376M569032J445866k536289m372708
35390e55241k821742L24245K006481Q87565j648888l203504k543847k02374K352169
35381e405136L743612L375670J790453L42831p2095j31291j242136l173209l515736
35372d287037p86970K640679K897744J16862j094993J831183N019929L164202
35364I501599k682178o114114l920632K84307J909148J176069R62892J792238
$$ plain form
35423 6728067 5258781 -460080 -5431794 -5891825 -2434956 1808753 3779957 1930577
35415 1930577 -2341964 -4718687 -1757810 4809803 9296870 8095926 3139870 -1016058
35407 -1016058 -2009588 -736112 1049010 2624828 3976367 4755926 4162237 1702251 -2071935
35398 -2071935 -5515433 -6653062 -4416518 338858 4907890 6353756 3817467 -555241
35390 -555241 -3376983 -3052738 -1046257 -158692 -1807580 -5011084 -7554931 -7757305 -5405136
35381 -5405136 -1661524 1714146 3504599 3847430 3775335 3644044 2401908 -771301 -4287037
35372 -4287037 -5074007 -2433328 464416 581278 -513715 1317468 6337397 9501599
35364 9501599 6819421 705307 -3215325 -2931018 -1021870 154199 1117091 2909329
35356B909329J930262Q26574m21158j251379j886177j920117q57304K44901k66599
$$ plain form
35356 2909329 4839591 5666165 5245007 3993628 2107451 187334 -669970 -425069 -691668
$$ [...]
##END NTUPLES=NMR SPECTRUM
##END=
