##TITLE=31Pdec_SR158H3
 D2O, 24 sc
 10.4.2023
##JCAMPDX= 6.0         $$ Bruker NMR JCAMP-DX V2.0
##DATA TYPE= NMR SPECTRUM
##DATA CLASS= NTUPLES
##ORIGIN= UXNMR, Bruker Analytische Messtechnik GmbH
##OWNER= root
$$ XWIN-NMR		Version 3.5
$$ Mon Apr 10 14:54:14 2023 Russian Standard Time (UT+4h)  she@DPX200
##.OBSERVE FREQUENCY= 81.013821
##.OBSERVE NUCLEUS= ^31P
##.ACQUISITION MODE= SIMULTANEOUS
##.ACQUISITION SCHEME= undefined
##.AVERAGES= 24
##.DIGITISER RES= 16
##SPECTROMETER/DATA SYSTEM= spect
##.PULSE SEQUENCE= zgpg30
##.SOLVENT NAME= D2O
##.SHIFT REFERENCE= (INTERNAL, D2O, 0, 248.564)
##AUDIT TRAIL= $$ (NUMBER, WHEN, WHO, WHERE, WHAT)
$$ ##TITLE= Audit trail, XWIN-NMR		Version 3.5
$$ ##JCAMPDX= 5.01
$$ ##ORIGIN= Bruker BioSpin GmbH
$$ ##OWNER= she
$$ F:/spectra/data/she/nmr/P31/1/pdata/1/auditp.txt
$$ ##AUDIT TRAIL=  $$ (NUMBER, WHEN, WHO, WHERE, WHAT)
(   1,<2023-04-10 14:51:56.54 +0400>,<she>,<DPX200>,
      <created by zg, POWCHK disabled, PULCHK disabled
       configuration hash MD5:
       00 E9 B6 7A A2 85 ED C7 34 08 36 98 17 FE 4E 26
       data hash MD5: 32K
       A1 8B A7 E9 D7 41 5C 95 B5 C8 09 5B C1 C3 06 2C>)
(   2,<2023-04-10 14:53:22.07 +0400>,<she>,<DPX200>,
      <Start of raw data processing
       efp BC_mod = 2 LB = 1 FT_mod = 6 PKNL = 1 PHC0 = -10733.56 PHC1 = 70.28476 SI = 64K 
       data hash MD5: 64K
       F5 01 86 66 00 FD C1 F4 A6 E7 D9 19 C2 91 A4 E5>)
(   3,<2023-04-10 14:53:42.82 +0400>,<she>,<DPX200>,
      <pk PHC0 = -354.0659 PHC1 = 229.8001 
       data hash MD5: 64K
       0A 40 42 15 9B 1E 33 41 FB 57 2A 98 ED 51 0A 95>)
(   4,<2023-04-10 14:53:46.14 +0400>,<she>,<DPX200>,
      <abs ABSG = 5 
       data hash MD5: 64K
       DE AA 36 23 4C 3B BA 32 AA FE 6D 5F 03 0F C6 92>)
$$ ##END=
$$ 
$$ hash MD5
$$ DB 87 31 37 8D FA 0B 3F 85 F0 23 0A E0 54 41 4D
##$RELAX= 
##$RELAX= 
##$RELAX= 
##$RELAX= 
##$RELAX= 
##$RELAX= 
##$RELAX= 
##$RELAX= 
##$RELAX= 
$$ Bruker specific parameters
$$ --------------------------
##$DU= <F:/spectra>
##$EXPNO= 1
##$NAME= <P31>
##$PROCNO= 1
##$TYPE= <nmr>
##$USER= <she>
##$AMP= (0..31)
100 100 100 100 100 100 100 100 100 100 100 100 100 100 100 100 100 100 
100 100 100 100 100 100 100 100 100 100 100 100 100 100 
##$AQSEQ= 0
##$AQ_mod= 1
##$AUNM= <au_zg>
##$AUTOPOS= <>
##$BF1= 81.014009
##$BF2= 200.13
##$BF3= 200.13
##$BF4= 200.13
##$BF5= 200.13
##$BF6= 200.13
##$BF7= 200.13
##$BF8= 200.13
##$BYTORDA= 1
##$CFDGTYP= 0
##$CFRGTYP= 5
##$CHEMSTR= <none>
##$CNST= (0..31)
1 1 145 1 1 1 1 1 1 1 1 1 1 1 1 1 1 1 1 1 1 1 1 1 1 1 1 1 1 1 1 1 
##$CPDPRG= <waltz16>
##$CPDPRG1= <>
##$CPDPRG2= <waltz16>
##$CPDPRG3= <>
##$CPDPRG4= <mlev>
##$CPDPRG5= <mlev>
##$CPDPRG6= <mlev>
##$CPDPRG7= <mlev>
##$CPDPRG8= <mlev>
##$CPDPRGB= <>
##$CPDPRGT= <>
##$D= (0..31)
0 1 0 0 0 0 0 0 0 0 0 0.03 2e-05 3e-06 0 0 0 0 0 0 0 0 0 0 0 0 0 0 0 0 
0 0 
##$DATE= 1681123916
##$DBL= (0..7)
120 120 120 11 120 120 24 19 
##$DBP= (0..7)
150 150 150 150 150 150 150 150 
##$DBP07= 0
##$DBPNAM0= <>
##$DBPNAM1= <>
$$ [...]
##$SUBNAM3= <"">
##$SUBNAM4= <"">
##$SUBNAM5= <"">
##$SUBNAM6= <"">
##$SUBNAM7= <"">
##$SUBNAM8= <"">
##$SUBNAM9= <"">
##$SW= 501.771253377433
##$SWIBOX= (0..15)
0 1 3 0 0 0 0 0 0 0 0 0 0 0 0 0 
##$SW_h= 40650.406504065
##$TD= 32768
##$TD0= 1
##$TE= 0
##$TE2= 300
##$TE3= 300
##$TEG= 300
##$TL= (0..7)
0 120 53 12 22 120 120 120 
##$TP= (0..7)
150 150 150 150 150 150 150 150 
##$TP07= 0
##$TPNAME0= <>
##$TPNAME1= <>
##$TPNAME2= <>
##$TPNAME3= <>
##$TPNAME4= <>
##$TPNAME5= <>
##$TPNAME6= <>
##$TPNAME7= <>
##$TPOAL= (0..7)
0.5 0.5 0.5 0.5 0.5 0.5 0.5 0.5 
##$TPOFFS= (0..7)
0 0 0 0 0 0 0 0 
##$TUNHIN= 0
##$TUNHOUT= 0
##$TUNXOUT= 0
##$USERA1= <user>
##$USERA2= <user>
##$USERA3= <user>
##$USERA4= <user>
##$USERA5= <user>
##$V9= 5
##$VALIST= <valist>
##$VCLIST= <CCCCCCCCCCCCCCC>
##$VD= 0
##$VDLIST= <DDDDDDDDDDDDDDD>
##$VPLIST= <PPPPPPPPPPPPPPP>
##$VTLIST= <TTTTTTTTTTTTTTT>
##$WBST= 1024
##$WBSW= 4
##$XGAIN= (0..3)
0 0 0 0 
##$XL= 0
##$YL= 0
##$YMAX_a= 1494
##$YMIN_a= -2171
##$ZGOPTNS= <>
##$ZL1= 120
##$ZL2= 120
##$ZL3= 120
##$ZL4= 120
##$ABSF1= 248.5645
##$ABSF2= -253.2056
##$ABSG= 5
##$ABSL= 3
##$ALPHA= 0
##$AQORDER= 0
##$ASSFAC= 0
##$ASSFACI= 0
##$ASSFACX= 0
##$ASSWID= 0
##$AUNMP= <proc_1d>
##$AZFE= 0.1
##$AZFW= 0.5
##$BCFW= 0
##$BC_mod= 2
##$BYTORDP= 0
##$COROFFS= 0
##$CY= -3
##$DATMOD= 1
##$DC= 0
##$DFILT= <>
##$DTYPP= 0
##$F1P= 0
##$F2P= 0
##$FCOR= 1
##$FTSIZE= 65536
##$FT_mod= 6
##$GAMMA= 0
##$GB= 0
##$INTBC= 1
##$INTSCL= 6.047779e-11
##$ISEN= 30
##$LB= 1
##$LEV0= 0
##$LPBIN= 0
##$MAXI= 10000
##$MC2= 0
##$MEAN= 0
##$ME_mod= 0
##$MI= 50
##$NCOEF= 0
##$NC_proc= -9
##$NLEV= 6
##$NOISF1= 182.463
##$NOISF2= 159.3651
##$NSP= 0
##$NTH_PI= 0
##$NZP= 0
##$OFFSET= 248.5645
##$PC= 4
##$PHC0= -11087.62
##$PHC1= 300.0848
##$PH_mod= 1
##$PKNL= yes
##$PPARMOD= 0
##$PSCAL= 0
##$PSIGN= 0
##$REVERSE= no
##$SF= 81.0140089999694
##$SI= 65536
##$SIGF1= 159.3651
##$SIGF2= -187.1042
##$SINO= 113.3802
##$SIOLD= 16384
##$SREGLST= <1H.CDCl3>
##$SSB= 0
##$STSI= 65536
##$STSR= 0
##$SW_p= 40650.406504065
##$SYMM= 0
##$S_DEV= 0
##$TDeff= 32768
##$TDoff= 0
##$TI= <>
##$TILT= no
##$TM1= 0
##$TM2= 0
##$TOPLEV= 0
##$USERP1= <user>
##$USERP2= <user>
##$USERP3= <user>
##$USERP4= <user>
##$USERP5= <user>
##$WDW= 1
##$XDIM= 65536
##$YMAX_p= 552915117
##$YMIN_p= -58802288
$$ End of Bruker specific parameters
$$ ---------------------------------
##NTUPLES= NMR SPECTRUM
##VAR_NAME=  FREQUENCY,     SPECTRUM/REAL,   SPECTRUM/IMAG
##SYMBOL=    X,             R,               I
##VAR_TYPE=  INDEPENDENT,   DEPENDENT,       DEPENDENT
##VAR_FORM=  AFFN,          ASDF,            ASDF
##VAR_DIM=   65536,         65536,           65536
##UNITS=     HZ,            ARBITRARY UNITS, ARBITRARY UNITS
##FACTOR=    0.620285442955139, 1,           1
##FIRST=     20137.2065510682, 0,            0
##LAST=      -20513.1999529968, 0,           0
##MIN=       -20513.1999529968, -58802288,   0
##MAX=       20137.2065510682, 552915117,    0
$$ Real data points
##PAGE= N=1
##DATA TABLE= (X++(R..R)), XYDATA
$$ [...]
14930 -16552324 -23186119 -18093841 -8959202 -6173706 -9060002 -8917425 -2209914 5229179
14922 5229179 6521211 1647193 -3988976 -6112895 -5100740 -3916211 -3955826 -3930132 -2910940
14913 -2910940 -2427961 -3314513 -2279193 4100569 12323512 14309200 8318907 2063624
14905 2063624 2066782 5538832 7127134 7823001 10314981 10345372 2195228 -8994191 -10559720
14896 -10559720 475794 12170059 12539782 2359323 -9898339 -18195602 -19535097 -12132512
14888 -12132512 -28740 6015088 198318 -9176579 -9941517 -2752452 1000082 -3272552
14880 -3272552 -7623013 -5304252 -1230977 -3604769 -11375654 -16572449 -15893415 -13541227
14872 -13541227 -13167067 -12515721 -7777649 3309 5441364 5008599 1004335 -1319041
14864 -1319041 66003 2090044 1402654 -823637 -1081764 702336 978745 -1657677 -4045456
14855 -4045456 -3142319 73780 3417931 7176883 11993459 15420516 14276353 9302743
14847 9302743 4125810 371080 -2946513 -5956926 -7505792 -7730158 -7144364 -3581385
14839 -3581385 4930125 13738854 14211924 5546013 -1908987 334774 7637199 10005668
14831 10005668 6801242 5407754 7314974 5495084 -2588580 -8647355 -5290023 2735553
14823 2735553 5470924 1414240 -2566344 -2112944 1195414 6419345 15621058 27569208
14815 27569208 35018995 32303177 22646452 14283142 10719249 8157657 2656735 -2985739
14807 -2985739 -1769144 8226482 19339830 21338300 12300878 -208030 -8663655 -12148670
14799 -12148670 -12095611 -7086363 3005593 11380710 9967082 310921 -7389481 -7040173
14791 -7040173 -3109034 -2946319 -7646983 -12721833 -13799100 -9520918 -2125937 3425668
14783 3425668 4351107 4573215 9657781 16897994 17226180 8890893 1197460 591492 1630162
14774 1630162 -1670618 -4356373 -450731 3143439 -3525624 -13595242 -9538257 9548550
14766 9548550 22770407 15570791 -764476 -6982844 -1766963 2541721 2005277 3934086
14758 3934086 10312434 12960122 7732160 2139050 3938375 10372719 14206257 14167435
14750 14167435 13300249 11415491 6039205 -980111 -4173007 -2110697 599875 440197
14742 440197 96821 3791026 10190164 13716997 12234393 9615180 9617068 10640736 9205787
14733 9205787 6037754 4801456 6124338 7368374 7953439 9796737 11849458 10039258
14725 10039258 4683118 1682251 2715060 911746 -7742107 -14867718 -10140939 2829604
14717 2829604 10960668 9958237 7553282 8821402 9715686 7404701 5679654 5553090
14709 5553090 1097468 -9071423 -16035420 -14188172 -11541435 -16847444 -24584002 -24477092
14701 -24477092 -19490710 -20451944 -26376607 -25275821 -14572770 -5928689 -6485043 -8681584
14693 -8681584 -4443693 1980012 2800956 -788215 -2974014 -3295654 -4328107 -4774719 -2468599
14684 -2468599 -119082 -1134951 -3297635 -3031970 -2463741 -5556630 -10149054 -10554421 -6011672
14675 -6011672 -510414 3680194 6453113 6215233 2191737 -1392154 265407 5281276
14667 5281276 8013329 7390972 6255719 4693611 1181027 -1463915 829443 5481991
14659 5481991 6598170 5239839 7370817 12034290 11954998 6914469 5176498 8512343
14651 8512343 7553171 -2174557 -10463565 -6786865 4367590 11519049 12245535 11531071
14643 11531071 10136053 5470315 441935 853345 5602977 8717374 9864212 13897139
14635 13897139 20644514 23955700 21083915 15077733 7998195 42919 -4682634 -942569
14627 -942569 7662299 10779538 5755511 847455 1021368 749430 -3677306 -4950040 3193007
14618 3193007 12419455 9527651 -4041356 -13587856 -11605631 -6610452 -8818821 -15156242
14610 -15156242 -14155319 -1947833 12371569 17573727 12922112 7413782 7275222 8293852
14602 8293852 3606208 -4334318 -6299715 -411427 4460604 2280301 -1369010 210135
14594 210135 3047402 -122784 -6191815 -6195883 -1030977 -1071827 -9495899 -17144767 -17091874
14585 -17091874 -14019802 -13847716 -13263714 -7258252 -154387 77199 -5366958 -8113145
14577 -8113145 -5867185 -5028502 -9521615 -14873678 -16054000 -14932821 -15766714 -17478340
14569 -17478340 -15526108 -9802163 -5690134 -6323528 -7460534 -2977917 5972595 11004935
14561 11004935 6708541 -2345911 -7394851 -5687160 -897742 4590689 11482276 17243498
14553 17243498 15371675 4970930 -4623985 -4497063 2204537 5219098 1243070 -3395629
14545 -3395629 -3092474 437206 2455443 651780 -4871265 -12461812 -18285760 -18515731
14537 -18515731 -13514886 -7240599 -2549184 -204320 -1485802 -6975383 -12963156 -14235451
14529 -14235451 -10711692 -6323505 -2011041 3340261 5518348 -1796522 -14202277 -17672302
14521 -17672302 -7938136 1501556 -1173167 -8399420 -6379527 1935221 1890531 -8469604
14513 -8469604 -15268797 -11248716 -6031260 -8756372 -13621991 -11121883 -4016253 -2190640
14505 -2190640 -7273575 -11581312 -9690348 -3946503 20320 -1662568 -8489603 -14202833
14497 -14202833 -11335914 -1065403 5815081 2706448 -2943028 -324992 8711562 13107668
14489 13107668 9388503 5206515 6441567 10345240 12878875 13707150 11309957 2327264
14481 2327264 -9670785 -13203930 -3283771 9589355 11995776 4153819 -3520465 -5867598
14473 -5867598 -5914910 -5004085 -468925 5955678 7020738 921129 -4008128 -307545 8300117
14464 8300117 12524786 9264066 2824944 -2137158 -3557732 -445124 5669065 8933012
14456 8933012 4612434 -3610401 -6924707 -2479154 3881301 6904012 8251225 10833377
14448 10833377 12122386 8058965 783002 -2740614 669357 6921712 9938779 7778837
14440 7778837 3191381 -4654 -497397 82285 498265 2739252 8692057 14074870 10776448
14431 10776448 -1886307 -13062606 -12539756 -3453139 3190714 3734319 3816582 6286156
14423 6286156 6394104 1210143 -4384738 -5465961 -4500664 -5915150 -8099725 -6463696
14415 -6463696 -1389783 2018539 482177 -4718825 -9621214 -9551619 -2254826 7924213
14407 7924213 12420733 8387268 2495200 1338347 3088779 3694687 5434755 11278078
14399 11278078 15392533 9810994 -1085688 -3720341 6042755 17615801 21495735 20362204
14391 20362204 20165444 19871926 17029102 15760934 20380953 25819639 23461313 14310186
14383 14310186 7905854 8293177 8613033 1553397 -10488540 -18811442 -18726907 -13336690
14375 -13336690 -8161738 -4645910 -99504 6737280 12500027 13384213 10640480 8432651
14367 8432651 7386425 5154682 3158791 6210099 13509067 17112080 13569623 10283278
14359 10283278 13772890 17422797 10026116 -6199188 -15891910 -9713440 4350176 11037517
14351 11037517 4030925 -9379155 -15961339 -8646861 5499774 11092168 2982482 -4499654
14343 -4499654 4596134 23414382 28520840 12171651 -6334199 -8782494 -3412569 -8799451
14335 -8799451 -22718359 -25650619 -12408257 -819072 -4443059 -13351061 -11678926 -1535703
14327 -1535703 3735356 1976057 2492816 6620664 3873410 -9082342 -18960128 -13215304
14319 -13215304 2091213 11006038 8508134 2771467 -154687 -3036886 -8180666 -11267281
14311 -11267281 -8346366 -2239624 2314263 5035934 7848590 10547592 12415237 14245688
14303 14245688 15306968 12526695 6518145 3658087 7161296 10691413 7046408 -946263
14295 -946263 -5556399 -6545100 -9423398 -13473664 -12097463 -5784495 -4002788 -10437189
14287 -10437189 -15532469 -9490553 4099279 13799256 14578025 10510577 6701079 4369816
14279 4369816 2556229 559333 -876184 535071 5444742 9359764 6648354 -933691
14271 -933691 -5128635 -2322848 2405566 4626549 6148988 7228120 2160148 -9972410
14263 -9972410 -18059148 -12409763 2789 4389297 -1533230 -7202870 -6742111 -4665325
14255 -4665325 -4171260 -2037464 2156129 2648854 -2388236 -6635992 -6323586 -6689502 -11997747
14246 -11997747 -16499766 -12324467 -1148558 8685931 12765310 12035737 6947687 -2885349
14238 -2885349 -14165181 -20908211 -20819321 -17301133 -14508152 -12507804 -8005411 573628
14230 573628 8829976 8869377 -1441304 -13157314 -14747817 -5985124 1482343 -1750244
14222 -1750244 -13157940 -23885769 -28365799 -26043939 -19120683 -12143709 -9606824 -10802460
14214 -10802460 -10652913 -7402078 -4592718 -3796908 -1961470 1193178 627648 -4708484
14206 -4708484 -7610348 -3546798 1515444 1271424 -390487 2097063 3978242 -1860080
14198 -1860080 -9804684 -7455554 4998924 13934202 11441046 3947369 -52205 -309364
14190 -309364 -17067 -96130 -1660254 -6114446 -10024054 -7798175 -1718154 -539932 -5559359
14181 -5559359 -7940302 -3750599 -953107 -5410259 -10492037 -8936347 -5367702 -6423942
14173 -6423942 -6680411 2337639 14233692 13669917 -460867 -11770958 -9155842 -762661
14165 -762661 317021 -5524944 -8380370 -5177571 -2976504 -7208464 -13742773 -14478971
14157 -14478971 -7185953 2347584 6663686 3650430 -2603516 -6653048 -6100472 -1596979
14149 -1596979 4970911 10654678 11828259 7327907 666716 -3466919 -4766932 -6833991
14141 -6833991 -11014167 -13653749 -11003737 -4917258 -1513061 -4475731 -10998531 -14589449
14133 -14589449 -11321255 -3215367 3903876 5289004 513967 -6509777 -9951343 -6101082
14125 -6101082 2926824 9992780 9313200 1913330 -6583922 -12315069 -14765530 -13409197
14117 -13409197 -7183494 2140470 10142309 14660513 17093164 17913216 15294833 9992719
14109 9992719 6675208 7152347 6741148 1618055 -4122844 -4044261 780051 3265015 148167
14100 148167 -5435234 -10638144 -16192762 -21868684 -23759971 -18943680 -10256250 -4077341
14092 -4077341 -4148239 -8292361 -10634044 -7307745 -650689 3164890 1280915 -2916873
14084 -2916873 -5055615 -5249556 -6187269 -8362458 -10007271 -9759493 -7069916 -2376284 1240356
14075 1240356 440133 -1811890 2481252 14132810 22222478 18920364 12767818 16860112
14067 16860112 27930371 30080351 18713774 7163820 6435692 10939628 10335889 5038551
14059 5038551 2184361 3992614 7877384 12162919 14751100 11541183 2826959 -3740269
14051 -3740269 -2676232 2206799 5935805 10542713 17409553 19183228 10205835 -1075076
14043 -1075076 -3085357 -473423 -7648798 -24034836 -31890932 -22105907 -7085641 -1368186
14035 -1368186 -2818344 -2461190 -1604399 -6637531 -13888705 -12888173 -2061811 9824495
14027 9824495 16522519 18721690 16594367 8532279 -1298195 -4092480 1279996 5179909
14019 5179909 835505 -5835247 -5387482 1743637 7186510 6260241 1528364 -3006422
14011 -3006422 -5494602 -5028102 -1730121 2220646 5146449 8303510 12374682 13815556
14003 13815556 9562402 3351326 1135949 1363575 -2810715 -11428385 -16207718 -13319542
13995 -13319542 -9116144 -8897915 -8501551 -3715495 -186561 -4317027 -9744545 -4453145
13987 -4453145 10599100 21379056 19845500 12351856 6681503 1285588 -7480865 -16108154
13979 -16108154 -18621383 -14606474 -6801212 3714250 14011748 16825173 9200520 -532700
13971 -532700 -2444127 1404971 1456550 -3516303 -4901113 1066784 6813685 4737202 -2900137
13962 -2900137 -9554684 -13175737 -14360980 -11583798 -4786971 182390 -2088221 -7665808
13954 -7665808 -7696615 -1278170 3212233 854904 -3001532 -2260026 126784 -1798123 -5519236
13945 -5519236 -3004673 5735149 10546219 4879950 -5469848 -11302321 -11567458 -10646855
13937 -10646855 -9321966 -5650068 -1604798 -820884 -901204 4079629 13070425 17666794
13929 17666794 13750780 6505077 1794791 -562580 -2395748 -3171815 -3819217 -7426805
13921 -7426805 -11814801 -8781267 3387254 13680542 12225941 4628101 3720700 11153832
13913 11153832 16561584 12825421 3269187 -5216237 -8053855 -3018385 7229361 13028918
13905 13028918 6536582 -7029432 -14962561 -13873589 -11820781 -13011363 -11449888 -3865358
13897 -3865358 1604632 -2774519 -11181233 -11638058 -2727922 5051031 3358986 -4883372
13889 -4883372 -10798965 -9619977 -4153059 -49223 1108492 2924375 7588045 10693069
13881 10693069 6559009 -2731244 -8917095 -8023141 -3738526 -135057 2741293 4866123
13873 4866123 4344116 1752792 613555 1463551 1012810 -1568185 -4107869 -7936292 -16238689
13864 -16238689 -24191332 -21528648 -9156980 -1611715 -6120413 -10958177 -4335359 6370902
13856 6370902 7253028 592039 -516045 5793349 9893654 9041362 8992107 8116261 -2449174
13847 -2449174 -20137796 -29134621 -22697297 -12547850 -9273964 -7535657 114255 7542246
13839 7542246 5324847 -2356618 -3976006 1526409 4837158 1024736 -6025654 -12085317
13831 -12085317 -16552198 -18930144 -18896900 -19141767 -21896365 -24157851 -22361298 -19321043
13823 -19321043 -19398945 -19159754 -11621086 782059 6746605 1363825 -7218452 -9263251
13815 -9263251 -4707586 386107 2437735 1242690 -2630444 -6675656 -6487803 -1386129
13807 -1386129 3178505 3104381 2310680 6710389 13965885 15761820 9990754 4071641 4196411
13798 4196411 7114579 6560538 3329564 3010693 5704706 4933836 -2029089 -8962566 -9462761
13789 -9462761 -6241055 -6446846 -10704545 -13224954 -11865526 -11053950 -13344822 -14758782
13781 -14758782 -11937422 -8325877 -8365889 -9678674 -6644557 852129 7795726 11370377
13773 11370377 12476544 11389294 7896567 5044839 6164985 7783264 2548004 -8842038
13765 -8842038 -15710055 -11251875 -2203063 625329 -3274781 -5472141 -1253521 5836982
13757 5836982 10969552 13205801 13246333 11203639 7930109 4845217 1524366 -3444622
13749 -3444622 -9038552 -12751037 -15002790 -18390356 -22015668 -21451711 -16132259 -12036371
13741 -12036371 -13992021 -19054184 -20929231 -18016334 -13659239 -10984344 -11001525 -13611289
13733 -13611289 -16760756 -16187146 -9616997 -370757 5830795 6522645 3390298 333046
13725 333046 2603989 13201020 26041522 27977236 14295310 -2067143 -5200662 3146053
13717 3146053 7826416 3285203 -483110 3330256 7267464 3615477 -1965116 -135802
13709 -135802 6833233 9346170 4741501 -1813010 -6694236 -9786194 -10444234 -9040797
13701 -9040797 -9042285 -10617477 -7206154 3258832 9870213 3007093 -7883330 -5317118
13693 -5317118 9259853 15768072 5047518 -7958447 -7082350 2983747 7236658 2508982
13685 2508982 -2270776 -1660548 1096243 1594704 -938564 -4517393 -4752895 2642609 15020188
13676 15020188 22424953 19096400 11150616 7464479 7505207 4810107 -1189603 -4336287
13668 -4336287 -1144213 5119218 8933021 6831804 -995359 -9762522 -13442837 -12319844
13660 -12319844 -13108919 -18102121 -20294545 -14800539 -8263892 -8783095 -12479149 -10117774
13652 -10117774 -2524645 1802068 1275970 1322127 1758745 -2662413 -8934762 -7165863 1667531
13643 1667531 3272176 -8462707 -19907043 -16430354 -3042216 3814649 -1458981 -9518784
13635 -9518784 -10270982 -2377473 8896472 15737812 11486126 -2849082 -16467878 -18360014
13627 -18360014 -8247016 5438251 15563406 19736607 17208800 8897613 -683609 -6964494
13619 -6964494 -10046031 -11915730 -11497043 -7745915 -4683819 -6036508 -6683194 1721647
13611 1721647 16246635 23180239 16067433 4751221 1433028 5233262 7615221 7030026
13603 7030026 8621842 12181505 10963697 3809184 -826184 2836360 8659876 7444812
13595 7444812 20802 -5228129 -4808130 -2827396 -2658127 -3453821 -5164238 -9049172 -11128356
13586 -11128356 -3379280 13730633 26937232 25192126 13989508 7380086 9680849 13551279
13578 13551279 13663837 12529659 12514817 11249848 7288678 2834237 -1702047 -8861220
13570 -8861220 -17002363 -18987709 -11995204 -2782311 882751 -1098212 -4272634 -5360121
13562 -5360121 -1192567 10795234 25351190 29723657 18810098 4300742 275976 4710561
13554 4710561 5156598 -1116800 -4579365 -88749 6086601 8014557 7900277 8072694 4976929
13545 4976929 -2793316 -8282293 -5203460 2172260 5097394 2377054 -356745 -366267 121680
13536 121680 19702 945071 2723089 2761302 397061 -2511944 -5414551 -8964159 -10923807
13527 -10923807 -7379653 496692 5818990 4715650 1555647 2164957 5298079 5127921
13519 5127921 229153 -4299840 -3209837 3721530 12589160 18654771 19153110 15407837
13511 15407837 11648307 9615300 6237796 -17383 -3420826 2035040 11276476 12287531
13503 12287531 3289885 -3050018 2950245 14542925 19243927 15710227 10966853 6600066
13495 6600066 -754041 -7807544 -6129454 3510463 9522456 5594085 -1149120 -2296348
13487 -2296348 366942 1044618 -156594 -426274 -1691359 -7563961 -16078853 -21404123
13479 -21404123 -20732420 -15527788 -8629027 -3230163 -1270665 -248334 3838487 8220599
13471 8220599 4834576 -6280441 -13396341 -9205601 -2113568 -2596043 -6136240 -1642749
13463 -1642749 8792053 12718133 7730620 4426532 7847995 9992317 4923742 -1189540
13455 -1189540 -1559764 147835 -1825393 -4135877 -697259 5124434 4159276 -4815483
13447 -4815483 -13043736 -13544787 -8689694 -4812327 -3866409 -3007409 -449403 1126487 -1839430
13438 -1839430 -7815048 -10633900 -7309239 -2422876 -1636215 -3670469 -3480452 -1182625
13430 -1182625 -1498766 -5036408 -7120580 -6175254 -6388362 -9990616 -13364374 -13647524 -13007011
13421 -13007011 -12830345 -9851770 -2971728 1436801 -2566245 -10504824 -11971009 -4138366
13413 -4138366 4662258 5450145 -1162949 -6760008 -5445132 -753186 -1342676 -9858828
13405 -9858828 -18666776 -19130315 -12476650 -6865657 -5709746 -5322086 -3385630 -1915898
13397 -1915898 -705660 3701494 9391453 7929182 -2858989 -12438814 -10932486 -3058148
13389 -3058148 -636147 -5241513 -7254037 -983593 7339952 8095874 -347394 -10387075
13381 -10387075 -12743806 -5092918 5303378 8759431 4007641 -846204 541619 5055429
13373 5055429 6297506 3624332 720994 -634663 -378241 2660399 7955611 10587392
13365 10587392 6892733 678243 -1249332 2167776 6392481 7872109 6193400 2433360
13357 2433360 -356370 1633380 6763364 7164299 -446237 -7965253 -6724822 -298102
13349 -298102 1949635 -53648 1342332 7126990 9686272 5202661 -2028480 -8550394
13341 -8550394 -15361641 -20729365 -18641408 -7894446 4386818 11303578 12453045 10101733
13333 10101733 5415853 187018 -3401323 -5671866 -6960062 -3588856 6491598 16061240
13325 16061240 16251363 10630399 10478374 16505097 18620278 14935486 15148629 20665114
13317 20665114 18567468 4334436 -5758948 1884116 15838076 16654617 5964575 1040252
13309 1040252 6873874 11879783 8870925 3213105 -437737 -4525673 -9512097 -11028197
13301 -11028197 -8633294 -6695895 -5035559 594143 7603034 7871817 2078850 702811
13293 702811 7362109 13126945 11966424 9781405 11853885 13139560 9345227 6847472
13285 6847472 11265083 15230589 9475344 -710454 -2979121 2587125 4961163 1103739
13277 1103739 -660612 2547128 1809941 -7715848 -16002345 -11908976 -395516 3879629
13269 3879629 -3112182 -10417992 -8477207 -1669833 -783986 -8188122 -16014979 -17393181
13261 -17393181 -14011320 -11304789 -10513207 -8988905 -6075603 -4285243 -4743160 -5320633
13253 -5320633 -4244430 -2277285 9177 3725031 8101375 8494143 1684061 -7952329
13245 -7952329 -11033333 -2619182 12267066 22750694 21638941 12008845 4458979 6016813
13237 6016813 11918403 11507249 2388967 -6357175 -7046357 -3312146 -2329141 -2826658 1158901
13228 1158901 7764083 8235010 840784 -5019121 -1487461 7941823 14594149 14418505
13220 14418505 8063646 -2512509 -12499035 -14832590 -8653856 -3221818 -6849765 -14941754
13212 -14941754 -15995564 -7414203 2288132 6343245 6679377 6685685 4768819 -1197722 -8706220
13203 -8706220 -14199454 -17764654 -20155707 -18619469 -10631454 -209725 4034719 -2419435
13195 -2419435 -15344750 -25459724 -25660157 -16181371 -4480702 1148961 -646053 -3977558
13187 -3977558 -3590766 -162652 3439534 6859206 9802452 8995800 3138256 -1563268
13179 -1563268 2709769 14470000 23874973 24592708 18599385 9140263 -2906847 -13081314
13171 -13081314 -12708158 -688944 10758562 10262195 2321109 -1053034 326185 -3744770
13163 -3744770 -13474650 -14731575 -987311 13128549 11046578 -1799752 -6909805 -862321
13155 -862321 1369083 -7910971 -16171353 -10572444 1782323 4775093 -3255208 -9502726
13147 -9502726 -6851946 -1858918 -2158164 -6314167 -8993676 -8243980 -4489357 974392
13139 974392 3522167 -1942721 -11951850 -15144590 -7072483 2099366 1449970 -4625026
13131 -4625026 -3051703 8243138 17285213 15059522 6293579 43710 -2958104 -8140721
13123 -8140721 -16928052 -24685458 -27003648 -23207168 -14378658 -2508371 7752801 10818336
13115 10818336 6422782 1778933 4034584 11318839 14927261 10821561 4709863 3413072
13107 3413072 5583880 5835750 4823731 8049305 15365978 19704068 18104627 16223298
13099 16223298 17943574 17807867 9820860 -2025867 -9212413 -10409689 -10234100 -9773103
13091 -9773103 -6789564 -3286529 -3788876 -6291340 -3756788 3993668 8066608 2888355
13083 2888355 -6104012 -10498115 -8986227 -6082932 -5525272 -8169714 -12585286 -14984551
13075 -14984551 -11783253 -4165488 2825452 6445578 7925120 8196642 6994086 6333364
13067 6333364 8943893 12577004 12268549 8909390 7948408 8414965 2760250 -8888955
13059 -8888955 -14477295 -6565086 5478974 8041059 1336704 -3892308 -2701717 148968
13051 148968 -472424 -5033703 -11689114 -16959177 -16164834 -8958199 -1671514 996009 2336619
13042 2336619 5852830 6974067 921276 -6425803 -5922501 84291 1469796 -3279255
13034 -3279255 -5913039 -3085098 -568081 -1818117 -3402699 -3859014 -6487273 -10445462
13026 -10445462 -9403396 -3041245 -192163 -5586315 -12247113 -12710869 -9908296 -10447760
13018 -10447760 -13595854 -13902280 -10455061 -7513811 -8588096 -13673564 -19624051 -21271755
13010 -21271755 -16050303 -8635603 -5934847 -7055894 -5253883 -416354 -136126 -5765825
13002 -5765825 -8108426 -2326247 3103153 -403984 -8529679 -12479686 -11919168 -10422426
12994 -10422426 -6342875 1021915 3658143 -4061808 -12038096 -6166443 9493770 16317913
12986 16317913 6415142 -8884468 -16864054 -16974026 -13797632 -8618527 -3263171 -2764483
12978 -2764483 -8137331 -13226512 -13365095 -11023051 -9060937 -5181924 1861794 6394745
12970 6394745 2343613 -7598100 -14485561 -13249833 -7036393 -2679781 -3841417 -7732834
12962 -7732834 -8346974 -4076986 -300455 -1623295 -4855627 -5207045 -6018594 -13421383 -22596756
12953 -22596756 -20525452 -4990849 9754824 11522435 5286554 3072898 6734654 9507181
12945 9507181 9291055 10729757 15857303 20555089 20469204 15389011 8154251 2968580 3358920
12936 3358920 7982917 10016799 4510648 -4959186 -10304138 -8238414 -2774346 -55802
12928 -55802 -3146330 -9892769 -13709789 -8996987 2082675 11174043 13830568 13885187 15580680
12919 15580680 16908379 14648025 10444709 6764783 2042586 -4340664 -7544686 -4647746
12911 -4647746 -1477526 -3999483 -7575608 -4385821 2308736 2737673 -2451987 -2490783 5386274
12902 5386274 10802558 7024497 1264698 1943914 5357330 3168833 -3799366 -8044015
12894 -8044015 -7376107 -6139067 -6548938 -6197297 -3877968 -1881313 -1439492 -144506 4281945
12885 4281945 9837047 11591197 6971296 -1092454 -7215994 -9707973 -11465369 -13710680
12877 -13710680 -12713814 -6494199 -904583 -2597565 -8381791 -9608711 -6124589 -6241480
12869 -6241480 -11663016 -13175012 -5796094 1801221 212047 -6459158 -8084115 -4181605
12861 -4181605 -2164715 -3539097 -2324726 3204533 6531208 2759702 -4203509 -7192975
12853 -7192975 -4271022 824656 4242761 6033527 9028492 14019691 17086063 14334713
12845 14334713 8807183 7742469 11896265 13910768 10219154 7167886 9664310 11007592
12837 11007592 2823243 -9854647 -13823444 -6172504 2328636 2632904 -2070352 -2615084
12829 -2615084 5548558 18753863 27412099 23248363 9404782 264498 4460222 12394813
12821 12394813 10317425 2371415 4669410 18660753 26989001 19669892 8205141 5605152
12813 5605152 6823795 866509 -8766849 -10048810 -2577585 2006308 -2635103 -11108051
12805 -11108051 -16252427 -16165352 -11886971 -6337502 -5233027 -11748742 -20473256 -22869417
12797 -22869417 -17767947 -10585784 -4465980 479077 1402618 -4636930 -12773954 -14565187
12789 -14565187 -11162471 -12730554 -22073153 -28331867 -22065487 -8639371 119113 1718224
12781 1718224 2854964 7098250 10765178 10485537 8068455 6307383 4742300 2007197
12773 2007197 -751913 -1845154 -3088305 -8583330 -18486431 -26288267 -24976900 -15548200
12765 -15548200 -6494170 -3890668 -4903728 -3345877 982745 2394596 -2078325 -8159423
12757 -8159423 -9383581 -4113571 3700343 9106475 10231638 8542672 6301206 4567426
12749 4567426 3765335 4497208 5696593 3400196 -4580668 -12730887 -11596701 671597
12741 671597 15103951 22377726 21455053 15435714 5928306 -3222116 -3818421 6638483
12733 6638483 17746173 18249891 11357066 7874926 7671153 1012904 -12166469 -18810942
12725 -18810942 -12375928 -3010932 -1675205 -5042829 -4335846 -68336 1567407 416833
12717 416833 696099 2039693 1393650 767237 4372539 9979935 11369482 8435905 7079677
12708 7079677 9020680 9054485 3959691 -1727400 -1354748 5715045 13195820 13566044 5161199
12699 5161199 -4864837 -6635958 1102969 8396472 5696878 -5241625 -15636426 -20558107
12691 -20558107 -20221335 -14788757 -5678998 387741 -2594266 -10050544 -11187618 -4117538
12683 -4117538 1437210 -1278887 -6676808 -6266262 -1231006 157107 -5452406 -11993922
12675 -11993922 -10890966 -245164 12467964 16980187 11033190 3193928 2040711 5307136
12667 5307136 5387505 2925479 5591149 12887620 13217139 1079796 -12347670 -13764995
12659 -13764995 -5868063 -1494133 -4294392 -5945446 -1288297 4461221 5858358 5658395
12651 5658395 8165196 10165885 4986894 -6521272 -14799245 -12350590 -2293727 5884156
12643 5884156 7371536 5905491 6423668 7329553 3231777 -6292440 -14999221 -17413421
12635 -17413421 -14167977 -8973545 -4095095 -463939 1475851 3287164 7450825 12350922
12627 12350922 12008367 3908976 -6306425 -11484031 -11219074 -9952004 -10191999 -11925342
12619 -11925342 -15572400 -20354851 -21987493 -17141319 -8468636 -617134 6227749 13497554
12611 13497554 17883513 14821111 6654724 95023 -3308652 -6592261 -8600871 -5242068
12603 -5242068 131840 -1783513 -11344798 -16739725 -10699881 -1098031 1757743 -154657
12595 -154657 947036 4594371 4966269 3441116 6989458 15114429 18677779 13083472
12587 13083472 4162949 -1508961 -4928315 -9572727 -13530719 -11822866 -4435039 2149946
12579 2149946 2018958 -3219441 -5988888 -1934622 4026320 4018988 -1194865 -2697720 2762524
12570 2762524 6448415 250465 -10536239 -14648270 -10761459 -7156205 -7988474 -9329248
12562 -9329248 -8285927 -6840249 -5865819 -3945991 -3238477 -7639678 -13351889 -10766815
12554 -10766815 1025575 10984277 11712918 8843320 9036859 8388334 1528763 -5812273
12546 -5812273 -4350961 3676435 8259463 7629165 9116788 14546571 16139440 9504682
12538 9504682 1125932 -1575052 -373890 -1219024 -4432380 -5802895 -4390940 -3441430
12530 -3441430 -4360987 -4839881 -3994165 -5307731 -11413079 -18076021 -17897147 -10701790 -5640004
12521 -5640004 -9668070 -17786051 -20063595 -15541981 -11816891 -12046886 -11582084 -8882118
12513 -8882118 -9794810 -16583310 -21810228 -19278992 -12945429 -8178424 -2630532 5745140
12505 5745140 10225434 5878815 1085682 5464087 12414239 8754560 -2568682 -6528424
12497 -6528424 -1055779 759847 -4669452 -4193062 8348312 19531361 17452324 9487679
12489 9487679 6872680 5504346 -3470380 -15016077 -17897222 -13196234 -9820746 -7549054
12481 -7549054 4007 9851355 12683633 8884792 6179176 3046135 -8862033 -24969561
12473 -24969561 -27923572 -12488597 5033753 9487354 5597121 5205567 7688111 4694162
12465 4694162 -3621021 -9265521 -9230078 -7298269 -5417331 -2371898 67170 -2088104
12457 -2088104 -7683556 -10166430 -5538700 3802493 12814826 17176268 14040404 4660106
12449 4660106 -3970273 -5166851 -586038 2376230 1152860 398670 2951768 4892794
12441 4892794 2889105 875550 4304925 11463681 16206610 16991030 16988317 16281339 11022855
12432 11022855 1579412 -5312107 -5860090 -4938672 -7798350 -10928588 -7505316 1263180
12424 1263180 7488920 7935863 6612159 6090796 4020278 98034 -911650 3250010
12416 3250010 7725081 7571965 4483851 2665964 2798651 3933682 6353634 8361582
12408 8361582 5747987 -481830 -1713736 6487870 15740493 15685073 8460910 3503735
12400 3503735 2451285 -50006 -3435161 -1271788 6046967 10398217 9066260 7707705
12392 7707705 8310425 5918180 854187 1990639 11605669 18099934 12274153 1844426
12384 1844426 191368 7681970 14275432 15422811 14608665 12879954 6536244 -4212136
12376 -4212136 -12347592 -11803218 -3620785 6238319 12202325 12957941 12348148 14615908 17474803
12367 17474803 14151352 4284269 -3541227 -4001939 -2471532 -4282372 -4321449 3815828
12359 3815828 14734573 17883763 12627344 5851059 -907252 -9293761 -12880211 -3530351
12351 -3530351 11510389 15202964 5840256 94343 6010699 10519963 3374733 -3574965
12343 -3574965 3575041 14724463 9785782 -8004299 -14523809 -970324 12780289 7947907
12335 7947907 -6782896 -10716944 -1738601 3792582 -2374706 -9203323 -4886870 5168451
12327 5168451 6846530 -2506400 -12029025 -13964972 -12606095 -13740627 -13839432 -6966137
12319 -6966137 3032582 6938121 5157741 8000525 18849571 26652514 20849519 6879284
12311 6879284 -539691 3968637 11203983 9363113 -3645439 -18933527 -24414264 -15572299
12303 -15572299 -1006444 5679315 1869193 -1042314 5649380 14904115 14901163 7212284
12295 7212284 3444504 6749446 8822692 5558372 3236379 5650158 6689208 2003455
12287 2003455 -1885588 1557273 6840620 5103718 -885245 -1481879 3079261 2638480
12279 2638480 -5478981 -10257211 -2774587 10014414 13853428 5235863 -5165202 -5556623
12271 -5556623 4831572 16266134 18491793 10416965 1045305 -329599 4674707 4980969
12263 4980969 -5664011 -19665614 -24840056 -19725720 -13524109 -11488662 -7904898 3073958
12255 3073958 15596991 17576085 6116490 -8386190 -14265043 -10638006 -6135124 -8412619
12247 -8412619 -16465145 -21990201 -17943677 -6753692 1020739 -1787148 -10677172 -16271890
12239 -16271890 -16931222 -18256037 -21233786 -20034228 -13810937 -10746181 -14563605 -16366364
12231 -16366364 -8914760 -1114388 -6134244 -20112599 -26552151 -19825175 -9568191 -1430492
12223 -1430492 10058511 24939180 30772351 21699669 10930870 12147467 19417052 19208942
12215 19208942 13186146 12938840 17930927 16243358 5629985 -2840097 -3181631 -1116272
12207 -1116272 -75217 3904816 9198468 6464438 -3339218 -4269519 10522794 23598572
12199 23598572 16236022 -3529680 -12041415 -2921174 8198278 9426362 5810942 4703431
12191 4703431 3836088 424504 -282308 5580403 10947109 7114712 -2382327 -6158804
12183 -6158804 -1020301 4556420 3325571 -1131781 -496258 6809985 14304689 16500350
12175 16500350 15367780 16088078 19039892 19845601 16788560 13279693 11375922 8106444
12167 8106444 2012888 -1639068 1837320 7812569 8457982 5307657 6888317 14193030
12159 14193030 18223460 14246222 9288319 11142971 17828309 23108759 25198767 23953469
12151 23953469 16453305 3208464 -6705957 -5388368 2644906 7188425 7017118 8847197
12143 8847197 14021077 16280948 12793709 8203785 6562509 7135640 8977198 11678198
12135 11678198 11173085 3892518 -4060700 -2348840 6993716 10413424 4437005 2836492
12127 2836492 14076820 24893723 19066328 2144819 -7992961 -8017059 -9257195 -14760844
12119 -14760844 -15016634 -7402636 -1851246 -2701195 -1454725 5487448 7407147 -2602625
12111 -2602625 -13577745 -12882419 -5653865 -4790183 -10268469 -12903867 -12052090 -13768169
12103 -13768169 -15344876 -8518953 2458394 2629793 -10759242 -22027636 -18995728 -8237821
12095 -8237821 -1916983 -1037930 -61317 1269540 -96324 -3377124 -6731284 -11365033
12087 -11365033 -16084441 -14427259 -4815866 3239445 1831492 -2995060 -1645569 2612271
12079 2612271 246699 -5920192 -3570566 8155158 15404080 10292530 1565809 -539881
12071 -539881 1663912 1280157 -1242854 -2536046 -4871988 -11220893 -17115680 -16176494 -10303607
12062 -10303607 -6837981 -8378995 -12054691 -15799715 -18386498 -16123995 -7294928 1856569
12054 1856569 3330726 -1232858 -2911121 905731 3011557 -2309555 -11548262 -17846141
12046 -17846141 -18906550 -16657470 -13581487 -11212832 -8628397 -2406655 7119829 10687760
12038 10687760 -957395 -21864879 -33446349 -25997203 -9986130 -1389749 -3403067
12031 -3403067 -8511327 -11190898 -10569339 -6194642 142094 2473281 -1177186 -2787875
12023 -2787875 4461191 13055661 10315758 -1727774 -8363143 -4350789 -593121 -5151431
12015 -5151431 -10629223 -7713145 -806083 -557786 -7409033 -11930931 -7923863 2303243
12007 2303243 12870096 18336656 15734082 8394946 4941792 9198129 14408804 12791687
11999 12791687 6697744 3729736 4749803 4680249 2352361 841864 -488823 -5323052
11991 -5323052 -11917306 -13999286 -11111948 -9849288 -12976374 -15090482 -11696277 -5414979
11983 -5414979 -63870 4674389 8990529 9745964 6126404 3155417 4562173 6473255
11975 6473255 3420310 -2709614 -5121020 -1572983 3459160 5305239 3850460 1711170
11967 1711170 421983 -862711 -3736533 -7692667 -9440795 -6502082 -957323 2568578
11959 2568578 2245553 -84371 -2577890 -4681205 -5296103 -3310246 176545 3298148
11951 3298148 6063115 8179252 6806668 1710309 -408989 5665235 13293285 11685285
11943 11685285 2857421 -730543 3637534 4506101 -3831503 -10766904 -6627943 1748599
11935 1748599 3142754 -541862 -1038676 102980 -4259073 -11601607 -12646875 -7467556
11927 -7467556 -5901463 -11812978 -17977277 -17893877 -13491313 -9450722 -7432032 -7498837 -9346336
11918 -9346336 -11218191 -11831630 -12256797 -12125384 -7706512 940664 5906955 1787481 -4991107
11909 -4991107 -5825797 -3669187 -6774674 -13670693 -16600418 -16022609 -17922194 -19367612
11901 -19367612 -12125267 18668 3829216 -2052054 -4908411 -210050 1314067 -5294101
11893 -5294101 -8744053 -1514220 5718330 2073484 -4595766 -1046671 9656833 14936216
11885 14936216 13220180 12018688 10891619 2520378 -11095371 -18620931 -16564802 -13379577
11877 -13379577 -13794143 -10985025 276034 11738927 10432153 -4638345 -20384012 -23360507
11869 -23360507 -12524351 1406263 7231701 2874085 -5629329 -12065184 -14464245 -13484144
11861 -13484144 -10943946 -9814421 -10989851 -9951007 -2015281 8760833 12602287 7473020
11853 7473020 2252540 3572346 6778231 4336478 -3202301 -9649163 -11481862 -9464184
11845 -9464184 -6663586 -7792142 -14863083 -21303219 -17921862 -7358245 -3093462 -9933006
11837 -9933006 -16387550 -12840241 -5636262 -4041401 -4748366 -1407426 723617 -5584210
11829 -5584210 -13024890 -9123132 2774190 8252638 4790735 3479729 8543452 11662062
11821 11662062 8496547 5296599 5247145 2391655 -5545573 -10749088 -7985671 -3259343
11813 -3259343 -3588101 -7121017 -9267225 -10395594 -11560820 -9953500 -4416832 808034
11805 808034 2872139 4837452 8987181 11921849 10953937 9189942 9307225 8175308 2968092
11796 2968092 -2729269 -4452699 -3912883 -5153706 -7710782 -8831213 -8909390 -9467717 -8713532
11787 -8713532 -4349978 1228500 3345831 1564418 5329 1705438 5215215 6301329
11779 6301329 1772617 -7133017 -14510442 -14934538 -9436072 -4128422 -2816218 -3906459
11771 -3906459 -4567575 -4060726 -2368917 402741 2097690 -283580 -6074419 -10677919
11763 -10677919 -10598956 -6092222 605795 5941528 5072985 -3331244 -12384896 -12939202 -5193704
11754 -5193704 1114077 -718630 -7022511 -10482812 -8916085 -5195599 -2587191 -1973942
11746 -1973942 -1025646 3449571 9309272 8258926 -3065249 -14834529 -15384185 -7923725
11738 -7923725 -5025963 -8107839 -5944671 4950316 13079974 10131107 2876415 -302582
11730 -302582 -2426751 -8433028 -13562462 -11669720 -6371976 -3509368 -311485 7300229
11722 7300229 13995591 13300648 10456966 14587559 22470283 22943840 15091699 9571027
11714 9571027 12081733 16461495 15265968 8381966 130049 -5096934 -4291181 852928
11706 852928 3287915 -872618 -6070084 -6046544 -4181500 -6119472 -7117373 896902 12522013
11697 12522013 13658607 3771157 -1217907 7609926 18934575 18075614 6407034 -4067436
11689 -4067436 -7324885 -5915655 -2483539 2860717 8982529 13527318 15313545 14006628
11681 14006628 9554424 3733064 -940742 -5079623 -10962634 -16272375 -15268813 -8374269
11673 -8374269 -3805884 -5739692 -7393662 -1374179 8826509 14559675 14967129 16180259
11665 16180259 19487871 18564365 9885667 -106272 -1367843 8635752 21874718 26867787
11657 26867787 19010337 5176971 -2469870 1393182 10062756 12839759 6612904 -2496658
11649 -2496658 -7253301 -5810894 -670987 5038079 8594835 7482233 1202426 -6608448
11641 -6608448 -10260999 -7876307 -3942544 -3702581 -5685710 -3428299 4661797 11683820
11633 11683820 11360666 6549855 3988721 4083932 2343467 -1190442 -1707512 1282142 2602019
11624 2602019 693578 376963 3476053 4632304 1027767 -1332778 2579793 7491792
11616 7491792 6311382 2400437 3747966 8722830 8732510 3617637 2263724 6304100 5574726
11607 5574726 -4995078 -15050064 -13756201 -6468523 -5839933 -11985852 -13765220 -7674593
11599 -7674593 -2586533 -3895261 -5092151 -609269 3090076 -2300320 -12661075 -17238117
11591 -17238117 -14703578 -12949413 -14147598 -11154276 -1292474 6295619 2953153 -6845421
11583 -6845421 -12184835 -10348207 -7099877 -5132217 -939140 6339282 11014171 9224428
11575 9224428 5479188 6113605 9802956 9930188 4916242 723041 2128804 5852656
11567 5852656 5032859 -1839177 -9461766 -12345554 -10291300 -7332835 -7496819 -11947721
11559 -11947721 -18114694 -20840294 -16614037 -8092647 -2480984 -3681050 -7876168 -8867382
11551 -8867382 -5549795 -1133882 2742322 6451872 8025307 4196394 -3109389 -6870919
11543 -6870919 -4243710 -977904 -2919281 -7426763 -8321413 -5937147 -5421503 -6445273
11535 -6445273 -2787309 5825184 9354544 845320 -10964233 -10893896 1791202 10583609
11527 10583609 3011811 -12560364 -17742767 -7119116 7652314 14876678 14695387 12379829
11519 12379829 8870846 3232185 -1969508 -4104051 -5000126 -6330043 -4898246 958540
11511 958540 4780449 258942 -7086139 -6448575 1278947 3966731 -3060377 -9975111
11503 -9975111 -8465624 -4917679 -10354627 -23788452 -33398037 -30985137 -19054057 -5561840
11495 -5561840 3322493 6227393 5929251 5562779 4791567 1648895 -2284202 -2838261 146302
11486 146302 2246844 1550406 801539 1087558 -338433 -3728935 -4978599 -3190512 -3547725
11477 -3547725 -8809589 -14066103 -13986347 -9593987 -4391498 -16054 1145238 -3327684
11469 -3327684 -8784398 -5982312 4269571 8634183 132334 -10604999 -11534721 -6335720
11461 -6335720 -4404124 -3573701 3257868 11852095 12692581 8615621 10386919 17166192
11453 17166192 17535493 9864886 5861669 11345655 17462273 14961935 5659316 -3849620
11445 -3849620 -9534568 -8281950 896808 11483208 14978685 13179874 14281829 16200067
11437 16200067 7444279 -12297119 -27024447 -26159353 -18320605 -15734487 -17057177 -14957789
11429 -14957789 -10076123 -6864810 -3999293 679720 2856982 -485701 -2610050 3030551
11421 3030551 9990955 7302234 -3080908 -8613715 -4079870 3247099 5843779 3949136
11413 3949136 814004 -1895566 -2739501 -1241084 -962360 -5842290 -12718617 -13536025 -6359561
11404 -6359561 1465621 3140782 191452 -2516830 -4998098 -10656975 -18612093 -22792262
11396 -22792262 -20046024 -15478565 -16158473 -20869308 -20852855 -12043763 -1797538 343744
11388 343744 -5029069 -9198233 -7095464 -1150709 4973419 9711243 10917340 6701691
11380 6701691 17775 -3289125 -1779838 1484288 5592568 11728218 16747536 14978903
11372 14978903 7407271 869742 -2946447 -8473442 -14701473 -13628681 -4101758 3900824
11364 3900824 4550760 4955719 11322478 16836541 13058308 4742729 2310978 5925645
11356 5925645 7921960 6158120 4372335 3086315 242830 -2160541 -1332933 -264724
11348 -264724 -1903626 -841341 8441097 18246800 14869429 -1483500 -15578970 -16918675
11340 -16918675 -10158300 -4390344 -2335020 -2966161 -5525387 -6885717 -2291419 7460889
11332 7460889 15493210 18185839 19183855 21778961 23498368 21228943 16164529 10567300
11324 10567300 4460479 -1653260 -5311807 -6005171 -6508642 -8185028 -9176282 -9253766 -11818927
11315 -11818927 -18370846 -25046448 -27428830 -25246010 -20012706 -12109647 -3235949 2166637
11307 2166637 2011549 398170 2162086 5370477 3831919 -3027859 -7244672 -1683098
11299 -1683098 9895382 15725668 9702513 -929637 -4546400 78684 3000961 -2408129
11291 -2408129 -10094219 -10001242 -1631903 6238724 7105112 3158065 1251890 6173260 16749924
11282 16749924 25578825 24464652 13220239 684691 -5934500 -8718340 -11699848 -11233249
11274 -11233249 -1782679 11708559 16981337 10316267 659586 -3653065 -4228421 -5688343
11266 -5688343 -6746561 -3376399 3299360 7074636 3291230 -6516618 -15214839 -15346579
11258 -15346579 -6494288 3116311 5672170 3158110 3035768 6190233 6265455 1157601
11250 1157601 -3060640 -2318063 -800977 -2426920 -2966724 2764702 10774612 12650120
11242 12650120 8098640 5017404 6989783 7999869 2511818 -4738552 -4560787 3088841
11234 3088841 7663785 2170044 -6464018 -6464435 2110382 7317211 2511700 -4772157 -5242300
11225 -5242300 -1469043 -1763403 -5964783 -6633476 -1823182 2834654 4510561 6859218
11217 6859218 12040057 16507225 16566637 12068137 3697788 -7110815 -15123994 -15291850
11209 -15291850 -10698948 -9339031 -12408735 -14122052 -13673727 -16601088 -21482826 -17494139
11201 -17494139 -1716519 12108097 11057872 350587 -6492504 -6617545 -5575220 -2982826
11193 -2982826 5705023 16375186 19114098 13744380 10144928 12126557 13060426 9863525
11185 9863525 8943268 13091851 13627872 3433229 -10426581 -15776032 -11416407 -5798323
11177 -5798323 -3688576 -2651989 -643359 1107855 2647145 5875092 9729759 10258431
11169 10258431 6587541 2380616 512384 274130 251750 -372584 -3832364 -11998668 -21109461
11160 -21109461 -23326673 -16106456 -5809539 424207 1863553 556891 -3778586 -10205082
11152 -10205082 -12812089 -7499865 246823 1549889 -3309269 -5695139 -1448543 4583096
11144 4583096 7522855 8286916 8125402 4500550 -3667775 -12099696 -16437726 -17012001 -15165342
11135 -15165342 -9922123 -2413719 1289915 -2804612 -9965998 -12115600 -7494783 -638139
11127 -638139 4879057 8999315 11955526 12738136 10676677 6600640 3315429 4953629
11119 4953629 12372687 19003809 17012474 9048609 6476872 12554072 15989165 7542653
11111 7542653 -5372729 -9941804 -7050974 -7565100 -13346010 -14530197 -5609133 6755870
11103 6755870 13920127 14716927 12689357 10819085 10788507 12097458 11490447 7974615 6607684
11094 6607684 11230308 16326496 14238250 7718058 5266520 5990756 1256174 -8573592
11086 -8573592 -12596349 -7523975 -3892182 -8287801 -11838401 -5148986 5250000 5909158
11078 5909158 -4392482 -14483010 -16110051 -10887616 -4157426 751829 2761134 2622819
11070 2622819 2092335 1280756 -1107916 -3481730 -1323777 6158730 13452650 15288865
11062 15288865 11732990 5112754 -2674504 -7767648 -6012966 -429497 -38791 -6850614
11054 -6850614 -11304190 -6506057 314534 -1362714 -8802221 -9942312 -1053250 8816508
11046 8816508 10721166 5520376 -332452 -3050186 -3801436 -5663913 -9012194 -9300265
11038 -9300265 -1797301 10216113 16313195 11110879 1227734 -3969182 -3874336 -3403903
11030 -3403903 -2678050 2364446 10910049 16646527 16867172 15895636 17412276 18069159 12022008
11021 12022008 -128425 -10070809 -10594507 -4591292 -2359132 -8470910 -15133262 -12995346
11013 -12995346 -4776240 -496270 -1553907 -153481 5056740 5365131 -1771325 -5477253
11005 -5477253 1745085 11031619 10954840 4619393 1161689 -1169535 -8760443 -15408357
10997 -15408357 -8468045 8752438 17131180 7323088 -8529414 -15307891 -12944565 -9486781
10989 -9486781 -6584726 -862305 6487316 10285236 9221935 7000209 6651077 7688371
10981 7688371 8135377 6751703 3896874 1607193 1973488 4826167 7955033 9433129
10973 9433129 8709368 6623977 5866287 9275756 15287089 17809611 14052381 9263145
10965 9263145 8920112 9655513 4867440 -2970319 -4518713 1465434 4512964 -2681009
10957 -2681009 -13101338 -14437480 -4538644 7524451 13106896 11843009 9055182 9356394
10949 9356394 12991374 15942496 13105382 3021725 -9509291 -16262690 -12763409 -3594265
10941 -3594265 1010810 -3872510 -11627451 -12365452 -6105670 -1761287 -2855233 -2552008
10933 -2552008 3569728 8479722 4477661 -4051566 -7838291 -7495378 -10399266 -15798666
10925 -15798666 -14782931 -5248923 3950885 5960155 3772228 2400106 1642906 267138
10917 267138 234033 2851920 6237691 9154265 11682496 10555584 1280470 -12331802
10909 -12331802 -18738635 -13152088 -4119402 -545429 402748 5535918 12387024 12871591
10901 12871591 6724464 2197483 4156744 9099182 12389508 13903160 15111276 15934916
10893 15934916 16565188 18322638 20377775 18704414 11046848 1255935 -3954163 -2235070
10885 -2235070 2378452 4963969 5273909 6163428 7801152 6814337 2031595 -2432613 -2591726
10876 -2591726 -497794 -1023123 -4425613 -6390986 -4671813 -1223892 2112032 5438945
10868 5438945 7811104 7074671 4019892 2524448 4025608 5867915 6826029 9804211
10860 9804211 16047330 20335985 16052889 3635105 -8923368 -13421969 -7987602 2381985
10852 2381985 10440812 12871438 12565579 13907528 16498735 15964173 10615497 4087144
10844 4087144 773708 1356522 3253945 3006816 -1453552 -7821927 -9551953 -3241273
10836 -3241273 4823528 5098996 -1993500 -5766590 139855 9595994 13579983 11499938
10828 11499938 8298106 5829583 3140247 1682889 4087323 9227996 12981931 12853737
10820 12853737 9247121 4449754 2415351 5664496 9805007 6420144 -4568223 -11567488
10812 -11567488 -6478795 2845229 3696484 -3101060 -6658524 -4614962 -5267852 -10827624
10804 -10827624 -12177461 -4872843 1557694 -2246702 -11207689 -14268677 -10144933 -5374228
10796 -5374228 -1780664 4108890 11755776 16253356 16627843 16344748 15788057 12046920 6408704
10787 6408704 4192291 6115308 7559969 7838521 11764738 19215640 21912134 15542858
10779 15542858 7294230 5057077 6023142 3379119 -1820386 -4398145 -5880399 -11091325
10771 -11091325 -16264099 -11669016 3165541 16722961 20321603 17132107 13410600 9023255
10763 9023255 1563091 -6714556 -12031029 -14956895 -17754338 -18697641 -14017762 -4273496
10755 -4273496 4763455 7124301 1090487 -9644819 -17819130 -17606553 -9547189 405640
10747 405640 6905006 8947904 8765516 9644396 13533834 17611398 15322544 5232399
10739 5232399 -3869948 -2928029 4798886 8877505 7164542 6220155 7483591 5372985
10731 5372985 642179 2167366 10799934 14534472 6878864 -2112818 -2136531 1187135
10723 1187135 -2630731 -10984110 -13387126 -7829797 -288531 6431966 12185411 13072846
10715 13072846 6878634 514785 1282648 5268379 5140645 3973132 8814808 15521041
10707 15521041 14405471 7968866 7848661 14905130 17220035 9128294 -1398081 -6422594
10699 -6422594 -6522350 -3401348 3506693 9859976 7644590 -2090867 -7882883 -3490289
10691 -3490289 3949762 5013143 -854912 -8178877 -11871395 -8784378 -112136 6942932
10683 6942932 7256199 6450866 12454747 20572537 18931883 7802704 -107592 941516
10675 941516 4419323 6819371 12219280 18241617 14315431 67040 -10390912 -9777222
10667 -9777222 -7854751 -12537233 -17070033 -15896522 -16630275 -23458428 -24596627 -12113238
10659 -12113238 -81083 -4369701 -15676671 -13273570 2277279 11798049 8530328 4276290
10651 4276290 4687068 396874 -12088549 -19869165 -13448790 -2944926 -3605773 -14356409
10643 -14356409 -21276155 -17085317 -7777834 -1806551 -102009 2089004 7431571 12839219
10635 12839219 13371241 8596373 3064771 113286 -1748601 -4685671 -7458150 -8462498
10627 -8462498 -9308204 -11503110 -12784475 -11143386 -9438622 -10813706 -12019347 -7356614
10619 -7356614 1679087 6480300 1656842 -8844110 -16590182 -16716705 -11036145 -5561332
10611 -5561332 -4994608 -8339371 -10791144 -10445804 -10337577 -12368289 -13020218 -8461307 -1125781
10602 -1125781 2693768 316278 -5430974 -10497238 -12906605 -12597173 -10388923 -7219859
10594 -7219859 -3878609 -1892962 -3278949 -6889882 -6940328 -183169 6339031 1649495
10586 1649495 -13606272 -25081958 -21768268 -8978552 310915 1636529 378192 604232
10578 604232 78370 -3591832 -7823317 -8832236 -7737719 -9445320 -15275297 -19819209
10570 -19819209 -17840439 -11962960 -8389281 -6244097 774850 10800677 12113604 464081
10562 464081 -11878761 -12701362 -6481772 -4546479 -7439931 -9106080 -10289670 -13639645
10554 -13639645 -12918654 -3030915 5717681 980769 -9626553 -9207644 345038 2303422
10546 2303422 -5841381 -10336664 -7223081 -6192226 -7475647 -283063 12519417 14148903
10538 14148903 3387851 -1898602 3128557 2285585 -9379188 -14483461 -5881856 -1004702
10530 -1004702 -9131882 -13160325 -1420399 9934783 5992638 -1228113 3337242 12604750
10522 12604750 16256050 20095016 26036899 19152001 -2741240 -13765227 666537 16484157
10514 16484157 10062877 -3212157 423713 11681218 10709723 4612675 7411460 8318471
10506 8318471 -3534836 -9015373 7986548 24824050 17855690 6097505 13195463 19626602
10498 19626602 3616818 -7526940 12702368 28741772 4397596 -16635251 16863288
10491 16863288 52752101 19485211 -4160880 137599542 409059845 552915117 410769867
10484 410769867 139007029 -4509930 20086170 59770226 30283343 -6701644 -280845
10477 -280845 8940749 -13025253 -31033592 -15407269 5091969 2592141 -3221697 8100426
10469 8100426 18577355 11006589 2071505 7603032 13369973 6176812 118667 8312790
10461 8312790 18212224 16102551 9764541 8755805 7031390 973984 462473 7589817
10453 7589817 8450204 -197307 -695940 14539178 26138559 18221624 3264765 -912439
10445 -912439 1448642 -1620175 -5719691 -315483 9651732 10860150 2066866 -6859809
10437 -6859809 -9691659 -7003335 -1080374 4638411 7365640 9914989 15383112 16536805
10429 16536805 3955362 -14308081 -18559910 -6627086 1816183 -3817781 -10325798 -6673175
10421 -6673175 -3542848 -11836398 -19805653 -10887825 8106681 16405134 9513117 1932017
10413 1932017 3394776 8411978 8974755 4780097 -820535 -6161925 -10547981 -13334061
10405 -13334061 -14685144 -14926791 -13892653 -11543004 -7148851 820768 9761366 10770792
10397 10770792 -755921 -14304982 -14167607 -263996 11433747 10279400 2001553 -3161657
10389 -3161657 -2229130 2917892 8746642 8534078 -1482162 -12692942 -12577578 -3532493
10381 -3532493 629474 -1864269 1916168 14614151 20069942 8714668 -6140096 -9111247
10373 -9111247 -4154933 -1841595 351726 9169332 18349356 17196385 8769416 3932780
10365 3932780 3169859 -988956 -8128585 -10808637 -8310537 -6778816 -7685370 -7211565 -4948328
10356 -4948328 -3218883 -510910 4704055 6983829 1071246 -7069741 -7232429 -677033
10348 -677033 2288858 -772330 -1340179 5347985 12765273 13172563 7891805 4583655 8619997
10339 8619997 18122754 24548768 19570322 4649421 -8952771 -13077649 -11168682 -9772877
10331 -9772877 -7991475 -2260303 4567949 7845457 9805005 13878541 14955522 6680740
10323 6680740 -4717593 -6557644 1282642 6252459 2820398 -824001 1001375 1399790
10315 1399790 -6250633 -15600692 -16208076 -8572002 -1758060 164276 1438796 5784400
10307 5784400 10770488 11787666 7689506 1321768 -3588994 -5241852 -4383921 -3189124
10299 -3189124 -4231872 -9757765 -19084536 -25789092 -21633828 -6915190 6697913 9109734
10291 9109734 4891077 6304383 14605185 17644132 8387966 -3623289 -5830607 -890285
10283 -890285 -2150359 -13533291 -23681418 -21900016 -11866560 -4569739 -2985189 -851076
10275 -851076 4924945 8203070 2701760 -7812838 -13215374 -9298125 -2228083 -657822
10267 -657822 -6500802 -14362141 -17860848 -15250986 -9983862 -6901190 -7849499 -10731634
10259 -10731634 -12123503 -9690985 -2940841 5332761 8235586 216152 -14127067 -21515145
10251 -21515145 -14967579 -3520604 -1112713 -8708340 -14663571 -11481308 -4175238 -929697
10243 -929697 -2495047 -3515449 414410 9036142 17086525 17110473 6763449 -6477727
10235 -6477727 -11995565 -6849990 4162673 16514806 27217611 30872263 24266826 14516590
10227 14516590 12189602 15387587 11899991 -490940 -8405157 -2888090 6773249 7098555
10219 7098555 -1374819 -8498688 -9348136 -6528318 -4472454 -8377770 -21107681 -34228066
10211 -34228066 -31618319 -11100098 7286036 6031158 -5921619 -7647830 3446715
10204 3446715 12353595 12334159 11555073 14664501 15762620 12669805 12234057 16425432 16973931
10195 16973931 9742013 2127110 -132640 -1814682 -6660309 -8254117 -1563579 6113393
10187 6113393 6270312 3432960 6609870 12337911 9446114 -1659835 -7896736 -3161462
10179 -3161462 2838884 -69106 -8095982 -11280813 -8595952 -6519180 -6320811 -2544200
10171 -2544200 5582167 10144404 5576939 -2861259 -6640632 -5218538 -4131257 -5565788
10163 -5565788 -7152136 -7344184 -5241216 2232727 14743980 22336120 15214054 -406548
10155 -406548 -7697120 -2045912 4121886 2749185 1748978 7845276 12728009 8325609
10147 8325609 3030035 7480320 14452353 10487924 93466 -1042224 7350510 10759828
10139 10759828 5953542 5232111 12201528 14371963 6217873 -91836 3657377 7320078
10131 7320078 1659796 -3837588 2795233 14319215 14968122 4386825 -4574852 -6031196
10123 -6031196 -4249647 -859959 6479648 14079403 13888756 5721574 -2182298 -4660725
10115 -4660725 -2940891 2196049 11017108 19095988 20120250 14785574 9348140 6197483
10107 6197483 3577294 2735625 5974490 8741519 3883514 -6151564 -11473634 -9625158
10099 -9625158 -7875387 -9656649 -10019213 -6972734 -5565562 -6575010 -2962576 6354160
10091 6354160 10526661 2720881 -7802129 -9035754 -3321646 -564622 -1312625 1270158
10083 1270158 6643679 6427990 -2214373 -12980282 -20173574 -23280601 -22150670 -16636931
10075 -16636931 -11638093 -13634454 -20363301 -21863418 -14056892 -3834704 2013707 5259673
10067 5259673 9416305 11378758 6236414 -3401386 -9032832 -6235283 764942 3944485
10059 3944485 -1197130 -12002873 -20464570 -19548852 -9246223 3502009 10419618 7198478
10051 7198478 -4156286 -15603338 -18166960 -10914630 -3143169 -3306650 -8123780 -8493988
10043 -8493988 -3826740 -2369273 -7858472 -14769506 -17967392 -18119704 -15367113 -7038819
10035 -7038819 4594767 11404318 11035719 10788876 14672044 15952891 9553662 2623923
10027 2623923 3773641 9645738 12016694 11155258 11333957 9528879 1032873 -8296796
10019 -8296796 -8519732 -1680176 1384220 -1395084 -1981775 1994738 3535261 -64196
10011 -64196 -2359370 451571 3958877 4912976 5800359 6899567 4025962 -2129906 -4262684
10002 -4262684 -30273 3929608 3252009 1588900 1447302 -384105 -3772906 -2518493
9994 -2518493 3458849 4175446 -4701486 -12649510 -9920698 -3084460 -4314939 -12370502
9986 -12370502 -15548574 -8988837 1343471 9018441 12589654 12687113 10750005 8924914
9978 8924914 6746604 1736239 -3287744 -638481 9316937 14523383 8210887 173235
9970 173235 954536 4226639 -1539235 -11726472 -12590526 -5072562 -3331691 -10174227 -12483349
9961 -12483349 -4439360 2209551 -2034384 -9473393 -9408698 -4809650 -3815284 -4419636 -210990
9952 -210990 4973150 1399175 -9762713 -16091004 -11541542 -4497007 -4743297 -10078871
9944 -10078871 -11375793 -6290746 -1273166 -938234 -1682698 1789069 7922051 10597967
9936 10597967 7851045 3232089 -1015252 -6175176 -10928266 -9504191 -546758 7138560
9928 7138560 4246453 -5945480 -10743460 -3953560 7221031 12194182 9001665 4167478
9920 4167478 3941947 8276704 12096453 10658597 3797194 -4396492 -9703355 -11262297
9912 -11262297 -11368930 -12862415 -16670531 -21161421 -24372424 -26953808 -30307509 -30975436
9904 -30975436 -22343158 -6169621 3928299 -1265517 -12048179 -12720496 -5113462 -4844943
9896 -4844943 -15756702 -25534108 -28411763 -31772929 -33543851 -15940858 23158483 52568706
9888 52568706 43372985 9182971 -12226011 -8896907 -2019874 -7518081 -15953836 -13931941
9880 -13931941 -3915668 4564311 7934942 6457055 1204253 -2614242 -111796 3602994
9872 3602994 -395590 -8653204 -8817843 -239243 3955016 -2018177 -8756586 -9000311 -7482613
9863 -7482613 -7989576 -5474269 2078624 7730740 8642888 11559858 17869373 17204499 4929589
9854 4929589 -7565006 -10391618 -10092441 -15325520 -19815345 -13587252 -1602634 3708080
9846 3708080 1835596 1877067 5605851 6450609 2550474 -1494313 -4405509 -8895570 -13334612
9837 -13334612 -12457351 -6544546 -1894359 -1631247 -2261103 261306 5469921 9137445 6685152
9828 6685152 -1993344 -9682202 -8294749 105864 4959047 2140586 -870524 1510554
9820 1510554 3966145 1244765 -1285514 2912035 9122422 8584110 2731318 234695
9812 234695 3340280 6065795 3770955 -2412585 -8473867 -10067376 -5858285 -1642975
9804 -1642975 -4857016 -11737994 -9390154 4058226 12800057 5395027 -7923731 -11110414
9796 -11110414 -4785754 366260 2873203 7576259 11209893 7835906 3383305 7634270
9788 7634270 15356676 12848685 1265129 -4376173 399889 3562947 -2534775 -10269882
9780 -10269882 -10864598 -5874974 -504725 2981869 2436331 -2474402 -4480871 3297492
9772 3297492 12901245 8986142 -7515331 -18239007 -13466121 -4102801 -2202526 -4483070
9764 -4483070 -2791664 2400571 7521752 13244597 17857738 14176733 1754997 -7837736
9756 -7837736 -6565934 -1359161 -1810459 -6348891 -9600073 -13252746 -18786575 -18753378 -8019255
9747 -8019255 3402582 2169650 -8296856 -12474874 -4816119 5194789 9100706 8820562
9739 8820562 8569136 7410665 3181690 -2937136 -8887049 -14312511 -18511651 -19079406 -14576450
9730 -14576450 -7220644 -1983449 -2468356 -6449531 -6712865 322216 8091645 7425643 -166713
9721 -166713 -4336738 -1638697 -30823 -4641728 -9197998 -7527649 -4286443 -6217381
9713 -6217381 -10339897 -9800102 -5584942 -3423085 -3663926 -2737235 -631865 951925 3621988
9704 3621988 7718217 7664758 505175 -5929683 -3122050 4332229 5605759 445522 -2472020
9695 -2472020 -1051080 -1044865 -3149735 -1811101 2696379 3660395 866503 1594303 6250410
9686 6250410 5909089 -1590481 -5760944 117811 8293335 9924264 8740364 12258258
9678 12258258 18268316 20283519 19355621 19668566 17952386 8920766 -2295887 -5243831
9670 -5243831 -507881 851263 -4800425 -7994097 -2267242 4500270 1882791 -7380913
9662 -7380913 -12142037 -9286429 -6331497 -8308271 -10702768 -8036825 -2497597 933482
9654 933482 3056082 7388881 10932960 6197792 -6295252 -15197859 -12202861 -2757118
9646 -2757118 2680149 2987660 4344288 7224659 5181231 -3210935 -10668914 -12273778
9638 -12273778 -11814220 -12535008 -9304967 2856953 17683754 23362760 17251696 7798992
9630 7798992 2727161 1893647 1902821 1376795 48241 -2348881 -4345518 -3813037 -2123594
9621 -2123594 -3059041 -5965808 -4746828 3254277 11485103 11556312 3717436 -4281033 -6708815
9612 -6708815 -3653711 2960019 11183988 16539645 13686190 3269292 -6923793 -10282008
9604 -10282008 -7560572 -2847385 2003382 5466933 4035201 -2215819 -5656880 -339896
9596 -339896 7264269 5911483 -2743357 -5053482 3639344 10698183 5384018 -4298795
9588 -4298795 -4223787 4273389 8084228 3116788 -2142414 -2340169 -660859 2691378 13262893
9579 13262893 28843057 36045759 28115549 15878468 12190048 14261974 11428751 3047702
9571 3047702 -3048008 -4919526 -6807602 -7569997 -1783242 7145927 7420332 -3944233
9563 -3944233 -14581033 -12841418 -2641409 3796564 2282810 -875148 449717 5291849
9555 5291849 8946706 9077665 7331566 6221683 5632272 3880721 2365854 5404260 12478112
9546 12478112 15005339 7021747 -3907404 -4699819 5249719 13288770 11771485 7296228
9538 7296228 8130446 11744750 11002056 5556530 116873 -3456293 -5731666 -5573084 -2709038
9529 -2709038 -1176016 -4492293 -9790584 -11009850 -5311349 6105694 18614949 23173689
9521 23173689 12659553 -5793843 -13718681 -4340541 6179917 923122 -12908451 -15389402
9513 -15389402 -4169991 3673587 -1285015 -9195300 -9320007 -4492785 -1336956 846536
9505 846536 3838561 3603004 -2117917 -7036901 -4856423 1001042 2347547 -3718919 -14050721
9496 -14050721 -23569468 -26587763 -19934794 -8435821 -1463358 -1151764 -736631 3062938
9488 3062938 4854371 1551012 -1240156 446489 1748343 -828296 -1349762 4925125
9480 4925125 11627566 11846424 10747125 16413626 24537276 24552398 16715556 10790758 10283196
9471 10283196 9658351 5942034 2207304 -95800 -2538104 -3689832 -572435 4342529
9463 4342529 5823296 4416549 4173187 4057329 817794 -2111533 729883 5343083 3528324
9454 3528324 -1504822 1558269 12421384 17467349 11357757 5767023 9972073 15892812
9446 15892812 11543367 -1207138 -12256859 -18065047 -20349312 -16977263 -5959886 5216108
9438 5216108 5899214 -2289306 -5892518 2449268 13492310 12452009 -2894470 -18631748
9430 -18631748 -19073134 -3143557 14990642 21489922 15937793 7047712 203596 -4591146
9422 -4591146 -5806104 -685611 7400520 10801309 8577664 7385074 9322126 8151409
9414 8151409 1440199 -2994639 1071015 7949108 8694154 3459323 -2313826 -8195158
9406 -8195158 -16687054 -24882870 -26965532 -23252276 -19405367 -17624665 -14899139 -9500417
9398 -9500417 -3850280 -800603 -678059 -1648223 -870719 2847794 5824430 2421437 -6330107
9389 -6330107 -11290974 -5824089 6237395 16562001 21483971 21503476 17476824 12581308
9381 12581308 12397356 16600266 15836006 4200535 -10103611 -14998403 -11071000 -8184009
9373 -8184009 -8895946 -6732428 -235925 3436668 1682071 2312548 10584564 18608275 15278651
9364 15278651 2276522 -7424859 -6036480 221838 462667 -6744218 -12519361 -10210804
9356 -10210804 -4099375 -2694765 -7051574 -11344744 -12922784 -14046501 -13676500 -6908782
9348 -6908782 4517493 10563292 6828499 1265781 650686 -328633 -7813005 -15532428
9340 -15532428 -14141748 -6837235 -3185867 -2905309 667433 5255166 2969725 -2981760
9332 -2981760 -799649 9859658 15618216 10015245 2107237 238586 692320 -1972877
9324 -1972877 -5502262 -6924452 -7889933 -7469703 -1038995 7839472 7025671 -4959790 -12157617
9315 -12157617 -3987994 7092087 3879096 -9281574 -13904886 -5254731 3116547 1266160
9307 1266160 -4878434 -5226716 816238 5482044 1489179 -11077160 -22782533 -22043447
9299 -22043447 -8854792 2916100 2766531 -2660023 -1188923 5704249 6905622 774686
9291 774686 -3315021 -1642486 -683499 -3213317 -2852801 3283360 7862475 5085597 -140505
9282 -140505 -1136526 194574 -1212371 -3833507 -2345286 3420344 8221111 8320952 5108338
9273 5108338 3349567 6985404 13823357 14794263 3751137 -12087636 -18562668 -12364412
9265 -12364412 -4182461 -2289184 -3002407 -1680042 -2226670 -7912795 -12395313 -10045039
9257 -10045039 -7486458 -13127596 -21021323 -18435860 -6464676 773246 -2530096 -6764363
9249 -6764363 -3937232 351244 -2429560 -10438016 -15625038 -15180281 -12857009 -12700102 -15572210
9240 -15572210 -18722539 -16565239 -6150693 6308903 9852423 2411757 -5542710 -4283861
9232 -4283861 3860177 10300645 11390246 8618694 2763679 -5728418 -13657326 -17984755
9224 -17984755 -19403287 -18618542 -12793898 -1228748 9021595 10092153 3843380 -1131656
9216 -1131656 -1399808 -617392 -511364 2208914 8547405 13589509 13065311 8933702 5781099
9207 5781099 5022015 4873027 3692968 1804430 1388144 4505251 9614319 11461136 7095494
9198 7095494 122183 -4484256 -7215161 -10681622 -12148100 -6787940 2456349 6667445
9190 6667445 4016363 2920946 9077094 16858258 18280775 14188099 10856204 10512972
9182 10512972 11552644 14409342 20014666 23909490 19088089 6303454 -3324954 743296
9174 743296 16227704 29116935 28035332 16743189 9772473 14549956 21781007 17947795
9166 17947795 4041103 -5627885 -2605442 6389978 11345084 11336282 10260314 7981206
9158 7981206 3030795 -1065792 -152649 2692462 1154075 -3818725 -4700430 1014934 6165242
9149 6165242 3183398 -5866206 -11420115 -7543183 962704 3779279 -2370313 -8841584
9141 -8841584 -5792550 4496787 10784769 8538330 4756281 5657143 8070523 7142617
9133 7142617 4612089 3684949 2900514 1724666 4958210 13082598 14900442 900874
9125 900874 -19859650 -27938186 -17717463 -3024170 1879171 -2756697 -8037968 -8678400
9117 -8678400 -5896153 -3602063 -4366917 -6178724 -3764540 3219666 6263726 -1409081
9109 -1409081 -13033412 -15299669 -5757482 5626292 11657213 14734633 17497186 17134385
9101 17134385 12725990 9476177 10842436 13143902 12192261 9334458 7159767 4925069
9093 4925069 2002562 652784 1833444 3013021 3098775 4602762 8097401 9653457 6937602
9084 6937602 3213355 2340126 3909461 5382894 4711074 -317379 -9946819 -18600914 -19382687
9075 -19382687 -13721099 -9834698 -10631222 -11299256 -10287092 -12444432 -17674808 -17330326 -7955549
9066 -7955549 1432891 3112879 2017112 4580501 5684844 -1935899 -12565440 -14460028
9058 -14460028 -7315623 -374403 3641270 9584779 15787241 12286002 -3729903 -20847713
9050 -20847713 -26277991 -19370448 -9424979 -5323014 -9399473 -17053780 -20713641 -17188983
9042 -17188983 -10893012 -6989356 -4043502 1564802 7089329 6742229 2252990 2098825
9034 2098825 9543729 18321648 21348800 17795516 10787101 4055359 1657600 4971487
9026 4971487 8765443 5860296 -3164381 -10164425 -9869164 -4436341 2688540 10520749
9018 10520749 16581639 16220933 9068575 869293 -3719151 -5367881 -5514377 -3444421
9010 -3444421 -280135 159438 -2402700 -3314029 -1250508 -1998891 -9517987 -18360862 -20234079
9001 -20234079 -14356668 -6559947 -1475390 -236336 -2770885 -7416156 -10446376 -10329208
8993 -10329208 -10511613 -14189785 -18619050 -18749454 -14550621 -10485481 -9028107 -8484390 -6267220
8984 -6267220 -1347900 5202842 9632284 7727639 551398 -4615378 -2369978 4528218
8976 4528218 10361248 14060584 16592424 14800007 5450014 -6366880 -11008964 -6778991
8968 -6778991 -1432598 -497066 -1635363 -2292418 -4609673 -8620191 -8016606 1044416 12104777
8959 12104777 15991440 12675422 9076862 7861101 5693310 1648670 69364 3695543
8951 3695543 9233441 11335414 7224308 -2856333 -15062850 -21318384 -15134816 -613029
8943 -613029 9247348 6544027 -3010953 -8529306 -6676214 -2016746 1251569 2332092
8935 2332092 1119061 -1531132 -1824115 3013654 9015246 9209211 3447328 -1199666 -1220590
8926 -1220590 -1940076 -8872278 -18660051 -23155307 -19702403 -12994306 -8162629 -5865834
8918 -5865834 -3795200 -102156 4774148 8025165 6823797 2254229 -269159 3405769
8910 3405769 10859952 15427622 13601218 8586857 6678495 11175449 19478620 25366833
8902 25366833 24680030 19105336 13392198 9389696 5804270 3993091 8618196 18856312
8894 18856312 23822769 13988543 -4224129 -13162532 -5124943 8137926 11182084 4150231
8886 4150231 -476986 3125685 7388998 4587883 -1621252 -3046195 193309 950783
8878 950783 -2972896 -5991861 -4874182 -4365473 -8725225 -13235719 -10221241 -776714 5890374
8869 5890374 4553749 -21046 -339981 4762836 10481529 12881303 12948763 14112747 16754482
8860 16754482 16518159 10105788 2032262 796836 6609067 9150266 2439266 -4316522
8852 -4316522 966821 14511261 20980041 14933707 6377709 3885252 4034021 1320809
8844 1320809 -2466402 -4458900 -6682443 -9329723 -6713220 2943885 11497364 11962344
8836 11962344 8061646 5385583 1550427 -5690748 -9037984 -1869712 8934106 12698711
8828 12698711 11453219 13250620 14644809 6266256 -6775575 -8097199 4848523 15961333
8820 15961333 14964420 10524583 12262885 14781648 9582255 1025352 -1045467 3356664
8812 3356664 6792023 6438176 4896087 3783748 4009423 7696342 13284276 14125332 8469453
8803 8469453 4586050 8463024 13048721 8957032 -83125 -3429046 -865483 -1522712
8795 -1522712 -7188249 -9176490 -3315133 2668660 127648 -9986650 -20381843 -24628379
8787 -24628379 -19348780 -6196891 6130143 8488225 2235500 -2630519 -1750169 -885694
8779 -885694 -3486512 -3389459 3710759 9788214 4771572 -7673936 -14406599 -10448186 -3087526
8770 -3087526 621248 905508 -1000026 -6334629 -12356432 -11089756 -616959 8842642
8762 8842642 7413319 -332189 -1789499 5583604 11154677 6194650 -5827964 -15967083
8754 -15967083 -19956058 -18458645 -13034653 -6362787 -2582865 -3057154 -4304786 -3332938
8746 -3332938 -2113778 -3616107 -6760216 -9205215 -11918493 -16296530 -19330025 -16742001
8738 -16742001 -9249847 -993534 6526332 14002940 19578609 20250004 17232748 14500145
8730 14500145 12488585 8611257 3631542 1944100 5332309 11367666 17602962 22298482
8722 22298482 22302583 16688502 11511864 13488015 19451672 20418194 15773767 13260250 13923461
8713 13923461 9366700 -1858795 -7791669 -747859 9496979 10171939 4002617 1579810
8705 1579810 2550015 -1859935 -11322638 -15356343 -9603924 -1162104 3628333 6036935
8697 6036935 7381710 4603472 -2653569 -8489135 -8693144 -6264007 -5267150 -4521112 -1181685
8688 -1181685 3715209 6924214 7240445 5683807 3975688 3913411 5383143 5009361 669433
8679 669433 -3319814 -1077506 5106781 7127527 4073966 4294243 11331582 16915073 13907659
8670 13907659 7880314 7246538 8508334 2169249 -10291685 -17039978 -12957827 -5036257
8662 -5036257 621928 6061026 12051818 12535456 5793222 2128030 10297465 21949359
8654 21949359 20741917 4611753 -11824411 -16842733 -13251256 -9286975 -8437060 -11566627
8646 -11566627 -18835772 -24137704 -17318982 871195 14907233 13995938 6529161 4485991
8638 4485991 3082783 -8169102 -20903720 -15183777 8642974 26471412 24354677 16065678
8630 16065678 17126412 20303507 12202690 -1200736 -5121356 -1939641 -5533379 -14869458
8622 -14869458 -14960554 -3998108 1453383 -6917692 -15847802 -12235836 -3154217 -3092396 -11811820
8613 -11811820 -16631611 -10733215 739907 9393952 10832217 5720231 -651255 -1869721
8605 -1869721 2868131 8110895 10055584 10436432 10829910 9747659 8219904 10292742 13592876
8596 13592876 8548332 -5911531 -14991898 -6698137 9161215 12935538 1629014 -9830152
8588 -9830152 -11674924 -9320822 -9102693 -8286407 -4483130 -2914052 -6550205 -8314412 -2103536
8579 -2103536 5207668 2662374 -7841599 -13549259 -8882666 -2384043 -3729606 -10716399
8571 -10716399 -12919788 -4585681 9490944 19322452 18709839 9576809 -1039269 -7639313
8563 -7639313 -9674521 -9175444 -7531786 -5847139 -5775928 -7084020 -6127190 -268180 7239732
8554 7239732 10636597 9300613 7522277 6723132 3693805 -1597723 -2867191 3029431
8546 3029431 8577318 4591198 -5854239 -10430831 -4361225 4012324 6874498 8074069
8538 8074069 14811121 24080885 25777406 17478431 8049492 5303849 6719793 5583082
8530 5583082 1363480 -778149 1569365 5052740 6168530 6145612 8190784 11535675 11066864
8521 11066864 4050440 -4327331 -5136893 3505934 12553712 11988074 3218020 -2587712
8513 -2587712 1471998 10478473 15937961 16481948 15895947 14287277 8246590 -507217 -3831343
8504 -3831343 2381401 11538767 14601219 11603571 9668932 11495608 12181244 7998986
8496 7998986 2113992 -1251344 -3263589 -6714632 -9558840 -7969699 -4181135 -4998456
8488 -4998456 -11686369 -16654684 -12648793 -1738012 7349036 8546285 3230710 -2355739
8480 -2355739 -3073213 -24953 -30055 -7083076 -14528391 -11127785 3175966 14037225 10301044
8471 10301044 -658054 -2847124 6292428 13176421 7817432 -2973209 -6263392 -240077
8463 -240077 5359324 3123712 -3373414 -4973985 2098644 11791010 14458257 7567680
8455 7567680 -1175319 -3384030 -863477 -2379253 -9946488 -14773950 -9695660 105421
8447 105421 3954237 -542216 -6576524 -8786722 -8122847 -6245447 -1916998 4438319 7749166
8438 7749166 4091967 -3135241 -6812328 -4776169 -1362688 -408642 -250385 2678063 7606208
8429 7606208 9580003 5564824 -1952564 -8260601 -11438692 -12416557 -11396624 -7058195
8421 -7058195 295402 7291139 10728129 10859830 9980329 8946762 6895904 3554382 -355000
8412 -355000 -4738016 -9688562 -12888216 -10194087 -1090002 7933864 8645866 362599 -8366222
8403 -8366222 -9002127 -2528156 2489187 795236 -3507860 -3085745 2851952 7996612 7887360
8394 7887360 6073964 9205725 17640945 24057965 21793901 11868479 166789 -9761403
8386 -9761403 -17624019 -21538857 -17817281 -7634416 957566 2285407 1341804 7084244
8378 7084244 18863167 26349132 23721426 16673721 12115528 7971041 -481423 -9185283
8370 -9185283 -8991961 266591 7670920 5207120 -2467960 -5645863 -2253495 1539856
8362 1539856 792703 -2893339 -5310250 -5148899 -4091689 -3376680 -2418912 -865239 -347545
8353 -347545 -2708494 -6815292 -8818160 -6238726 -724481 3814414 4791293 2392501 -1191165
8344 -1191165 -3787079 -6100175 -12061742 -23188612 -32681490 -30177881 -14611908 2489337
8336 2489337 10061604 9258702 7701643 7083288 3659461 -2198433 -5585009 -5623541 -6492496
8327 -6492496 -9250899 -10076877 -8013080 -7129146 -8682237 -8193767 -3542862 617476 451552
8318 451552 -1134641 -627804 -151674 -2219953 -3605954 -1098327 707873 -4999900 -15887794
8309 -15887794 -22084572 -18772539 -10586581 -3045309 3786062 10888736 15375958 14434476
8301 14434476 11153671 11563248 16095425 17911996 11509089 576259 -5806109 -4085048
8293 -4085048 539976 2745180 4096302 7678889 10137324 5970815 -1946331 -4033328
8285 -4033328 2841454 10989836 12717078 8764680 3363091 -1986304 -5820366 -4831240
8277 -4831240 -84280 1137008 -4097763 -7902394 -3114297 4094869 2321187 -7997330
8269 -7997330 -15680051 -15255860 -11761716 -8677648 -1945871 10070395 19432830 17703528
8261 17703528 7322663 -1546210 -2851940 839283 3889810 3914017 2623969 2456023
8253 2456023 3409652 3744701 3320786 3677436 3806877 -279330 -8670282 -14256939 -11315534
8244 -11315534 -4036113 -242661 485281 4487039 11508521 14066398 10156233 6972047
8236 6972047 8919895 10876835 8042389 4274189 4250852 4287080 -1111077 -8385025 -9248741
8227 -9248741 -3417262 1223475 470545 -1952436 -3040258 -6106675 -14021325 -21667518
8219 -21667518 -20481572 -9611652 1545658 3413934 -3223288 -8971756 -7205744 -423755
8211 -423755 5314657 7812489 7428139 2862675 -5584723 -11353806 -8185936 -682896 427912
8202 427912 -5460048 -7145640 468700 7260426 3476356 -4910923 -6177738 -1188934
8194 -1188934 -161633 -5304648 -9310217 -10072576 -14141143 -23090892 -27729138 -21138886
8186 -21138886 -9304086 -2956070 -4708666 -9638353 -13820576 -16609508 -17530253 -16242978
8178 -16242978 -14432860 -14111344 -14603086 -13165455 -7850392 553414 7445886 6028586
8170 6028586 -5610347 -18646778 -20402189 -9282422 2492358 3940812 -2579275 -8217464
8162 -8217464 -10231309 -11213348 -10693929 -6092155 -66500 1436227 -1375755 -1867594 2805581
8153 2805581 7751712 8451144 6850915 6499699 6376828 3034725 -4028520 -11618629 -15420883
8144 -15420883 -12650096 -5192837 -51665 -1960083 -5376885 -625001 10069602 11300097
8136 11300097 -4865943 -24578000 -27890533 -14078786 -366056 2684019 2036127 6284893
8128 6284893 11318432 9106930 1813580 -2584317 -3577900 -6752195 -11412490 -10268519
8120 -10268519 -2531742 2691157 273481 -2018565 4707374 15539028 17165839 6011878
8112 6011878 -7344447 -12196774 -8642279 -2507170 3441164 8674731 10597934 7082055
8104 7082055 856039 -3603049 -5676839 -6619561 -4511176 2746399 10888676 12875425
8096 12875425 9140368 6817906 7429393 3749722 -7245606 -16645949 -15645847 -8913994
8088 -8913994 -7273222 -11062791 -10491350 -1391949 8731483 11573185 7051380 -565298
8080 -565298 -8418634 -13921848 -13959215 -8933526 -3055562 2176509 9728403 19165871 22943823
8071 22943823 15939016 4401883 -890858 1928538 5233716 3571264 -118021 -623463
8063 -623463 2163058 4285142 3524365 1948483 3082165 7211827 9985899 6974868 -136400
8054 -136400 -4100085 -188424 8193868 13537720 11972392 5329966 -2355601 -8069484
8046 -8069484 -11025834 -12728381 -14734710 -15419132 -11357735 -3286124 2648311 2191322 -1465716
8037 -1465716 -2563637 -416987 1411600 1097914 -288796 -1760739 -2707502 -1809512 918926
8028 918926 2884527 2825856 3032116 3958540 874358 -8175050 -15038181 -10409501 1899398
8019 1899398 8850840 6012949 1504358 443992 -3532962 -15455410 -26817833 -25291091
8011 -25291091 -12052770 -525183 862455 -3008638 -3774436 -1335311 -2024923 -7968517
8003 -7968517 -13021294 -10865960 -4460445 -3100451 -9481619 -14781026 -10421863 -346702
7995 -346702 4702114 2137308 -1397054 -2712225 -5947829 -11804810 -12913964 -5334455
7987 -5334455 3258950 3836804 -1282854 -3349002 -646346 731486 -2428726 -6181898
7979 -6181898 -5917686 -2074172 1216324 499382 -3255204 -3833538 4217239 16459147 20016318
7970 20016318 8593545 -7969846 -14631581 -8420056 966658 4719769 2244680 -3009717
7962 -3009717 -7524746 -7689038 -2341641 4125784 6471110 6118621 8345420 12408346 11247508
7953 11247508 2165507 -8540552 -13941644 -14372516 -14331764 -15435286 -15204351 -10715810 -2083612
7944 -2083612 6445220 9654950 7500603 5669389 6868428 5409242 -3866518 -15047899
7936 -15047899 -17607071 -10959714 -3319700 2311856 9780164 17242976 16086031 6132108
7928 6132108 -586438 2460837 6241339 1715967 -5393596 -5571425 -1789521 -2452666 -5155084
7919 -5155084 -1398769 6396684 6842457 -1926206 -8371382 -3910018 7055931 15409599
7911 15409599 16853655 11620249 3087060 -1487437 3334015 12855489 16675659 12394928
7903 12394928 7420891 6671944 7333808 7013211 7304335 6905041 1519624 -5787299 -4939423
7894 -4939423 5214192 12128721 7725972 715263 1669159 5764933 2288673 -6302673
7886 -6302673 -8542114 -2859357 1351071 -89248 -1791819 -920888 -1769315 -6348234 -10780481
7877 -10780481 -13417741 -17014169 -20302595 -17062934 -7340884 -552222 -2403028 -6469888
7869 -6469888 -4390427 2148208 5614546 3684404 260675 -850896 1403716 5628292
7861 5628292 7319765 1920971 -8043488 -13571636 -10700989 -6151762 -6893239 -9853914
7853 -9853914 -8265172 -3024932 82221 752883 3175879 6867426 7412412 5755301 7616499
7844 7616499 12223461 10445195 -1781370 -14910432 -16209732 -4932227 7939792 12918289
7836 12918289 10279967 5810686 2852436 523240 -2527671 -5779982 -8601886 -11477914
7828 -11477914 -13140978 -8834660 3903285 18189930 22465224 14216281 3432973 -830963
7820 -830963 -1244384 -4305337 -7889683 -5466605 634799 623677 -7550141 -13796882 -9818318
7811 -9818318 -45661 5623645 4450566 1372124 657802 2025615 3427170 3663845 2346637
7802 2346637 -253197 -2683496 -2521803 1920059 8968266 12970615 9113335 3029
7794 3029 -6017520 -5200083 -2612011 -2793667 -2220313 2716758 6424596 2602207 -2456285
7785 -2456285 2243769 12639447 12294677 -2476909 -14601745 -9929248 3728059 10475433
7777 10475433 8723294 8091390 11142584 10882772 3678247 -5908764 -12506196 -14470537
7769 -14470537 -12109160 -7678603 -5494830 -6642756 -6318623 -1582751 2625529 1600618
7761 1600618 -185578 3481133 9060617 9187168 6102812 7577839 11907557 9925228
7753 9925228 1717559 -2190455 1491395 3286080 -2434793 -7883782 -5625378 -773280
7745 -773280 -913605 -3078423 -556896 4295856 4371834 197487 -1948173 -1165933 -1676683
7736 -1676683 -3435999 -2471486 -94706 -2597813 -10425248 -15661196 -12842340 -5682364
7728 -5682364 -179855 2933317 5175375 5225704 2200100 527492 5338338 13758534 16444740
7719 16444740 9252253 -809677 -3958913 781779 5873204 5719717 2558490 1347749
7711 1347749 3002768 5261286 7175685 9144845 10301596 9708052 9126655 10644183 12093646
7702 12093646 9278676 3151020 229628 4278615 11320580 14848622 12770735 7199716
7694 7199716 514452 -5621624 -9307226 -8957174 -4221303 3922747 12261694 15301587
7686 15301587 10098805 1560853 -1721484 1696335 4458348 1657691 -2139763 -1058576
7678 -1058576 2648471 3450892 2624821 5938337 12950201 15999791 10422890 17875
7670 17875 -8657171 -12461690 -10887147 -4025848 5674823 12405025 11012864 2146006 -7418817
7661 -7418817 -9990971 -3663113 5562217 9731915 7537596 4622223 4806638 5261403 2721784
7652 2721784 -418349 -717770 -190559 -2335439 -4753920 -2303662 4224393 8935332 8982418
7643 8982418 6125606 2458118 1169710 8231428 24139239 36510111 32504180 18196038
7635 18196038 12569915 20578232 26813940 20843320 13083661 15769508 22418240 20212080
7627 20212080 11916141 9133828 11120800 7951341 880098 1325042 9820243 13609483
7619 13609483 7924647 3156302 5940936 8738513 5300250 1869798 3738782 4114890
7611 4114890 -2057096 -5101791 4433274 17167224 17419761 8302061 6624682 14896317
7603 14896317 17028845 5202840 -6248785 -2437927 9478568 10987321 -1725360 -14189950
7595 -14189950 -13801638 -3596758 5359376 8142310 8596089 10845291 12720151 9376688
7587 9376688 1602141 -3611188 -2432924 -2328 -2698890 -8131459 -9176157 -5599555
7579 -5599555 -3349931 -2932526 1349647 8409656 7882011 -3194583 -11342802 -3984853
7571 -3984853 11673572 18715254 14373222 10217644 10428764 5619573 -7767678 -16573782
7563 -16573782 -9204243 4986003 6853804 -6444345 -18443238 -15769920 -2608478 9559099
7555 9559099 16639066 20241548 18532551 8067199 -6959814 -15733269 -13306096 -6576989
7547 -6576989 -4772660 -8159275 -10239022 -8183924 -5792414 -6760561 -10118597 -13383403
7539 -13383403 -15880902 -16869448 -14095687 -7327533 -731810 1720437 1582095 3262774
7531 3262774 7215539 9580172 8399704 6353742 6331802 7437200 7081928 4869709 2575723
7522 2575723 1583121 1745740 1745687 -455667 -6106937 -13022728 -15656821 -10249360 -9872
7513 -9872 6983515 6073045 633627 -3069425 -4035394 -6420923 -11387330 -13435573 -7944499
7504 -7944499 719100 3708525 -504556 -4450402 -2834720 442067 -317056 -3350014
7496 -3350014 -2898863 1399683 4794833 5574406 6523674 8162348 6881469 1714590 -2440807
7487 -2440807 -1497605 1845408 2133874 -1736400 -6679740 -10298351 -12078382 -11224707 -6900030
7478 -6900030 -423880 5290408 8513620 9366704 8448107 6685311 5937543 7654962 10914210
7469 10914210 13092543 12140649 7372441 -325029 -7096526 -7067219 1271211 10219790 9279597
7460 9279597 -2273655 -13676061 -15782346 -11043178 -6382735 -1464898 7911259 17348608
7452 17348608 15829520 2818753 -7099830 -3572812 4161771 1441878 -8623328 -9823080
7444 -9823080 1367037 10372794 8186479 4883284 10867633 18144984 13740780 2366033
7436 2366033 -692414 5220081 5380191 -5630407 -15366302 -14291224 -10189117 -13713205
7428 -13713205 -21469003 -23597879 -19456495 -15037665 -11039886 -4362872 2545902 4255417
7420 4255417 1896512 641486 -464027 -6416172 -14915058 -17321332 -11942618 -6852333
7412 -6852333 -7329440 -9490400 -9472516 -9989573 -13016912 -14183074 -10901663 -9299741 -15190772
7403 -15190772 -22871753 -21529681 -10659034 -1007344 -338235 -5286931 -8580057 -8376774
7395 -8376774 -7661548 -8095612 -7720960 -4101948 1399222 3143194 -2959567 -12466038 -15148805
7386 -15148805 -7796986 11087 -1561436 -8095556 -7247346 1991223 6766591 -567379
7378 -567379 -10915976 -11823156 -4433133 780496 -249965 -2566836 -2381426 -1074125 406283
7369 406283 3371111 6793586 7248181 4644655 2733743 3090226 3771257 4523204 7478906
7360 7478906 11338268 10856747 4579929 -2159657 -4723418 -4988669 -7025543 -11388253 -16224083
7351 -16224083 -19529071 -18031865 -9300118 2017081 6132757 619121 -5077850 -3077981
7343 -3077981 1071631 -2559606 -12169294 -16185056 -9166477 2771114 11687117 15208319
7335 15208319 14235726 10642905 8154271 9142101 9628701 3474845 -7408356 -12894720
7327 -12894720 -6511850 6915379 16506004 14645482 1991459 -11965785 -14747124 -3450454
7319 -3450454 9724270 11336451 4135572 1433533 5498169 4302924 -7657487 -18862259
7311 -18862259 -17985934 -10027471 -5827176 -5058386 -1229980 3205733 -108734 -10076464
7303 -10076464 -16054502 -13411258 -9146211 -10266551 -14604882 -15713048 -10941243 -2241268
7295 -2241268 6862248 13228772 15503129 14020946 8365142 -2172887 -13391896 -16336122
7287 -16336122 -7886529 3103463 6766212 5130180 6045553 8278899 3518918 -8223075
7279 -8223075 -16989726 -17807774 -15981128 -14978315 -10662996 -2362387 1599933 -3081486
7271 -3081486 -7395268 -1466640 10898202 18956228 19927788 17601413 11800180 726366
7263 726366 -9331054 -8608782 1983623 11661162 15130781 17088152 20242964 19653430
7255 19653430 12621606 4728797 1167131 138923 -414298 1992755 6565169 5434466
7247 5434466 -3944211 -10312370 -3118477 10165776 13464911 5709630 1706738 9339988
7239 9339988 19254054 20798070 16380493 13852249 14113828 13667141 12422834 11597914 9214291
7230 9214291 4482148 2064597 5578735 11049079 12835325 11667037 10696355 8552979
7222 8552979 3471287 -524363 299977 1555401 -2130551 -6477202 -4354635 510547
7214 510547 -1308401 -8222905 -9329342 -2687465 1816649 -532148 -3494812 -4202066 -8248839
7205 -8248839 -14787616 -12013662 3091855 14661997 10072937 376046 3813264 17876549
7197 17876549 24411830 17259211 7579716 3161967 -805962 -7942783 -12401770 -9964376
7189 -9964376 -6446301 -8650495 -14549497 -18059435 -17863351 -16658098 -15860368 -14939685 -13021135
7180 -13021135 -8875568 -2301760 3179218 2443029 -5060119 -14036442 -18727266 -16871623
7172 -16871623 -9145609 1294505 9110857 10986374 9593088 9601281 10543094 8168856 2082722
7163 2082722 -3187981 -4557397 -2912502 263402 3737774 4853630 2725644 2104170
7155 2104170 7380237 13665058 12073527 4119843 1253427 7495670 12352157 6458227
7147 6458227 -3984979 -5932350 2798921 12388557 14711278 11088687 7231979 6242434
7139 6242434 7444630 8607586 8052716 5804185 3175111 1553183 2156426 5428447 8606016
7130 8606016 6215103 -2929653 -11243663 -10519166 -3184298 1400290 935654 1658282 5213793
7121 5213793 4893070 -933631 -2527869 6232194 15429791 12043430 -521485 -7288740
7113 -7288740 -3330069 1187793 -1875005 -7356865 -6801825 -1848129 -1380414 -8809257 -17488454
7104 -17488454 -18421269 -9825796 1232351 5808086 1572527 -5687774 -8972179 -7159950
7096 -7159950 -4255460 -3197303 -2918336 -1567908 -437010 -2857853 -8880795 -12425327
7088 -12425327 -6628961 6536253 15193575 10380274 -1673992 -5787497 3411846 15221165
7080 15221165 17354313 10204310 2477242 -1485901 -3395876 -3719823 -615264 4422054
7072 4422054 7087581 7971181 13402863 25009139 33233628 27165558 9509872 -4299334
7064 -4299334 -3955863 3408177 3120783 -7756570 -17624406 -16835254 -9467268 -5104805 -5564711
7055 -5564711 -6125967 -5224276 -5049720 -4956340 -2273375 1292004 1693237 500354 2955805
7046 2955805 7993429 8607802 3396154 -703944 569944 3105977 2511828 247297 -1239418
7037 -1239418 -1946575 -203256 6635603 14439206 14493979 7291390 4032261 9230196 12701796
7028 12701796 6010477 -4163054 -8338763 -9215507 -12758893 -14092615 -6580938 2310544
7020 2310544 139322 -9830541 -13196031 -7672851 -5386167 -11220903 -15003864 -9201917
7012 -9201917 -267748 3564301 4053420 5787045 6792606 3359330 -2864896 -8482170
7004 -8482170 -13074921 -15889374 -14117579 -8659156 -5050896 -4609806 -1949180 3968705
6996 3968705 4731508 -4187416 -12460787 -7408403 6799548 13291155 4881440 -7860162
6988 -7860162 -12623262 -10226349 -8761582 -9824502 -8092926 -2075050 2412920 1017324
6980 1017324 -2660776 -3001488 -837281 -860613 -2859486 -2066006 1767351 2705334 -1668279
6971 -1668279 -5566857 -3998419 -308550 635361 1105103 5180941 9057622 5189926 -5802408
6962 -5802408 -15395231 -18634519 -18068408 -16519499 -13099478 -7021747 730555 9776024
6954 9776024 18687286 21851019 15080230 4245326 639942 6799165 14281399 16602904
6946 16602904 16276165 16675658 15156365 8755418 676107 -3434889 -1628842 4536830
6938 4536830 11929088 15828090 13237849 8061335 7403713 11041638 11005565 3701634 -4996779
6929 -4996779 -9956047 -13915424 -19194793 -20188583 -12115822 -1869728 -887672 -8966518
6921 -8966518 -13261278 -4340675 12257458 22456709 18803373 7379449 100078 1486336
6913 1486336 5480230 6122527 6416427 11249987 15872307 11040409 -1095709 -7126787
6905 -7126787 -1069654 7367999 8099218 4696291 6034966 11727578 14520015 12161430
6897 12161430 8665954 6818371 6203051 6328115 6395210 4546767 1448745 927154 3345167
6888 3345167 3600605 120286 -733691 4598350 8618613 3472335 -6116200 -10261185 -9370637
6879 -9370637 -11255625 -16065021 -15989869 -9150241 -2412285 267899 1564089 1547363 -3977118
6870 -3977118 -12497307 -13113622 -1968932 9486338 9228750 915289 -3244822 -1290015
6862 -1290015 -2972048 -12818468 -21405233 -17855941 -5046357 4041238 2944618 -2130685
6854 -2130685 -3752947 -3690225 -6779982 -9965874 -6373708 1566181 3596809 -1837167 -3068003
6845 -3068003 7438660 20482385 22681641 14189818 4836182 -1149428 -5899440 -7914235
6837 -7914235 -3368854 4197293 6947493 5307498 6413659 9606930 5620157 -6915693
6829 -6915693 -16202966 -14153570 -8063474 -7866863 -10399983 -5827201 5975041 15614447
6821 15614447 18393171 19079224 22136039 24667001 21546589 12973701 4152508 -491232
6813 -491232 -1130902 -1517758 -4711744 -9288942 -10185353 -4304532 5193056 11685929 12400208
6804 12400208 11463017 14407383 20567818 23638115 20624431 16710672 17637612 20162488
6796 20162488 16368479 6501401 -520052 -847449 -848880 -4312342 -4137329 5348810 15981143
6787 15981143 16078575 7218875 -602631 -5430050 -11573476 -14941274 -6400912 9432574
6779 9432574 15119288 4743119 -7279850 -8250005 -4169376 -5708191 -9739793 -6782274
6771 -6782274 2313720 9733035 14402259 20078192 24231792 20903983 12201882 6048263
6763 6048263 4149990 2372463 1314252 5334273 11292309 9912409 578735 -5848231
6755 -5848231 -2841995 2588153 1760939 -2705028 -2676135 2482667 6445636 6773717 7928358
6746 7928358 13037068 17705430 14463116 2128935 -10725555 -13077982 -3596110 5900085
6738 5900085 2563621 -11968628 -22486506 -18004780 -4184891 4975996 3884705 -836932
6730 -836932 -896919 4853929 12165033 17048533 17821135 14587224 8985836 3159428 -2078074
6721 -2078074 -6683052 -8748935 -5204154 3290980 10774740 11860305 7341643 1579590
6713 1579590 -3158083 -6183293 -5060971 1305226 7511590 6737627 1554266 1731824 8839665
6704 8839665 11796232 3040681 -9267145 -13237869 -10334784 -10119080 -13211775 -12025366
6696 -12025366 -6106612 -3230633 -4532039 -1946899 6399171 11357833 8846806 8278749
6688 8278749 16616689 24845978 21032914 8766696 901639 549216 467372 -1815838 -678568
6679 -678568 5809973 11567714 12133347 10451101 10587565 12170331 13536009 15228546 17939228
6670 17939228 20615026 22238907 22800888 21882194 18574400 12794941 5208122 -2677175
6662 -2677175 -7049182 -3983757 4133417 8541875 4521211 -2176492 -3765472 -637736
6654 -637736 2291418 4351160 7394902 10068277 11331904 14776363 20912928 20687136 7429494
6645 7429494 -9478660 -15311423 -10615508 -7371788 -7852837 -3896766 3494395 2409223
6637 2409223 -8955474 -17415063 -16113734 -13043873 -11772510 -2886430 15121471 25721757
6629 25721757 19689803 13174204 22404993 35445608 30799484 12831752 4243226 9482628
6621 9482628 10946483 799997 -7644917 -4393972 2392939 2836297 -707452 -3418593
6613 -3418593 -6683766 -9616922 -5666101 4510068 9299817 3424845 -2390422 2640909
6605 2640909 14145973 21603908 22642054 19667178 11851928 366953 -6417267 -3034244
6597 -3034244 4042508 6172610 4833337 5690747 7596179 6976140 6321818 8069240 6675041
6588 6675041 -1829784 -8593187 -3387280 7274498 7860858 -2619758 -9691253 -6198960
6580 -6198960 -1041071 -2029196 -4116460 -1024999 2827040 303420 -6306303 -9260215
6572 -9260215 -6667175 -2907508 -834946 541529 1925985 1654624 -1992786 -7941508
6564 -7941508 -11887370 -9757975 -3190692 631801 -2076641 -5529283 -2218126 5305625
6556 5305625 7279053 612511 -7194101 -8522963 -3420625 3828405 9374969 10081801
6548 10081801 5580927 1166245 2512995 7170013 8197412 6000085 7514095 12554268
6540 12554268 11415830 -184289 -13281257 -17667421 -13412752 -5745811 2878684 10069439
6532 10069439 11399722 7525396 5869597 9188268 10489669 5462293 528075 653205
6524 653205 -770530 -9240563 -15419217 -7245935 10430926 21658607 20560019 14147700
6516 14147700 8037484 2674770 776464 4492933 6528730 -2010213 -15141650 -17124235
6508 -17124235 -4910065 7818442 10496590 6355377 1399538 -3488092 -6192949 -2750576
6500 -2750576 2525542 -670876 -11533659 -16656544 -10991879 -6023330 -9766031 -13245426
6492 -13245426 -6957948 2642429 5352169 4546984 8991567 16561696 19569143 18590419
6484 18590419 17897113 14475589 5186679 -2137970 580809 5965184 1820200 -7738349
6476 -7738349 -8801891 -1512505 1248727 -2382213 -580446 9324035 15214377 12350463
6468 12350463 11906382 19269180 21832626 9932156 -5224956 -8022624 -894848 3483465
6460 3483465 2546988 1831064 368924 -6502450 -14362109 -14459611 -9043962 -8621382 -14856181
6451 -14856181 -18528832 -14545668 -7543817 -2033478 1913672 1961763 -6223851 -19037635
6443 -19037635 -25179868 -19627846 -9219820 -1556051 3051664 5684289 4479662 748113
6435 748113 300392 3124700 680962 -9685676 -16519659 -9598279 3792922 8785725
6427 8785725 4052772 1107927 5049144 8518102 5728962 1143286 552583 2438362
6419 2438362 2824453 1890136 1019212 -1175232 -4843192 -5164242 1966471 12664843 17961751
6410 17961751 13398611 3183745 -4486506 -4680990 708868 5600798 6473461 5754555
6402 5754555 6751098 7351451 3313180 -3336354 -5586023 -2023084 588697 -2180150 -5966157
6393 -5966157 -5615444 -3368774 -3602466 -4741335 -3049468 -457031 -1201126 -3059355 442330
6384 442330 9546087 16704458 16291923 10652204 5464150 3269758 2781383 1797709 7976
6375 7976 -113524 3416334 7226112 4963918 -3175087 -8489680 -5408319 542105 1866481
6366 1866481 -25558 -335890 -591139 -3232341 -3170109 2746005 3847666 -10490694 -28625700
6357 -28625700 -27875346 -8692191 3755070 -2458418 -8819745 1628061 16393891 15180846
6349 15180846 2389310 -3489571 -945595 -2290472 -6532990 -441453 14404437 19600009
6341 19600009 8949062 -1594037 -6513 4500039 20250 -8077444 -7937576 -191523
6333 -191523 6536693 10748375 16293467 20758316 17239894 5880629 -4987845 -8683934
6325 -8683934 -5920907 -2437483 -4526192 -13623825 -22095423 -19224986 -5341335 5728690
6317 5728690 3280161 -7291584 -14180564 -15108490 -14983532 -13287540 -5212312 6314379
6309 6314379 10773220 3852725 -7236049 -14363765 -17466863 -20443370 -23887224 -25040438
6301 -25040438 -21383608 -12539608 -1638805 4949204 3316548 -2058886 -2473272 4044858
6293 4044858 10404214 10445479 6785794 6252573 10841640 15896051 15412633 7579264 -3369312
6284 -3369312 -10084027 -8680744 -2704662 1191245 867973 -502809 -67006 2181440 5940269
6275 5940269 11046584 14994197 14622856 11249446 9674778 10993769 11070439 7543473 3274317
6266 3274317 818342 -1212586 -3439450 -2693007 2533311 8425676 11738064 14459214
6258 14459214 17846126 17111292 8795627 -801633 -2827983 835675 425918 -5960891
6250 -5960891 -8905460 -2468975 5890597 5479221 -2983335 -9038616 -6479861 -67524
6242 -67524 2136646 -714945 -1980860 2832050 9001220 8107869 -225370 -7144462 -6989851
6233 -6989851 -5024591 -7826155 -11620287 -8485208 -544417 2660217 168250 1030476
6225 1030476 7177328 7192084 -5873670 -20611159 -21206941 -8970252 742898 109662
6217 109662 -2842786 2339053 14793144 24151738 21849595 9773291 -248601 2659508
6209 2659508 15703898 24244352 19728711 10568951 9373412 14853173 15140250 5528682
6201 5528682 -7042630 -15598886 -19019034 -16493536 -6590955 6396839 14799222 18624911
6193 18624911 24846332 32937988 31943363 17609320 2487808 571405 9120782 15004241
6185 15004241 14003622 13660537 18717027 23274284 19509145 8451966 -810739 -820089 6390990
6176 6390990 10980462 5822231 -5110209 -11548698 -9419930 -3907778 -52798 3277299
6168 3277299 8083004 12558841 15244836 17927545 20495193 18676113 11200143 3497341
6160 3497341 -243850 -2619601 -5652447 -4816297 2787114 10448240 9923920 2703348 -4112061
6151 -4112061 -7996629 -9298412 -5314386 4063274 9597370 2697075 -10862464 -17993569
6143 -17993569 -16421517 -14568928 -15784259 -15358310 -12446088 -11648453 -11743940 -6200549 2599751
6134 2599751 3141607 -6742482 -14041297 -9564662 -1078598 386234 -3017411 -2642158 1571397
6125 1571397 2891313 -406639 -4186435 -6267756 -7624172 -8074428 -6795766 -5275144
6117 -5275144 -5307625 -6121918 -6493199 -6795578 -6944044 -6300244 -6719564 -9854840 -10696798 -2489699
6107 -2489699 9593492 10597000 -2912246 -14811947 -11008962 1348014 6871052 4656200
6099 4656200 4567432 7878375 7127825 2065451 498223 3514424 3859549 573903 2376261
6090 2376261 13170974 25029637 29314408 25745740 17689808 7591718 -161405 -1264867
6082 -1264867 300328 -4606609 -15492398 -20668688 -15223614 -9869510 -14658350 -23646043
6074 -23646043 -25118416 -19100821 -13848774 -10771016 -4898550 2473774 3557179 -3318032
6066 -3318032 -10867757 -13909495 -14510504 -14475030 -11527540 -6355025 -5502679 -12042300 -19134477
6057 -19134477 -18483647 -11254130 -5429321 -5398483 -9080159 -12781820 -13826207 -10319763 -3531419
6048 -3531419 842115 -1046805 -4855178 -3567572 1868332 4401201 2971393 3964491
6040 3964491 8764062 9756706 3646588 -1168082 1366196 2705904 -6756118 -18849008
6032 -18849008 -17503737 -4676792 401399 -10236000 -22022080 -20939392 -12374141 -7352028
6024 -7352028 -3631581 6022564 16516454 16874080 8946077 4926847 8150711 9871273
6016 9871273 5359468 956344 2875985 8820810 13347473 14007577 10815038 6446954
6008 6446954 6809080 14034313 20260897 17254952 10304084 11115575 17979589 17377084 7187696
5999 7187696 2164322 10184259 18851156 15906646 8926397 10989494 17818566 15602048
5991 15602048 4699240 -1732879 122379 971456 -2563702 -1418746 8650346 16894411
5983 16894411 12466388 69599 -7523896 -6458580 -3678897 -5643475 -11895130 -18016068
5975 -18016068 -19668608 -14514887 -4235351 5327472 8660976 5502882 306481 -2453650
5967 -2453650 -1580899 1199200 3856159 6580195 11404263 18346198 22864888 19442874
5959 19442874 7778612 -6361022 -16346779 -19308767 -16668991 -12533949 -10840459 -11574711
5951 -11574711 -10559515 -5220828 1375411 5485325 8733453 13607142 15534374 8033177
$$ [...]
##END NTUPLES=NMR SPECTRUM
##END=
