##TITLE=31Pdec_SR158H
 D2O, 64 sc
 24.3.2023
##JCAMPDX= 6.0         $$ Bruker NMR JCAMP-DX V2.0
##DATA TYPE= NMR SPECTRUM
##DATA CLASS= NTUPLES
##ORIGIN= UXNMR, Bruker Analytische Messtechnik GmbH
##OWNER= root
$$ XWIN-NMR		Version 3.5
$$ Fri Mar 24 15:46:43 2023 Russian Standard Time (UT+4h)  she@DPX200
##.OBSERVE FREQUENCY= 81.013821
##.OBSERVE NUCLEUS= ^31P
##.ACQUISITION MODE= SIMULTANEOUS
##.ACQUISITION SCHEME= undefined
##.AVERAGES= 64
##.DIGITISER RES= 16
##SPECTROMETER/DATA SYSTEM= spect
##.PULSE SEQUENCE= zgpg30
##.SOLVENT NAME= CDCl3
##.SHIFT REFERENCE= (INTERNAL, CDCl3, 0, 248.564)
##AUDIT TRAIL= $$ (NUMBER, WHEN, WHO, WHERE, WHAT)
$$ ##TITLE= Audit trail, XWIN-NMR		Version 3.5
$$ ##JCAMPDX= 5.01
$$ ##ORIGIN= Bruker BioSpin GmbH
$$ ##OWNER= she
$$ F:/spectra/data/she/nmr/P31/1/pdata/1/auditp.txt
$$ ##AUDIT TRAIL=  $$ (NUMBER, WHEN, WHO, WHERE, WHAT)
(   1,<2023-03-24 15:45:41.57 +0400>,<she>,<DPX200>,
      <continue with go, POWCHK disabled, PULCHK disabled
       configuration hash MD5:
       00 E9 B6 7A A2 85 ED C7 34 08 36 98 17 FE 4E 26
       data hash MD5: 32K
       33 E3 50 02 B6 CB 5D 2F FF 6B 64 D3 3B 02 36 94>)
(   2,<2023-03-24 15:45:57.85 +0400>,<she>,<DPX200>,
      <Start of raw data processing
       efp BC_mod = 2 LB = 1 FT_mod = 6 PKNL = 1 PHC0 = -10477.28 PHC1 = -267.9153 SI = 64K 
       data hash MD5: 64K
       AF 93 85 C0 6F 57 F0 3B 08 7F 59 DF B5 3C CD 79>)
(   3,<2023-03-24 15:46:14.57 +0400>,<she>,<DPX200>,
      <pk PHC0 = -54.95734 PHC1 = 152.2 
       data hash MD5: 64K
       61 B4 37 22 53 EE 78 FC E3 42 3C 24 2B 90 0C 09>)
(   4,<2023-03-24 15:46:20.15 +0400>,<she>,<DPX200>,
      <abs ABSG = 5 
       data hash MD5: 64K
       A1 87 58 DE 25 E4 94 62 37 E5 B3 E3 3D FB 5E 35>)
$$ ##END=
$$ 
$$ hash MD5
$$ E2 0F 5D 6D 83 63 F7 12 FD 2C 10 3D 77 48 8C EA
##$RELAX= 
##$RELAX= 
##$RELAX= 
##$RELAX= 
##$RELAX= 
##$RELAX= 
##$RELAX= 
##$RELAX= 
##$RELAX= 
$$ Bruker specific parameters
$$ --------------------------
##$DU= <F:/spectra>
##$EXPNO= 1
##$NAME= <P31>
##$PROCNO= 1
##$TYPE= <nmr>
##$USER= <she>
##$AMP= (0..31)
100 100 100 100 100 100 100 100 100 100 100 100 100 100 100 100 100 100 
100 100 100 100 100 100 100 100 100 100 100 100 100 100 
##$AQSEQ= 0
##$AQ_mod= 1
##$AUNM= <au_zg>
##$AUTOPOS= <>
##$BF1= 81.014009
##$BF2= 200.13
##$BF3= 200.13
##$BF4= 200.13
##$BF5= 200.13
##$BF6= 200.13
##$BF7= 200.13
##$BF8= 200.13
##$BYTORDA= 1
##$CFDGTYP= 0
##$CFRGTYP= 5
##$CHEMSTR= <none>
##$CNST= (0..31)
1 1 145 1 1 1 1 1 1 1 1 1 1 1 1 1 1 1 1 1 1 1 1 1 1 1 1 1 1 1 1 1 
##$CPDPRG= <waltz16>
##$CPDPRG1= <>
##$CPDPRG2= <waltz16>
##$CPDPRG3= <>
##$CPDPRG4= <mlev>
##$CPDPRG5= <mlev>
##$CPDPRG6= <mlev>
##$CPDPRG7= <mlev>
##$CPDPRG8= <mlev>
##$CPDPRGB= <>
##$CPDPRGT= <>
##$D= (0..31)
0 1 0 0 0 0 0 0 0 0 0 0.03 2e-05 3e-06 0 0 0 0 0 0 0 0 0 0 0 0 0 0 0 0 
0 0 
##$DATE= 1679658261
##$DBL= (0..7)
120 120 120 11 120 120 24 19 
##$DBP= (0..7)
150 150 150 150 150 150 150 150 
##$DBP07= 0
##$DBPNAM0= <>
##$DBPNAM1= <>
$$ [...]
##$SUBNAM3= <"">
##$SUBNAM4= <"">
##$SUBNAM5= <"">
##$SUBNAM6= <"">
##$SUBNAM7= <"">
##$SUBNAM8= <"">
##$SUBNAM9= <"">
##$SW= 501.771253377433
##$SWIBOX= (0..15)
0 1 3 0 0 0 0 0 0 0 0 0 0 0 0 0 
##$SW_h= 40650.406504065
##$TD= 32768
##$TD0= 1
##$TE= 0
##$TE2= 300
##$TE3= 300
##$TEG= 300
##$TL= (0..7)
0 120 53 12 22 120 120 120 
##$TP= (0..7)
150 150 150 150 150 150 150 150 
##$TP07= 0
##$TPNAME0= <>
##$TPNAME1= <>
##$TPNAME2= <>
##$TPNAME3= <>
##$TPNAME4= <>
##$TPNAME5= <>
##$TPNAME6= <>
##$TPNAME7= <>
##$TPOAL= (0..7)
0.5 0.5 0.5 0.5 0.5 0.5 0.5 0.5 
##$TPOFFS= (0..7)
0 0 0 0 0 0 0 0 
##$TUNHIN= 0
##$TUNHOUT= 0
##$TUNXOUT= 0
##$USERA1= <user>
##$USERA2= <user>
##$USERA3= <user>
##$USERA4= <user>
##$USERA5= <user>
##$V9= 5
##$VALIST= <valist>
##$VCLIST= <CCCCCCCCCCCCCCC>
##$VD= 0
##$VDLIST= <DDDDDDDDDDDDDDD>
##$VPLIST= <PPPPPPPPPPPPPPP>
##$VTLIST= <TTTTTTTTTTTTTTT>
##$WBST= 1024
##$WBSW= 4
##$XGAIN= (0..3)
0 0 0 0 
##$XL= 0
##$YL= 0
##$YMAX_a= 3865
##$YMIN_a= -3972
##$ZGOPTNS= <>
##$ZL1= 120
##$ZL2= 120
##$ZL3= 120
##$ZL4= 120
##$ABSF1= 248.5645
##$ABSF2= -253.2056
##$ABSG= 5
##$ABSL= 3
##$ALPHA= 0
##$AQORDER= 0
##$ASSFAC= 0
##$ASSFACI= 0
##$ASSFACX= 0
##$ASSWID= 0
##$AUNMP= <proc_1d>
##$AZFE= 0.1
##$AZFW= 0.5
##$BCFW= 0
##$BC_mod= 2
##$BYTORDP= 0
##$COROFFS= 0
##$CY= -3
##$DATMOD= 1
##$DC= 0
##$DFILT= <>
##$DTYPP= 0
##$F1P= 0
##$F2P= 0
##$FCOR= 1
##$FTSIZE= 65536
##$FT_mod= 6
##$GAMMA= 0
##$GB= 0
##$INTBC= 1
##$INTSCL= 6.047779e-11
##$ISEN= 30
##$LB= 1
##$LEV0= 0
##$LPBIN= 0
##$MAXI= 10000
##$MC2= 0
##$MEAN= 0
##$ME_mod= 0
##$MI= 50
##$NCOEF= 0
##$NC_proc= -7
##$NLEV= 6
##$NOISF1= 182.463
##$NOISF2= 159.3651
##$NSP= 0
##$NTH_PI= 0
##$NZP= 0
##$OFFSET= 248.5645
##$PC= 4
##$PHC0= -10532.24
##$PHC1= -115.7153
##$PH_mod= 1
##$PKNL= yes
##$PPARMOD= 0
##$PSCAL= 0
##$PSIGN= 0
##$REVERSE= no
##$SF= 81.0140089999694
##$SI= 65536
##$SIGF1= 159.3651
##$SIGF2= -187.1042
##$SINO= 113.3802
##$SIOLD= 16384
##$SREGLST= <1H.CDCl3>
##$SSB= 0
##$STSI= 65536
##$STSR= 0
##$SW_p= 40650.406504065
##$SYMM= 0
##$S_DEV= 0
##$TDeff= 32768
##$TDoff= 0
##$TI= <>
##$TILT= no
##$TM1= 0
##$TM2= 0
##$TOPLEV= 0
##$USERP1= <user>
##$USERP2= <user>
##$USERP3= <user>
##$USERP4= <user>
##$USERP5= <user>
##$WDW= 1
##$XDIM= 65536
##$YMAX_p= 137575607
##$YMIN_p= -248736467
$$ End of Bruker specific parameters
$$ ---------------------------------
##NTUPLES= NMR SPECTRUM
##VAR_NAME=  FREQUENCY,     SPECTRUM/REAL,   SPECTRUM/IMAG
##SYMBOL=    X,             R,               I
##VAR_TYPE=  INDEPENDENT,   DEPENDENT,       DEPENDENT
##VAR_FORM=  AFFN,          ASDF,            ASDF
##VAR_DIM=   65536,         65536,           65536
##UNITS=     HZ,            ARBITRARY UNITS, ARBITRARY UNITS
##FACTOR=    0.620285442955139, 1,           1
##FIRST=     20137.2065510682, 0,            0
##LAST=      -20513.1999529968, 0,           0
##MIN=       -20513.1999529968, -248736467,  0
##MAX=       20137.2065510682, 137575607,    0
$$ Real data points
##PAGE= N=1
##DATA TABLE= (X++(R..R)), XYDATA
$$ [...]
##PAGE= N=2
##DATA TABLE= (X++(I..I)), XYDATA
13071d516479K993459L419406m72614j223151K614324L740284q90311m522061
$$ -4516479 -1523020 1896386 1423772 200621 2814945 6555229 5664918 1142857
13063A142857k108427J450052p5461m298072m755896n88515L715127N048282L783396
$$ 1142857 -965570 484482 409021 -3889051 -8644947 -9233462 -5518335 -470053 3313343
13054C313343J388946o72403j202004n00803L5916K14809P87487R41197p77180
$$ 3313343 4702289 4029886 2827882 2327079 2362995 2577804 3365291 4306488 3529308
13045C529308k923603k283961R51909K941824J800781k98141j281402j533035
$$ 3529308 605705 -1678256 -726347 2215477 4016258 3718117 2436715 903680
13037I03680j339626K4028J649601J218337j140752k704846k385596j465703j55119
$$ 903680 -435946 -411918 1237683 2456020 1315268 -1389578 -3775174 -5240877 -5395996
13028e395996K166516L329987L53420m376912m728053K3357L594034K213502l49117
$$ -5395996 -3229480 100507 453927 -3922985 -8651038 -8627681 -5033647 -2820145 -3169262
13019c169262k0200J385903R46496R7742R18521J654912N27955j65612J600644
$$ -3169262 -3189462 -1803559 -857063 -759321 159200 1814112 2342067 2176455 3777099
13010C777099L024165J132045j558473j209774O45493P9573k165556k391624q28402
$$ 3777099 6801264 7933309 6374836 5165062 5810555 5890128 3724572 1332948 504546
13001E04546q13071k135522j218221K084198L510886J130829j786368k028575
$$ 504546 -308525 -2444047 -3662268 -1578070 1932816 3063645 1277277 -751298
12993g51298n44183K63135k0418o69626j386983j619279n90038R57534J268347
$$ -751298 -1295481 -1032346 -1052764 -1722390 -3109373 -4728652 -5318690 -4361156 -3092809
12984c092809N81558J106254L052018L505246R04021j980257j854381L13658J040890
$$ -3092809 -2511251 -1404997 1647021 5152267 6056288 4076031 2221650 2535308 3576198
12975C576198m87049j955208j973732j371541l11332K380066N646424N382203
$$ 3576198 3089149 1133941 -839791 -2211332 -2522664 -142598 5503826 10886029
12967A0886029P4541n219075m552363M53588K545270o14172l151920l61412L812555
$$ 10886029 10960570 5741495 1189132 1642720 4187990 3573818 421898 60486 3873041
12958C873041L039779j393874k696903R32087M010428K293832j850426m159671
$$ 3873041 6912820 5518946 2822043 3754130 7764558 10058390 8207964 4048293
12950D048293l985804k730468m56474K924547N397117M632289R96763k904812
$$ 4048293 62489 -2667979 -3124453 -199906 5197211 9829500 10826263 7921451
12942G921451m712997l533119l19648K104495J298942j584326k818204j157315
$$ 7921451 3208454 -324665 -644313 1460182 2759124 1174798 -1643406 -2800721
12934b800721N98381L31327K3311K156887N003616M498620j75614n338692o803927
$$ -2800721 -2202340 -1871013 -1847702 309185 5312801 9811421 9635807 4297115 -2506812
12925b506812l623400J505539M387288K790373j160645l088752j589632L54641
$$ -2506812 -6130212 -4624673 -237385 2552988 1392343 -1696409 -3286041 -2931400
12917b931400J25940q39470j21491J293130P67829j304155k016880o05428P56241
$$ -2931400 -2805460 -3644930 -3766421 -2473291 -1705462 -3009617 -5026497 -5631925 -4875684
12908d875684Q99021J132925J996966J636410q99469l186259k525309N9164J378149
$$ -4875684 -3976663 -2843738 -846772 789638 -109831 -3296090 -5821399 -5762235 -4384086
12899d384086P29511L34211J258017J688531J83820j754056j946353n08510J296141
$$ -4384086 -3654575 -3320364 -2062347 -373816 -189996 -1944052 -3890405 -4398915 -3102774
12890c102774L337646N254428M545326l31701n764511o156437j582006K043283
$$ -3102774 234872 5489300 10034626 9702925 3938414 -2218023 -3800029 -1756746
12882a756746J341246o79170q41176o28067j668087j556951J231205K829428Q2630
$$ -1756746 -415500 -1094670 -1935846 -2563913 -4232000 -5788951 -4557746 -1728318 -1645688
12873a645688k725075p8057M799353M166206j493744l680955O50870M471154J950438
$$ -1645688 -4370763 -4448820 350533 4516739 3022995 -657960 -7090 4464064 6414502
12864F414502l352285n285813l575042j175804J292890L692009L492897j98341
$$ 6414502 3062217 -2223596 -5798638 -6974442 -5681552 -1989543 1503354 1305013
12856A305013l218983j746110J733034K446004P95467Q86405L278559M230280
$$ 1305013 -1913970 -3660080 -1927046 518958 1314425 2200830 5479389 9709669
12848I709669J851171j248141k120107j301446j360339l104186m186351j703622
$$ 9709669 11560840 10312699 8192592 6891146 5530807 2426621 -1759730 -3463352
12840c463352L525444O429386L472911k042701l870310j468532j13586j983185
$$ -3463352 62092 6491478 9964389 7921688 4051378 2582846 2469260 486075
12832D86075k932410l36265J836489j31115k867221j266881K993970M129162J154284
$$ 486075 -2446335 -2782600 -946111 -1077226 -3944447 -5211328 -2217358 1911804 3066088
12823C066088j550517j420668k19629L15895P47895J441167J367651R4997j337160
$$ 3066088 1515571 94903 -124726 191169 939064 2380231 3747882 3842879 2505719
12814B505719j724402n16415J808804L051388R01843l235491m660657j696858
$$ 2505719 781317 264902 2073706 5125094 6026937 2791446 -1869211 -3566069
12806c566069J486157J061165q95617o10131J106417J329673P14371J448351J996387
$$ -3566069 -2079912 -1018747 -1914364 -2524495 -1418078 -88405 625966 2074317 4070704
12797D070704l26476l342331k689874O22479J639015j69763o13609R68321K62392
$$ 4070704 3744228 401897 -2287977 -1665498 -26483 -196246 -809855 158466 420858
12788D20858l627878n167555q46829M956184O245218L105111m82692k576037l094923
$$ 420858 -3207020 -8374575 -9221404 -4265220 1979998 5085109 4602417 2026380 -1068543
12779a068543j103793L184693N878072L466159j560980l302821m57379K141465
$$ -1068543 -2172336 1012357 6890429 10356588 8795608 5492787 5035408 7176873
12771G176873O92309k482960l053666j224485q70459l019441l983857j166071
$$ 7176873 7869182 5386222 2332556 1108071 237612 -2781829 -6765686 -7931757
12763g931757K606528L364068K122689K565290L998452K113866k808139m570693
$$ -7931757 -5325229 -1961161 161528 2726818 6725270 8839136 6030997 1460304
12755A460304n01421L481095J552845l041004l328810N91714K659076Q47244p68559
$$ 1460304 958883 4439978 5992823 2951819 -376991 214723 2873799 3721043 2952484
12746B952484K35279J107136o16677l116174l490132j409619J606156L703191
$$ 2952484 3187763 4294899 3678222 562048 -2928084 -4337703 -2731547 971644
12738I71644L084066k61123l264865l067542r30691K73696J008334L144159M562496
$$ 971644 4055710 3794587 529722 -2537820 -3468511 -3194815 -2186481 957678 5520174
12729E520174J542788l717278m444698O24680M694518K722113j818477l011847
$$ 5520174 7062962 3345684 -1099014 -474334 4220184 6942297 5123820 2111973
12721B111973n04990K012831K389355O78162k452402m847523l436809J338174
$$ 2111973 1606983 3619814 6009169 6687331 4234929 -612594 -4049403 -2711229
12713b711229M493029K747254r52970j990734l56010Q34228O44736N67255R84607
$$ -2711229 1781800 4529054 3576084 1585350 1229340 2063568 2708304 3275559 4260166
12704D260166P04459n90528j758870j698841k31159J689478K199645N29192j188194
$$ 4260166 4964625 4374097 2615227 916386 685227 2374705 4574350 5103542 3915348
12695C915348n13318J079760J30369k563641k394561J234079L044479L76481k087925
$$ 3915348 3402030 4481790 4612159 2048518 -346043 888036 3932515 4308996 2221071
12686B221071o6376L095683K281972o20207k71973K594660K190316k710258o590543
$$ 2221071 2154695 5250378 7532350 6912143 6640170 9234830 11425146 8714888 2124345
12677B124345n193348o13615K604312K598101O31546o23093Q81117L726303L196206
$$ 2124345 -3069003 -3682618 -1078306 1519795 2151341 1528248 2409365 6135668 9331874
12668I331874k562218q055670o506615N65898M983978L093832k67301k06507J375394
$$ 9331874 6769656 -1286014 -7792629 -7226731 -2242753 851079 583778 377271 1752665
12659A752665K93322k822760l832106j301167J908240K523368L74169j641831
$$ 1752665 2045987 -776773 -4608879 -5910046 -4001806 -1478438 -1104269 -2746100
12651b746100n44124L033162M655552J459870l173881l520556L59197K696747
$$ -2746100 -3290224 -257062 4398490 5858360 2684479 -836077 -476880 2219867
12643B219867Q19149j149485M56750K834945J741338j404261k201559m73720K12386
$$ 2219867 3039016 1889531 2346281 5181226 6922564 5518303 3316744 2843024 3055410
12634C055410j161684k022529r34087Q39138K241481L052051K031279j426480
$$ 3055410 1893726 -128803 -1062890 -223752 2017729 5069780 7101059 5674579
12626E674579m127017k264295K074793K842326o54378k261961J027618L849136
$$ 5674579 1547562 -716733 1358060 4200386 3546008 1284047 2311665 6160801
12618F160801J267733k908055k426059J216064J901358n95594r83855J666535
$$ 6160801 7428534 4520479 2094420 3310484 5211842 4616248 3632393 5298928
12610E298928K361252o51313k586813l60944K357101J604224q32639j520921q20215
$$ 5298928 7660180 7008867 4422054 4061110 6418211 8022435 7189796 5668875 4848660
12601D848660l41719P60731K811368K837367p04835l900138k872109j64375m44328
$$ 4848660 4506941 5267672 8079040 10916407 10211572 6311434 3439325 3274950 2830622
12592B830622k672718k414004J65598R87925l73853l54350J485917J454267j220065
$$ 2830622 157904 -2256100 -2090502 -1102577 -1476430 -1830780 -344863 1109404 -110661
12583a10661k404329q8157J938372K04993k816437k382468J865394N580939M716814
$$ -110661 -2514990 -2603147 -664775 -459782 -3276219 -5658687 -3793293 1787646 6504460
12574F504460m50747n344991n291418r73141J804121n2731k105472N62180M629898
$$ 6504460 6053713 708722 -4582696 -5555837 -3751716 -3804447 -5909919 -5347739 -717841
12565g17841L335682k048413l673521J94912K843539R76234l19102K191121L724996
$$ -717841 2617841 569428 -3104093 -2909181 -65642 910592 591490 2782611 6507607
12556F507607O68756k345212r22013R40763j479983m490575k860524L4363j546035
$$ 6507607 7176363 4831151 3909138 4849901 3369918 -1120657 -3981181 -3946818 -5492853
12547e492853m121510m46792O489008O652712m86950m365819k6778M645447K355740
$$ -5492853 -9614363 -10061155 -3572147 3080565 2593615 -1772204 -1798982 2846465 5202205
12538E202205k610213k674842J203626K743644M28779k052499k443732j567609
$$ 5202205 2591992 -82850 1120776 3864420 4293199 2240700 -203032 -1770641
12530a770641k64769R41333N98342j671925l242542j621646J699228L237591K183198
$$ -1770641 -2035410 -1094077 -495735 -2167660 -5410202 -7031848 -5332620 -2095029 88169
12521H8169N67256j57882k58724j25679K80360N82431J02604j157295k288475
$$ 88169 655425 497543 238819 113140 393500 975931 1078535 -78760 -2367235
12512b367235k054855O5490K611911K788992J32358j676342M15254L421804K096875
$$ -2367235 -4422090 -4356600 -1744689 1044303 1176661 -499681 -84427 3337377 5434252
12503E434252k323812l031838J475094M104801K32512m417218k674179K568121
$$ 5434252 3110440 78602 1553696 5658497 5891009 1473791 -1200388 1367733
12495A367733L246725q81383k718546p5304J464106j028595l001127j079979R09013
$$ 1367733 4614458 3733075 1014529 939225 2403331 1374736 -1626391 -2706370 -1797357
12486a797357q04623k825332n23262L575317L845965R07937K1955J798034J653386
$$ -1797357 -2601980 -5427312 -5950574 -2375257 1470708 2378645 2400600 4198634 5852020
12477E852020j427613k629295L58264K954268R62881k693400k771650K56978J685074
$$ 5852020 4424407 1795112 2153376 5107644 6070525 3377125 605475 862453 2547527
12468B547527M3293j609983j190732j30022r779r5438O99463J792336K008640
$$ 2547527 2590820 980837 -209895 -339917 -349696 -445134 254329 2046665 4055305
12459D055305J136760k84077j499267j591099k93800J100327J007683j66264m46143
$$ 4055305 5192065 4907988 3408721 1817622 1523822 2624149 3631832 3465568 3019425
12450C019425Q24461J953990J172007j176088l030081k526055K54261K750190
$$ 3019425 3843886 5797876 6969883 5793795 2763714 237659 491920 3242110
12442C242110K016838j511685l650138j618217J963273K798813J079506L02853
$$ 3242110 5258948 3747263 97125 -1521092 442181 3240994 4320500 4623353
12434D623353J025480M35012j845283k643144j121840o50403k534746k856277
$$ 4623353 5648833 6083845 4238562 1595418 473578 -176825 -2711571 -5567848
12426e567848R98198N015688M163972k282k104151q74494N67247P00150Q65795
$$ -5567848 -4569650 446038 4610010 4607728 2503577 1629083 2196330 2896480 3762275
12417C762275J307648N98447j057101j872152j690404j608749j007434J114436
$$ 3762275 5069923 5668370 4611269 2739117 1048713 -560036 -1567470 -453034
12409d53034K605928O89441k332763j410439K672457L230529j801295n671210
$$ -453034 2152894 2842335 509572 -900867 1771590 5002119 3200824 -2470386
12401b470386l049028J353787L32418l914703l073723L731092P867982M131733
$$ -2470386 -5519414 -4165627 -3833209 -7747912 -10821635 -7090543 777439 4909172
12393D909172j541236j343294K801125K838651k827034o944173m064766K039597
$$ 4909172 3367936 2024642 4825767 7664418 4837384 -2106789 -6171555 -4131958
12385d131958M270956J625179j065956p29812P99173R62183N5971m94592p53622
$$ -4131958 138998 1764177 698221 -31591 767582 1729765 1785736 1291144 537522
12376E37522j465870k245301k189459j411895o73526O057J335859L396035M779898
$$ 537522 -928348 -3173649 -5363108 -6775003 -7448529 -7442472 -6106613 -2710578 2069320
12367B069320L458710q26558m952293m791762l28146L505175L105252J108054
$$ 2069320 5528030 4701472 -250821 -5042583 -5370729 -1865554 1239698 2347752
12359B347752J747808L556347J807105k853979m598678j843417K89514r37407
$$ 2347752 4095560 7651907 9459012 6605033 2006355 162938 452452 -484955
12351d84955j276899K185598M722536J535159l763670m664142j497527J049784
$$ -484955 -1761854 423744 5146280 6681439 2917769 -1746373 -3243900 -2194116
12343b194116K402519M635170N545674J509740m312042n040564r35736J002435
$$ -2194116 208403 4843573 10389247 11898987 7586945 2546381 1610645 2613080
12335B613080j483222l176397j242368O84452M91937J281808L683931K618588
$$ 2613080 1129858 -2046539 -3288907 -2604455 -2112518 -830710 2853221 5471809
12327E471809l448253p337718l338101L362447M159751n11111l148398n60056
$$ 5471809 2023556 -5314162 -8652263 -5289816 -1130065 -1641176 -4789574 -5349630
12319e349630L483882N185349M155848R14100l458948n542100k541124K751589
$$ -5349630 -1865748 3319601 7475449 8389549 4930601 -611499 -3152623 -401034
12311d01034M402981J283711j438622K25240L658819L610060o48077m457328l705722
$$ -401034 4001947 5285658 3847036 4072276 7731095 11341155 10693078 6235750 2530028
12302B530028L7817J528370j208773m056430k645194J147505K165819O6842o97576
$$ 2530028 2567845 4096215 2887442 -1168988 -3814182 -2666677 -500858 -434016 -1131592
12293a131592J075878J470369q18862j500266J248628K298693j740651n316195
$$ -1131592 -55714 1414655 595793 -904473 344155 2642848 902197 -4413998
12285d413998k214941L719074M269136N0447j049102K565377L709521j184985
$$ -4413998 -6628939 -2909865 1359271 1409718 360616 2925993 6635514 5450529
12277E450529n946296m425776N61844K602790Q97390p26061n39189P7990L92504
$$ 5450529 -495767 -4921543 -4359699 -1756909 -859519 -1585580 -2124769 -2046779 -1654275
12268a654275R36569J179495j33776k360461l011634q58325K291646L422177J560260
$$ -1654275 -717706 461789 328013 -2032448 -5044082 -5902407 -3610761 -188584 1371676
12259A371676j126470j865857p57084m13403j714603k067210M60933L476506L455997
$$ 1371676 245206 -1620651 -2377735 -2791138 -4505741 -6572951 -6112018 -2635512 820485
12250H20485R39074p07760n21309l72508r00758p62247K49601Q39508Q75096J126202
$$ 820485 1759559 1051799 530490 157982 -742776 -1505023 -1255422 -415914 459182 1585384
12240A585384Q14249r22012j854031N50247L666497K423904k263042l764421K46817
$$ 1585384 2399633 1477621 -376410 173837 3840334 6264238 4001196 236775 483592
12231D83592M226996L560252P78496l76620j118978l293294m266144j715616Q74363
$$ 483592 4710588 8270840 9049336 8672716 7553738 4260444 -5700 -1721316 -846953
12222h46953l59215k331091J50634M832046M697199q42953m783988l028418O23838
$$ -846953 -1206168 -3537259 -3386625 1445421 6142620 5299667 515679 -2512739 -1888901
12213a888901J563669O03008O07084J511834J622415P38558l85209j352889j410981
$$ -1888901 -325232 277776 884860 2396694 4019109 4757667 4372458 3019569 1608588
12204A608588J87560K061916J600006j094750l008471k762948k010903j364333
$$ 1608588 1796148 3858064 5458070 4363320 1354849 -1408099 -3419002 -4783335
12196d783335Q96477M155191M068329p45199m632069k214178L111848L568288
$$ -4783335 -3886858 268333 4336662 3591463 -1040606 -3254784 -142936 3425352
12188C425352j490321m535646r65622M360618M233709j309000n959567n426810
$$ 3425352 1935031 -2600615 -3566237 794381 5028090 3719090 -2240477 -7667287
12180g667287j299729K443103L699550K814807J188369K17376M58821J138122
$$ -7667287 -8967016 -6523913 -2824363 -9556 1178813 1396189 1855010 2993132
12172B993132J058148J63814n13425n03174m35357o30164m19850L09052J88357
$$ 2993132 4051280 4215094 3701669 3198495 2763138 2132974 1713124 2022176 2210533
12163B210533j520999k847811j270285K295696M066543K398612k38752j342756
$$ 2210533 689534 -2158277 -3428562 -1132866 2933677 5332289 5093537 3750781
12155C750781j796927l216134m268693k699727M10742J788592P73299k60330m6900
$$ 3750781 1953854 -1262280 -5530973 -8230700 -7819958 -6031366 -5258067 -5518397 -5565297
12146e565297L36819M77145J326978K333515J476754q31066j571933j39142M96868
$$ -5565297 -5228478 -4751333 -3424355 -1090840 385914 -445152 -2017085 -2156227 -1659359
12137a659359n63548M4905L494012M887999N19868m986022m727234J4960K032080
$$ -1659359 -2222907 -2178002 1316010 6204009 6723877 1737855 -2989379 -2974419 -942339
12128i42339n32236k315642k72361K016234J253608o19292r27057l43214K54295
$$ -942339 -1474575 -3790217 -4062578 -2046344 -792736 -1412028 -2339085 -2682299 -2428004
12119b428004J975231M006695K543263k772283o119150l448362J222021K187302
$$ -2428004 -452773 3553922 6097185 3324902 -2794248 -6242610 -5020589 -2833287
12111b833287N54910Q13227K552083K088075j51802o51425L04324m76845k177047
$$ -2833287 -2278377 -1465150 1086933 3175008 3023206 2371781 2676105 2199260 22213
12102B2213q83262K681346L386767L78092j462002j22248N51844j287753j815440
$$ 22213 -861049 1820297 5207064 5585156 4123154 4000906 4552750 3264997 1449557
12093A449557Q99427K444959l70813l589967k779097r9720P41811J153823K914322
$$ 1449557 2348984 4793943 4423130 833163 -1945934 -2045654 -1303843 -150020 2764302
12084B764302K112921m162436r331813m993752N159566R057025L493701k338402
$$ 2764302 4877223 714787 -8617026 -13610778 -8451212 605813 4099514 1761112
12076A761112j817483P05413j41612j841345n57888J150674j35779j539118O07986
$$ 1761112 -56371 649042 507430 -1333915 -1891803 -741129 -876908 -2416026 -1808040
12067a808040K948469M27831m181052m115221L17794K745513J686347J929776
$$ -1808040 1140429 1568260 -2612792 -6728013 -6410219 -3664706 -1978359 -48583
12059d8583M502265L941269j820275o578053n048821p16668M18831j102584r39885
$$ -48583 4453682 8394951 6574676 -3377 -5052198 -5768866 -5350035 -6452619 -7392504
12050g392504J023320J356970m22324j620899j382142r14770K77850L303313N609524
$$ -7392504 -6369184 -5012214 -5434538 -7055437 -8437579 -9352349 -9074499 -5771186 -161662
12041a61662L264938k118615m132325n67298L345356K738708m73300j742202l71834
$$ -161662 3103276 984661 -3147664 -3714962 -369606 2369102 1895802 153600 -218234
12032b18234J461261K764790L206369J434824k236825l987886j477068J507728
$$ -218234 1243027 4007817 7214186 8649010 6412185 2424299 947231 2454959
12024B454959L0904m058076m514964l10090K935309J758933n73482k99937J111778
$$ 2454959 2485863 -1572213 -6087177 -6397267 -3461958 -1703025 -2276507 -2576444 -1464666
12015a464666O45225q20360o12501P81842P39674r44695j938688j135667K40078
$$ -1464666 -819441 -1639801 -2252302 -1470460 -730786 -1675481 -3614169 -4749836 -4509758
12006d509758R82236J131811R94024O09096R5059n01436j146698j003289R29290
$$ -4509758 -3527522 -2395711 -1401687 -792591 -697532 -1198968 -2345666 -3348955 -2419665
11997b419665L463157L546011N58083j905492r01657J324581Q14590j861479k850723
$$ -2419665 1043492 4589503 5147586 3242094 2340437 3665018 4479608 2618129 -232594
11988b32594j556613j229324k663137k220953J809212N137359L264031j425881
$$ -232594 -1789207 -3018531 -5681668 -7902621 -6093409 -956050 2307981 882100
11980H82100k626169Q42458L285012L50931m546181m706177O32627M946527K883033
$$ 882100 -1744069 -901611 2383401 2734332 -1811849 -6518026 -5885399 -938872 1944161
11971A944161k781282m965713j520944K699436L065886Q37419j58936N93541Q27736
$$ 1944161 -837121 -5802834 -7323778 -4624342 -1558456 -721037 -879973 -286432 541304
11962E41304n2377o27268o95866j318768j867263n51347J777401J864149r09037
$$ 541304 488927 -138341 -834207 -2152975 -4020238 -4571585 -2794184 -930035 -1839072
11953a839072k941396j375785K105928M109056L701648K058673K70954o39809
$$ -1839072 -4780468 -6156253 -4050325 58731 3760379 5819052 6090006 5450197
11945E450197K53692J762527P89162l242997o363568n016385j001536J394319
$$ 5450197 5703889 7466416 8255578 5012581 -1350987 -6367372 -7368908 -5974589
11937e974589J250348P16755O79408O00347J302268L491629M357097O81200m660608
$$ -5974589 -4724241 -4007486 -3328078 -2727731 -1425463 2066166 6423263 7104463 2443855
11928B443855m884578P54685M834097K171001k959085l892710j128193M41639
$$ 2443855 -2440723 -1686038 3148059 5319060 2359975 -1532735 -2660928 -2219289
11920b219289K55505J651691M453164M570506J060006k254179l027103k910579
$$ -2219289 -1963784 -312093 4141071 8711577 9771583 7517404 4490301 1579722
11912A579722k692570n31143K846851K828869j745509m959345k020380L165034
$$ 1579722 -1112848 -1643991 1202860 4031729 2286220 -2673125 -4693505 -1528471
11904a528471L943413R47935j35833J461887J063752k431727m194917j592442
$$ -1528471 2414942 3362877 3227044 4688931 5752683 3320956 -873961 -2466403
11896b466403J596844J628410K14008M21909J527329J342616J89412o93628j663395
$$ -2466403 -869559 758851 972859 1394768 2922097 4264713 4454125 3760497 2097102
11887B097102k638258j686630J288034K730770P35701j214235K06139K339090
$$ 2097102 -541156 -2227786 -939752 1791018 2526719 1312484 1518623 3857713
11879C857713J171964j396723q93962J551412J235858j290561j003562K030212
$$ 3857713 5029677 3632954 2738992 4290404 5526262 4235701 3232139 5262351
11871E262351J928137k534151m760936j069519K852099J259022k300451j418710
$$ 5262351 7190488 4656337 -104599 -1174118 1677981 2937003 636552 -782158
11863g82158K338723K589853r10654k444310l99406N99536j609990l010692p47999
$$ -782158 1556565 4146418 3235764 791454 392048 991584 -618406 -3629098 -4377097
11854d377097J801911Q72996j373237o90717K150395K754673J72139j830856o54796
$$ -4377097 -2575186 -1702190 -3075427 -3766144 -1615749 1138924 1311063 -519793 -1174589
11845a174589J577181J490040r66114k994915k670927o48211J338337K402165
$$ -1174589 402592 1892632 926518 -2068397 -4739324 -5387535 -4049198 -1647033
11837a647033K758005K776483K331781J163668l31638j146128q71567n05856j225041
$$ -1647033 1110972 3887455 6219236 7382904 7051266 5905138 5033571 4527715 3302674
11828C302674k411986k177972m10793K78994j716187l683256j846654K446109
$$ 3302674 890688 -1287284 -1698077 -1419083 -3135270 -6818526 -8665180 -6219071
11820f219071L568653j77729l240042p17825L907416L727982j039050l474989
$$ -6219071 -2650418 -2828147 -6068189 -6786014 -2878598 849384 -189666 -3664655
11812c664655p23096K152594R60301j135708J84656K806081K239484k25976J55889
$$ -3664655 -4387751 -2235157 -1274856 -2410564 -2225908 580173 2819657 2593681 2749570
11803B749570K802029K171908k765353n976147l421427R00553J382222j161788
$$ 2749570 5551599 7723507 4958154 -1017993 -4439420 -3538867 -2156645 -3318433
11795c318433k183661q42515K31447O49726K346556M475862L639090K7001j811748
$$ -3318433 -5502094 -6344609 -6113162 -5463436 -3116880 1358982 4998072 5025073 3213325
11786C213325k35668M82176k370706m283732m87005N037774M362359k035738n265636
$$ 3213325 2977657 3459833 1089127 -3194605 -3681610 1356164 5718523 3682785 -1582851
11777a582851j129081M221943M412175J534147J38915j102145n130677q586733
$$ -1582851 -2711932 1510011 5922186 7456333 7595248 6493103 1362426 -7224307
11769g224307o061122K98919L489398K766755L716866P056541O310509q16919
$$ -7224307 -13285429 -12986510 -9497112 -6730357 -3013491 4043050 10353559 9536640
11761I536640p003651n729252n09325J583304K72091L0461J698888K424979J589886
$$ 9536640 2532989 -3196263 -3705588 -2122284 -1850193 -1819732 -120844 2304135 3894021
11752C894021J050691Q52689l52286j699853j407579o33781j667489l185102j857773
$$ 3894021 4944712 5797401 5445115 3745262 2337683 1703902 36413 -3148689 -5006462
11743e006462J750584L465856J917608L86693J363104L007326K500945P4879j963408
$$ -5006462 -3255878 209978 2127586 2514279 3877383 6884709 9385654 9460533 7497125
11734G497125k411697j991553j842793j929347r10278J876750M359099L483759
$$ 7497125 5085428 3093875 1251082 -678265 -1588543 288207 4647306 8131065
11726H131065l07833k823178j737717K95483J83522r79995o57699O56619J145498
$$ 8131065 7823232 5000054 3262337 3557820 3741342 2761347 2103648 2760267 3905765
11717C905765J268205J953089J681264o41092k392118j151887O53656j60367j530266
$$ 3905765 5173970 7127059 8808323 8167231 5775113 4623226 5276882 5116515 3586249
11708C586249O9578K365545O30844l386275l432500Q68670L327778J360319q12485
$$ 3586249 3655827 6021372 6652216 3265941 -166559 702111 4029889 5390208 4577723
11699D577723m35316j40697j447262j543106N76687J435356k59829o37482K089668
$$ 4577723 4142407 4001710 2554448 1011342 1588029 3023385 2763556 2126074 4215742
11690D215742L532446M16947l594660l812442j339660L57822J087231J795346
$$ 4215742 7748188 8165135 4570475 758033 -581627 -223805 863426 2658772
11682B658772J219102q95046j349037J370610L526665J972132n93847o53547J69139
$$ 2658772 3877874 2982828 1633791 3004401 6531066 8503198 7909351 7255804 7424943
11673G424943q78366j914569k23859J845467N88832k482080l381240k140351j134371
$$ 7424943 6546577 4632008 4408149 6253616 6842448 4360368 979128 -1161223 -2295594
11664b295594N8149K377038K951259n49974l916388j670151L701855N014674J479890
$$ -2295594 -2237445 139593 3090852 2540878 -1375510 -3045661 656194 5670868 7150758
11655G150758j004200q1647L47358j648200k561494k32518K244998K018905P04237
$$ 7150758 6146558 6064911 6412269 4764069 2202575 1970057 4215055 6233960 6938197
11646F938197M70459K95399j147203k418190j856560o40949r43442k627336l481204
$$ 6938197 7408656 7704055 6556852 4138662 2282102 1641153 697711 -1929625 -5410829
11637e410829j960024R86774K550475J120007j104923n08875K405979L222277
$$ -5410829 -7370853 -6384079 -3833604 -2713597 -3818520 -4327395 -1921416 1300861
11629A300861P37933o63043J392184K566273o47965l922316j975950K133889K226955
$$ 1300861 2038794 1375751 2767935 5334208 4686243 763927 -1212023 921866 3148821
11620C148821l29900R7526K395061P86743l680192m229481o97780R0111k663441
$$ 3148821 2818921 2916447 5311508 6098251 2418059 -1811422 -2509202 -2419091 -5082532
11611e082532j717156M354668O756730J030584m500840j858631L920109L561723
$$ -5082532 -6799688 -2445020 4311710 5342294 841454 -1017177 2902932 6464655
11603F464655j879820m253390j543727R25354J96425j034267j63937J947736L177298
$$ 6464655 4584835 331445 -1212282 -286928 -90503 -1124770 -1288707 659029 3836327
11594C836327K034209j705245n579575n510946p89888M194049N272791K883832
$$ 3836327 5870536 4165291 -1414284 -6925230 -7715118 -3521069 1751722 4635554
11586D635554m07954l051760l462676m29916L164165K125772k848002m472434
$$ 4635554 4227600 1175840 -2286836 -2716752 447413 2573185 -274817 -4747251
11578d747251J95376M500061K578107j464581r87121K391911K817869L02572j120004
$$ -4747251 -4551875 -51814 2526293 1061712 74591 2466502 5284371 5586943 4466939
11569D466939j601021l625405m875875j483473L527824L626540m68831j923512
$$ 4466939 2865918 -759487 -5635362 -7118835 -3591011 35529 -433302 -2356814
11561b356814P21704J877354o60510k290561n33739Q05684n30669o96331K842068
$$ -2356814 -1635110 242244 -418266 -2708827 -3242566 -2436882 -2967551 -3663882 -821814
11552h21814N632969L004430k212147l915660j457592P82833M76751n58771m64327
$$ -821814 4811155 7815585 5603438 1687778 230186 1013019 1489770 930999 466672
11543D66672K95384P63825R42530Q87380J33048j304380k288205j603979M98860
$$ 466672 762056 1525881 2468411 3355791 3488839 2184459 -103746 -1707725 -1208865
11534a208865K204648J902686m0968j732552j774205j73008K162889L467797J544635
$$ -1208865 995783 2898469 2857501 1124949 -649256 -822264 1340625 4808422 6353057
11525F353057l322897o458737l452477L021392N461075J791221j745794l83761
$$ 6353057 3030160 -3428577 -6881054 -3859662 1601413 3392634 1646840 1263079
11517A263079K105698N06784k824216k290149J093097J340912k427334m447273
$$ 1263079 3368777 3875561 1051345 -1238804 -145707 1195205 -1232129 -5679402
11509e679402j168089L962657N667396K715068k139282m978987l429209Q28746
$$ -5679402 -6847491 -2884834 2782562 5497630 3358348 -1620639 -5049848 -4221102
11501d221102L019417J196158p81737O84295K834025J193099k464420k873274
$$ -4221102 -1201685 -5527 -787264 -102969 2731056 3924155 1459735 -1413539
11493a413539k16517M63299j816063k568852J07619K625944K393777J237870N91147
$$ -1413539 -1630056 -1166757 -2982820 -5551672 -5444053 -2818109 -424332 813538 1404685
11484A404685j176098m307576n395086k284194K342293M480096L163614J86104
$$ 1404685 228587 -4078989 -9474075 -11758269 -9415976 -4935880 -1772266 -1586162
11476a586162j827099p59241K626663M057767R20855l023950k468468J261188
$$ -1586162 -3413261 -4172502 -1545839 2511928 3432783 408833 -2059635 -798447
11468g98447K394058M9890j190195K08911Q51889l03468j67904J588309J333240
$$ -798447 1595611 1645501 455306 664217 1516106 1212638 1044734 2633043 3966283
11459C966283r32522n14257K892791L176170j566921m663990j984603O79039k316691
$$ 3966283 3033761 2519504 5412295 8588465 7021544 2357554 372951 1051990 -1264701
11450a264701o362945m321417J506602L651447J577553R33158L279813M748223
$$ -1264701 -7627646 -11949063 -10442461 -6791014 -5213461 -4280303 -1000490 3747733
11442C747733L678994K249531J003281j630318m413311l932473n94012J285598
$$ 3747733 7426727 9676258 10679539 9049221 4635910 703437 109425 1395023
11434A395023K2940j436495p88605N56633O81580k7249l73956j12881M92480J001117
$$ 1395023 1417963 -18532 -807137 -250504 431076 403827 29871 -83010 409470 1410587
11424A410587O46174n60274j194626m88746J28574o55949j740166j704050j355752
$$ 1410587 2056761 1496487 301861 -186885 -58311 -714260 -2454426 -4158476 -5514228
11415e514228j637461r72930K013378M647975K882671k604544o328419m356603
$$ -5514228 -7151689 -8124619 -6111241 -1463266 1419405 -1185139 -7513558 -11870161
11407a1870161J486061N942802N404662J004248k387959j165971K488868L036947
$$ -11870161 -10384100 -4441298 963364 1967612 -420347 -1586318 902550 3939497
11399C939497q14572m039598k489177J347197K613187R67280m27832l39139O4478
$$ 3939497 3124925 -914673 -3403850 -2056653 556534 1523814 1095982 756843 821321
11390H21321M91641J445481J917239N57090j557867k099098p19395J006278J772577
$$ 821321 1312962 2758443 4675682 5232772 3674905 1575807 856412 1862690 3635267
11381C635267J028706j005232k419964j230246Q14559k76562l702641l384861
$$ 3635267 4663973 3658741 1238777 8531 823090 546528 -3156113 -6540974
11373f540974K305586O091876K224224m071401m486316m30261M93892k238321
$$ -6540974 -4235388 1856488 4080712 9311 -4477005 -4907266 -4413374 -6651695
11365f651695j915035L103197O472744M501248J090428l17668j866486m868822
$$ -6651695 -8566730 -5463533 1009211 5510459 6600887 6283219 4416733 -452089
11357d52089n223875o0568O027405O394029J034985m087085m453385q78788K481213
$$ -452089 -5675964 -5736532 290873 6684902 7719887 3632802 -820583 -1699371 781842
11348G81842K170058j205531l091870l85236L681908L324357j379041m271678
$$ 781842 2951900 1746369 -1345501 -1730737 1951171 5275528 3896487 -375191
11340c75191k032074J469425J523410j075174k524692j328810J305242L404152
$$ -375191 -2407265 -937840 585570 -489604 -3014296 -4343106 -3037864 366288
11332C66288K682580j766488o514154o132539n20923L935501K966625O0925K50920
$$ 366288 3048868 1282380 -5231774 -11364313 -11885236 -7949735 -4983110 -4922185 -4671265
11323d671265K372277K099528l77516j058784R97351K610422J940981N66021k18781
$$ -4671265 -2298988 -199460 -576976 -1635760 -638409 1972013 3912994 4479015 4260234
11314D260234j250432k740337k938309r68852J353271J962304J114708K92195
$$ 4260234 3009802 269465 -2668844 -3637696 -2284425 -322121 792587 1084782
11306A084782r2052n49126r53538n37379O78568J450741O28841j515136l510784
$$ 1084782 992730 443604 -509934 -1047313 -368745 1081996 1710837 195701 -3315083
11297c315083l968932k463947L48414K865093L257337J284354o59231J00012K693829
$$ -3315083 -7284015 -9747962 -9399548 -6534455 -3277118 -1992764 -2651995 -2551983 141846
11288A41846L189433j5684l389113k874701M84252K320875J208359j26043L83131
$$ 141846 3331279 3315595 -73518 -2948219 -2463967 -143092 1065267 939224 1322355
11279A322355J431063J167721n4825r93410j492876j846111j676913o70456N10263
$$ 1322355 2753418 3921139 3866314 2872904 1380028 -466083 -2142996 -2813452 -2303189
11270b303189Q39344q0645j727715k706144j594667J113556K663460J286503r31339
$$ -2303189 -1463845 -1544490 -3272205 -5978349 -7573016 -6459460 -3796000 -2509497 -3440836
11261c440836n69806K219693L821275K144764r65557k580114j653843J070048
$$ -3440836 -4010642 -1790949 2030326 4175090 3209533 629419 -1024424 45624
11253D5624L758835L888467N47113l299667l641227r80060J98370j618741k484565
$$ 45624 3804459 7692926 8240039 4940372 1299145 319085 517455 -1101286 -3585851
11244c585851L86973L415691J882146k314171k951861J285439M757845L025073
$$ -3585851 -3198878 216813 2098959 -215212 -3167073 -1881634 2876211 5901284
11236E901284j128623k319332k91288N87425j542796l348677j706266J415149
$$ 5901284 4772661 2453329 2162041 2749466 1206670 -2142007 -3848273 -2433124
11228b433124J930671l40530j736561l50724J531432J209221q36197k313447k048259
$$ -2433124 -502453 -842983 -2579544 -2930268 -1398836 -189615 -1025812 -3339259 -5387518
11219e387518l02598K007669L169718J558464j922463l895364k334310J173946
$$ -5387518 -5690116 -3682447 -512729 1045735 -876728 -4772092 -7106402 -5932456
11211e932456L925309M831844L737069P42580k258665k390202j94184k5056l452795
$$ -5932456 -2007147 2824697 6561766 7304346 5045681 2655479 2461295 2436239 -1016556
11202a016556n794927k823732K419912M088090K028008N36925O88733j19967j913751
$$ -1016556 -6811483 -9635215 -7215303 -3127213 -1099205 -562280 126453 6486 -1907265
11193a907265j683913M45424N17520k303795l317597O89809N998476O505507J387502
$$ -1907265 -3591178 -3145754 -2628234 -4932029 -8249626 -7559817 -1561341 4944166 6331668
11184F331668m237238n212980j488106K280283K010910j065933k374517p02945
$$ 6331668 2094430 -3118550 -4606656 -2326373 -315463 -1381396 -3755913 -4458858
11176d458858M21552o34556m03396K840342M226566k2552m636746k586932L077492
$$ -4458858 -4037306 -4671862 -5075258 -2234916 1991650 1969098 -2667648 -5254580 -2177088
11167b177088L610069j195232l145925J90809K121894n15060j966462J173616
$$ -2177088 1432981 237749 -2908176 -2717367 -595473 -1110533 -3076995 -1903379
11159a903379L240063r8659l383400o55585L820913K528092k641004l582579Q87499
$$ -1903379 1336684 1238025 -2145375 -2800960 1019953 3548045 907041 -2675538 -1788039
11150a788039L702030R03701l019384k563263J336942L636016K070918n66173
$$ -1788039 1913991 2817692 -201692 -2764955 -1428013 2208003 4278921 3712748
11142C712748n62268J497231J201750k943899n703816j853481M984763O171374
$$ 3712748 3150480 4647711 5849461 2905562 -2798254 -4651735 333028 6504402
11134F504402O32814l418951j097095K300237P92985k941977l248738q06785P1628
$$ 6504402 7137216 3718265 2621170 4921407 5714392 2772415 -476323 -1283108 -1211480
11125a211480q60255j162612j310024k597359k463089J502169N246539K915527
$$ -1211480 -2071735 -3234347 -4544371 -7141730 -9604819 -8102650 -2856111 59416
11117E9416l475261n907960j706920L378126M069244J693155o1289m69650n57636
$$ 59416 -3415845 -9323805 -11030725 -7652599 -3583355 -1890200 -1951489 -2421139 -2978775
11108b978775k67914O09307Q94987m53703k318634k324153L58447L511665L642168
$$ -2978775 -3246689 -2637382 -1742395 -2196098 -4514732 -6838885 -6480438 -2968773 673395
11099F73395N8218l393584k598024J189172K904097R31905j094082o02392L93513
$$ 673395 731613 -2661971 -5259995 -4070823 -1166726 -234821 -1328903 -1931295 -1537782
11090a537782M0113J78378K145425L442148K135855M82087L94290m11053l387808
$$ -1537782 -1497669 -1319291 826134 4268282 6404137 6886224 7280514 6869461 3481653
11081C481653m706908j209316L129908K816294l71878q61239J102365O34462k529256
$$ 3481653 -1225255 -2434571 695337 3511631 3139753 2278514 3380879 4015341 1486085
11072A486085l501242p65241J800501K000497J936015K481554J284949j989292
$$ 1486085 -2015157 -2780398 -979897 1020600 2956615 5438169 6723118 4733826
11064D733826l870074k613357q23431n16313J5461K100970L470468J914680r01362
$$ 4733826 863752 -1749605 -2573036 -3089349 -3073888 -972918 2497550 4412230 3510868
11055C510868k003439j284975p69751j269778j711233q91500J188660L036335
$$ 3510868 1507429 222454 -547297 -1817075 -3528308 -4419808 -3231148 -194813
11047a94813K535725o71036l741279l271502L67295K990608J505946k317059l743902
$$ -194813 2340912 1669876 -2071403 -5342905 -4975610 -1985002 -479056 -2796115 -6540017
11038f540017m16474M621904N818801J523079l635171m438707j726385j74804
$$ -6540017 -6956491 -2334587 3484214 5007293 1372122 -3066585 -4792970 -4967774
11030d967774o79218M9825K269360J864036j833921l324862L60338M208463L121130
$$ -4967774 -5646992 -5597167 -3327807 -1463771 -3297692 -6622554 -6262216 -2053753 1067377
11021A067377k34130r24504L3848o98523j518052N95553K965064J192525k578548
$$ 1067377 833247 -91257 -57409 -755932 -2273984 -1678431 1286633 2479158 -99390
11012i9390k972215n84180j31044j428075l80749K389683K304099m50350j265617
$$ -99390 -3071605 -3655785 -3786829 -5214904 -5595653 -3205970 -901871 -1352221 -2617838
11003b617838Q4646n53670k740117j305828L697811N700218K305552j033844o09133
$$ -2617838 -2533192 -3086862 -5826979 -7132807 -3434996 2265222 4570774 3536930 2927797
10994B927797L04087j047500j827769N6465J432503j21865j746915q20100N13539
$$ 2927797 3231884 2184384 356615 413080 1845583 1723718 -23197 -843297 -329758
10985c29758J34787o1320J261035J485251r16638k783360j492823P46016J349873
$$ -329758 -194971 -256291 1004744 2489995 1573357 -1210003 -2702826 -1956810 -606937
10976f06937J530048K499376K130763q34925l444540k964482q00497Q72918K102741
$$ -606937 923111 3422487 5553250 4718325 1273785 -1690697 -2491194 -1618276 484465
10967D84465K282751n12700m431779l917912J475615M464927P45596l850984k499133
$$ 484465 2767216 2254516 -2177263 -6095175 -4619560 -154633 590963 -3260021 -5759154
10958e759154K093318K961941l3200j612429j93853J314981J480033J038457k00049
$$ -5759154 -3665836 -703895 -737095 -2349524 -2543377 -1228396 251637 1290094 1090045
10949A090045j889490j307418J909647K732897j719994n568407k221915M490260
$$ 1090045 -799445 -2106863 -197216 2535681 815687 -4752720 -6974635 -2484375
10941b484375N578680P49948k220678p86174l80466l093834l475066J208560N012656
$$ -2484375 3094305 3844253 1623575 837401 456935 -2636899 -6111965 -4903405 109251
10932A09251K381228l152081m447178n77604L489249M097010J940109k43538m23327
$$ 109251 2490479 -661602 -5108780 -5686384 -2197135 1899875 3839984 3596446 3173119
10923C173119R20252Q24641k220318m599338j685690M282658N755419P21689l877429
$$ 3173119 4093371 4918012 2697694 -1901644 -3587334 695324 6450743 7172432 3295003
10914C295003k538411Q76893K30396l023748l242657k67057J267715L76015L85846
$$ 3295003 756592 1633485 1863881 -1159867 -4402524 -4669581 -3401866 -3025851 -2640005
10905b640005J655435O86297k554451l182020M43928L255248J585644q04400N71041
$$ -2640005 -984570 -298273 -2852724 -6034744 -5590816 -2335568 -749924 -1554324 -983283
10896i83283K936684R65654l739555m741320j019221J816452Q47237l63067R42481
$$ -983283 1953401 2919055 -820500 -5561820 -6581041 -4764589 -3917352 -4280419 -3337938
10887c337938J983930K98021j103046J038896L908025K723384j443130l237548
$$ -3337938 -1354008 -1055987 -2159033 -1120137 2787888 5511272 4068142 830594
10879H30594j059215J435088J415394n2202j241504k042810k246672r62432J163675
$$ 830594 -228621 1206467 2621861 2569659 1328155 -714655 -2961327 -3923759 -2760084
10870b760084J846839L76870j147123p06850J121868K232679J444704m06505j238049
$$ -2760084 -913245 -536375 -1683498 -2390348 -1268480 964199 2408903 2002398 764349
10861G64349k4042J392577L49048k300684k653372J44187J931523J98295j473717
$$ 764349 740307 2132884 2481932 181248 -2472124 -2327937 -396414 -198119 -1671836
10852a671836L30710K390240L69098k805140j382062K762546K525867k319700
$$ -1671836 -1341126 1049114 1418212 -1386928 -2768990 -6444 2519423 199723
10844A99723m369386r05111K022015N05433q59305K022473M990901K833070j580762
$$ 199723 -4169663 -5074774 -3052759 -2547326 -3406631 -1384158 3606743 6439813 4859051
10835D859051j940557J587107L364495R27008k759698m416024l584102j470773
$$ 4859051 2918494 4505601 7870096 8797104 6037406 1621382 -1962720 -3433493
10827c433493K72685M49878p4881Q68688L168426M000937K195708j7720r41094
$$ -3433493 -3160808 -2710930 -2785811 -1917123 1251303 5252240 7447948 7430228 6489134
10818F489134j509038j971556o61399J877264J944333j538400m568035m005512
$$ 6489134 4980096 3008540 2347141 4224405 6168738 4630338 62303 -3943209
10810c943209j533861Q30457L812936O252697L622283l950806q157122l346115
$$ -3943209 -5477070 -4646613 -833677 5419020 9041303 5090497 -3066625 -6412740
10802f412740M121479M548761j144582m079937j200775K027171J590639m00694
$$ -6412740 -2291261 2257500 1112918 -2967019 -4167794 -2140623 -549984 -950678
10794i50678j371288j738772j696183k24175J610652J164258j170248k086512
$$ -950678 -2321966 -4060738 -5756921 -5981096 -4370444 -3206186 -4376434 -6462946
10786f462946n54417J070489J296453J016812P30438j24087j103471j224814r45204
$$ -6462946 -7017363 -5946874 -4650421 -3633609 -2903171 -3027258 -4130729 -5355543 -6300747
10777f300747p96065M13874K758468K994772n15482l459655j552516J898836J039243
$$ -6300747 -7096812 -6682938 -3924470 -929698 -1445180 -4904835 -6457351 -4558515 -3519272
10768c519272k327855j657086K512163K928521j615128l585896N99254M441480
$$ -3519272 -5847127 -7504213 -4992050 -2063529 -3678657 -7264553 -6665299 -2223819
10760b223819K413942j053005L14984M080359L627644j182686m716595m215852
$$ -2223819 190123 -862882 -547898 3532461 7160105 5977419 1260824 -2955028
10752b955028j783726M93111K228160K701954J508083M21078J194807K547926
$$ -2955028 -4738754 -4245643 -2017483 684471 2192554 2613632 3808439 6356365
10744F356365K244385O70761n10116j422416k619324k676311o44674R57983m61950
$$ 6356365 8600750 9271511 8761395 7338979 4719655 2043344 1398670 2356653 1894703
10735A894703k678275j414324K850404N220764L388319J24549j608197k076172
$$ 1894703 -783572 -2197896 652508 5873272 9261591 9386140 7777943 5701771
10727E701771k325961j859995l36882J016015J139170L69052q23952k206053k448180
$$ 5701771 3375810 1515815 1178933 2194948 3334118 3703170 2879218 673165 -1775015
10718a775015j78784K783467K412669j648075m349141j966432K186342K312055
$$ -1775015 -1953799 829668 3242337 1594262 -2754879 -4721311 -2534969 -222914
10710b22914j499782l713112j549083J699685K347671J207474P71835Q49230N0607
$$ -222914 -1722696 -5435808 -6984891 -5285206 -2937535 -1730061 -958226 -108996 -58389
10701e8389n61315J073828L687117L334233j067757n572371n765168j697644K860136
$$ -58389 -619704 454124 4141241 7475474 6407717 835346 -4929822 -6627466 -3767330
10692c767330M626688L061335l02675l155828l610603j594396R26207J984855
$$ -3767330 859358 3920693 3618018 462190 -3148413 -4742809 -3816602 -1831747
10684a831747J709588J580533K006598J922820P99141m25405r82655j468171k319709
$$ -1831747 -122159 1458374 3464972 5387792 6186933 5761528 4778873 3310702 990993
10675I90993k325905l95205J866754J560552j396464l749247l111306n08722K145785
$$ 990993 -1334912 -1730117 136637 1697189 300725 -3448522 -6559828 -7068550 -4922765
10666d922765M449378N705911L764002j246447m538529k215073K425100K875152
$$ -4922765 -473387 5232524 8996526 7750079 3211550 996477 3421577 6296729
10658F296729j213947m037309k872149j167807j240340m58282K393281L214952
$$ 6296729 5082782 1045473 -1826676 -2994483 -4234823 -4693105 -2299824 915128
10650I15128m17308l590344r84617M354417N158993L92868m190449m479157j767877
$$ 915128 497820 -3092524 -4077141 277276 5436269 5829137 1638688 -2840469 -4608346
10641d608346J051697K425830J685613n70590k097481j737173j110946j172553
$$ -4608346 -3556649 -1130819 554794 -15796 -2113277 -3850450 -4961396 -6133949
10633f133949J27278L470116M920440J553893k809398k685248R21494K813921
$$ -6133949 -6006671 -2536555 2383885 3937778 1128380 -1556868 -635374 2178547
10625B178547J580384k53865j634306k802526k093758J213836L311658J086965
$$ 2178547 3758931 3505066 1870760 -931766 -3025524 -1811688 1499970 2586935
10617B586935j950288j279951O86024l94660j898047P66870M058476J651206l114175
$$ 2586935 636647 -643304 42720 -351940 -2249987 -1483117 2575359 4226565 1112390
10608A112390j889344L479464L334158k645867m483142M74092L080034j027972
$$ 1112390 -776954 2702510 6036668 3390801 -1092341 -618249 2461785 1433813
10600A433813m148031j044370K160311K93476j419303K027441N598355L273717
$$ 1433813 -2714218 -3758588 -1598277 -1304801 -2724104 -696663 4901692 8175409
10592H175409j647465l162285k017470j475936p13037J059472Q19937j906197
$$ 8175409 6527944 3365659 1348189 -127747 -840784 218688 1038625 -867572
10584h67572j959231K574494N754823L449259k25275j427233k917271n994540
$$ -867572 -2826803 -252309 5502514 8951773 8726498 7299265 4381994 -1612546
10576a612546n339823J065121N761649L224215r27089M6613K984065K078609o45562
$$ -1612546 -6952369 -5887248 -125599 3098616 2171527 2218140 5202205 7280814 6635252
10567F635252o68973K21810j318203l112663k487649j792008k491855j226818
$$ 6635252 5966279 6188089 4869886 1757223 -730426 -2522434 -5014289 -6241107
10559f241107K327098K489753j465038j697843L920684N547481k026030q609609
$$ -6241107 -3914009 -1424256 -2889294 -4587137 -666453 4881028 2854998 -5754611
10551e754611m855977K451802L021395j76741O21367L116930J748067k06958J595362
$$ -5754611 -10610588 -8158786 -5137391 -5314132 -4692765 -1575835 172232 -34726 1560636
10542A560636K056803l112982o392259j132226M760137J913806l823008k527738
$$ 1560636 3617439 504457 -5887802 -7020028 -2259891 -346085 -4169093 -6696831
10534f696831K089680J518110j060628J004546L156332o44677l918952O8918L292951
$$ -6696831 -4607151 -3089041 -4149669 -3145123 11209 -633468 -4552420 -4483502 -1190551
10525a190551k367526p658673k096791N268665K010662l930080N41939P848512
$$ -1190551 -3558077 -11216750 -13313541 -8044876 -6034214 -9964294 -9422355 -1573843
10517a573843M000875m007650j719544M272163k51206p538025k339710O174038
$$ -1573843 2427032 -1580618 -3300162 972001 720795 -6817230 -9156940 -2982902
10509b982902K14738j0577566m969980Q827383O962575n137764l777675O128691
$$ -2982902 -2768164 -13345730 -18315710 -9488327 -2525752 -7663516 -11441191 -5312500
10501e312500J142919j1558255n575640J0296073M614011j4017782r139215J0349244
$$ -5312500 -4169581 -15727836 -21303476 -11007403 -6393392 -20411174 -29550389 -19201145
10493a9201145J194558k6304043j6959153J6468534j0109997r9891103j25171177
$$ -19201145 -18006587 -44310630 -61269783 -44801249 -54911246 -154802349 -279973526
10486b79973526p983203J38305836J52120401M5856713l1123292j3564271K1020662
$$ -279973526 -287956729 -149650893 2469508 48326221 17202929 3638658 24659320
10479B4659320P577001j6975034p191302J1214035K849711j2126101m477778Q878466
$$ 24659320 32236321 15261287 8069985 19284020 22133731 10007630 5529852 14408318
10471A4408318K568019q993081l463301O264616o233r934857l522441Q534090
$$ 14408318 16976337 7983256 4519955 10784571 10778338 843481 -2678960 5855130
10463E855130N807501m798217m913558J557581M53991l587084J564201R267817
$$ 5855130 11662631 6864414 1950856 3508437 3962428 375344 1939545 11207362
10455A1207362N753534l693163m617630P31916Q4679n307560n116210k93903O97529
$$ 11207362 16960896 13267733 8650103 9382019 9466698 4159138 -957072 -1250975 -553446
10446e53446o69028K502462O681729L721193k781298k959520K001164K860469
$$ -553446 -1222474 1279988 7961717 11682910 8901612 5942092 7943256 10803725
10438A0803725j234108k995355n66146J318726J006936M07483j030416l772470
$$ 10803725 9569617 6574262 6008116 7326842 8333778 8741261 7710845 3938375
10430C938375l665986J536588N764880L092251k311564k984465M8427O96226j522611
$$ 3938375 272389 1808977 7573857 10666108 8354544 5370079 5418506 6114732 4592121
10421D592121k456025j327836n31128m78932l00706m14632m51540J102090K594435
$$ 4592121 2136096 808260 277132 -201800 -502506 -917138 -1368678 -266588 2327847
10412B327847N25679k918539j652659L014667K963414k029226k204595M923765
$$ 2327847 2853526 -65013 -1717672 1296995 4260409 2231183 26588 4950353
10404D950353Q481066K341674m108465k408230Q46672k560942p017985m057066
$$ 4950353 13431419 15773093 11664628 9256398 10103070 7542128 524143 -3532923
10396c532923J597200R72849k711262r11398L938202L449581r20303j315106J609383
$$ -3532923 -1935723 -962874 -3674136 -4585534 -647332 2802249 1881946 566840 2176223
10387B176223J052560k100860j391012J900827R54539k817822j548538M125559
$$ 2176223 3228783 1127923 -263089 1637738 2592277 -225545 -1774083 2351476
10379B351476N021619p41713m266101p38309L285013J319763l316449l847247
$$ 2351476 7373095 6631382 2365281 1626972 4911985 6231748 2915299 -931948
10371i31948J79679L597514K431020k298037n483151k892934K867196M002951
$$ -931948 -752269 2845245 5276265 2978228 -2504923 -5397857 -2530661 1472290
10363A472290j864247o956512l968466L169473N585906K405251k16266J34712
$$ 1472290 -391957 -7348469 -11316935 -8147462 -2561556 -156305 -372571 -237859
10355b37859M78515l01256l62869L624q71574j432439M38050J959514m42060l566296
$$ -237859 240656 -60600 -423469 -419845 -1291419 -2723858 -2285808 -326294 -768354 -4334650
10345d334650j600161L655492M799977M24899l296454k650571l34838J136377
$$ -4334650 -5934811 -2279319 2520658 2945557 -350897 -3001468 -3336306 -2199929
10337b199929K527502L284364Q55610l613475m957799j328313L043330L843715
$$ -2199929 327573 3611937 4467547 854072 -4103727 -5432040 -2388710 1455005
10329A455005J266193j985214l294644r46052L539711M855967L55839m565074
$$ 1455005 2721198 735984 -2558660 -3504712 34999 4890966 5246805 681731
10321F81731l248669J802141K444334k059964l871351O49107N426745M701857
$$ 681731 -2566938 -764797 1679537 -380427 -4251778 -3602671 1824074 6525931
10313F525931J054475o06061q10265k428708m404514l598310j51078K981198L950447
$$ 6525931 7580406 6974345 6164080 3735372 -669142 -4267452 -4418530 -1437332 2513115
10304B513115K677518l08377l170336l004986O25895M052947L732606P59901j030088
$$ 2513115 5190633 4882256 1711920 -1293066 -667171 3385776 7118382 7878283 6848195
10295F848195l60316L94905q80695l028178l232666q11331J714272J763421M4931
$$ 6848195 6487879 6882784 6002089 2973911 -258755 -1070086 644186 2407607 2452538
10286B452538p13062J698l0754j480998j726898P09340K869376J534547j496821
$$ 2452538 1739476 1741174 1710420 229422 -1497476 -788136 2081240 3615787 2118966
10277B118966k002917J57698J241163m6182o57034J371262L279933J624171k328762
$$ 2118966 116049 273747 1514910 1468728 811694 2182956 5462889 7087060 4758298
10268D758298m002890j691451J196951R13119j461021j800735P30341K297607
$$ 4758298 755408 -936043 260908 1174027 -286994 -2087729 -1357388 940219
10260I40219M25674j956690j225802J173287J647546O45120Q65066J260955q92236
$$ 940219 1365893 -590797 -1816599 -643312 1004234 1649354 2514420 3775375 2883139
10251B883139l072761j65040N670290O110662k50009m465765q29166M278748K901352
$$ 2883139 -189622 -354662 5315628 11426290 11176281 6710516 5881350 10160098 13061450
10242A3061450k279434l502939k45528J918265J069563j58922j035608k805948
$$ 13061450 10782016 7279077 7033549 8951814 10021377 9862455 8826847 6020899
10234F020899l770539j061370L245148L798932k09391l902517l543827m10448
$$ 6020899 2250360 1188990 4434138 8233070 8023679 4121162 577335 166887
10226A66887K164466K261574J47891j861503j221016J271501J817482n20497j604555
$$ 166887 2331353 4592927 4740818 2879315 1658299 2929800 4747282 4226785 2622230
10217B622230J326336M765279M189863N44119k571620m391922n228619l318491
$$ 2622230 3948566 8713845 12903708 13447827 10876207 6484285 1255666 -2062825
10209b062825J320332L795739R24331k813478k139370Q7754j856560n794206m742305
$$ -2062825 -742493 3053246 3977577 1164099 -975271 -887517 -2744077 -8538283 -13280588
10200a3280588J239540N208477M612665L642144M109012K735716r79849k410623
$$ -13280588 -12041048 -6832571 -2219906 1422238 5531250 8266966 7287117 4876494
10192D876494J20555K081266N29206j261708k94550R08642n15365k315551j245349
$$ 4876494 4997049 7078315 7607521 6345813 6051263 6959905 6444540 4128989 2883640
10183B883640J098996J020313j171544j963249k44920J491124J279778J89781
$$ 2883640 3982636 5002949 3831405 1868156 1623236 3114360 4394138 4583919
10175D583919J20643R46657J089617J64028o17206r53309k227087m166332l265765
$$ 4583919 4704562 5651219 6740836 6904864 6287658 5334349 3107262 -1059070 -4324835
10166d324835J962783O329013L909037k446187m276736k83603K076468o03500
$$ -4324835 -2362052 3966961 7875998 5429811 1153075 869472 2945940 2342440
10158B342440k460542K04430J890865j378882l463598J209520O405493L865344
$$ 2342440 -118102 86328 1977193 598311 -2865287 -1655767 4749726 8615070
10150H615070k213873k127308K743150K876023k637908n164713j659200J579214
$$ 8615070 6401197 4273889 7017039 9893062 7255154 2090441 431241 2010455
10142B010455J098245P33051J996802P84823l499387n197107k033440J064863
$$ 2010455 3108700 3841751 5838553 6623376 3123989 -2073118 -4106558 -3041695
10134c041695Q20478J57651J055853R48514o81966j34673K696985K291515k776631
$$ -3041695 -2221217 -2063566 -1007713 -59199 -741165 -875838 1821147 4112662 1336031
10125A336031n751961j990705L593122M389614J292603j010153j453714j189315
$$ 1336031 -4415930 -6406635 -2813513 1576101 2868704 1858551 404837 -784478
10117g84478M00488L118253L386198p80202n326646m993735j40370M578496N867723
$$ -784478 -383990 2734263 6120461 5340259 13613 -4980122 -5120492 -541996 5325727
10108E325727L489264q72174l895692k512555K112274M882529K831975j522271
$$ 5325727 8814991 7942817 4047125 1534570 3646844 8529373 11361348 9839077
10100I839077m076237l657423j637974J90246N12143l46938k10234J574370J966257
$$ 9839077 5762840 2105417 467443 657689 1169832 822894 612660 2187030 4153287
10091D153287j073319l961407k574530M22601j38737k373469k58705M810342M847488
$$ 4153287 3079968 -881439 -3455969 -3033368 -3172105 -5545574 -5804279 -993937 3853551
10082C853551j340278n245612j944938K723374K342166p81706j461480j6587M36215
$$ 3853551 2513273 -2732339 -4677277 -1953903 388263 -393443 -1854923 -1871510 -1435295
10073a435295k37627p97286j653339k656739j987672J32175J024496N83504J519715
$$ -1435295 -1672922 -2470208 -4123547 -6780286 -8767958 -8635783 -7611287 -7027783 -5508068
10064e508068L316071K260826j033566j398716J645122K387654o93133j679919
$$ -5508068 -2191997 68829 -964737 -2363453 -718331 1669323 976190 -703729
10056g03729J978799M316467J375444j799798n73331J121201j219724m070045
$$ -703729 1275070 5591537 6966981 5167183 4593852 5715053 4495329 425284
10048D25284k691557R7355l63124j919310l48145K367727K057471J57800L13761
$$ 425284 -2266273 -2168918 -2532042 -4451352 -4799497 -2431770 -374299 -216499 97262
10039I7262J335496L40947j082268l07504P73514k79378j290480k64087m02992
$$ 97262 1432758 1773705 691437 383933 1157447 878069 -412411 -676498 -1079490
10030a079490l839858n537764q02680N791064O700356K580069m29909p10575p77758
$$ -1079490 -4919348 -10457112 -11259792 -5468728 1231628 3811697 3381788 2671213 1893455
10021A893455m41025J916417M120987L275433J077251J09j633477m538348m034321
$$ 1893455 1452430 3368847 7489834 10765267 11842518 11842627 10209150 5670802 1636481
10012A636481J716935N211353M97574n528062l499229K441193J793033l599015
$$ 1636481 3353416 8564769 9062343 3534281 35052 2476245 4269278 670263
10004F70263k801380M004745M424770n095907j1960511o329364M754280Q766560
$$ 670263 -2131117 1873628 6298398 1202491 -10758020 -17087384 -12333104 -3566544
9996c566544M093189j675915l202844j084537J605986K076934j03619j877521
$$ -3566544 526645 -1149270 -4352114 -5436651 -3830665 -1753731 -1857350 -3734871
9988c734871n27369J797072J620161N66318K191369M165191J391269m046259m870766
$$ -3734871 -4262240 -2465168 -845007 -278689 1912680 6077871 7469140 3422881 -1447885
9979a447885n95501J820204K25963K28426L594110L960002j585852n963937k941548
$$ -1447885 -2043386 -223182 2781 231207 3825317 7785319 6199467 235530 -2706018
9970b706018L021270L966110l26962m090759m052349j232724K024000L027816
$$ -2706018 315252 4281362 3954400 -136359 -4188708 -5421432 -3397432 -369616
9962c69616K83539l307511k834468J184792K869942L44951j167715J617086M467261
$$ -369616 -86077 -3393588 -6228056 -5043264 -2173322 -1828371 -2996086 -1379000 3088261
9953C088261K960954o31881k154152j841964j457035k80412J700163J628062q85479
$$ 3088261 6049215 5417334 3263182 1421218 -35817 -316229 1383934 3011996 2126517
9944B126517j403670J884455L818780N48365l318735k064119J518322J046425
$$ 2126517 722847 2607302 6426082 6974447 3655712 1591593 3109915 4156340
9936D156340k582507l044463O68399K963993Q70890k011438j779721N50043J634139
$$ 4156340 1573833 -1470630 -802231 2161762 3032652 1021214 -758507 -208464 1425675
9927A425675L74005j449693j498931N84707K433589J621416q27478j743144p05879
$$ 1425675 1799680 349987 -1148944 -564237 1869352 3490768 2663290 920146 214267
9918B14267k71110q48946J14211K468660K129369j882048m429171j874061K229128
$$ 214267 -56843 -905789 -791578 1677082 3806451 1924403 -2504768 -4378829 -2149701
9909b149701L141291J841945J302838N93604j849930l293312j046638J759938
$$ -2149701 991590 2833535 4136373 4729977 2880047 -413265 -1459903 300035
9901C00035Q26786j998351k196226m05240l32404j551286j140912o7072q80960
$$ 300035 1126821 -871530 -3067756 -3472996 -3805400 -5356686 -6497598 -6564670 -7445630
9892g445630j430733J445724M213799J513431k738284N96656J0258116J3888673
$$ -7445630 -8876363 -7430639 -3216840 -1703409 -4441693 -3845037 6413079 20301752
9884B0301752N881016m239243o099159k114376n16249k390451l365502k715082
$$ 20301752 26182768 21943525 15844366 13729990 13213741 10823290 7457788 4742706
9876D742706k708980k361423O15067L787494K867262p72231j905138P2454Q45872
$$ 4742706 2033726 -327697 287370 4074864 6942126 6169895 4264757 4337211 5183083
9867E183083q18639j227836J135108K794856J676370Q18199K521526L405624l99800
$$ 5183083 4364444 3136608 4271716 7066572 8742942 9561141 12082667 15488291 15088491
9858A5088491o188340p574811l227518J565872K068731o59459k420757j031782
$$ 15088491 8900151 1325340 -1902178 -336306 1732425 1072966 -1347791 -2379573
9850b379573K394615N350765N728529K981506j186795l941762l965740k459429
$$ -2379573 15042 5365807 11094336 14075842 12889047 8947285 4981545 2522116
9842B522116j175183n51779l63101p16484j182975l60829J899438L044160J015204
$$ 2522116 1346933 795154 432053 -284431 -1467406 -1828235 71203 3115363 4130567
9833D130567j838693j143320K982859N169904K017167k984140m307139j840940
$$ 4130567 2291874 1148554 4131413 9301317 11318484 8334344 4027205 2186265
9825B186265k4319p25779j075249J070727L265685K216068j080521k781920j688010
$$ 2186265 2161946 1436167 360918 1431645 4697330 6913398 5832877 3050957 1362947
9816A362947l61804p08269j197897J96780K306970K196044m95519k867611k582720
$$ 1362947 1001143 292874 -905023 -708243 1598727 3794771 3299252 431641 -2151079
9807b151079m86991J178528J473373O84742q50994k367718k331017l01094J602628
$$ -2151079 -2638070 -1459542 13831 698573 -152421 -2520139 -4851156 -5152250 -3549622
9798c549622R82063j470295k709206j264946J362085L135074L378708K157889
$$ -3549622 -2567559 -4037854 -6747060 -8012006 -6649921 -3514847 -136139 2021750
9790B021750j21447j975634j724224Q1380R24549j14181r60294R5573J534295
$$ 2021750 1900303 -75331 -1799555 -1718175 -793626 -907807 -1868101 -1772528 -238233
9781b38233R06548j337612k374134p98235J859791L270072K576947M51886k046783
$$ -238233 668315 -669297 -3043431 -3841666 -1981875 1288197 3865144 4317030 2270247
9772B270247m160258n219027m207609m91614M245701N982344K550820k401590
$$ 2270247 -1890011 -7109038 -11316647 -11808261 -7562560 -1580216 970604 -1430986
9764a430986k644793K501268O393820L590746k636618m722689j002663K753145
$$ -1430986 -4075779 -1574511 4819309 8410055 5773437 1050748 48085 2801230
9756B801230J893384j236549j605633J391339L774639K590944p12908k475962
$$ 2801230 4694614 3458065 1852432 3243771 7018410 9609354 8896446 6420484
9748F420484r88597J830916K505652j51551l288585k958791R14096L854130K200640
$$ 6420484 5431887 7262803 9768455 9616904 6328319 3369528 4283624 8137754 10338394
9739A0338394k068760l822044j496935J257598J176116k57157m4160J086856R6565
$$ 10338394 8269634 4447590 2950655 4208253 5384369 5127212 5083052 6169908 6266473
9730F266473k736092l696905j636335L8722q62857j543005O48419K793989P51950
$$ 6266473 3530381 -166524 -1802859 -1764137 -2626994 -4169999 -3521580 -727591 24359
9721B4359l306020l301030J320077M324065J947778j955328k393543k04392Q16585
$$ 24359 -3281661 -6582691 -5262614 -938549 1009229 -946099 -3339642 -3544034 -2727449
9712b727449R9636k72678K66037R93519K281473M019430L542835o84120m775829
$$ -2727449 -2627813 -2900491 -2634454 -1640935 640538 4659968 8202803 7518683 2742854
9703B742854l601304J313968L187950j90476l282672j365350K593871L051869
$$ 2742854 -858450 455518 3643468 3452992 170320 -1195030 1398841 4450710
9695D450710J76019j464946m43652J31754j490716k860510j691546K85121J16385
$$ 4450710 4626729 3161783 2718131 2849885 1359169 -1501341 -3192887 -2907766 -2791381
9686b791381j750407k218278j11582K389687K968154J812428L94839o77621j369915
$$ -2791381 -4541788 -6760066 -6871648 -4481961 -1513807 298621 693460 15839 -1354076
9677a354076j060414O03488K280518K154504M81075p77304r07845j095944j728061
$$ -1354076 -2414490 -1811002 469516 2624020 3105095 2327791 1419946 324002 -1404059
9668a404059j349771N11422J739452Q03633l49858Q27256L068269K853212j96969
$$ -1404059 -2753830 -2242408 -502956 300677 -49181 778075 3846344 6699556 6502587
9659F502587k764378k764737j518479l44385J492273L810924L798695n5947m626794
$$ 6502587 3738209 973472 -545007 -889392 602881 4413805 8212500 8156553 3529759
9650C529759n643632k947863L71864K431103L090827J648444k037354m790110
$$ 3529759 -2113873 -5061736 -4689872 -2258769 832058 2480502 443148 -4346962
9642d346962k864552K108670M144598J076427k373259j668841J314403K152531
$$ -4346962 -7211514 -5102844 -958246 118181 -2255078 -3923919 -2609516 -456985
9634d56985P05637K08954J549795K425621J345913q38940k853568l697102k264013
$$ -456985 248652 457606 2007401 4433022 5778935 4939995 2086427 -1610675 -3874688
9625c874688R59762K841637J285918j128153o52705J631888J572514j035951k225432
$$ -3874688 -2914926 -73289 1212629 84476 -568229 1063659 2636173 1600222 -625210
9616f25210q40915k88963j977159k482843J95739K529254J048179k043029k624418
$$ -625210 -1466125 -1755088 -3732247 -6215090 -6019351 -3490097 -2441918 -4484947 -7109365
9607g109365o65990J317101K801011M305227M527303K424379m5101r50855j752301
$$ -7109365 -7775355 -6458254 -3657243 647984 5175287 7599666 7554565 6603710 4851409
9598D851409l866489m758846k074010J076424M44391j924293p55083L380002M736824
$$ 4851409 984920 -3773926 -5847936 -4771512 -4327121 -6251414 -7006497 -3626495 1110329
9589A110329J743056j136732j358523j303483k004827p12813K836362M123774
$$ 1110329 2853385 1716653 358130 -945353 -2950180 -3662993 -826631 3297143
9581C297143J170192j539254l11673J777956O49285j664807r22088J809272K127403
$$ 3297143 4467335 2928081 2616408 4394364 5043649 3378842 2456754 4266026 6393429
9572F393429m06480k250026j942016j413300j747507j748905p42950M38408J299063
$$ 6393429 5986949 3736923 1794907 381607 -1365900 -3114805 -3857755 -3419347 -2120284
9563b120284K007898K180362J415432M34591j9553k55599j22179J460336L506891
$$ -2120284 -112386 2067976 3483408 3917999 3898446 3642847 3520668 4981004 8487895
9554H487895K423898k466076n886181l346408J695094K660757j35374o35018K520785
$$ 8487895 10911793 8445717 2559536 -786872 908222 3568979 3433605 2798587 5319372
9545E319372L793387K59902l423185k585868M76556J049529p13125j379176j30621
$$ 5319372 9112759 9372661 5949476 3363608 3840164 4889693 4176568 2797392 2666771
9536B666771J131316J564445J585892Q60822p21447j609814j040906j054108k930982
$$ 2666771 3798087 5362532 6948424 7809246 7087799 5477985 4437079 3382971 451989
9527D51989l837311r91700K800692K688803l61515q43549K258581L713416O23864
$$ 451989 -3385322 -4377022 -1576330 1112473 750958 -92591 2165990 5879406 6503270
9518F503270l050948l163205j364806q59974o76452J354028L357576K127109j169822
$$ 6503270 3452322 289117 -1075689 -1935663 -2612115 -1258087 2099489 4226598 3056776
9509C056776k711572j828018o56803M37238K366659L478692J338377k190321k769401
$$ 3056776 345204 -1482814 -2139617 -1702379 664280 4142972 5481349 3291028 521627
9500E21627l75270Q66567k88710q55889J27595q5011j994017k205245J25603J177434
$$ 521627 146357 1012924 724214 -131675 -4080 -89091 -2083108 -4288353 -4162750 -2985316
9490b985316m09180l88249L341848N825384K822513j821737k342583l2109L51374
$$ -2985316 -3394496 -3782745 -440897 5384487 8207000 6385263 4042680 4010571 4361945
9481D361945o50623P91638L490714K433355k477958n581756l725102J25J361293
$$ 4361945 3711322 4502960 7993674 10427029 7949071 2367315 -1357787 -1357662 3631
9472C631l52289k959347l469822k74954M092460M553848O99532j367859J574029
$$ 3631 -348658 -3308005 -6777827 -7052781 -2960321 1593527 2293059 925200 2499229
9463B499229L744672j74731m935128k904253K258070J337587l799628k485148
$$ 2499229 6243901 6069170 1134042 -1770211 487859 1825446 -1974182 -4459330
9455d459330N769831Q646200R17359o372403l207769M334024M925255j018808
$$ -4459330 1310501 9956701 10874060 4501657 1293888 5627912 10553167 9534359
9447I534359m765768l432507j248500n26057J75276R97978O88212J37205R92971
$$ 9534359 4768591 1336084 87584 -438473 -263197 734781 1422993 1560198 2553169
9438B553169K386551K757025K451649J511321j448804n056185m610176M51640
$$ 2553169 4939720 7696745 10148394 11659715 10210911 5154726 544550 996190
9430I96190L670077Q25014l144407j970643K209459L247387P23910j388680k085147
$$ 996190 4666267 5491281 2346874 376231 2585690 5833077 6556987 5168307 3083160
9421C083160k628993j833037J176701K520884j177923n773256m819394N25602
$$ 3083160 454167 -1378870 -202169 2318715 1140792 -4632464 -9451858 -8926256
9413h926256L802367L250081K287824J938488M13581r42742R78972M096283K906220
$$ -8926256 -5123889 -1873808 414016 2352504 2766085 1823343 2802315 6898598 9804818
9404I804818k482881n809407l765420L31160K447040J904480o40905l940684m816424
$$ 9804818 7321937 1512530 -2252890 -1921730 525310 2429790 1788885 -2151799 -6968223
9395f968223j188468L741755N114648L280890J974720J279731j388720m595295
$$ -6968223 -8156691 -4414936 699712 3980602 5955322 7235053 5846333 1251038
9387A251038m083491k10666K406131K296861J786206J103486j146861k598804
$$ 1251038 -2832453 -3043119 -636988 1659873 3446079 4549565 3402704 803900
9379H03900p8509K737441n43779p141060p085299J335369Q022270O028897N99310
$$ 803900 725391 3462832 2919053 -4222007 -11307306 -9971937 -1949667 4079230 4678540
9370D678540j020567P6467j94157r38494M6745P56229p46454j563458Q75035L376721
$$ 4678540 3657973 3734440 3540283 2601789 2648534 3404763 2658309 1094851 1969886 5346607
9360E346607K095677r87031j885861j220012j833476k951921j835228R72469K526354
$$ 5346607 7442284 6455253 4569392 3349380 1515904 -1436017 -3271245 -2298776 227578
9351B27578K009279Q98964J54255r5396K87825O53732j64374j593550j767851
$$ 227578 2236857 3135821 3290076 3194680 3482505 4136237 3971863 2378313 610462
9342F10462q07994m98610n73216N57160J442633p38819l942339l048505J276663
$$ 610462 -197532 -696142 -1269358 -712198 730435 -8384 -3950723 -6999228 -5722565
9333e722565K765395K13649j81579L927500O081823J923453l155585l113539m95031
$$ -5722565 -2957170 -2743521 -2925100 1002400 7084223 9007676 5852091 2738552 2243521
9324B243521k4611q7526J931654K355318k194556o298456l043249M088427N835991
$$ 2243521 2218910 2131384 4063038 6418356 4223800 -2074656 -5117905 -1029478 4806513
9315D806513J028371k970982k005656R07122K353658J797183j162042n915934
$$ 4806513 5834884 2863902 858246 1765368 4119026 5916209 4754167 -1161767
9307a161767q042823l971854K408855M269604J873427J191741L355553L210262
$$ -1161767 -9204590 -13176444 -10767589 -6497985 -4624558 -3432817 -77264 3132998
9299C132998j005708l995652j630925K971094M269450J209045k778829l992202
$$ 3132998 2127290 -1868362 -3499287 -528193 3741257 4950302 2171473 -1820729
9291a820729j593207J678856K179480J5952j032622J58271j53503l299216l909099
$$ -1820729 -3413936 -1735080 444400 460352 -572270 -413999 -567502 -3866718 -7775817
9282g775817J595753P158126N184606j332631l398763n9280J639623n24792j285764
$$ -7775817 -6180064 978062 6162668 4830037 1431274 1371994 3011617 2486825 1201061
9273A201061J327721K366597n93412l178647k522945j960343l706958l956239
$$ 1201061 2528782 4895379 4301967 1123320 -1399625 -3359968 -7066926 -11023165
9265a1023165K86701N219491N567758J612765k603488m287374k536467J960996
$$ -11023165 -10736464 -5516973 50785 1663550 -939938 -5227312 -7763779 -5802783
9257e802783N586837M336501k57509k154841L94547K124646p81734m768514m773459
$$ -5802783 -215946 4120555 3863046 1708205 2102752 4227398 3445664 -1322850 -6096309
9248f096309j400608J480081K488581K465746J600431J56284m33626K25025N29161
$$ -6096309 -7496917 -6016836 -3528255 -1062509 537922 694206 260580 485605 1014766
9239A014766j45582l04049M83178N58859l51997k97677R85971J271525K22691
$$ 1014766 869184 565135 1048313 1607172 1255175 957498 1943469 3214994 3437685
9230C437685K32186J518784J185005j203792k274944j020759p51676k531766k694730
$$ 3437685 3669871 5188655 6373660 5169868 2894924 1874165 1122489 -1409277 -4104007
9221d104007K8754J279380j016764j958359J912695N601256L454454j238879j684026
$$ -4104007 -4075253 -2795873 -3812637 -5770996 -3858301 1742955 5197409 3958530 2274504
9212B274504J412514J961567j098339l183038k385119j227670p33736O06853J988898
$$ 2274504 3687018 5648585 4550246 1367208 -1017911 -2245581 -2979317 -2372464 -383566
9203c83566O20312k504207k733695J194426M916352M547605J229822j552721k073990
$$ -383566 236746 -2267461 -5001156 -3806730 1109622 5657227 6887049 5334328 3260338
9194C260338r09410J67463n03132k347391k429523M47698L012227J775342j616217
$$ 3260338 2350928 2518391 2015259 -332132 -2761655 -2313957 698270 2473612 857395
9185H57395k816079j145441M20825M85610J56962n11890k466635m138468k397996
$$ 857395 -1958684 -3104125 -2683300 -2197690 -2040728 -2552618 -5019253 -9157721 -11555717
9176a1555717K463961O430147O799684M214218m8845m810633p118233m218899
$$ -11555717 -9091756 -2661609 4138075 8352293 8303448 3492815 -3625418 -7844317
9168g844317J748742N146116L915669J407430L51298m87359k027554j889587J344482
$$ -7844317 -6095575 -949459 2966210 4373640 4724938 4237579 2210025 320438 1664920
9159A664920M398728L272883j184966m576478m329964j471970J611558L044170
$$ 1664920 6063648 9336531 8151565 3575087 -754877 -2226847 -615289 2428881
9151B428881K074085l87353k391615l024732k970512k658741j537745K02018J206565
$$ 2428881 4502966 4115613 1723998 -1300734 -4271246 -6929987 -8467732 -8265714 -7059149
9142g059149J181653J400157J929631R17394j668259k381470Q13530M296173L231814
$$ -7059149 -5877496 -4477339 -2547708 -1630314 -3298573 -5680043 -4866513 -570340 2661474
9133B661474r65289k048983J885796N125830K297830l989468o841793m214661
$$ 2661474 1696185 -352798 1532998 6658828 8956658 4967190 -1874603 -6089264
9125f089264l13870J288540J460327J683317Q69735j487673k553906k10901K577390
$$ -6089264 -6403134 -5114594 -3654267 -1970950 -1101215 -2588888 -5142794 -5353695 -2776305
9116b776305J699730j399077j702923J432973L571673K681997J723947K317984
$$ -2776305 -1076575 -2475652 -4178575 -2745602 826071 3508068 5232015 7549999
9108G549999J589382j815453l901676j588896J656905J200235j421744j730901
$$ 7549999 9139381 7323928 3422252 1833356 3490261 4690496 3268752 1537851
9100A537851J12635O28058k68048J83577J602372J018936j105458j271705N45509
$$ 1537851 1650486 2278544 2010496 2194073 3796445 4815381 3709923 2438218 2983727
9091B983727N86441j716715k189764R42584L594910K050927j595110l089994j872296
$$ 2983727 3570168 1853453 -336311 606273 4201183 6252110 4657000 1567006 -305290
9082c05290m91892m84949j176988j179219K09883J930632J595593j029097j994056
$$ -305290 -797182 -1282131 -2459119 -3638338 -3428455 -1497823 97770 -931327 -2925383
9073b925383J787635O220649L955454m549717r570809m471849N228172Q981888
$$ -2925383 -1137748 5082901 9038355 4488638 -5082171 -9554020 -4325848 4656040
9065D656040M020134l084545n497360k691050J299088K853703J497038p15716
$$ 4656040 8676174 5591629 94269 -2596781 -1297693 1556010 3053048 2337332
9057B337332j761206j281114M68480L509247O121275M270915k998580r269830
$$ 2337332 576126 -704988 -236508 3272739 9394014 13664929 10666349 1396519
9049A396519p258793Q36710N555230L130072o15970q17126k52701j979381k861853
$$ 1396519 -5862274 -5025564 529666 3659738 3043768 2226642 1973941 -5440 -2867293
9040b867293L6343K938338J662215p84297K33918K397456R01532k275614j705773
$$ -2867293 -2830950 107388 1769603 985306 1219224 3616680 4518212 2242598 536825
9031E36825J604926K099730l29693q94465M63501q84766m272635l230878L013296
$$ 536825 2141751 4241481 3911788 3017323 3480824 2596058 -1676577 -4907455 -1894159
9022a894159O574850L052576j558585r61035J663079J60950l949458m507648r58439
$$ -1894159 4680691 7733267 6174682 5213647 6876726 7037676 3088218 -1419430 -2377869
9013b377869J446860K51411j497931j022348O03930J284750P08675m93590j826555
$$ -2377869 -931009 -679598 -2177529 -3199877 -2595947 -1311197 -602522 -1096112 -2922667
9004b922667k468176j523680P59281L035736M018196K987480J15288k760452k976026
$$ -2922667 -5390843 -6914523 -6155242 -3119506 898690 3886170 4001458 1241006 -1735020
8995a735020j62422K508702J863271j229171k999290j506059J370504K603286
$$ -1735020 -1897442 611260 2474531 1245360 -1753930 -3259989 -1889485 713801
8987G13801J386614n20453j164481n80176k81895o80694k37058J777544L075799
$$ 713801 2100415 1579962 415481 -164695 -446590 -1127284 -1364342 413202 3489001
8978C489001J175454k363583l453118j183023J155027J243731M96570M71397J50259
$$ 3489001 4664455 2300872 -1152246 -2335269 -1180242 63489 560059 1031456 1181715
8969A181715j091112j126153J397905L835604L122755N32605n87636k15077j002907
$$ 1181715 90603 -1035550 362355 4197959 7320714 7853319 7265683 7050606 6047699
8960F047699l118389l657247j386351J294775J910777Q34644k27321o19652o72518
$$ 6047699 2929310 -727937 -2114288 -819513 1091264 1925908 1698587 1078935 406417
8951D06417p23077r58393j298501j199457l92042M23951O26897R06631K114117
$$ 406417 -316660 -1275053 -2573554 -3773011 -4165053 -3741102 -3114205 -2207574 -93457
8942i3457L343778K755385J78382k498946l460606k358474K5904K217433K545347
$$ -93457 3250321 6005706 6184088 3685142 224536 -2133938 -2108034 109399 2654746
8933B654746O22422j817333k589660j218915J221978L333281L578879J038914
$$ 2654746 3277168 1459835 -1129825 -2348740 -1126762 2206519 5785398 6824312
8925F824312k451376k979201K87946K764644M70058l656507l778583p9431J737998
$$ 6824312 4372936 1393735 1681681 4446325 4916383 1259876 -2518707 -2598138 -860140
8916h60140k97527j698854M27469K526062J085138j000156P61267M627135M833764
$$ -860140 -1157667 -2856521 -2429052 97010 1182148 181992 943259 5570394 10404158
8907A0404158J62198m427530m581799j341680J202441M58174k702363m700172
$$ 10404158 10566356 6138826 1557027 215347 1417788 1875962 -826401 -5526573
8899e526573k329918L226562O421020L553040k083328m066722j165749J603822
$$ -5526573 -7856491 -4629929 1791091 5344131 3260803 -805919 -1971668 -367846
8891c67846M43863k296904k276795M59362J841343m51493l835678l896745L59289
$$ -367846 76017 -2220887 -4497682 -4038320 -2196977 -2648470 -6484148 -10380893 -10021604
8882a0021604N092609N644391J613103k779543l436443n55419K288415K176938
$$ -10021604 -4928995 715396 2328499 -451044 -3887487 -4442906 -2154491 22447
8874B2447n96522l027488k071898J959165M613791K005105l405026m857267l51926
$$ 22447 -574075 -3601563 -5673461 -3714296 899495 2904600 -500426 -5357693 -5709619
8865e709619M139643L055249j141328k728545j452214r66770j287236M38824K894269
$$ -5709619 -1569976 1485273 343945 -2384600 -3836814 -4803584 -6090820 -5651996 -2757727
8856b757727J727014k013488k095115K593728N356509K239583j817184j571911
$$ -2757727 -1030713 -3044201 -5139316 -2545588 2810921 5050504 3233320 1661409
8848A661409L40251p15899k942861k071465M91662M17440j563747j290939J144746
$$ 1661409 2001660 1285761 -1657100 -3728565 -3236903 -2819463 -4383210 -5674149 -4529403
8839d529403J935709N50332n5524O13030M38510j46270J177229L221998K594902
$$ -4529403 -2593694 -2043362 -2098886 -1485856 -1047346 -1193616 -16387 3205611 5800513
8830E800513P6188n37047K99529j344446m641650m232806J14187K199543J33686
$$ 5800513 5876701 5339654 5639183 4294737 -346913 -4579719 -4465532 -2265989 -2132303
8821b132303l7309M618018P511302K965865m066352n676268k663280j046540j534733
$$ -2132303 -2169612 2448406 9959708 12925573 8859221 3182953 519673 -526867 -2061600
8812b061600n41445J492017R92389j256558j153632J082497J406083l87628l99392
$$ -2061600 -2603045 -1111028 -118639 -1375197 -2528829 -1446332 -40249 -427877 -827269
8803h27269J834743K242770m49998k417880j207568P86268Q36282o62396k393111
$$ -827269 1007474 3250244 2800246 382366 -825202 -38934 797348 134952 -2258159
8794b258159l637454l032857K9695K765184K211663M01483R64687J833011j414011
$$ -2258159 -5895613 -8928470 -8898775 -6133591 -3921928 -3520445 -2555758 -722747 -2136758
8785b136758n611290k780884N748101Q404384O80672o812629m155638L280232
$$ -2136758 -7748048 -10528932 -4780831 3623553 4304225 -2508404 -6664042 -3383810
8777c383810M740667Q16977l25274K090038J956100j132829j473840J252955J147955
$$ -3383810 1356857 2173834 1848560 3938598 5894698 4761869 3288029 4540984 5688939
8768E688939k384233k812866J498531L386378j155487n970680m665192K0926K276064
$$ 5688939 3304706 491840 1990371 5376749 4221262 -1749418 -6414610 -6393684 -4117620
8759d117620K048961J836826N10297k920785m169059L78823O027768N508187k7224
$$ -4117620 -2068659 -231833 278464 -2642321 -6811380 -6432557 -404789 5103398 5076174
8750E076174l159077j823796j011597l037042l953257j276785J654076J832352
$$ 5076174 1917097 93301 -918296 -3955338 -7908595 -9185380 -7531304 -5698952
8742e698952J350219K672661L879401K335171n60183j886678j506838o29388J000300
$$ -5698952 -4348733 -1676072 2203329 4538500 3978317 2091639 584801 -44587 955713
8733I55713L097975K918975p30118l972142k673532J044642J663000j633523m455874
$$ 955713 4053688 6972663 6242545 2270403 -403129 641513 2304513 670990 -3784884
8724c784884m100968k004539N32959L800451O121249M188600j212246m597277
$$ -3784884 -7885852 -9890391 -9357432 -5556981 564268 4752868 3540622 -1056655
8716a056655l190029m82198R0768K21207K001927K915066M34641k236830p98450
$$ -1056655 -4246684 -4728882 -4638114 -4416907 -2414980 500086 934727 -1302103 -2100553
8707b100553K577290K532407m82098j214997J135984J772643r19477k422441j10658
$$ -2100553 476737 3009144 2527046 1312049 2448033 4220676 3301199 878758 768100
8698G68100K078624M03663k446616j994562J069008K822712K172139R24941j67747
$$ 768100 2846724 3250387 803771 -1190791 -121783 2700929 4873068 5798009 5630262
8689E630262j709639l217939l375289j933852M75505L064928M097107J704800
$$ 5630262 3920623 702684 -2672605 -4606457 -4130952 -1066024 3031083 4735883
8681D735883k747187m754934k261782J478598K739884J959756J107392j9822j617885
$$ 4735883 1988696 -2766238 -5028020 -3549422 -809538 1150218 2257610 2237788 619903
8672F19903j539916R38390K337311K61283j906076n03952J682996J48849l015680
$$ 619903 -920013 18377 2355688 2616971 710895 206943 1889939 2038788 -976892
8663i76892k564936M70306O95507j592434q49738L179874M287587O56558j854224
$$ -976892 -3541828 -3071522 -2376015 -3968449 -4818187 -1638313 2649274 3305832 1451608
8654A451608l1828J524728n08197j928506R09852L792673J630368k937835m342694
$$ 1451608 1419780 2944508 2436311 507805 1417657 5210330 6840698 3902863 -439831
8645d39831k773462j666467o78843K132281M503433L135971J04310l89537O41265
$$ -439831 -3213293 -4879760 -5558603 -3426322 1077111 4213082 4317392 3927855 4569120
8636D569120o02093l032266k403986O65525J494589m84765j308389r0583o8577
$$ 4569120 3967027 934761 -1469225 -803700 690889 206124 -1102265 -1192848 -1261425
8627a261425j615987j239900J286667J688801j036971k249109L92047K912438
$$ -1261425 -2877412 -4117312 -2830645 -1141844 -2178815 -4427924 -4035877 -1123439
8619a123439K148276R13884K085944K936158K26077l321821k915871Q42031L295233
$$ -1123439 1024837 1938721 4024665 6960823 7186900 3865079 949208 1791239 5086472
8610E086472K560459O66898p06493j749946k606463k938741k720828j569046J188601
$$ 5086472 7646931 8313829 7607336 5857390 3250927 312186 -2408642 -3977688 -2789087
8601b789087M167437M128744O02162k567916k745908k199786l133196k921390
$$ -2789087 1378350 5507094 6109256 3541340 795432 -1404354 -4537550 -7458940
8593g458940J047766N163206M134285m00505k160292J7102J388889J84304J75957
$$ -7458940 -6411174 -1247968 2886317 2485812 325520 342622 1731511 1915815 2091772
8584B091772K850655L790669R7563m103740l724440j89485J485464J50903j285914
$$ 2091772 4942427 8733096 8830659 4726919 1002479 812994 2298458 2449361 1163447
8575A163447j234638q40835q63244o35358l5487J18796k49611k17210P20795K121733
$$ 1163447 -71191 -912026 -1775270 -2410628 -2446115 -2327319 -2576930 -2794140 -2073345 48388
8565D8388L088260K553240J20011k539114k630245J62453K573778J779850r58885
$$ 48388 3136648 5689888 5809899 3270785 640540 802993 3376771 5156621 4197736
8556D197736k360169j396396L32546J206026O86938r73488k355657j533042J138022
$$ 4197736 1837567 441171 773717 1979743 2666681 1693193 -662464 -2195506 -1057484
8547a057484K560068J154918n67539j99762L97866j246495k905201j031466K163778
$$ -1057484 1502584 2657502 2089963 1890201 2288067 1041572 -1863629 -2895095 -731317
8538g31317J141892l588136n095266n27996M401348M361734J892945J636613K245829
$$ -731317 410575 -3177561 -8272827 -8800823 -4399475 -37741 1855204 3491817 5737646
8529E737646j33893l805401l487809J063749M388931L159353l69809l018473m098088
$$ 5737646 5603753 1798352 -1689457 -625708 3763223 6922576 6552767 3534294 -563794
8520e63794l437259m58694L291766M416346K188854j95123l15313M89538K79787
$$ -563794 -4001053 -4459747 -1167981 3248365 5437219 5242096 4926783 5416321 5696108
8511E696108m39982p21467j320684k570902k652357n10597J661690J480944r164
$$ 5696108 5256126 4534659 3213975 643073 -2009284 -2519881 -858191 622753 613589
8502F13589n01329l65196j280462k419043j578073O64331J566350P37362L82334
$$ 613589 112260 -252936 -1533398 -3952441 -5530514 -4866183 -3299833 -2562471 -2180137
8493b180137Q73095j3758k458686l117987l13360K650029K141347l98690r37450
$$ -2180137 -1307042 -1320800 -3779486 -6897473 -7210833 -4560804 -2419457 -2818147 -3755597
8484c755597J089760K682021K179677O93244r72376l115478m497125k664823J750112
$$ -3755597 -2665837 16184 2195861 2889105 1916729 -1198749 -5695874 -8360697 -6610585
8475f610585M457451L240903J160050J358323J743969j065261m665736l276730
$$ -6610585 -2153134 1087769 2247819 3606142 5350111 4284850 -380886 -3657616
8467c657616K832808O109457K068155m069027m863687j035803P58536j499989
$$ -3657616 -824808 5284649 7352804 3283777 -1579910 -2615713 -1857177 -3357166
8459c357166k762375N80987N104176N512549J641896k486206m012739k877061
$$ -3357166 -6119541 -5538554 -434378 5078171 6720067 4233861 221122 -2655939
8451b655939j13262K537161K657133k56313l043573k459996K50045J321614L24625
$$ -2655939 -2769201 -232040 2425093 2168780 -874793 -3334789 -3084744 -1763130 -1438505
8442a438505K97526J931011K019566p36809k689283r60114J447368L66258k459054
$$ -1438505 -1140979 790032 2809598 2072789 -616494 -1576608 -129240 237018 -2222036
8433b222036k127026J110093K134126m20758j983279j37488J184284r62420k525088
$$ -2222036 -4349062 -3238969 -1104843 -1525601 -3508880 -3646368 -2462084 -3424504 -5949592
8424e949592R36015N769243M970073q55346m341124k618002n13380j420824k111175
$$ -5949592 -5013577 755666 5725739 4870393 529269 -2088733 -2602113 -4022937 -6134112
8415f134112K97390K410635K91577l336819k912093J614606N125475M438649R32897
$$ -6134112 -5836722 -3426087 -3134510 -6471329 -9383422 -7768816 -2643341 1795308 2728205
8406B728205k576309l838611j447737L110250N033061J693841k828554k933361
$$ 2728205 151896 -3686715 -5134452 -2024202 3008859 4702700 1874146 -1059215
8398a059215K03996O25044k860141m987604k576109R93228J761920O75756M68922
$$ -1059215 -855219 -230175 -3090316 -8077920 -10654029 -9660801 -7898881 -7223125 -6754203
8389f754203J197103J749009K450439L374487K902973N11016j606917j881270
$$ -6754203 -5557100 -3808091 -1357652 2016835 4919808 5430824 3823907 1942637
8381A942637j604920j811966j127719Q63028J556837l32064j720946M3775K546570
$$ 1942637 337717 -1474249 -2601968 -1738940 -182103 -514167 -2235113 -2191338 355232
8372C55232K446661J104742J318540J332123k043010o213323n303838N04048M605274
$$ 355232 2801893 3906635 5225175 6557298 4514288 -1699035 -7002873 -6498825 -1893551
8363a893551L673179J510195J538875J558642r15717l334995k365866L07809R24452
$$ -1893551 1779628 3289823 4828698 6387340 5471623 2136628 -229238 78571 1003023
8354A003023j97257M4344J631765J358580j541560l597128j854369K184148M565416
$$ 1003023 805766 850110 2481875 3840455 2298895 -1298233 -3152602 -968454 3596962
8345C596962L362813K34188j794331j580729q70589j675686k945728j575775K595024
$$ 3596962 6959775 7193963 5399632 3818903 2948314 1272628 -1673100 -3248875 -653851
8336f53851N077898K204966l257428m970534j100685L501997L753244K10305k850716
$$ -653851 4424047 6629013 3371585 -1598949 -2699634 802363 4555607 4765912 1915196
8327A915196k991068j186409P75403K008350J814902n15980m201254o414641m630282
$$ 1915196 -1075872 -2262281 -1486878 521472 2336374 1820394 -2380860 -8795501 -13425783
8318a3425783L76843M658812M842652J605186j259581j327574j0882K28713k83236
$$ -13425783 -13048940 -8390128 -3547476 -1942290 -3201871 -4529445 -4540327 -4311614 -4594850
8309d594850M56657J888524J061759k110326l329323j15472L580347K820238n43705
$$ -4594850 -4138193 -2249669 -1187910 -3298236 -6627559 -6743031 -3162684 -342446 -886151
8300h86151o00565L113864M792013J723540j712857j798857j197467k911098l958228
$$ -886151 -1486716 1627148 6419161 8142701 6429844 4630987 3433520 522422 -3435806
8291c435806p43765L394720K681391j673100l468783j412677Q7481n99895m48663
$$ -3435806 -4179571 -784851 1896540 223440 -3245343 -4658020 -4570539 -5170434 -5619097
8282e619097J174024J004194j077704p72182K526925L515964J32380k105858P57851
$$ -5619097 -4445073 -3440879 -4518583 -5290765 -2763840 752124 884504 -1221354 -463503
8273d63503M214201K866049r02102j884057p01261r74701k007630j070185L97306
$$ -463503 3750698 6616747 5714645 3830588 3129327 2154626 146996 -923189 -525883
8264e25883l67763j376523M89915K581731N12429l282913k849589J119845K576120
$$ -525883 -893646 -2270169 -1780254 801477 1313906 -1969007 -4818596 -3698751 -1122631
8255a122631N41164k09821J435474J573223j94800J60684K273341Q97583l600379
$$ -1122631 -581467 -791288 644186 2217409 2022609 2183293 4456634 5354217 1753838
8246A753838l926034J465799M189525l68270m676097j516869L747947K417021
$$ 1753838 -2172196 -706397 3483128 3114858 -1561239 -3078108 669839 3086860
8238C086860k857506l098196J695141L360763j33944k062407P47820K795312j12020
$$ 3086860 229354 -2868842 -1173701 2187062 2053118 -9289 738531 3533843 3421823
8229C421823l815556k954292P41925K011533M8760j626040j136483k9614K95532
$$ 3421823 -393733 -3348025 -2606100 -594567 -545807 -2171847 -3308330 -3337944 -3042412
8220c042412P58797K498145M348948L836595O44306k193681j913704r6147o28858
$$ -3042412 -2283615 214530 4563478 8400073 9044379 6850698 4936994 4840847 4211989
8211D211989l476627l979295k6261L794265K592709j285417j800982J414503K695870
$$ 4211989 735362 -3243933 -3270194 524071 3116780 1831363 30381 1444884 4140754
8202D140754n87297l968568k799017J055334K592620J091034L73039K323520L698127
$$ 4140754 3553457 -415111 -3214128 -2158794 433826 1524860 1897899 4221419 7919546
8193G919546R20539l991986n250602j269987K371588M67867l850716l347967K028358
$$ 7919546 8840085 4848099 -402503 -1672490 699098 1166965 -2683751 -6031718 -4003360
8184d003360M370125J3735m158207j205424M719401M650790j274839m387490r75435
$$ -4003360 366765 380500 -3777707 -4983131 -263730 4387060 3112221 -1275269 -2250704
8175b250704L076338K431702m15501j016560R4734L46245J35918N19100k35123
$$ -2250704 825634 3257336 2841835 1825275 1920009 2266254 2402172 2921272 2686149
8166B686149l161310m772517j680066L160232M022794R85364m41449J911503L879357
$$ 2686149 -475161 -5247678 -6927744 -3767512 255282 1240646 799197 2710700 6590057
8157F590057J932242j757149l513681l336349k848074j482289J463128L459272
$$ 6590057 8522299 6765150 3251469 -84880 -2932954 -4415243 -2952115 507157
8149E07157J841401j203979j425137M88275k5972l102862l322191J110296M324596
$$ 507157 2348558 1144579 -280558 207717 181745 -2921117 -6243308 -5133012 -808416
8140h08416J948617j460174o5667K981218P70429m922688n641386p697M077930
$$ -808416 1140201 -319973 -385640 2595578 3366007 -1556681 -7198067 -7205764 -3127834
8131c127834K372438l2338Q70553J205884j978973l666582K98080M464828K152631
$$ -3127834 -755396 -787734 82819 1288703 -690270 -4356852 -4058772 406056 2558687
8122B558687l098797l466841J86487J017411j207029o14502L040444L676045K25194
$$ 2558687 -540110 -4006951 -3820464 -2803053 -4010082 -4624584 -1584140 2091905 2317099
8113B317099j462715M27344O80056k339716k764652J920482N128828J914398k404878
$$ 2317099 854384 1281728 1961784 -377932 -3142584 -1222102 3906726 5821124 3416246
8104C416246j139770K712135J975747k705910m308486m60171L950312M284156
$$ 3416246 2276476 4988611 6964358 4258448 -50038 -510209 3440103 7724259
8096G724259Q94874l017575m256884j427915K785325L004772j867801n624728
$$ 7724259 8619133 5601558 1344674 -83241 2702084 5706856 3839055 -1785673
8088a785673k652551L809384O021303K166583k676177m362709l171332m40572
$$ -1785673 -4438224 -628840 5392463 7559046 4882869 520160 -2651172 -3091744
8080c091744K890971M505851K399684j254327k152429n2194J072171p02768k814220
$$ -3091744 -200773 4305078 6704762 5450435 3298006 3245812 4317983 3615215 800995
8071H00995k562364k90919K269941L608402K292915j441342m103331k490166J412863
$$ 800995 -1761369 -2052288 217653 3826055 6118970 4677628 574297 -1915869 -503006
8062e03006K827672J018725n71857n52286q01830j400907j20754K103058J232116
$$ -503006 2324666 3343391 2771534 2219248 1417418 16511 -104243 1998815 3230931
8053C230931k621384m177858j655841K9919j815867k368764J945432N780763L003622
$$ 3230931 609547 -3568311 -5224152 -5194233 -7010100 -9378864 -7433432 -1652669 1350953
8044A350953k501568k466610K481488M111518j8016l411111j698631J404632J618993
$$ 1350953 -1150615 -3617225 -1135737 2975781 2957765 -453346 -2151977 -747345 871648
8035H71648M68302O79378J024313k79817j570944j051367l60552j153325j539808
$$ 871648 1339950 2019328 3043641 2763824 1192880 141513 -219039 -1372364 -2912172
8026b912172K48841J795700L06859k078122j272725K223030M199023L033705Q97855
$$ -2912172 -2663331 -867631 -560772 -2638894 -3911619 -1688589 2510434 5544139 6441994
8017F441994o85853k373833m130782m511226l196999j351699N70142K648073L617375
$$ 6441994 5756141 3382308 -748474 -5259700 -8456699 -9808398 -9238256 -6590183 -2972808
8008b972808K335010O20210J024161K185521O88997k429048k137824K391868N280852
$$ -2972808 -637798 -17588 1006573 3192094 3881091 1452043 -685781 1706087 6986939
7999F986939K231118l250044n284798l374688q44507J037567K770350K956690
$$ 6986939 9218057 5968013 683215 -2691473 -3535980 -2498413 271937 3228627
7991C228627N2641l374406k950646J125891M118356L272849O09930j052832j287345
$$ 3228627 3281268 -93138 -3043784 -1917893 2200463 5473312 6083242 5030410 3743065
7982C743065o48981O01873J394599K81559j995835k790818j287110K97314L5778
$$ 3743065 3094084 3695957 5090556 5372115 3376280 585462 -701648 -404334 -368556
7973c68556j328283k046043j341651P95541L568367M683753K318264j504302k359210
$$ -368556 -1696839 -3742882 -5084533 -4288992 -720625 3963128 6281392 4777090 2417880
7964B417880N42703K675517L96210l844450m978776k001926J632647L051699K506219
$$ 2417880 2960583 5636100 6032310 2187860 -2790916 -4792842 -3160195 -108496 2397723
7955B397723J260119l50692k059327k689219j361329Q35667J600187L92574k29741
$$ 2397723 3657842 3307150 1247823 -1441396 -2802725 -1967058 -366871 25703 -204038
7946b04038K109648N208567M021677j902897o166817l931662O67944O92805k513390
$$ -204038 1905610 7114177 11135854 9232957 3066140 -865522 -197578 495227 -2018163
7937b018163j726656L277033M298638j302502m552302J204688Q299542N545642
$$ -2018163 -3744819 -467786 3830852 2528350 -2023952 -819264 7480278 13025920
7929A3025920m338802q628266l493863K045163J540875m51529J111562K568808
$$ 13025920 8687118 58852 -3435011 -1389848 151027 -300502 811060 3379868
7921C379868p63697m942519l324710K202879M032053Q46488j075305J355119L335731
$$ 3379868 2616171 -2326348 -5651058 -3448179 583874 1430362 355057 1710176 5045907
7912E045907N58891l675058l709458j6617K179809Q72066p08930J15410J688282
$$ 5045907 5604798 1929740 -1779718 -1796335 383474 1255540 546610 662020 2350302
7903B350302J365540k69054p24413M49991J289803M17454j408027k598157k214329
$$ 2350302 3715842 3446788 2722375 3172366 4462169 4879623 3471596 873439 -1340890
7894a340890l56275J666907J987964M64828l28999J612790M094637L161653r40987
$$ -1340890 -1697165 -30258 1957706 2422534 2093535 3706325 7800962 10962615 10021628
7885A0021628l668581k728018r75592j213107k075870j743922j779670l352342
$$ 10021628 6353047 3625029 2649437 1436330 -639540 -2383462 -4163132 -7515474
7877g515474l154142J674139O961465O001695l07491m210945k326916L54309n62443
$$ -7515474 -10669616 -8995477 -2034012 3967683 3660192 -550753 -2877669 -2523360 -3085803
7868c085803k266096o12136K599574K946877N42622r49483l69770K94969R6512
$$ -3085803 -5351899 -5964035 -3364461 -417584 125038 -824445 -1194215 -899246 -802734
7859h02734o854J80508m4817j95604O48548J508547Q46462l20865K14141J743728
$$ -802734 -809588 -629080 -673897 -869501 -220953 1287594 2134056 1813191 2027332 3771060
7849C771060J391434q61529j622531L81901J813010j51896l122621k882551K80781
$$ 3771060 5162494 4300965 2678434 3060335 4873345 4721449 1598828 -1283723 -1002942
$$ [...]
##END NTUPLES=NMR SPECTRUM
##END=
