##TITLE=31Pdec_SR158(r2)rm
 , 64 sc
 22.2.2023
##JCAMPDX= 6.0         $$ Bruker NMR JCAMP-DX V2.0
##DATA TYPE= NMR SPECTRUM
##DATA CLASS= NTUPLES
##ORIGIN= UXNMR, Bruker Analytische Messtechnik GmbH
##OWNER= root
$$ XWIN-NMR		Version 3.5
$$ Wed Feb 22 16:03:43 2023 Russian Standard Time (UT+4h)  she@DPX200
##.OBSERVE FREQUENCY= 81.013821
##.OBSERVE NUCLEUS= ^31P
##.ACQUISITION MODE= SIMULTANEOUS
##.ACQUISITION SCHEME= undefined
##.AVERAGES= 24
##.DIGITISER RES= 16
##SPECTROMETER/DATA SYSTEM= spect
##.PULSE SEQUENCE= zgpg30
##.SOLVENT NAME= CD3CN
##.SHIFT REFERENCE= (INTERNAL, CD3CN, 0, 248.564)
##AUDIT TRAIL= $$ (NUMBER, WHEN, WHO, WHERE, WHAT)
$$ ##TITLE= Audit trail, XWIN-NMR		Version 3.5
$$ ##JCAMPDX= 5.01
$$ ##ORIGIN= Bruker BioSpin GmbH
$$ ##OWNER= she
$$ F:/spectra/data/she/nmr/P31/1/pdata/1/auditp.txt
$$ ##AUDIT TRAIL=  $$ (NUMBER, WHEN, WHO, WHERE, WHAT)
(   1,<2023-02-22 16:02:36.75 +0400>,<she>,<DPX200>,
      <created by zg, POWCHK disabled, PULCHK disabled
       configuration hash MD5:
       00 E9 B6 7A A2 85 ED C7 34 08 36 98 17 FE 4E 26
       data hash MD5: 32K
       D6 75 99 BD 2A 22 7C D3 2C 0D 3C 35 E8 CE 39 67>)
(   2,<2023-02-22 16:02:46.42 +0400>,<she>,<DPX200>,
      <Start of raw data processing
       efp BC_mod = 2 LB = 1 FT_mod = 6 PKNL = 1 PHC0 = -11033.79 PHC1 = 182.4102 SI = 64K 
       data hash MD5: 64K
       15 8F E6 FE F6 C0 41 A4 92 63 C4 3D 3F 5C B3 2D>)
(   3,<2023-02-22 16:02:56.79 +0400>,<she>,<DPX200>,
      <pk PHC0 = 11.1287 PHC1 = 0 
       data hash MD5: 64K
       39 EB 98 A9 62 B7 B8 A7 07 57 AA D4 CF 29 30 77>)
(   4,<2023-02-22 16:03:08.39 +0400>,<she>,<DPX200>,
      <abs ABSG = 5 
       data hash MD5: 64K
       79 8C B9 93 FE 1D 8F A1 C3 54 77 48 38 B4 4E 9A>)
$$ ##END=
$$ 
$$ hash MD5
$$ 2F 9E AE 51 08 D0 23 6E D3 CE 6F 17 35 93 13 8B
##$RELAX= 
##$RELAX= 
##$RELAX= 
##$RELAX= 
##$RELAX= 
##$RELAX= 
##$RELAX= 
##$RELAX= 
##$RELAX= 
$$ Bruker specific parameters
$$ --------------------------
##$DU= <F:/spectra>
##$EXPNO= 1
##$NAME= <P31>
##$PROCNO= 1
##$TYPE= <nmr>
##$USER= <she>
##$AMP= (0..31)
100 100 100 100 100 100 100 100 100 100 100 100 100 100 100 100 100 100 
100 100 100 100 100 100 100 100 100 100 100 100 100 100 
##$AQSEQ= 0
##$AQ_mod= 1
##$AUNM= <au_zg>
##$AUTOPOS= <>
##$BF1= 81.014009
##$BF2= 200.13
##$BF3= 200.13
##$BF4= 200.13
##$BF5= 200.13
##$BF6= 200.13
##$BF7= 200.13
##$BF8= 200.13
##$BYTORDA= 1
##$CFDGTYP= 0
##$CFRGTYP= 5
##$CHEMSTR= <none>
##$CNST= (0..31)
1 1 145 1 1 1 1 1 1 1 1 1 1 1 1 1 1 1 1 1 1 1 1 1 1 1 1 1 1 1 1 1 
##$CPDPRG= <waltz16>
##$CPDPRG1= <>
##$CPDPRG2= <waltz16>
##$CPDPRG3= <>
##$CPDPRG4= <mlev>
##$CPDPRG5= <mlev>
##$CPDPRG6= <mlev>
##$CPDPRG7= <mlev>
##$CPDPRG8= <mlev>
##$CPDPRGB= <>
##$CPDPRGT= <>
##$D= (0..31)
0 1 0 0 0 0 0 0 0 0 0 0.03 2e-05 3e-06 0 0 0 0 0 0 0 0 0 0 0 0 0 0 0 0 
0 0 
##$DATE= 1677067356
##$DBL= (0..7)
120 120 120 11 120 120 24 19 
##$DBP= (0..7)
150 150 150 150 150 150 150 150 
##$DBP07= 0
##$DBPNAM0= <>
##$DBPNAM1= <>
##$DBPNAM2= <>
$$ [...]
##$SUBNAM3= <"">
##$SUBNAM4= <"">
##$SUBNAM5= <"">
##$SUBNAM6= <"">
##$SUBNAM7= <"">
##$SUBNAM8= <"">
##$SUBNAM9= <"">
##$SW= 501.771253377433
##$SWIBOX= (0..15)
0 1 3 0 0 0 0 0 0 0 0 0 0 0 0 0 
##$SW_h= 40650.406504065
##$TD= 32768
##$TD0= 1
##$TE= 0
##$TE2= 300
##$TE3= 300
##$TEG= 300
##$TL= (0..7)
0 120 53 12 22 120 120 120 
##$TP= (0..7)
150 150 150 150 150 150 150 150 
##$TP07= 0
##$TPNAME0= <>
##$TPNAME1= <>
##$TPNAME2= <>
##$TPNAME3= <>
##$TPNAME4= <>
##$TPNAME5= <>
##$TPNAME6= <>
##$TPNAME7= <>
##$TPOAL= (0..7)
0.5 0.5 0.5 0.5 0.5 0.5 0.5 0.5 
##$TPOFFS= (0..7)
0 0 0 0 0 0 0 0 
##$TUNHIN= 0
##$TUNHOUT= 0
##$TUNXOUT= 0
##$USERA1= <user>
##$USERA2= <user>
##$USERA3= <user>
##$USERA4= <user>
##$USERA5= <user>
##$V9= 5
##$VALIST= <valist>
##$VCLIST= <CCCCCCCCCCCCCCC>
##$VD= 0
##$VDLIST= <DDDDDDDDDDDDDDD>
##$VPLIST= <PPPPPPPPPPPPPPP>
##$VTLIST= <TTTTTTTTTTTTTTT>
##$WBST= 1024
##$WBSW= 4
##$XGAIN= (0..3)
0 0 0 0 
##$XL= 0
##$YL= 0
##$YMAX_a= 11813
##$YMIN_a= -15770
##$ZGOPTNS= <>
##$ZL1= 120
##$ZL2= 120
##$ZL3= 120
##$ZL4= 120
##$ABSF1= 248.5645
##$ABSF2= -253.2056
##$ABSG= 5
##$ABSL= 3
##$ALPHA= 0
##$AQORDER= 0
##$ASSFAC= 0
##$ASSFACI= 0
##$ASSFACX= 0
##$ASSWID= 0
##$AUNMP= <proc_1d>
##$AZFE= 0.1
##$AZFW= 0.5
##$BCFW= 0
##$BC_mod= 2
##$BYTORDP= 0
##$COROFFS= 0
##$CY= -3
##$DATMOD= 1
##$DC= 0
##$DFILT= <>
##$DTYPP= 0
##$F1P= 0
##$F2P= 0
##$FCOR= 1
##$FTSIZE= 65536
##$FT_mod= 6
##$GAMMA= 0
##$GB= 0
##$INTBC= 1
##$INTSCL= 6.047779e-11
##$ISEN= 30
##$LB= 1
##$LEV0= 0
##$LPBIN= 0
##$MAXI= 10000
##$MC2= 0
##$MEAN= 0
##$ME_mod= 0
##$MI= 50
##$NCOEF= 0
##$NC_proc= -7
##$NLEV= 6
##$NOISF1= 182.463
##$NOISF2= 159.3651
##$NSP= 0
##$NTH_PI= 0
##$NZP= 0
##$OFFSET= 248.5645
##$PC= 4
##$PHC0= -11022.66
##$PHC1= 182.4102
##$PH_mod= 1
##$PKNL= yes
##$PPARMOD= 0
##$PSCAL= 0
##$PSIGN= 0
##$REVERSE= no
##$SF= 81.0140089999694
##$SI= 65536
##$SIGF1= 159.3651
##$SIGF2= -187.1042
##$SINO= 113.3802
##$SIOLD= 16384
##$SREGLST= <1H.CDCl3>
##$SSB= 0
##$STSI= 65536
##$STSR= 0
##$SW_p= 40650.406504065
##$SYMM= 0
##$S_DEV= 0
##$TDeff= 32768
##$TDoff= 0
##$TI= <>
##$TILT= no
##$TM1= 0
##$TM2= 0
##$TOPLEV= 0
##$USERP1= <user>
##$USERP2= <user>
##$USERP3= <user>
##$USERP4= <user>
##$USERP5= <user>
##$WDW= 1
##$XDIM= 65536
##$YMAX_p= 447257324
##$YMIN_p= -60130369
$$ End of Bruker specific parameters
$$ ---------------------------------
##NTUPLES= NMR SPECTRUM
##VAR_NAME=  FREQUENCY,     SPECTRUM/REAL,   SPECTRUM/IMAG
##SYMBOL=    X,             R,               I
##VAR_TYPE=  INDEPENDENT,   DEPENDENT,       DEPENDENT
##VAR_FORM=  AFFN,          ASDF,            ASDF
##VAR_DIM=   65536,         65536,           65536
##UNITS=     HZ,            ARBITRARY UNITS, ARBITRARY UNITS
##FACTOR=    0.620285442955139, 1,           1
##FIRST=     20137.2065510682, 0,            0
##LAST=      -20513.1999529968, 0,           0
##MIN=       -20513.1999529968, -60130369,   0
##MAX=       20137.2065510682, 447257324,    0
$$ Real data points
##PAGE= N=1
##DATA TABLE= (X++(R..R)), XYDATA
$$ [...]
43625F0339l90295j699180j198339J100665J537425p16259j606632J180176L988062
43616B255962K716539r70389k620868j562040n78985p40538n41036M78710Q97172
43607f65473L09332Q1066P50171J060842J50043j221273k090963k284886j650795
43598e561936O768J738663J798224o0689j847368j667430Q2378J472690J302085
43589b736615Q7648p15366j58542J237820J999632J475234O49616O00632Q57824
43580C297883L64974o06977j001486r43473j335878j701067o05338J460332J969502
43571H98472R7298j596413p44344J352065J758448J61967j077034n38520O53944
43562I65883Q46131j63960j413839j878469j081056M93908J501697J000797l96983
$$ y = [60339, -329956, -2029136, -3227475, -2126810, -589385, -1305644, -2912276, -1732100, 2255962, 4972501, 4002112, 1381244, -180796, -759781, -1500319, -2041355, -1562645, -665473, -356141, -275075, 475096, 1535938, 1685981, 464708, -1626255, -3911141, -5561936, -5555168, -3816505, -2018281, -2078970, -3926338, -5593768, -5511390, -4038700, -2736615, -2648967, -3364333, -3522875, -2285055, -285423, 1189811, 1839427, 2440059, 3297883, 3662857, 3055880, 2054394, 1110921, -224957, -1926024, -2531362, -1071030, 898472, 995770, -600643, -1344987, 7078, 1765526, 1927493, 850459, 311939, 965883, 1812014, 1648054, 234215, -1644254, -2725310, -2231402, -729705, 271092, -125891]
43553a25891j259214r93535j12475P78669J389489J435755Q55165J84717n1742
43544B100938r8407l93311o46746l28727L62851R00329J269082J487177J002939
43535E656125k66367j109541o79916j25801p97009j706770j045521M90131O82654
43526A097985k38098N6220J404643P51069k346141l705223o30477L258330K880180
43517B528488r09917k864891j089987J039710P09266o33989n86296M44255O90744
43508f72617J02289o7403M60246Q55440O88091K24211l87213j089332j265294
43499a151582j54881J837733K933777J664192j237904l100397k013765P86252
43491d36575K015492J99328k396770k545770j15245J961001J628593J41130n8496
$$ y = [-125891, -1385105, -2378640, -2491115, -1712446, -322957, 1112798, 1967963, 2152680, 2100938, 2002531, 1609220, 962474, 633747, 996598, 1896927, 3166009, 4653186, 5656125, 5389758, 4280217, 3600301, 3474500, 2677491, 970721, -74800, 415331, 1097985, 859887, 916107, 2320750, 3071819, 725678, -2979545, -3610022, -351692, 2528488, 1618571, -1246320, -2336307, -1296597, -587331, -1221320, -1807616, -1363361, -672617, -570328, -637731, -177485, 677955, 1366046, 1590257, 1203044, 113712, -1151582, -1306463, 531270, 3465047, 5129239, 3891335, 790938, -1222827, -436575, 1578917, 1778245, -618525, -3164295, -3279540, -1318539, 310054, 451184, 392688]
43482C92688J267172K052459Q52918j331573k500981k098889j257609r48428q21106
43473d393349p0804J294553K458699K555975J222123q83025j966316p38730J406502
43464H85628J505878p88391k216167p21233J198205O97279l28137J429893M056694
43455E719649K678286j997780l697337m22700K145382m4823k914557j563003J365441
43446A268558N98009k522929k528188Q51204K733433J392443m1941k0116m91010
43437A239463j818752j595830L10380Q37874p17122j239645M74940J464068J31455
43428i13169p44044Q32434K273634R04106j453810j708554k75908N79512N78690
43419G2891N64332J31950r46506j031116Q15743K438583J486441r36350k014487
$$ y = [392688, 1659860, 3712319, 4565237, 3233664, 732683, -1366206, -2623815, -3572243, -4393349, -4464153, -3169600, -710901, 1845074, 3067197, 2184172, 217856, -520874, 885628, 2391506, 1603115, -613052, -1334285, -136080, 561199, 233062, 1662955, 5719649, 8397935, 6400155, 2702818, 2280118, 4425500, 4380677, 1466120, -96883, 1268558, 1866567, -656362, -3184550, -2333346, 400087, 1792530, 1750589, 1730473, 1239463, -579289, -2175119, -1864739, -1026865, -1743987, -2983632, -2508692, -1044624, -913169, -1657213, -824779, 1448855, 2352961, 899151, -809403, -1085311, -505799, 72891, 637223, 769173, -177333, -1208449, -392706, 2045877, 3532318, 2595968, 581481]
43410E81481j118856K64561J019224Q50064k12864j146208n69243P11339K90296
43401F69794j475160j164068J734867K732769o29862l894019k240654J756840
43393b509493K342744l30381j453169o6484K69976j244542j236815J321669L107638
43384B01143K296434J111884R30244o9060k309161k773431k78872J598583J21480
43375H29244j872764n62800K528735K910723k9241k504397j881722M93031J860112
43366A770921J043182j099054k578412j843871M44025J800137R40532o21200r10435
43357a054175l6096P41854R41954M64801j091403k992815k877699J36571L210681
43348b556327L105246P33545k97205R11750J587149r4800k258852k234343j30324
$$ y = [581481, -537375, -272814, 746410, 1596474, 1383610, 237402, -331841, 379498, 669794, -805366, -1969434, -234567, 2498202, 1868340, -2025679, -4266333, -2509493, -166749, -497130, -1950299, -2016783, -1746807, -2991349, -4228164, -2906495, 201143, 2497577, 3609461, 4539705, 4470645, 2161484, -611947, -890819, 707764, 829244, -1043520, -1606320, 922415, 3833138, 3803897, 1299500, -582222, -89191, 1770921, 2814103, 1715049, -863363, -2707234, -2263209, -463072, 477460, -143740, -1054175, -1090271, -348417, 593537, 1058338, -33065, -3025880, -5903579, -5767008, -2556327, 548919, 1282464, 985259, 1897009, 3484158, 3389358, 1130506, -1103837, -1234161]
43339a234161J793215J992691P01430j021663k263183k594361k046631q06771
43331e479434Q63309K182530K062495O06589l81008K98461J161212J26349j847140
43322d06637j742297P26244K225578Q39387r05186j73781J517482Q83081j529938
43313A433933k065268J58200J883835Q81641r71780j184668k27661L29291P01389
43304I38912J504541J573087m3467j452013l53452J881618J817881p86139k655193
43295B425775k085691r94323j061132j054802M02502K056384K013906O11332n74881
43286A739070j019710q71427J70568J802202K318713P68129j208136j479313l32854
43277A887242M71844M77722M28059L09356m49615j417538j665022j317181r73361
$$ y = [-1234161, 559054, 2551745, 3253175, 2231512, -31671, -2626032, -4672663, -5479434, -4616125, -2433595, -371100, 235489, -145519, 152942, 1314154, 1440503, -406637, -2148934, -1422690, 802888, 1642275, 737089, 563308, 2080790, 2963871, 1433933, -631335, -473135, 1410700, 2292341, 1320561, 135893, -91768, 237523, 938912, 2443453, 4016540, 3973073, 2521060, 2167608, 4049226, 5867107, 5080968, 2425775, 340084, -654239, -1715371, -2770173, -2367671, -311287, 1702619, 2313951, 1739070, 719360, -152067, 18501, 1820703, 4139416, 4907545, 3699409, 2220096, 1887242, 2359086, 2836808, 3264867, 3574223, 3124608, 1707070, 42048, -1275133, -2248494]
43268b248494l23535R39390J741940J135935K60172N93413J177661J70421j575742
43259A871161j468816N49358J729140O53848j229213k418545k742909j723672
43251d779648J096896L613480K612282j078118k674133l79321J737701L49194
43243D98333j681906k96633K659850K313224j206395k968257r99336J251114Q49686
43234D19680p56399j252657r34742o75152L37208K413572L440957J713459j131037
43225C574889k398674k009336j479142p31231J146779K849267J872317j261309
43217A563560k863113j115895J338527J345106l57868p70150O87347J582167K93385
43208A703066j767561k321026j066290N22596J279437J226482Q37711L84697L7107
$$ y = [-2248494, -2572029, -1632639, 109301, 1245236, 1505408, 2098821, 3276482, 3446903, 1871161, 402345, 951703, 2680843, 3334691, 2105478, -313067, -3055976, -4779648, -3682752, -69272, 2543010, 1464892, -1209241, -1588562, 149139, 498333, -1183573, -1480206, 1179644, 3492868, 2286473, -681784, -1681120, -430006, 419680, -336719, -1589376, -2524118, -3199270, -2862062, -448490, 2992467, 4705926, 3574889, 1176215, -833121, -2312263, -3043494, -1896715, 952552, 2824869, 1563560, -1299553, -2415448, -1076921, 268185, -89683, -859833, -172486, 1409681, 1703066, -64495, -2385521, -3451811, -2929215, -1649778, -423296, 414415, 799112, 836219]
43199H36219n3066P820p4089k44431J4633Q95688J622359J182938k98554j585110
43189B304407j874416j496851p18560R04978K899595K930382l65958m261292m415984
43180d093699p02041K424939K250316J112859J488565J458352j285495l904818
43172a251022k027782K562495L639497L8089k501354n86426J605309l04732l393640
43163b219566k250667K119684L860308J178761j717370j476910L69751J111058
43155I75049O69971K24920r6184n21353n82608l0625N80745R16540J127668Q13007
43145D077130o36252k313873k245469k05141J569827J275755k61210j102965o96445
43136e38643K446L758q35172j802622j823410m68778J433648K638846K628194
$$ y = [836219, 783153, 790973, 716884, 472453, 487086, 1382774, 3005133, 4188071, 3889517, 2304407, 429991, -1066860, -1785420, -880442, 2019153, 4949535, 4583577, 322285, -4093699, -4795740, -2370801, -120485, 992374, 2480939, 3939291, 2653796, -1251022, -3278804, -716309, 2923188, 2961277, 459923, -126503, 1478806, 1174074, -2219566, -4470233, -2350549, 1509759, 2688520, 971150, -505760, -136009, 975049, 1645020, 1869940, 1773756, 1252403, 669795, 639170, 1219915, 2136455, 3264123, 4077130, 3440878, 1127005, -1118464, -1323605, 246222, 1521977, 1260767, 157802, -538643, -536197, -532439, -1367611, -3170233, -4993643, -5462421, -4028773, -1389927, 1238267]
43127A238267J449147o79633k630801k447933J67486K513666K111598K77621o8389
43118A931029P85131J14107j963175k043488Q16714K886414J278168j683287k221007
43109i9394n20412O20073M85386M77800P25134L1456j182797r65344Q58630K010968
43099B441500J084654m78305o81701K63515O52326q1640o68010P2838J405201
43090D010378J413829m44470k299444k126698m93850K71486m80819q54682M95175
43081e09095K165811K111340N67770o66421r15467q77146p19319K15301J653666
43072C026440J949884J74686k268106l056104j726089j85135j46094p86227l7067
43063c053812J935014K260476n65946l702787l176422O33431L263556K066810
$$ y = [1238267, 2687414, 2007781, -623020, -3070953, -2903467, -389801, 1721797, 1999418, 1931029, 2716160, 2830267, 867092, -1176396, -359682, 2526732, 3804900, 2121613, -99394, -619806, 267, 485653, 963453, 1688587, 1720043, 537246, -428098, 430532, 2441500, 3526154, 3047849, 2366148, 2629663, 3281989, 3200349, 2532339, 2605177, 4010378, 5424207, 4979737, 2680293, 553595, 59745, 331231, -149588, -1004270, -509095, 1656716, 3768056, 4335826, 3669405, 2753938, 1876792, 1157473, 1372774, 3026440, 4976324, 5151010, 2882904, -173200, -1899289, -2084424, -2230518, -3016745, -3053812, -1118798, 1141678, 575732, -3127055, -6303477, -5670046, -2406490, -339680]
43055c39680o89493j478732K2004J594963J871299J271554N37422r6623o59015
43046B033699j281241j874277j669152o4981J802346J845856J4702j167015l9428
43037c99491J844963K074382N62334j070548j907947j921029r69473O33211J509004
43028C55406Q33889k51660l35758J40256M0899k66474K02137Q38698K44545j254305
43018E47633j914255j129975R7887R15897J108750L29217j202621j687072K80834
43009b653705K881911K726179l44568k628007j564699R89886J836171P50613j07095
43000A886686K67070Q48104O82613J0970p03745j372812j606586o95170J078932
42991C96062K022017Q98028j203168j932938o03266J061563J394781P65365K93789
$$ y = [-339680, -1029173, -2507905, -2485901, -890938, 980361, 2251915, 2789337, 2692714, 2033699, 752458, -1121819, -2790971, -2855952, -1053606, 792250, 806952, -360063, -399491, 1445472, 3519854, 4082188, 3011640, 1103693, -817336, -1786809, -1153598, 355406, 1189295, 937635, 601877, 742133, 783032, 516558, 718695, 1557393, 1801938, 547633, -1366622, -2496597, -2398710, -1482813, -374063, -44846, -1247467, -2934539, -2653705, 228206, 2954385, 2609817, -18190, -1582889, -593003, 1243168, 1993781, 1886686, 2153756, 3001860, 3684473, 3695443, 2991698, 1618886, 12300, -682870, 396062, 2418079, 3316107, 2112939, 180001, -423265, 638298, 2033079, 2798444, 3092233]
42982C092233j21540j035794j700427j022222K42071M00128l04304j39725P80750
42973A91170M60769j143446j435358L86810J502025J70350r71233O30259K523627
42964B314973Q59309k941606l788604o38168K018264J021442j246155j137428
42956c537973J036872K272422J271071n44625j312280m98666R72677J500696L19669
42947A479863j387744j679718k93753J110651J217263L83854m22357p88495p11491
42938a091927l75830k62710n74784o64808m932O81248M87738j1144K93730R75640
42928e47779P78367l3604p3917P01196J083805R15232R33050N71508j279306l274975
42918b26423k579118N64113K498659J486622O1431M85388J233479L43265q10957
$$ y = [3092233, 2970693, 1934899, 234472, -787750, -545679, -145551, -449855, -589580, 191170, 651939, -491507, -1926865, -1540055, -38030, 132320, -838913, -208654, 2314973, 3174282, 232676, -3555928, -4194096, -2175832, -1154390, -2400545, -3537973, -2501101, -228679, 1042392, 497767, -814513, -1313179, -340502, 1160194, 1479863, 92119, -1587599, -1881352, -770701, 446562, 830416, 408059, -380436, -1091927, -1467757, -1730467, -2305251, -2970059, -2974991, -2293743, -1806005, -1817149, -1523419, -547779, 230588, 196984, 123067, 824263, 1908068, 2823300, 3756350, 4327858, 3048552, -226423, -2805541, -2241428, 257231, 1743853, 1805284, 2290672, 3524151, 3867416, 3056459]
42909C056459j71757R65910P9135j962643j992488M13156K291793J676069j77181
42900D178453j270089j266681q60141m90417k67016m8775N55803J415573J498300
42891C445010K99768j020815j240680j015710j591770k351516j681819J71844
42883d985688J329660J237874J171726J615681J398299J113j309028j439394q36790
42874a816547j93874N11642J008003N95454j40963N34136K490456K922609K96876
42865F207792k725779k579721K90748K300061J700178N4797r73585j563279k025404
42856F85808j627537j54724J170473J356380P92024j6547j215449k220113j440340
42847b670025J171082K966277J851794n98530j296092J27054J428171J312640
$$ y = [3056459, 2884702, 3850612, 3929747, 1967104, -25384, 387772, 2679565, 4355634, 4178453, 2908364, 1641683, 781542, 291125, 24109, -24666, 531137, 1946710, 3445010, 3744778, 2723963, 1483283, 467573, -1124197, -3475713, -5157532, -4985688, -3656028, -2418154, -1246428, 369253, 1767552, 1768665, 459637, -979757, -1816547, -2010421, -1498779, -490776, 104678, -36285, 497851, 2988307, 5910916, 6207792, 3482013, 902292, 1193040, 3493101, 5193279, 5248076, 4274491, 2711212, 685808, -941729, -1096453, 74020, 1430400, 2222424, 2205877, 990428, -1229685, -2670025, -1498943, 1467334, 3319128, 2720598, 1424506, 1551560, 2979731, 4292371]
42839D292371M62021n43161j709502k072978l98675K080511K301899l17331k677913
42830A417242k282054l23872R37847J431513J898881J535965l57342k013469j371942
42821H72769M08581N02692j104372j638857k3964J473563P11050j477166k775546
42812c051250k098285r2993J762506K101953Q67450k29491L91968J882842J995351
42803C530051L44268j075033q33089K03283N64545P9890m76891m32127M09670
42794B314567J320770P29034j748452l667310k296843J190481K638962N80128
42786A061337j757693j311925O20927R80525m72784j581423j334135n34801K42392
42777d087580J142604J844961J685770P66497l55459j563383k527178k035153
$$ y = [4292371, 4754392, 4211231, 2501729, 428751, 30076, 2110587, 4412486, 4095155, 1417242, -864812, -1188684, -250837, 1180676, 3079557, 4615522, 4258180, 2244711, 872769, 1281350, 1784042, 679670, -959187, -983151, 490412, 1201462, -275704, -3051250, -5149535, -5242528, -3480022, -1378069, -510619, -740110, -348142, 1534700, 3530051, 3874319, 2799286, 1966197, 2169480, 2734025, 2813915, 2337024, 1904897, 2314567, 3635337, 4364371, 2615919, -1051391, -3348234, -2157753, 481209, 1061337, -696356, -2008281, -1387354, -406829, -879613, -2461036, -3795171, -4329972, -4087580, -2944976, -1100015, 585755, 1352252, 996793, -566590, -3093768, -5128921]
42769e128921L05926K397548J738753j005383k557390j308750R39945K026566
42761b591706K189257K580270K670644J084583j595471k876133j597390L94600
42753B58654P40461l57095r02046l03535K8582o00621q71609J55184J123902N01509
42743b26614p38349o02078O49944J012998N2306p14651o34824n90024o35400L58702
42733b067990K030276K179295K66112j261641o68437M18374o781q65407j4313
42724I488J848795K120297M21481q47084j13004J301134J205141o68173k412764
42715B865311k029107K41672J721103K97596k394571k527465O22585L177366J962167
42706C936657r09081j221504J190065K609235J140320j000286j363825o54417
$$ y = [-5128921, -4822995, -2425447, -686694, -1692077, -4249467, -5558217, -4618272, -2591706, -402449, 2177821, 4848465, 5933048, 4337577, 1461444, -135946, 258654, 999115, 642020, -260026, -563561, -534979, -1135600, -2007209, -1852025, -728123, -226614, -964963, -1567041, -917097, 95901, 148207, -566444, -1201268, -1791292, -2426692, -2067990, -37714, 2141581, 2407693, 1146052, 477615, 895989, 889208, 23801, 9488, 1858283, 3978580, 4400061, 3552977, 3439973, 4741107, 5946248, 5278075, 2865311, 836204, 1077876, 2798979, 3096575, 702004, -1825461, -1202876, 1974490, 3936657, 3027576, 1806072, 2996137, 5605372, 6745692, 5745406, 4381581, 3727164]
42698C727164q71404j893483j728768L30818K265638J643274j081424k653482
42690b61667j056723J559050J642197p05466j983986p38518M29811m50486j305167
42681b870955K68712K600099K463955R6187j670017j874603j603325q21117J210536
42672b200528K909167J659368j678597l106392r70296J969114K637180J031124
42664B250140j096530k249470j359468J335655L137750J502462j774498k282440
42656e36399M38603J900146l37480k735090j439512J661528K099415l91635k108741
42647a449165j146740O61343J256158Q19138M04863K48035J0931m50375q43994
42638d89806n36785O59600J574051P24692j260180j898064l47654J236626J053886
$$ y = [3727164, 2855760, 962277, -766491, -435673, 1829965, 3473239, 2391815, -261667, -1318390, 240660, 1882857, 1177391, -806595, -1545113, -1115302, -1565788, -2870955, -2602243, -2144, 2461811, 2557998, 887981, -986622, -2589947, -3411064, -2200528, 708639, 2368007, 689410, -2416982, -3387278, -1418164, 1219016, 2250140, 1153610, -1095860, -2455328, -1119673, 2018077, 3520539, 1746041, -536399, -97796, 1802350, 1464870, -1270220, -2709732, -1048204, 1051211, 659576, -1449165, -2595905, -1934562, -678404, 140734, 545597, 793632, 804563, 354188, -489806, -1026591, -366991, 1207060, 1931752, 671572, -1226492, -1574146, -337520, 716366]
42629G16366K99276P18448J517300R93589l63014r15440p46187r11879r69088
42620C39371k409Q46488o5432j448568n49973K108482L006145J086251o68055
42611D652300k86052J07771j618158l445950k163725J382342L245124J869120
42603C742772l34000r70650n97103q10154j420269j039213M91569J784302J868242
42594B715496J250191O60485k47264j951081l294735k195837J309020M020666
42586B266941K952808q21483l259265k264141Q1986P12701n18190j318351l87629
42577b554623J187453J840666J464980R46074O24386N5012r12642j588497j294216
42568b31407l26547M67412Q69692J268226J378757J25514k385120l796756k020486
$$ y = [716366, 1015642, 1734090, 3251390, 4244979, 3881965, 2966525, 2220338, 1308459, 339371, 336962, 1183450, 1118018, -330550, -880523, 1227959, 4234104, 5320355, 4652300, 4366248, 4474019, 2855861, -590089, -2753814, -1371472, 1873652, 3742772, 3408772, 2438122, 1841019, 1030865, -389404, -1428617, -937048, 847254, 2715496, 3965687, 4626172, 4378908, 2427827, -866908, -3062745, -1753725, 2266941, 5219749, 4398266, 1139001, -1125140, -1043154, -330453, -848643, -2166994, -2554623, -1367170, 473496, 1938476, 2884550, 3508936, 3563948, 2651306, 1062809, -231407, -557954, -90542, 779150, 2047376, 3426133, 3551647, 1166527, -2630229, -4650715]
42559d650715J513625L042542J295710q37243n54000Q75572M25791j730404k453169
42550c072291o05983J256822J075623L71518J292643K785926K298811m8332j810723
42541C544014k063427j988225j797904k41454K208966K810789O33532j487095
42533A619196r44974R79869J573693O89372j92696j023111k328363k709092n41189
42524b877295K544102L195815J100625r38156j505042j791457k177563j266420
42516c715391Q23275J692073N08772n15374J00363R73245J017525J403505K381484
42507D669477J596979j724245m075828k433747R33355J931250N78051l13009k83373
42498H78910p68892j040112P37584L154456K917441M13367o04475Q11944J441886
$$ y = [-4650715, -3137090, -94548, 1201162, 363919, -190081, 685491, 1111282, -619122, -3072291, -3678274, -2421452, -1345829, -974311, 318332, 3104258, 5403069, 5354737, 3544014, 1480587, -507638, -2305542, -2546996, -338030, 2472759, 3106291, 1619196, 674222, 1654091, 3227784, 3917156, 3724460, 2701349, 372986, -2336106, -2877295, -333193, 2862622, 3963247, 3025091, 1520049, -271408, -2448971, -3715391, -2892116, -1200043, -691271, -1206645, -1106282, -133037, 884488, 2287993, 4669477, 6266456, 4542211, 466383, -1967364, -1034009, 897241, 1475292, 1162283, 878910, 110018, -930094, -192510, 2961946, 5879387, 6292754, 5688279, 6500223, 7942109]
42489G942109m18072k229158j701558k14376J13976m27800p66093j011917j158995
42480A28116m45412N89805J96758j156979o57175J975169L040538N50731k194315
42471B027236j660809N61871R95908L1875L52406J696134J552705j33607j070559
42462D353160p24626n66255p68722k97554J61885r34127k447756j670565R56018
42453a938542K041301N71223p51804k23922N81319L83170L61967J177172J242864
42444C444748r7299p88209M21168J565021Q62996k23184M9596K79168j426093
42435D087912l455925k862990k00091J266690M80970n23493m03446p9678k97475
42426a987526l44970J77151N03507K97405L22801R51366J511057J547120J341913
$$ y = [7942109, 7524037, 5294879, 3593321, 3378945, 3492921, 3065121, 2299028, 1287111, 128116, -317296, 272509, 469267, -687712, -1344887, 630282, 3670820, 4221551, 2027236, 366427, 928298, 1924206, 1956081, 2308487, 4004621, 5557326, 5423719, 4353160, 3628534, 3062279, 2293557, 1996003, 2157888, 1223761, -1223995, -2894560, -1938542, 102759, 673982, -77822, -301744, 279575, 662745, 1024712, 2201884, 3444748, 3347449, 2559240, 2980408, 4545429, 5408425, 5185241, 5234837, 5514005, 4087912, 631987, -2231003, -2431094, -1164404, -683434, -1206927, -1610373, -1690051, -1987526, -2332496, -2155345, -1651838, -1354433, -1031632, -80266, 1430791, 2977911, 4319824]
42417D319824R08087j02067j222351j384460o48391k83366p23986q85187m0734
42408f2631R91232J205244P46731K18215k49389n58404l40072J93714J30588n94189
42398A681039n61645J105039K838199K132545j157924m177319m096363j178828
42390c415257J629861J958438L45533q99985o66907L6706J44274K03729J118982
42381D55374K257686K174454O78414j127398k391574k747439j647022P14141K265137
42372F31773J132994j154151j069672J786822L645794J836066j443545k443324
42364B922757q44292P77813Q56249j50237j470662k392541j762956N62147K365470
42355H63748J429590j161303k275857r46147R12574J695003J589765R65375j34880
$$ y = [4319824, 5227911, 5125844, 3903493, 2519033, 1870642, 1587276, 863290, -21897, -62631, 928601, 2133845, 2880576, 3098791, 2849402, 2290998, 1950926, 2144640, 2275228, 1681039, 1119394, 2224433, 5062632, 7195177, 6037253, 1859934, -2236429, -3415257, -1785396, 173042, 518575, -381410, -1048317, -1011611, -867337, -663608, 455374, 2713060, 4887514, 5565928, 4438530, 2046956, -700483, -2347505, -1633364, 631773, 1764767, 610616, -459056, 1327766, 4973560, 6809626, 5366081, 2922757, 2078465, 2856278, 3712527, 3562290, 2091628, -300913, -2063869, -1501722, 863748, 2293338, 1132035, -1143822, -2089969, -1177395, 517608, 2107373, 3072748, 2937868]
42346B937868p00863L51195J583604K65423k986636m013234j147990J758166Q85737
42337a066730j737483j408037K069112M299388K826799l8585j339977j105584
42329B498903p16711l27482M22838R17970M46020m87959r70635r81788r68513
42320a67357r14245n99573o2176O93780J539658J511542l00600k638616k726785
42311c664372j53035J871964Q88872j072729o24442J642977K217111L51436r99982
42302D57800k46103N60157j96934p62740O40581K335739J855614M6700n30465
42293D160349J20647m7984j176520j373629l46421P1559o26448o96722N04568
42284E89399J109754k1340j176774n80358P93434J074265M64364L16362N05340
$$ y = [2937868, 2237005, 2588200, 4171804, 4437227, 1450591, -2562643, -3710633, -1952467, -1066730, -2804213, -4212250, -2143138, 2156250, 4983049, 4944464, 3604487, 2498903, 1782192, 1454710, 1877548, 2795518, 3241538, 2753579, 1782944, 801156, -167357, -1081602, -1681175, -1743351, -1049571, 490087, 2001629, 1701029, -937587, -3664372, -3817407, -1945443, -1056571, -2129300, -2753742, -1110765, 1106346, 1457782, 457800, 211697, 771854, 574920, -187820, 452761, 2788500, 4644114, 4690814, 4160349, 4280996, 4233012, 3056492, 1682863, 1336442, 1408001, 781553, 84831, 589399, 1699153, 1677813, 501039, -79319, 714115, 1788380, 2252744, 2569106, 3074446]
42275C074446j74682j690603k669912k255901p27025J233295K701823K610793
42267B102234R32768p96264j211837o69926j29056L61677Q05694K87957j347103
42258C36144k135454n33803J730675J902355M62070J50193J112978N39061k263019
42249A301200l915369j797601J882289L064891J124790j023227j078283L53424
42241h7886J249180N41257j008192j684142o98028Q29074J345980R52123Q14374
42232B253740R63088M84137l25217k57454L00373k05823j236849m34812J991168
42223C532351K652081L52046j567151o27561P04413m17038k083641j287772L44895
42214A602623l55840j629926M96210M246175L673214j447848m248884j252327
$$ y = [3074446, 2899764, 1209161, -1460751, -3716652, -4443677, -3210382, -508559, 2102234, 3035002, 2238738, 1026901, 356975, 227919, 589596, 1395290, 1683247, 336144, -1799310, -2333113, -602438, 1299917, 1761987, 1912180, 3025158, 3564219, 1301200, -2614169, -4411770, -2529481, 535410, 1660200, 636973, -441310, -87886, 1161294, 1702551, 694359, -989783, -1687811, -858737, 487243, 1439366, 2253740, 3216828, 3700965, 3375748, 3118294, 3418667, 3212844, 1975995, 1541183, 3532351, 6184432, 6536478, 4969327, 4341766, 5046179, 4629141, 2545500, 1257728, 1602623, 1246783, -383143, 113067, 4359242, 8032456, 6584608, 2335724, 1083397]
42206A083397K296630R92827k560141k833803j53081J157506M69607Q48616K719239
42197D020797L110979J249618Q6667J333890K885502K564377J297104Q54830P69125
42188A8172889n92310l177251n049832m590481k169631J06424L04170j208812
42180A795166j920773j97434K464111L254407J478108j090054k593130k384623
42172H05778o53090J498904K170447P31730p32814n8766J520408J016048j543041
42163D755604k954642j766554k66287n12823j212160k10510K066365L422078K601569
42154E922640p3759l196011m414741k113389J826979L165735P56703j534482l80155
42145d0480K124572K026376l03158j374134n90500o68645k207737k283660L71231
$$ y = [1083397, 3380027, 4372854, 1812713, -1021090, -1174171, -16665, 452942, 1301558, 4020797, 7131776, 8381394, 8468061, 9801951, 12687453, 15251830, 16548934, 17403764, 18172889, 17580579, 14403328, 9353496, 4763015, 2593384, 2699808, 3003978, 1795166, -125607, -323041, 2141070, 5395477, 6873585, 5783531, 3190401, 805778, 152688, 1651592, 3822039, 4553769, 3820955, 3762189, 5282597, 6298645, 4755604, 1800962, 34408, -231879, -744702, -1956862, -2167372, -101007, 3321071, 5922640, 5848881, 2652870, -1761871, -3875260, -2048281, 1117454, 1874157, 339675, -40480, 2084092, 4110468, 3807310, 2433176, 1842676, 1174031, -1033706, -3317366, -2946135]
42136b946135K648330J701779n80636m85276J937472L099037J057975k101902
42128D330644l384850k458658j219215q90342p57532L27038K102873L136988K587724
42119C774670J028319n20574j575998j895487j134211M03326J391866R25767q1938
42110B315740j5061J182822J968779J363100P2047p14537p47337o25766q44961
42101C954826j175450q19693O08235K147383K261365R51342M3474N43698R69125
42092I484305k70372k037852k065378n72607J86343k83697j31354J224679J682567
42083G216634j02005k215734k215874o48854J70422j90871L2569J758849L489722
42074G294858L214761R43905j190647j250327K16933O01787j497451l940353l327493
$$ y = [-2946135, -297805, 1403974, 823338, 338062, 2275534, 5374571, 6432546, 4330644, 945794, -1512864, -2732079, -3622421, -4379953, -4052915, -1950042, 1186946, 3774670, 4802989, 4282415, 2706417, 810930, -323281, 80045, 1471911, 2397678, 2315740, 2300679, 3483501, 5452280, 6815380, 6887427, 6172890, 5425553, 4799787, 3954826, 2779376, 1959683, 2567918, 4715301, 6976666, 7928008, 7971482, 8515180, 9484305, 9213933, 7176081, 5110703, 4538096, 4724439, 4440742, 4309388, 5534067, 7216634, 7114629, 4898895, 2683021, 2034167, 2204589, 2013718, 2046287, 3805136, 7294858, 10509619, 11453524, 10262877, 9012550, 9229483, 9831270, 8333819, 4393466, 1065973]
42065A065973L72961L200499J989950j692310l689360k339108J20379Q87725j31410
42056b14701q19128J88397J804328J928817J73588j616851j775320q01864k22258
42047a354992m02694o45850o25608l20194O63151K041936K086149L7414j654720
42038a75408l32286K329528K294511m85695j858085k71580Q59555n62143j432283
42029C66114Q99569L292855J615889k194319k995198n17544P33125r93639k421003
42020b214151j040853J281620J829323P26848l39934n19302K28879J443490J788631
42011C184551M06507j125782n21170J468924J822427L016j276147p39415m63573
42002B759338j676263k181206l08238J622364Q02370j354316j344913R64252K361965
$$ y = [1065973, 1438934, 4639433, 6629383, 4937073, 1247713, -1091395, -971016, -83291, -214701, -1033829, -845432, 958896, 2887713, 3061301, 1444450, -330870, -1132734, -1354992, -1757686, -2403536, -3029144, -3349338, -2686187, -644251, 1441898, 1479312, -175408, -507694, 1821834, 4116345, 3630650, 1772565, 1500985, 2360540, 1798397, 366114, 1265683, 4558538, 6174427, 3980108, 984910, 467366, 1200491, 206852, -2214151, -3255004, -1973384, -144061, 582787, 242853, -276449, -47570, 1395920, 3184551, 3591058, 2465276, 1944106, 3413030, 5235457, 5238473, 3962326, 3222911, 2759338, 1083075, -1098131, -1406369, 215995, 1018365, -335951, -1680864, -716612, 1645353]
41993A645353J217689o85844j330001q13434J8513J063103K095675K062987N08553
41984E782594j187515j190169M22300J579744O94439j365251k312835j287541
41976A135766J41560K03304o84161p54062M01205J351914J027299j3188p76497
41967B033140r72159n45582N48738J506455J020090o77567j502883l53428J135806
41958B192610J119368M50450R61678J813105M11450k894774m068063q49894L358139
41949B494069L568611q1067k650270j357072R12522M04022j890171k153182J56286
41940e96252J566763J01398j749265j039446J156629J614459j16309j259817k3745
41931c45585J962228K011008j89872k358846k342369m40111J174088J215829P31940
$$ y = [1645353, 2863042, 2177198, 847197, 33763, 52276, 1115379, 3211054, 5274041, 5782594, 4595079, 3404910, 3827210, 5406954, 6101393, 4736142, 2423307, 1135766, 1277326, 1480630, 796469, 42407, 443612, 1795526, 2822825, 2809637, 2033140, 1060981, 515399, 1064137, 2570592, 3590682, 2913115, 1410232, 1056804, 2192610, 3311978, 3762428, 4724106, 6537211, 6948661, 4053887, -14176, -864070, 2494069, 6062680, 5981613, 3331343, 1974271, 2886793, 3290815, 1400644, -752538, -596252, 970511, 1071909, -677356, -1716802, -560173, 1054286, 937977, -321840, -345585, 1616643, 3627651, 3437779, 1078933, -1263436, -1703547, -529459, 686370, 1418310]
41922A418310J073492J381449m5112k309478k557823n46531N04668r26884j811471
41913c819380O23035M019019M223483J457746o39272p28019m69934l59830P62824
41904E069672K045394Q32972k573567m240538k042084J495351L176202K918198
41896F681600K044308P22586r78980j866201j400881q97269j359292j793592j023099
41887A29180M32757J464109J808879J464319K90106j034719j342736q06738o16012
41878A789145o26360L40493J681679J386264l07365q24091M36103J154107M25833
41869E455808J87050R26049K58676k093187k389616R81981L699649J764970k144283
41860F647097l061845j303911o52231j448187r43314R26191J506069N52888M03581
$$ y = [1418310, 2491802, 3873251, 3828139, 1518661, -1039162, -1585693, -1081025, -2007909, -3819380, -3196345, 822674, 5046157, 6503903, 5864631, 5136612, 4666678, 4306848, 5069672, 7115066, 7948038, 5374471, 1133933, -908151, 587200, 3763402, 6681600, 8725908, 9448494, 8469514, 6603313, 5202432, 4305163, 2945871, 1152279, 129180, 561937, 2026046, 3834925, 5299244, 5589350, 4554631, 3211895, 2405157, 1789145, 1162785, 1503278, 3184957, 4571221, 4263856, 3439765, 3875868, 5029975, 5455808, 5642858, 6568907, 6827583, 4734396, 2344780, 3326761, 7026410, 8791380, 6647097, 3585252, 2281341, 1629110, 180923, -762391, 163800, 1669869, 2222757, 2626338]
41851B626338J176183N47811j412354j750740K29706J502140K40317j413564j055819
41842F90018M86988J036794J72611j014202j626229j367420m76559K44314L63422
41833a490263O10797J544155K128159J273049j06890n48037n22603j127051j398445
41824C62871J75576K308262K295884L18170q81820l87174J20024j05705k1294
41815D184794K93154o28425k376241k444187j15015K383308L278579K905179J535493
41806I016639j108902l493649k973970k0566J635509L94566j047995m33705O59970
41797B627897J97131p72451m42423N25176O41482K97966M80959O49557J6336p44630
41787C477000q64681q12311p57139K19753J851301K006656P0915j514287j111212
$$ y = [2626338, 3802521, 4350332, 2937978, 1187238, 1416944, 2919084, 3159401, 1745837, 690018, 1177006, 2213800, 2386411, 1372209, -254020, -1621440, -2097999, -1853685, -1490263, -879466, 664689, 2792848, 4065897, 3959007, 3410970, 2888367, 1761316, 362871, 538447, 2846709, 5142593, 5460763, 4578943, 4191769, 4311793, 4206088, 4184794, 4477948, 3849523, 1473282, -970905, -1085920, 1297388, 4575967, 7481146, 9016639, 7907737, 4414088, 1440118, 1419552, 3055061, 3449627, 2401632, 1967927, 2627897, 2825028, 2052577, 1610154, 2135330, 2776812, 3074778, 3555737, 4205294, 4221630, 3477000, 2612319, 1800008, 1042869, 1262622, 3113923, 5120579, 5191494, 3677207, 2565995]
41778B565995n80018j634209k287133j86616K797338L054627P57150q58028o98816
41769B930290n37229j018293p24316N38014R19793j85554q40239L28743J881912
41760C293121J708611j9363j214734n19146J124355J435093n59450k846233k395110
41751G144P56772K946939J566654j378846k229287o80234O41307N77401M55381
41742B663231R07462O34486r87490k441988k240491q31823N75482J633160K366955
41733B278984K325550J279770k6772p13822q22486q89195r50125o24416R0125
41724A947613P28567J081597J503543K132550K096058L72614k209131k974640
41716D678771o81634K061531J676132j374043k984661j257775R37682O51262p54103
$$ y = [2565995, 1985977, 351768, -1935365, -2121981, 675357, 3729984, 4487134, 3629106, 2930290, 2393061, 1374768, 650452, 1188466, 2108259, 1922705, 1082466, 1411209, 3293121, 5001732, 4982369, 3767635, 3248489, 4372844, 5807937, 5248487, 2402254, 7144, 763916, 3710855, 5277509, 3898663, 1669376, 989142, 1630449, 2207850, 2663231, 3570693, 4205179, 3217689, 775701, -1464790, -2296613, -1721131, -87971, 2278984, 4604534, 5884304, 5857532, 5143710, 4321224, 3432029, 2481904, 1857488, 1947613, 2676180, 3757777, 5261320, 7393870, 9489928, 9862542, 7653411, 4678771, 3997137, 6058668, 7734800, 6360757, 3376096, 2118321, 3056003, 3707265, 2953162]
41707B953162l70982J315564J499888j38470j093602k48034O77428L13304l50327
41698D557931j5109Q60132J031497J80030j029281j627284q62468R65005K274191
41689F334644J920803Q15552M81571N55132l90146j924369k052513n66853L78948
41680E552769l26971j187509r10222m20043o44296n14233Q73737J929178P81126
41671E133536j373787j671597K08101J683469J137151j37760m02745Q8893J60061
41662D825322k38857l88412l87844r87165k004158k090020m69289J728210K464413
41653B452200J066539q94707j277457J96762J627920J262516l84272j372900r45909
41644A730692j91621J221K43770J033552J167356n12919k515053k097080O08093
$$ y = [2953162, 2582180, 3897744, 5397632, 5259162, 4165560, 3917526, 4594954, 4908258, 4557931, 4542822, 5402954, 6434451, 6614481, 5585200, 3957916, 3095448, 4060453, 6334644, 8255447, 9070999, 9552570, 10107702, 9717556, 7793187, 5740674, 5173821, 5552769, 5225798, 4038289, 3128067, 2708024, 2063728, 1549495, 2423232, 4352410, 5133536, 3759749, 2088152, 2296253, 3979722, 5116873, 4979113, 4576368, 4665261, 4825322, 4586465, 4198053, 3810209, 2823044, 818886, -1271134, -1740423, -12213, 2452200, 3518739, 2624032, 1346575, 1543337, 3171257, 4433773, 4049501, 2676601, 1730692, 1539071, 1540292, 1784062, 2817614, 3984970, 3472051, 956998, -1140082, -531989]
41635e31989K255628R70895r67516p85966N91424N44034o43125m92047R87385
41626A928723J048526q47794j533235P43358K912637J527674j682499k110763
41618A986627R04046L099206J470188j617055j973536P30615K892140J924048
41610I416279o88535j800419p20624M16852m9744j325653j946862j865668j491299
41601e5673k05808K106022L255755J295235j710384j793519Q84942J897886m97231
41592E177225k376510m85223K290755J480286j841957k972985r26758Q72321O03288
41583A820442P5159M39210K92024q04159q09622J090304K561787J820013L93944
41574F879102J62571K84414n72933j322838n30592M88615l42476k063226j950459
$$ y = [-531989, 1723639, 2694534, 1727018, 941052, 1532476, 2076510, 1433385, 941338, 1928723, 2977249, 2129455, 596220, 1339578, 4252215, 5779889, 4097390, 1986627, 2890673, 5989879, 7460067, 5843012, 3869476, 4600091, 7492231, 9416279, 8727744, 6927325, 6206701, 6623553, 6573809, 5248156, 3301294, 1435626, -55673, -261481, 1844541, 5100296, 6395531, 4685147, 2891628, 3776570, 5674456, 5177225, 2800715, 2315492, 4606247, 6086533, 4244576, 1271591, 344833, 1217154, 1820442, 1895601, 2334811, 2626835, 1822676, 1013054, 2103358, 4665145, 6485158, 6879102, 7041673, 7326087, 6753154, 5430316, 4899724, 5388339, 5045863, 2982637, 1032178]
41565A032178J31666J674166J517438R49583P59900K01104n76592p7085J446251
41556G058609J371239j085082k787957j263519J076738N94433j500591r53557
41548B510313K295733L466072M61699k629064j965758K23626p1080j782298j041744
41539A467499J551317J533177j648911l045142J621L368491K397047j190444k424555
41530B010100o15359M95995r37081k449631j511417R83630K573247K465084J637486
41521D652054R10693J39855r56291j865400j531498K41198J917361J652048k90502
41512D869518j646403j080332K43716O69216K64137M2385K35897N50126J038067
41503E186327J452896P93834j099001k456586j629253M92324J584984Q58572m43905
$$ y = [1032178, 1163844, 2838010, 4355448, 5305031, 6064931, 6266035, 5689443, 5612358, 7058609, 8429848, 7344766, 4556809, 3293290, 4370028, 4964461, 3463870, 2510313, 4806046, 8272118, 8733817, 6104753, 4138995, 4362621, 4291541, 2509243, 1467499, 3018816, 4551993, 2903082, -142060, -140439, 3228052, 5625099, 4434655, 2010100, 1394741, 1890736, 953655, -1495976, -3007393, -2023763, 549484, 3014568, 4652054, 5562747, 5702602, 4746311, 2880911, 1349413, 1590611, 3507972, 5160020, 4869518, 3223115, 2142783, 2386499, 3055715, 3319852, 3362237, 3598134, 4148260, 5186327, 6639223, 7433057, 6334056, 3877470, 2248217, 2740541, 4325525, 5184097, 4740192]
41494D740192j003166o14141J67020N27686j4575q43903q45725k60416n33491
41485A319481j597713j294934J072256K734531J204861j713898k337384k89726
41477i02526J554864J582448J003568J055273J236374O91684m81454j538463j538664
41468B663104P238J833404J504871j113786k616095n21810K707758L032147P27295
41459H224126o03997R0096M23949o55241j272873m11002L22293k43442r98694
41450D875215q12344r9049O09797J251773R82530j018109l105253k404626R10828
41441A190762L394773K999069J162127k81397j173829j318674k86J704897J337880
41432I015322r94856k219966j091524n4015p77396j306905K08769K118710K104033
$$ y = [4740192, 3737026, 3122885, 3289905, 3817591, 3803016, 2959113, 2113388, 1852972, 1319481, -278232, -1573166, -500910, 2233621, 3438482, 1724584, -612800, -902526, 652338, 2234786, 3238354, 4293627, 5530001, 6221685, 5740231, 4201768, 2663104, 2670342, 4503746, 6008617, 4894831, 2278736, 1756926, 4464684, 7496831, 8224126, 7620129, 7710225, 8134174, 7478933, 6206060, 5795058, 6117351, 5873909, 4875215, 4062871, 3963822, 4573619, 5825392, 6807922, 5789813, 2684560, 279934, 1190762, 4585535, 7584604, 8746731, 8465334, 7291505, 5972831, 5972545, 7677442, 9015322, 8020466, 5800500, 4708976, 4654961, 3877565, 2570660, 2779429, 4898139, 7002172]
41423G002172P74424n6611m15454j103010j577228j092582k14609N35876J623111
41414E476089K632631J870895n25796j709685k85677J286942N90220j110762j477480
41405F747377p61920l19104J05820J017636J448820J090917J604489L220678K954523
41396A7109236o31378l784649k484836J427533L076881J469204n14858j236560
41388A4430573j169186j65420J835194K588990L02647k489019k073465N22731
41380A3783045J304160m2511l14835R55203Q61157j048207j747665m92859l59547
41371A2897941k451588l488788j341225J428952K069181J752274K381809K732376
41363A5980932R84987j479342j998161o02503N81531N53136j27471r33730j548160
$$ y = [7002172, 7776596, 7719985, 7304531, 6201521, 4624293, 3531711, 3317102, 3852978, 5476089, 8108720, 9979615, 9453819, 7744134, 7458457, 8745399, 9335619, 8224857, 6747377, 5985457, 5666353, 5772173, 6789809, 8238629, 9329546, 10934035, 14154713, 17109236, 16477858, 12693209, 10208373, 11635906, 14712787, 16181991, 15667133, 14430573, 13261387, 13095967, 14931161, 17520151, 17822798, 15333779, 13260314, 13783045, 15087205, 15044694, 14729859, 15685062, 16546219, 15498012, 13750347, 13257488, 12897941, 10446353, 6957565, 5616340, 7045292, 9114473, 10866747, 13248556, 15980932, 16965919, 15486577, 13488416, 12885913, 13467444, 14020580, 13893109, 12959379, 11411219]
41354A1411219j439625o64895j30056k00022l19295m88675j255748j753751k25674
41345D933478K603390L511870J609361K07936J682762L326058J440144k572024
41337A6742975l940494j397837J339403J082569r52839j733413o32965L58106
41329A0865505l85772k119042k648719r25148J491717J994760N2350j982096j633211
41320D710344Q23927K859895K514956J55353k155938k561147r87170R18838J638201
41311G917259J317334R21848M76237n84480j684964j469465l1210R49061O88595
41302H500215K07823K11953o7486r93984j304665j31635J211796J037624j68426
41293H503215n98327J52864P49185K34869p98026j219867o59271L65622J084377
$$ y = [11411219, 9971594, 9306699, 9176643, 8976621, 8657326, 8168651, 6912903, 5159152, 4933478, 7536868, 11048738, 12658099, 12866035, 14548797, 17874855, 19314999, 16742975, 12802481, 11404644, 12744047, 13826616, 12873777, 11140364, 10507399, 10865505, 10479733, 8360691, 5711972, 4786824, 6278541, 8273301, 8325651, 6343555, 4710344, 5534271, 8394166, 10909122, 11064475, 8908537, 6347390, 5360220, 6279058, 7917259, 9234593, 10156441, 10632678, 10048198, 8363234, 6893769, 6862559, 7811620, 8500215, 8708038, 8919991, 8852505, 7858521, 6553856, 6422221, 7634017, 8671641, 8503215, 7904888, 8057752, 8806937, 9041806, 8243780, 7023913, 6364642, 6730264, 7814641]
41284G814641J065355L78298o19168j428128j428228m07536P25496P03707j73675
41275F630762j67869J059004J450794j79131j856161j592505p99129j505833k062212
41266I77720K79409L708549L688441K17144j945876r01160J2858j083544j277318
41257C676223J078904K455020J53121k500977j533743J080167J187552m91085
41249E105182m60754R72207Q55132m44505l7263J798133K108371P75539L13183
41240A0985225O36320o29992k772663k456655O6653Q28149q92218j187199J320648
41231E898268K716561O97232j228109J27671K123313J099301j268541j117159
41223I048537J031887J714741O41162O08249K204960K931691J521343m25664j364654
$$ y = [7814641, 8879996, 9258294, 8639126, 7210998, 5782770, 5375234, 6100730, 6804437, 6630762, 6462893, 7521897, 8972691, 8793560, 6937399, 5344894, 4545765, 3039932, 977720, 1257129, 4965678, 8654119, 8871263, 6925387, 6024227, 6037085, 4953541, 3676223, 4755127, 7210147, 7363268, 4862291, 3328548, 4408715, 5596267, 5105182, 4644428, 5616635, 6471767, 6027262, 5989999, 7788132, 9896503, 10672042, 10985225, 11621545, 10991553, 8218890, 5762235, 5828888, 6657037, 5764819, 4577620, 5898268, 8614829, 9312061, 8083952, 8211623, 10334936, 11434237, 10165696, 9048537, 10080424, 11795165, 12436327, 13044576, 15249536, 18181227, 19702570, 19276906, 17912252]
41214A7912252j500845j347353j018886j072609j891910k315496j044409P69196
41206H489940P47860q64611j231742N93399J829046J2499l141799l885180j347484
41197A201928J665404K504788J526503O45156M63034R2644p18931q67423K62382
41188F775485J485217J341025J07511q13929q33525l04326N13987J177617O19965
41179A0069027j158655j926874k02043J562370J23190k780744k195881K034288
41171E524678M119902J147715k120150p90477K472157K203646j019696k336702
41163I201073q93456j34737q64804l50535J525346J352210j392162k643093l99121
41154E400721J948771J315989n53784r38916m05101l00600K26097J550762J455226
$$ y = [17912252, 16411407, 15064054, 14045168, 12972559, 11080649, 8765153, 7720744, 8489940, 9237800, 8373189, 7141447, 7734846, 9563892, 9576391, 6434592, 2549412, 1201928, 2867332, 5372120, 6898623, 7543779, 8006813, 8099457, 7380526, 6513103, 6775485, 8260702, 9601727, 9709238, 8895309, 8061784, 7757458, 8271445, 9449062, 10069027, 8910372, 6983498, 6781455, 8343825, 8467015, 5686271, 3490390, 5524678, 9644580, 10792295, 8672145, 7881668, 10353825, 12557471, 11537775, 9201073, 8307617, 8172880, 7308076, 6957541, 8482887, 9835097, 8442935, 5799842, 5400721, 7349492, 8665481, 8111697, 7172781, 6767680, 6467080, 6693177, 8243939, 9699165]
41145I699165q96666k219818j43817K171168Q30687k119263j846146J367002K808662
41136I650974J017919o86588m11543j68293j177114j467906R0144J371852O89361
41127H908806m08068j54294N03430K10367j33635N53000R75210l31659j821718
41118H301439q22636K164819L714350K045781p73434j756062o47203L20674k94230
41109A2253498j262239o14060J237740J788064J26538j505902j069625K45011
41101A1199025M11575J92568J350642K618494J378674j190580j106985J937335
41093A6790748L794315K694097J868785L200856L417399J76128k787611j486473
41085B7668244J098895n05921n004194n973241j936294J571265O70810j829672
$$ y = [9699165, 8802499, 6582681, 6438864, 8610032, 9440719, 7321456, 5475310, 6842312, 9650974, 10668893, 9982305, 9570762, 9402469, 8225355, 6757449, 6847593, 8219445, 8908806, 8500738, 8346444, 8849874, 9060241, 8926606, 9479606, 10454816, 10123157, 8301439, 7478803, 9643622, 13357972, 15403753, 14630319, 12874257, 12227054, 12547728, 12253498, 10991259, 10377199, 11614939, 13403003, 13529541, 12023639, 10954014, 11199025, 11610600, 11803168, 13153810, 15772304, 17150978, 15960398, 14853413, 16790748, 20585063, 23279160, 25147945, 28348801, 31766200, 31942328, 29154717, 27668244, 28767139, 28261218, 23257024, 17283783, 15347489, 16918754, 17589564, 15759892]
41077A5759892j853376K31050J766220K054946J799914Q82704q08764k023755
41069A7808831j575195j6706J244213J414774M09934j091744j506683k6193J612416
41060A8273647J234519j14920M43378K569441K751888J87008j518241k82594R52437
41051B4496563n60494k454984j290819J511533K143765P07478L56384J357730
41043B6267156R01354j302198j996092J06493J985131J238320j54597O40603K679664
41034C0365834K903965Q10021j304353j998727k011048j928701r07468J356885
41026B7286408L033218K090493p60770k555297j618015O21264J829730J598918
41018C1525949J157418J301350J935812K890600L636879K901785M86989j159518
$$ y = [15759892, 13906516, 14137566, 15903786, 17958732, 19758646, 20641350, 19832586, 17808831, 16233636, 16216930, 17461143, 18875917, 19285851, 18194107, 16687424, 16661231, 18273647, 19508166, 19393246, 19836624, 22406065, 25157953, 25344961, 23826720, 23544126, 24496563, 23936069, 21481085, 20190266, 21701799, 23845564, 24553042, 24909426, 26267156, 27168510, 25866312, 23870220, 23976713, 25961844, 27200164, 27045567, 27686170, 30365834, 33269799, 34079820, 32775467, 30776740, 28765692, 26836991, 25929523, 27286408, 30319626, 32410119, 31649349, 29094052, 27476037, 28097301, 29927031, 31525949, 32683367, 33984717, 35920529, 38811129, 42448008, 45349793, 45836782, 44677264]
41010D4677264L18191L193441L538228J391555J277889N120987Q579083P349759
41002G5446397L874039L801597P869062J1659820J2522452J2424350J3801856
40995A41399573J6405894J9158083K2115043K5511415K9165622L3550252L9053312
40988C26359194M3196973M0815155K8562789Q323213j4274441l3453652m5458220
40981C54071011m9382494m7137362m1766025l5315007k8791136k3295048j9430519
40974A08953420j6123085j2157849q648363p719402q868081r141257p135144m412569
40966C4747670k736374k337910l006477m136094l649329j83514L369857K446364
40958B4514193k171527m331437j333940J870694L72105l180644l136547M20070
$$ y = [44677264, 44995455, 48188896, 51727124, 53118679, 54396568, 59517555, 68096638, 75446397, 79320436, 83122033, 90991095, 102650915, 115173367, 127597717, 141399573, 157805467, 176963550, 199078593, 224590008, 253755630, 287305882, 326359194, 369556167, 410371322, 438934111, 447257324, 432982883, 399529231, 354071011, 304688517, 257551155, 215785130, 180470123, 151678987, 128383939, 108953420, 92830335, 80672486, 72024123, 64304721, 55436640, 46295383, 39160239, 34747670, 32011296, 29673386, 26666909, 22530815, 18881486, 18697972, 22067829, 24514193, 22342666, 18011229, 16677289, 18547983, 18920088, 15739444, 12602897, 13022967]
40950A3022967K677663J842649N41246K96387k42351j321534j029282P00049J004054
40941A7491848j363651l597108k812609l300J883352J950744J481246J264896
40933A6295418P36708m57134j340556n18210J944775L882536L003191k19694k657991
40924B0669043k235537l28899N73301J75226k57057m23456p25484n28565Q92817
40915A7811389K382788K321914J420407J543914K332941J882983M27850R9831
40907C0224017R60650P24144j007294j762099n45644L09752p07292j566202l39679
40898B6290353J305426R61386m34298l07335J316181K190084J556565Q28151R60905
40889C4667418J373458J439322J384065J638064K360079L431062M293656M408741
$$ y = [13022967, 15700630, 17543279, 18084525, 18380912, 18138561, 16817027, 15787745, 16487794, 17491848, 16128197, 12531089, 9718480, 9715180, 11598532, 13549276, 15030522, 16295418, 17032126, 16574992, 15234436, 14716226, 16661001, 20543537, 23546728, 23327034, 20669043, 18433506, 18104607, 18677908, 18853134, 18596077, 18172621, 17447137, 16918572, 17811389, 20194177, 22516091, 23936498, 25480412, 27813353, 29696336, 30124186, 30224017, 31184667, 31908811, 30901517, 29139418, 28593774, 28903526, 28196234, 26630032, 26290353, 27595779, 28557165, 28122867, 27815532, 29131713, 31321797, 32878362, 33706513, 34667418, 36040876, 37480198, 38864263, 40502327, 42862406, 46293468, 50587124, 54995865]
40881E4995865M320980N159733O560974O687151N223440M534449O444502R575474
40873A03502568J1564375J2373727J3542826J5520440J7595311J9077423J8607846
40866B11784516J3908770M746488n052560j1181647j3542356j4807834j5438443
40859A70416934j3474154q973932n144147m246734n012874n052695l814267k362702
40851A22335429j822587k541574l516250k731019M95697M050922N778612O847899
40843A28897129R770107J3770534J5518441J4327099J2688381J0949431N835591
40836B11756713l604723j2433237j5449216j3802051j2612166j3784410j4717577
40829A25353333j3303789j0757542r144814q611293p909293o336421m544588l855492
$$ y = [54995865, 59316845, 64476578, 71037552, 77724703, 82948143, 87482592, 93927094, 103502568, 115066943, 127440670, 140983496, 156503936, 174099247, 193176670, 211784516, 225693286, 230439774, 225387214, 214205567, 200663211, 185855377, 170416934, 156942780, 147968848, 142824701, 138577967, 133565093, 128512398, 124698131, 122335429, 120512842, 117971268, 114455018, 111723999, 112219696, 116270618, 122049230, 128897129, 138667236, 152437770, 167956211, 182283310, 194971691, 205921122, 211756713, 208151990, 195718753, 180269537, 166467486, 153855320, 140070910, 125353333, 112049544, 101292002, 92147188, 83535895, 75626602, 69290181, 64745593, 60890101]
40821F0890101m587538m948351k755622J171233L031865P97199k676713l201089
40813D7721085o18688J667045J599422L06594n98850q39898k84471J532072L737236
40804E4221547L957096J088724l059769n935350o910477o800994n902367l997991
40796B6660419j788442p72712j441132k495016k272696n09265J585725K663975
40788B1630856K355377J274837L20194L0381L77734J004816J670948K379423K907586
40779C3952152K495784O54022j710279k840191k183383j061917p90448j135604
40771B7380136j408199j838407k532530k240423p9389K284632K368820M21274
40763B4355914r71466n93279M45955J298518K175742K425683R34542r37005k05130
$$ y = [60890101, 56302563, 51354212, 48598590, 49769823, 52801688, 53598887, 50922174, 47721085, 47102397, 48769442, 50368864, 50675458, 50076608, 49236710, 48952239, 50484311, 54221547, 58178643, 59267367, 56207598, 50272248, 43361771, 36560777, 30658410, 26660419, 24871977, 24099265, 22658133, 20163117, 17890421, 17381156, 18966881, 21630856, 23986233, 25261070, 25581264, 25611645, 25989379, 26994195, 28665143, 31044566, 33952152, 36447936, 37101958, 35391679, 32551488, 30368105, 29306188, 28515740, 27380136, 25971937, 24133530, 21601000, 19360577, 19281188, 21565820, 23934640, 24355914, 23384448, 22791169, 23237124, 24535642, 26711384, 29137067, 30071609, 29134604, 28929474]
40754B8929474K743407L566620L52676k871933j809128J940747L733276K483782
40746C9068921P29966o2036l67348l898J493431K626159J652618k6731K71574
40737D5382656J843895J567167p86484k252432j814009j618593k365953j776987
40729C8179260Q63882K611105J399876o78875r81862l03055p49011k028566k465615
40720C5847139j892293j169323l43548O30366Q05710j42567o80223K64502J229191
40711C4548954N31284p99987p34904K97098J99664j221792j962526r22372Q00716
40702C0736135J801423J830475J226204L53999r4472O71212K624927M692509N499693
40693D9342105M383818K247290J299132K760364M786385M405200J879294Q63749
$$ y = [28929474, 31672881, 35239501, 35592177, 32720244, 30911116, 32851863, 36585139, 39068921, 39798887, 39736851, 39369503, 39365605, 40859036, 43485195, 45137813, 45111082, 45382656, 47226551, 48793718, 48007234, 45754802, 43940793, 42322200, 39956247, 38179260, 39043142, 41654247, 43054123, 42375248, 41393386, 41090331, 40341320, 38312754, 35847139, 33954846, 32785523, 32441975, 33072341, 33878051, 33735484, 33055261, 33319763, 34548954, 35080238, 34280251, 33545347, 33842445, 34042109, 32820317, 30857791, 29935419, 30736135, 32537558, 34368033, 35594237, 35948236, 35853764, 36524976, 39149903, 43842412, 49342105, 53725923, 55973213, 57272345, 60032709, 64819094, 69224294, 71103588, 71967337]
40685G1967337L216130O200471O705238N784224O284163P926842Q217189P215143
40677A23516737P635154J0016638J1093593Q003462J819102m117403p656146q827840
40669A41483297q824953q770641q584269o895384l074208R73014K628259K093747
40661A11028862K275556M873483Q357350J0311185J0053628Q171029N017863P85587
40653A60874543l902337q293552j1703015j3107320j1730581q627401o436158
40646I7074179o520270p153276n611489j671379J891567K226064p69134m606668
40638G4859594o827722p162793p013691p197891p021827n720142l773241k138294
40630B8003993j068946n19047p77515j629331j808534o13104P53047R00190M47866
$$ y = [71967337, 75183467, 81383938, 88089176, 93873400, 100157563, 108084405, 116301594, 123516737, 131151891, 141168529, 152262122, 160265584, 162084686, 157967283, 150311137, 141483297, 132658344, 123887703, 115303434, 108408050, 105333842, 106306856, 108935115, 111028862, 113304418, 118177901, 126535251, 136846436, 146900064, 155071093, 160088956, 160874543, 156972206, 148678654, 136975639, 123868319, 112137738, 103510337, 97074179, 90553909, 83400633, 77789144, 76117765, 78009332, 80235396, 79466262, 74859594, 68031872, 60869079, 53855388, 46657497, 39635670, 33915528, 30142287, 28003993, 26935047, 26416000, 25638485, 24009154, 22200620, 21587516, 22340563, 23240753, 23688619]
40621B3688619P48782J237907K73977j757080k566777j316843L23197P74091K20915
40612B1626788n79034j172500q39316P65941K120833J230075j150283k171603
40604A9830901j222649p05572j659753j938773l87847N37961j099556k918762
40596A0435950j824234Q25192J342689m77332j543015p33446j14047q00154j175236
40587E936367l3467J411712J696763R89448o3360j259650j829992o36840J640740
40578G851721K524704J067688o72276o97958J90974K28865l68901j82338P60407
40569A0702886J072704K78668o92394j109882j110745p46966L68441K114755L397461
40560A4274928L118328J396191l30870m98742R96267K453238K157417M66857p58201
$$ y = [23688619, 24437401, 25675308, 25949285, 24192205, 21625428, 20308585, 20631782, 21405873, 21626788, 21047754, 19875254, 19035938, 19801879, 21922712, 23152787, 22002504, 19830901, 18608252, 17902680, 16242927, 14304154, 13916307, 14454268, 13354712, 10435950, 8611716, 9436908, 10779597, 10302265, 8759250, 8025804, 7911757, 7111603, 5936367, 5902900, 7314612, 9011375, 10000823, 9937463, 8677813, 6847821, 6210981, 7851721, 10376425, 11444113, 10771837, 10073879, 10264853, 10493718, 10124817, 9942479, 10702886, 11775590, 12054258, 11361864, 10251982, 9141237, 8394271, 8762712, 10877467, 14274928, 17393256, 18789447, 18458577, 17959835, 18956102, 21409340, 23566757, 24033614, 23275413]
40551B3275413q39114j041772k134256k748816j448925P75044J713060Q98099
40543A8448733k59548p00868l52358R26318K956434M049774K579459o4626o65642
40534B6917676J011829J442333j222017l880766l121380n81358k32136k038635
40526A8295546k468243o15217P21991M60367R88192K891083K608559j563547n145647
40517A6173084l458816R55716J946976r77873k606071p79759P31252p45145k485196
40508H754168j609855J67263L68809K53714J526322K065215l16794k598798n65248
40499H044796L564512L601583q42063l363418p20060K364699J089890k116510
40491A1623429k270384K85427J518970N59555j11026J34238m30269j593235r92005
$$ y = [23275413, 22436299, 21394527, 19260271, 16511455, 15062530, 15837574, 17550634, 18448733, 18189185, 17488317, 17135959, 18062277, 21018711, 25068485, 27647944, 27583318, 26917676, 27929505, 29371838, 28149821, 24269055, 21147675, 20566317, 20334181, 18295546, 15827303, 15212086, 15934077, 16394444, 17382636, 20273719, 22882278, 21318731, 16173084, 12714268, 13669984, 15616960, 14639087, 12033016, 11253257, 11984509, 11239364, 8754168, 7144313, 7311576, 7680385, 7934099, 9460421, 11525636, 11208842, 8610044, 8044796, 11609308, 15210891, 14368828, 11005410, 10285350, 12650049, 13739939, 11623429, 9353045, 9638472, 11157442, 11716997, 11605971, 11740209, 11309940, 9716705, 8724700]
40482H724700J385350K536352J234888r0540M73937J584533J687083J724409K661226
40473B1921938K972606J211730r78506j244310l33344m81435j131487J93093K944637
40464B5074922L246816l25590l872370l270201P2233J366819p56469k730105j564415
40455A7241640J013969J510496k52763j428888p31263j1088p96755j722204r07956
40446A3915188Q63133J390660M26519l91554l94862l37428j87244R72732K481784
40437A8738928K194401r811j358086k61873J182514O99147n02110j52875R81049
40428B1511284P02210k82024N63911K628100K317446j100978l631020k219430
40420B0489499Q52001J579617j83986j554883j415068j256381j689337j064982
$$ y = [8724700, 10110050, 12646402, 13881290, 13790750, 14264687, 15849220, 17536303, 19260712, 21921938, 24894544, 26106274, 25127768, 23883458, 23550114, 23068679, 21937192, 22130285, 25074922, 28321738, 27996148, 24123778, 20853577, 20925810, 22292629, 21536160, 18806055, 17241640, 18255609, 19766105, 19513342, 18084454, 17353191, 17342103, 16545348, 14823144, 13915188, 14778321, 16168981, 16595500, 16203946, 15809084, 15471656, 15284412, 16257144, 18738928, 20933329, 20923518, 19565432, 19303559, 20486073, 21185220, 20683110, 20530235, 21511284, 22213494, 21931470, 22495381, 25123481, 27440927, 26339949, 22708929, 20489499, 21341500, 22921117, 22737131, 21182248, 19767180, 18510799, 16821462, 15756480]
40412A5756480J658045M650790N097153K534310o62534j930464j024460K68307
40404B6347627N29605K19889N67012J618185K259301J925693J291841J193738
40396C5952891J778183K842074M081551M831111M534310L722497L549458M119564
40388F5411639M383198M028218M232237N891932Q165186R519610R435705Q513510
40380A19581235P634213P323158P052733N131205O64043m226329o013230m218752
40372A32928276k227624k612483l800521l020777m95613J621525K921198M620025
40364A29934006O614598P367783O485662M983233K993149m73486n178357r175843
40356A43550745j1258466j2147695j2690226j2521468j1290215r813136r037626
$$ y = [15756480, 17414525, 22065315, 27162468, 29696778, 29034244, 27103780, 26079320, 26347627, 26877232, 27097121, 27664133, 29282318, 31541619, 33467312, 34759153, 35952891, 37731074, 40573148, 44654699, 49485810, 54020120, 57742617, 61292075, 65411639, 69794837, 73823055, 78055292, 83947224, 92112410, 101632020, 111067725, 119581235, 127215448, 134538606, 141591339, 146722544, 147386587, 143160258, 137147028, 132928276, 130700652, 128088169, 124287648, 121266871, 120771258, 122392783, 125313981, 129934006, 136548604, 143916387, 150402049, 155385282, 158378431, 157904945, 152726588, 143550745, 132292279, 120144584, 107454358, 94932890, 83642675, 73829539, 64791913]
40349F4791913q711473p838594n957301l634044k147720k616418m690274o221130
40341B2974959n200168k122063M27677O41459p74652j705870p64333J572792L303146
40332A8352947K632035K1178j948544j504162J93495P84830k81022j763737k787075
40323A3699945l266320k795691j080022P00755Q23673n98480j714631j359986
40315D409243K5654J530326K226244J104192j459655k817580j065750J573429
40307E526103J272626j736315l353774j719920N01025Q07005R6360k42670p58428
40298C92012j398312j93986K816165L803638O84487k634748j625000J745294K005501
40289E595051j275222l103748q72229K430870L499823K755399J758781M54443
$$ y = [64791913, 56080440, 48241846, 42284545, 38650501, 36502781, 33886363, 29196089, 22974959, 17774791, 15652728, 16080405, 16721864, 15947212, 14241342, 13477009, 15049801, 18352947, 20984982, 21006160, 19057616, 17553454, 17746949, 18531779, 18250757, 16487020, 13699945, 10433625, 7637934, 6557912, 7258667, 8082340, 7483860, 5769229, 4409243, 4434897, 5965223, 8191467, 9295659, 7836004, 5018424, 3952674, 5526103, 6798729, 5062414, 1708640, -11280, 489745, 1296750, 1393110, 1150440, 392012, -1006300, -1200286, 1615879, 5419517, 6104004, 3469256, 1844256, 3589550, 5595051, 4319829, 1216081, 343852, 2774722, 6274545, 9029944, 10788725, 11243168]
40281A1243168j132938j584354n03143K24419n81061j378255o51681M89704L93709
40272F519568m00800n50134k93044l53641p6012J092193J746012O44106o24178
40263G704070J22928J797498J572334l32681r24311M32847R34344o27695j466759
40254I212575N20361K853043K119387p33584j982096n95736J118349J583332J441402
40245A5537033J137569J41482r87954o02979J115975J716326j633k186916k750510
40236A3118393j910439p97654L27032J056494J93493k067165l227342j785655
40228D907157K75614M95603k62280L68146K036850K339616R11054k82077n03389
40219A0286294j055071k278544k572845j103792Q00330J661444J385727M23050
$$ y = [11243168, 10110230, 8525876, 8022733, 8247152, 7666091, 6287836, 5636155, 6125859, 6519568, 6118768, 5568634, 5275590, 4921949, 4845937, 5938130, 7684142, 8328248, 7704070, 7826998, 9624496, 11196830, 10864149, 9939838, 10372685, 11307029, 10679334, 9212575, 9732936, 12585979, 14705366, 13971782, 11989686, 11393950, 12512299, 14095631, 15537033, 16674602, 16816084, 15828130, 15225151, 16341126, 18057452, 18055819, 15868903, 13118393, 11207954, 10410300, 10737332, 11793826, 11987319, 9920154, 6692812, 4907157, 5182771, 5678374, 5416094, 5784240, 7821090, 10160706, 11071760, 10789683, 10286294, 9231223, 6952679, 4379834, 3276042, 4076372, 5737816, 7123543, 7546593]
40211G546593p27480j044533p2543N76295p44381k306280q37441K814461L652215
40202H856906k88240m409104l792911J08781K340582J686382J127864K174594
40194G804854K747727J042976j646419l004263k520604j228655j2410Q85411J460298
40185E528915J739076J706754J302758O70400J64473j08195k76379o3515R44278
40176A1608565J984560J308401j348890l602715l129968q23667L31189p64412
40168E563063k074486j402095P35606J981380J198003k78201n20578N37999J241507
40159F982198O31135l45713n22694k43255l13686k81831O08932J486449Q45564
40150H847099q61281j658801r43606P7720O80539J112588R40070n05171j981101
$$ y = [7546593, 6819113, 5774580, 5702037, 6278332, 5533951, 3227671, 2390230, 5204691, 8856906, 8568666, 4159562, 366651, 475432, 2816014, 4502396, 5630260, 7804854, 10552581, 11595557, 9949138, 6944875, 4424271, 3195616, 3183206, 4068617, 5528915, 7267991, 8974745, 10277503, 10947903, 11112376, 11004181, 10727802, 10664287, 11608565, 13593125, 14901526, 13552636, 9949921, 6819953, 5996286, 6327475, 5563063, 3488577, 2086482, 2822088, 4803468, 6001471, 5723270, 5202692, 5740691, 6982198, 7613333, 7267620, 6744926, 6501671, 6187985, 5906154, 6515086, 8001535, 8847099, 7985818, 6327017, 5383411, 5461131, 6141670, 7254258, 8194328, 7689157, 5708056]
40141E708056j503727J23080J37758j424853j538187L79178J072775p78276j841387
40132C34417J14266K016011O73836j628642j093581J181622J607905M48172N21979
40123D175985J293959k03016l261405l727858n79997K457614K496479O12702j126717
40114B137746j941352j215677J120824K685188R14377k379149k717166L40194
40106a055015K532610J661621K80966L16475K0456j466151j440425J241447K773296
40097D865280J70071l202027k497820R36573J851986n60601j928478r6105J734573
40088A273452N24625j886793j843914P64767K669733J811160k54102p51167O66841
40079B974602J604720K58166j948100k151919j5082J816108J467272J54241k11167
$$ y = [5708056, 4204329, 4327409, 4465167, 3040314, 1502127, 1881305, 2954080, 2175804, 334417, 448683, 2464694, 3138530, 1509888, 416307, 1597929, 3205834, 3654006, 4175985, 5469944, 5266928, 2005523, -1722335, -2302332, 155282, 2651761, 3264463, 2137746, 196394, -1019283, 101541, 2786729, 3701106, 1321957, -1395209, -1055015, 1477595, 3139216, 3420182, 3736657, 3757113, 2290962, 850537, 2091984, 4865280, 5035351, 1833324, -664496, 272077, 2124063, 1563462, -365016, -461121, 1273452, 1798077, -88716, -1932630, -1167863, 1501870, 3313030, 3058928, 2307761, 2974602, 4579322, 4837488, 2889388, 737469, 722387, 2538495, 4005767, 4160008, 3948841]
40070C948841P4080l44035j128055p61206P17786J566135J058845N48620J134858
40061F815869J723946O67019j421331k107195o25105O67053m09912k244762j426374
40052A639208J778314K874468n82956m913222n136727j851599K04748o13530j151930
40043g753226P91747L023363K804724J018009L39960J328017K343270K034312
40035E930176L99089j491713j871388J64073K654055K262138j079603l220707
40027C746120j263793K149432K532804j22214j898418j093703k39283j320897
40019B490048k255359l08481K985987L372725O9558k601545j104199K203077K494847
40010G346658m00141k025115m65079Q39399p41794k264412k19424K982185K449201
$$ y = [3948841, 4022921, 3678886, 2550831, 1789625, 2507411, 4073546, 5132391, 5681011, 6815869, 8539815, 9206834, 7785503, 5678308, 5053203, 5720256, 5310344, 3065582, 1639208, 3417522, 6291990, 5709034, 795812, -4340915, -6192514, -5987766, -6601296, -7753226, -6961479, -3938116, -1133392, -115383, 224577, 1552594, 3895864, 5930176, 6329265, 4837552, 2966164, 3130237, 5784292, 8046430, 6966827, 3746120, 2482327, 4631759, 7164563, 7042349, 5143931, 4050228, 3810945, 2490048, 234689, -73792, 2912195, 6284920, 6354478, 3752933, 2648734, 4851811, 7346658, 6946517, 4921402, 4456323, 5295722, 4553928, 2289516, 2070092, 5052277, 7501478]
40001G501478j152336k533360k92884J175703p73558k916996j767071J107769
39993C48745K196760J096339m18744j657310k548043k116844j06470J574219J310847
39984c20501J89960L4182O45101Q36267N76135K78763m64302j678315k049535
39975a952245q57426N68287Q10605L22182J27058J69164J40779K53955K05403
39966b12238o75674j492194m67231J644653J887243p9921j061366K39172R17869
39957G00313o92487j586119N98852K852819J539956j517671k257661q48210j74142
39948a384350k63285P50678J969358J141023o27745n42021O31786j7109j809224
39939a50889j361862J265920K539663J529238R00839J527768J197411n42699j150239
$$ y = [7501478, 6349142, 3815782, 3522898, 4698601, 3925043, 1008047, -759024, 348745, 2545505, 3641844, 3223100, 1565790, -982253, -3099097, -3205567, -1631348, -320501, -130541, -96359, 548742, 1385009, 1961144, 2239907, 1775605, 97290, -1952245, -2809671, -2241384, -1430779, -1108597, -981539, -812375, -671596, -417641, -212238, -887912, -2380106, -2847337, -1202684, 684559, 604638, -456728, -217556, 700313, 7826, -1578293, -979441, 1873378, 3413334, 1895663, -361998, -1210208, -1384350, -1647635, -896957, 1072401, 2213424, 1585679, 1043658, 1675444, 1658335, -150889, -1512751, -246831, 2292832, 3822070, 4722909, 6250677, 7448088, 6905389, 5755150]
39930E755150J19835P11563n70312j585788r82745l29874o52258o26766K75828
39921B114633N30509r7536L51827K090351K545178R43951j7014Q98091R58648
39912A0318638j470085l304174j582304J383073J552385o58534j727933p70588
39904C740478P9315J5669M16822J494005J466854l09693j944731j660686j19662
39895C178371Q44538P35860O42930J291770J722911N60509j575554k199468l48265
39886D853602J484565N85948j799013k064909K98706J829744L00649k036728j889904
39877A562660N48548K357274J879641K93947k66917Q81222K298722J973875j75846
39868A1353126j959600j846752j083861j337250j649089l14501J315414L52165
$$ y = [5755150, 5874985, 6586548, 6016236, 4430448, 3447703, 3117829, 2465571, 1838805, 2114633, 2645142, 2547606, 2899433, 4989784, 7534962, 8478913, 8461899, 9359990, 10318638, 8848553, 5544379, 3962075, 5345148, 6897533, 6238999, 4511066, 3740478, 3819793, 3835462, 4252284, 5746289, 7213143, 6903450, 4958719, 3298033, 3178371, 4022909, 4758769, 5401699, 6693469, 8416380, 8976889, 7401335, 5201867, 4853602, 6338167, 6924115, 5125102, 3060193, 3358899, 5188643, 5489292, 3452564, 1562660, 2111208, 4468482, 6348123, 6642070, 6375153, 7256375, 9555097, 11528972, 11353126, 9393526, 7546774, 6462913, 5125663, 3476574, 3162073, 4477487, 4829652]
39860D829652k566694l454233q32511K083309K240059O62157q826P64326J781081
39851E498320K073282J166875p76296k185181j389816P24775J559651O23949r9218
39842G196341J11611k02092j238819j113920L74689P06409j085010k502823j713976
39833E32410k74930J32069L39450J008916O94350j026676j727448k8532J725420
39824A375029J302001P2540k1566J14545p20035j155767j41865L49070j000347
39815A73605j505010J166796M002954K579463j943136m353501k729437Q528J116558
39806a483180P03442k17659r97620q63992K89050J164519J014464R40970J425364
39797A975358Q54627j158272j847101K43499J920139K73549k081385j259474J172915
$$ y = [4829652, 2262958, -1191275, -2023786, 59523, 2299582, 2961739, 2952913, 3717239, 5498320, 7571602, 8738477, 7962181, 5777000, 4387184, 5111959, 6671610, 7295559, 7196341, 7307952, 7105860, 5867041, 4753121, 5127810, 5834219, 4749209, 2246386, 532410, 257480, 389549, 728999, 1737915, 2432265, 1405589, -321859, -350391, 1375029, 2677030, 2749570, 2728004, 2842549, 2122514, 966747, 824882, 1173952, 173605, -1331405, -164609, 3838345, 6417808, 4474672, 121171, -2608266, -2599738, -1483180, -779738, -997397, -1995017, -2859009, -2569959, -1405440, -390976, 549994, 1975358, 2829985, 1671713, -175388, 68111, 1988250, 2261799, 180414, -1079060, 93855]
39788I3855J020632j197774j513643L53921J066866N9204m8738Q96765L69342
39779A100430j289575r02075J420034J848714m95091j919213n39687R18548L31391
39770D73476o93370p10356r01119j731645j390693N28009J725370J240359Q64302
39761e95667J085544q6810k588122l086139m47583J854494J148982o56944j053915
39752d426160o26863k98277R91498L022092K753655p08635l306639j667608J740628
39743b526309K653580J241339N90406J401265J879470J219887J45708p00095q10459
39734E094792J01530P71194m41181k148163j241432J367975J052667k638198m018885
39725b099701l68976K942516J070402k236772j185241K327318K569458j84122
$$ y = [93855, 1114487, -83287, -1596930, -1243009, -176143, -116939, -165677, 731088, 1100430, -189145, -1091220, 328814, 2177528, 1682437, -236776, -776463, 142085, 473476, -219894, -930250, -1831369, -3563014, -4953707, -4425698, -2700328, -1459969, -595667, 489877, 403067, -2185055, -5271194, -5718777, -3864283, -2715301, -3372245, -4426160, -5053023, -5351300, -4359802, -1337710, 1415945, 707310, -2599329, -4266937, -2526309, 127271, 1368610, 1959016, 3360281, 5239751, 6459638, 6605346, 5905251, 5094792, 5196322, 5967516, 5526335, 3378172, 2136740, 3504715, 4557382, 1919184, -2099701, -2468677, 473839, 1544241, -692531, -1877772, 449546, 3019004, 2834882]
39717B834882j246821k99874q00633k295918j144360J851739K173076j76441o36261
39708B59389J347016J325776j473879k148266J056501L187088R24185k106010
39700B371800k006949o52983r58842j436508j0867J298532K52060r24561M81941
39691a586377K349900J297613j183457j221555Q66727J513453N3319q75857l79084
39682H34682k46411r69540q60239M94049J302325O48765k64010l89676l1733M46498
39672I64710J010052J064843J63298o56300k25340N94217L39063j88098P51565
39663C818010K169942J346670j416047k588380q35686P94822k83110k250633k057081
39654a301493r2566J010402N87294J39930K33664r0294r95750j267550l19572
$$ y = [2834882, 1588061, 1288187, 487554, -1808364, -2952724, -1100985, 1072091, 895650, 259389, 1606405, 2932181, 1458302, -689964, 366537, 3553625, 4477810, 2371800, 364851, -288132, -1246974, -2683482, -2694349, -1395817, -1143757, -2068318, -1586377, 763523, 2061136, 877679, -343876, 522851, 2036304, 2089623, 1213766, 834682, 588271, -381269, -1241508, -747459, 554866, 1203631, 939621, 549945, 518212, 964710, 1974762, 3039605, 3202903, 2546603, 2321263, 2915480, 3254543, 3066445, 3818010, 5987952, 7334622, 5918575, 3330195, 2494509, 3289331, 3006221, 755588, -1301493, -1394059, -383657, 203637, 343567, 577231, 486937, -508813, -1776363, -2095935]
39645b095935R72944J730821J862405J210094m81430k301934k509225r82318P9977
39636b514601q85972k314578j572530J160783K966193K173313M09878p9386M37263
39627b19637J88828q90274q92343R71643K683482J855507r92582k866130j928425
39618b089931M23376J611168J134432O67921J141803J227763m41203k690170l039768
39609b054609j174762O06284O93072J06146K81842O99847L02118j41475P09361
39600B7824J886374J020539j772670l350183j715649J266921K550751J697771
39592A611678N27128J94891L25105L79982K42410l30283j387156j951138q73332
39583a260715J242345K217231R70983r33138j193278L76327J775686J406689j31096
$$ y = [-2095935, -1122991, 607830, 2470235, 3680329, 3198899, 896965, -1612260, -2594578, -2514601, -3400573, -5715151, -7287681, -6126898, -3160705, -987392, -577514, -656900, -219637, -30809, -921083, -1813426, -841783, 1841699, 3697206, 2704624, -161506, -2089931, -1666555, -55387, 1079045, 1746966, 2888769, 4116532, 3675329, 985159, -2054609, -3229371, -2623087, -1930015, -1823869, -1542027, -842180, -540062, -681537, 27824, 1914198, 2934737, 1162067, -2188116, -3903765, -2636844, -86093, 1611678, 2138806, 2333697, 2658802, 3038784, 3281194, 2950911, 1563755, -387383, -1260715, -18370, 2198861, 3169844, 2236706, 1043428, 1419755, 3195441, 4602130, 4471034]
39574D471034j082073p58317j18772k38162q04422n51121R45332K342566J785332
39565E991397q12831l073486k401672Q28256L105793J689625j820051l205524
39557C01507r38076J938870J956290m03808j926648j088711N72270J018149m7458
39548A382385j399589j490146L17865K597453K609758l22598l059540k319094
39540a683506O32925J669561j13135j293820K83425K254235J731137l90778j426811
39531A663233r42056k99799R9726N98885O29184k61187q21224N9551R62029k9964
39521A658378j785046j514155O83364J701184J46112j620598j044716J244781
39513e30696K765073K323538P80082l34294k52257L78916J75485j081832j749616
$$ y = [4471034, 3388961, 2630644, 2511872, 2273710, 1469288, 918167, 1863499, 4206065, 5991397, 5178566, 2105080, -296592, 531664, 3637457, 5327082, 3507031, 301507, -636569, 1302301, 3258591, 2854783, 928135, -160576, 411694, 1429843, 1382385, -17204, -1507350, -1189485, 1407968, 4017726, 3695128, 635588, -1683506, -1050581, 618980, 505845, -787975, -504550, 1749685, 3480822, 3090044, 1663233, 721177, 421378, 521104, 1119989, 1749173, 1487986, 666762, 726313, 1688342, 1658378, -126668, -1640823, -957459, 743725, 889837, -730761, -1775477, -530696, 2234377, 4557915, 5337997, 5003703, 4751446, 5130362, 5305847, 4224015, 2474399]
39504B474399n11744J525380K358704J850135J148721K62520j432712k909863
39496D765540k467771p54661J5052k53506K35610J218178L90397j895150k053784
39487h00095Q91509K868211Q10062k339564k101623Q07928K150151P68469n41901
39478B513147J9619J177289J442595J012398M68995j07712m83252m63916n83672
39469D995491j092662r71488L29215J211993J36494j576479j645559n06847k08529
39460F71629n36770L39532J809926J234009j278387k297285k90057K030495J955731
39451C638823K83086j001887j655654j977396j320817J53014N29556r29478j920561
39442d201314l31797K391724L281448J807208j94003j245437j055583R0728J070218
$$ y = [2474399, 1962655, 3488035, 5846739, 7696874, 8845595, 9108115, 7675403, 4765540, 2297769, 1543108, 1558160, 1304654, 1540264, 2758442, 3148839, 1253689, -800095, 91414, 2959625, 3769687, 1430123, -671500, 136428, 2286579, 3055048, 2513147, 2532766, 3710055, 5152650, 6165048, 6634043, 6526331, 6043079, 5579163, 4995491, 3902829, 2931341, 3260556, 4472549, 4609043, 3032564, 1387005, 880158, 671629, 134859, 474391, 2284317, 3518326, 2239939, -57346, -347403, 1683092, 3638823, 3921909, 2920022, 1264368, -713028, -2033845, -1880831, -1351275, -2280753, -4201314, -4533111, -2141387, 1140061, 2947269, 2753266, 1507829, 452246, 542974, 1613192]
39433A613192M16702j379351j763588N4214J325823M923j615230n50413J672889
39424b20839J304939j460619k811143j311461O15799J298237J691971J967416
39416A074300M74940k359605l074831l85823K056362Q97764j792965j887040N11549
39407d485349J807539P02606m88467p0562Q21035P56041R7560k58752k17976J55163
39397a181162Q91838J204396J06474j476369j211867J086580K492006J045471
39389B957367j119343q53531J290562K066378M58793j292386j502566r35444l74301
39380F95529P15520J913706J182653j563340k923064p40281J940034J089774j879715
39371D30816k153948Q06757K413108L21053k084849j406849P44913J148116n3058
$$ y = [1613192, 2029894, 650543, -1113045, -1058831, 266992, 271915, -1343315, -1893728, -220839, 1084100, -376519, -3187662, -4499123, -3883324, -2585087, -893116, 1074300, 1549240, -810365, -3885196, -4271019, -2214657, -1316893, -3109858, -4996898, -4485349, -2677810, -1975204, -2463671, -2534233, -1713198, -957157, -859597, -1118349, -1336325, -1181162, -289324, 915072, 1021546, -454823, -1666690, -580110, 1911896, 2957367, 1838024, 984493, 2275055, 4341433, 4800226, 3507840, 2005274, 1069830, 695529, 1411049, 3324755, 4507408, 2944068, 21004, -719277, 1220757, 2310531, 430816, -1723132, -916375, 1496733, 1817786, -267063, -1673912, -928999, 219117, 166059]
39362A66059r56208j670878k889331k891025L4168L525286L569728M43364j574465
39353b243302m29007J335220R61880r17232k025849j312026P89616K944577L263578
39344B367455J046649j521112j494743Q07759K119429P38037j646886k857718
39336d41130k444867p62538J438723K191298J00720k597932k136205R88730K208086
39327a455115L8389j434005N51261K677500J275047j264779n09006K514685L063737
39318E457714K26006k420329k856647k444930j963094n43631J122024R58259m38113
39309b902741j14429K000878K463684K25103j232905K32389J667448J57910j970799
39300E26538r76297J966273K611357L16933j476231r57789k7091k24462k99675
$$ y = [166059, -790149, -2461027, -5350358, -8241383, -8207215, -4681929, -1112201, -668837, -2243302, -2672309, -1337089, -375209, -1292441, -3318290, -4630316, -3840700, -896123, 2367455, 3414104, 1892992, 398249, 1206008, 3325437, 4063474, 2416588, -441130, -2885997, -3648535, -2209812, -18514, 82206, -2515726, -4651931, -3663201, -1455115, -1416726, -2850731, -2299470, 378030, 1653077, 388298, -120708, 2393977, 5457714, 5683720, 3263391, 406744, -2038186, -4001280, -4544911, -3422887, -2464628, -2902741, -3017170, -1016292, 1447392, 1672495, 439590, 671979, 2339427, 2497337, 526538, -449759, 1516514, 4127871, 4444804, 2968573, 2010784, 1983693, 1759231, 1459556]
39291A459556Q16722J586499L74938j605719j990938p61629j4293o97186j439458
39282b271508q36602N73454J317895J053340O87960P70511O91447k45021j515370
39273B26106j694076q3266K247441L246329J850968p46305k030993p27091J673357
39264C962470K430733O18285j918901k758516j353913R05625K222751J573170
39256E681704o63777k565629k117793L16983J973743J176207l86879m40259K12676
39247C186976o49004k230354j439993J633515K765724j24676l157867j969735
39239a985414J537611J908035j648435m209450k608347L50398Q74932k19423J96538
39230e803555K106536K714466J213163k73047m79790n76507j249097j081784O91092
$$ y = [1459556, 2276278, 3862777, 4237715, 2631996, 641058, -120571, -134864, -832050, -2271508, -3108110, -2534656, -1216761, -163421, 524539, 1295050, 1986497, 1741476, 226106, -1467970, -1551236, 696205, 3942534, 5793502, 5047197, 3016204, 2289113, 3962470, 6393203, 7011488, 5092587, 2334071, 980158, 1885783, 4108534, 5681704, 5017927, 2452298, 334505, 651488, 2625231, 3801438, 3414559, 2974300, 3186976, 2537972, 307618, -1132375, 501140, 3266864, 3142188, -15679, -1985414, -447803, 1460232, -188203, -4397653, -7006000, -6655602, -5780670, -6000093, -5803555, -3697019, -982553, 230610, -42437, -522227, -1098734, -2347831, -3429615, -2738523]
39221b738523K138106J318305n90305r75544M51680J705220J637616Q49765j63838
39212C632482j554133k673570k166319n7256J863590K262532J509019M53812n15048
39203B755109r64444o48262n05675j570603k679517j620446R50984J657653l51986
39194b977187j521198N76562K937965J666739j622186k098834Q62154L003130
39186H27145J831799k98076o82951j21942m98415j350363j085754J11711O52810
39177f14036n1831j057680j306390o47370K58747O17114L54034K35560O91548
39168a520304J014593N39031q9567j1718K53859j64349o56364j83523N23882j4324
39158c08784j289206j378924M7245J571255K450672K778321J867397n95477k391119
$$ y = [-2738523, -600417, 717888, 127583, -847961, -396281, 1308939, 2946555, 3796320, 3632482, 2078349, -595221, -2761540, -2818796, -955206, 1307326, 2816345, 3270157, 2755109, 1790665, 1142403, 636728, -933875, -3613392, -5233838, -4282854, -2625201, -2977187, -4498385, -3921823, -983858, 682881, -939305, -3038139, -2175985, 827145, 2658944, 2360868, 1677917, 1555975, 1057560, -292803, -1378557, -1266846, -614036, -665867, -1723547, -3029937, -3677307, -3418560, -2801446, -2447412, -2211852, -1520304, -505711, 33320, -56247, -67965, 185894, 21545, -634819, -818342, -294460, -308784, -1597990, -2976914, -2929669, -1358414, 1092258, 3870579, 5737976, 5142499, 2751380]
39149B751380j219228J106825Q81324j296434j269980J361755K144760n66340
39141C894062k579236j096462O56454l46824j471671J73729J794742P639k274733
39132a242300m81216L269341L336379j48558k236779j906797k406974l505950
39124e322854j329478L315496M308538P5863l112377q84121K633443J980439j352796
39115C12153k466597o58482J169836J600858J074626k74925j697722j284907P00513
39106a524647J001564j165566j637647J875561M606084J593271l702709l981325
39098b935414Q76435M137834K667567J92315k33596l62776j658694j951929J01933
39089H33675J858715Q88635j272535k136295j772912r74808Q17007L216263L672382
$$ y = [2751380, 1532152, 2638977, 3520301, 2223867, 953887, 2315642, 4460402, 3894062, 1314826, 218364, 874818, 527994, -943677, -769948, 1024794, 1032433, -1242300, -1723516, 1545825, 4882204, 4733646, 2496867, 590070, -1816904, -5322854, -6652332, -3336836, 971702, 1047565, -2064812, -2948933, -315490, 1664949, 312153, -2154444, -2812926, -1643090, -42232, 1032394, 757469, -940253, -2225160, -1524647, -523083, -1688649, -3326296, -1450735, 3155349, 4748620, 1045911, -2935414, -2058979, 2078855, 4746422, 4938737, 4705141, 4342365, 2683671, 731742, 833675, 2692390, 3581025, 2308490, 172195, -1600717, -2575525, -1758518, 1457745, 5130127]
39080E130127J360144o30594P147Q18062j127429l626659k475829J471292L223555
39071D149816J162177j061132p01163K98434p25832k825749l267108j461419R34147
39062c497829K377451K341958J071743k69357k63739R15365J423537L55256r45563
39053C508822j190085j129752j733642j960413m82890J469134J533557L3743l29221
39044b80747J169616J975244L57353j656920j341280N49178J094123k46672j086105
39035E33790j07100R70840L51544r76894r23732M74048J324401P69634j72675
39026B243856n51614n96996n70691k5974J014693J323107k274j911313k356597
39017a433803o63017J740464K761338J401479j436104l370492k431452O71591
$$ y = [5130127, 6490271, 5859677, 5866824, 6684886, 5557457, 1930798, -545031, 926261, 4149816, 5311993, 4250861, 3549698, 3848132, 3122300, 296551, -2970557, -4431976, -3497829, -1120378, 1221580, 2293323, 2023966, 1760227, 2675592, 4099129, 4454385, 3508822, 2318737, 1188985, -544657, -2505070, -2987960, -1518826, 14731, 48474, -280747, 888869, 2864113, 3221466, 1564546, 223266, 772444, 1866567, 1619895, 533790, 426690, 1397530, 1749074, 772180, -151552, 322496, 1646897, 2416531, 2243856, 1692242, 1095246, 524555, 498581, 1513274, 2836381, 2834107, 922794, -1433803, -2096820, -356356, 2404982, 3806461, 2370357, -1000135, -3431587, -2759996]
39009b759996K779943J759289q64731j949015p76027O25501Q33246N34664M11135
39000E94009j30851j097176r58632P92013J974095P42098j143746o43076J816256
38991A944990K825359J131709p25216o51640j0631p68062j946236j319826O56333
38982A136780J228103n75874k489668k160256j33543J186844N73631r95375j885644
38973d115002j473924k35735J129737K180233K563889J982997O15600p35005j282689
38964F30101r48334k20063M10484O43608M29477K10703O10119J405041J485685
38955D656821N06147l22785j60417k07231j734431l324870k494717K22317J595574
38946a263592M67247p19775j30164P60561L90542J15125J431717K636985J429338
$$ y = [-2759996, 19947, 1779236, 914505, -1034510, -1810537, -1185036, -351790, 182874, 594009, 463158, -634018, -1592650, -800637, 1173458, 1915556, 771810, 128734, 1944990, 4770349, 5902058, 5176842, 4525202, 4514571, 3746509, 1800273, 480447, 1136780, 2364883, 1789009, -700659, -2860915, -2994458, -1807614, -1233983, -2229358, -4115002, -5588926, -5824661, -4694924, -2514691, 49198, 2032195, 2647795, 1912790, 630101, -318233, -538296, -127812, 515796, 945273, 1155976, 1766095, 3171136, 4656821, 5162968, 4840183, 4679766, 4472535, 2738104, -586766, -3081483, -2859166, -1263592, -796345, -1516120, -1646284, -885723, -495181, -380056, 1051661, 3688646, 5117984]
38937E117984q90313j286757N2146K71999j109385j471155K86370J884415J397574
38928D252878j01928q22064o80543k76097L21361O27008k63742j685073j629669
38919b57869m560Q59938K34672N79733L046829M386684J523644l035978m229834
38910C103259j660791K59531q28139k257749j171636J146639J732817M40776k87752
38901D76955Q72169K495894K340490m8165k723656l200498j181537Q85588O87733
38892F04973j017360j612712l98757O63074J54598q58982r03100k97519k5109
38883c690894J39975Q35066J477535J044246j42801q60008p42401k86136L84592
38874a840826J300936J640162N86698r71897j298910l50021L14843K66961P37345
$$ y = [5117984, 4227671, 2940914, 2993060, 3265059, 2155674, 684519, 970889, 2855304, 4252878, 4150950, 3328886, 2648343, 2372246, 2693607, 3320615, 3056873, 1371800, -257869, -262429, 597509, 832181, 1411914, 4458743, 8845427, 10369071, 7333093, 3103259, 1442468, 1701999, 873860, -1383889, -2555525, -1408886, 323931, 764707, 476955, 1349124, 3845018, 6185508, 6137343, 3413687, 213189, -968348, -82760, 604973, -412387, -2025099, -2423856, -1760782, -1606184, -2465166, -3368266, -3665785, -3690894, -3550919, -2715853, -1238318, -194072, -336873, -1196881, -1939282, -2225418, -1840826, -539890, 1100272, 1686970, 715073, -583837, -933858, -619015, -352054, 385291]
38865C85291J827788J543325r66891l226746k523581K51809K074757K006913J463225
38856B835890R96693k74926j999565k261333o71876P43483P43280N18193R02786
38847A532625N26601j317127k325970l97092K488685K617348j21456k225555j561755
38838g83696M68965J783295J927284J110302n86367k250827k424394j132343L3294
38829a854487L02754M26389P20920N31219L5623K28086N47893p40965k857839
38820b660407k321501J742580N129870M003667K81539j539788q63360o11744j708956
38811A451900k038058p00526N10320M96973M48257J065037J064035k39262j282278
38802G76398p18459M16563N43391p4360l29747k87274n66824p53514p6679R68272
$$ y = [385291, 2213079, 3756404, 2789513, -437233, -2960814, -2709005, -634248, 1372665, 2835890, 3832583, 3557657, 1558092, -703241, -1375117, -631634, 111646, 629839, 1532625, 2059226, 742099, -1583871, -1980963, 507722, 3125070, 3003614, 778059, -783696, -314731, 1468564, 3395848, 4506150, 3919783, 1668956, -755438, -1887781, -1854487, -1551733, -1125344, -404424, 126795, 162418, 390504, 938397, 197432, -2660407, -4981908, -3239328, 1890542, 5894209, 6175748, 4635960, 3772600, 3160856, 1451900, -586158, -1286684, -776364, -279391, 168866, 1233903, 2297938, 2058676, 776398, 57939, 474502, 1017893, 943533, 613786, 326512, -240312, -993826, -1070505, -102233]
38792a02233J184935N09281j6921Q4371K23816j14317o81980j026649j016324
38783i56021o66738M18P59975J222831J213214Q79943L97536k06334q58756j296259
38773D89809j294474r64923o09115k77103J97285N93066L20254m04762j05678
38764b055641J974109L822197K504007j533265m118192k566932O98247J658368
38756C82898J61715p56832M8567O65864k5464n77764P6837P04257J94432m23167
38746D51343m8960M23501M3761M5454J789908L696986K934523k17862k317286
38737F801368j450714K68374r7647k264817l339670j703069J133480K555680J716632
38728C619617o5048j179736j209559n82851K98521R31243M38471j359210k804693
$$ y = [-102233, 1082702, 1591983, 1575062, 1659433, 1883249, 1768932, 1086952, 60303, -956021, -1622759, -1622341, -862366, 360465, 1573679, 2453622, 2851158, 2644824, 1786068, 489809, -804665, -1769588, -2378703, -2655806, -2458521, -1865455, -1545201, -1949963, -2055641, -81532, 3740665, 6244672, 4711407, 593215, -1973717, -1275470, 382898, 544613, -212219, -163652, 502212, 476748, -101016, -24179, 680078, 874510, 451343, 402383, 825884, 869645, 915099, 2705007, 6401993, 9336516, 9118654, 6801368, 5350654, 5619028, 5521381, 3256564, -83106, -1786175, -652695, 1902985, 3619617, 3554569, 2374833, 1165274, 582423, 880944, 1812187, 2250658, 891448, -1913245]
38719a913245j780269J387217L704316K954314K85628j557267j574809q48995
38711F56890l38000M5234L38250Q8327o26175r06567l03257M90757P68273Q68259
38701A081991J373366J806736J128478n25220j577797r49703M18576P75978l7523
38692C494882m82677K11613P32581k15044j463668p12850J830679L007234P57176
38683G159926k761960l606941j043910J518865Q88115j987103l490969k037521
38675e361498K45994Q10914J07176L23215J625726J831733K7048j724657j409802
38666c524151J01947R16129J146671J841756K140133L61957k496061l316929j230103
38657d058651J207181J771728J041625L81793j7554p8641P04610J490622K66348
$$ y = [-1913245, -3693514, -2306297, 1398019, 4352333, 4637961, 3080694, 1505885, 656890, 318890, 364124, 702374, 790701, 164526, -742041, -1045298, -554541, 213732, 1081991, 2455357, 4262093, 5390571, 4865351, 3287554, 2337851, 2756427, 3532405, 3494882, 3012205, 3223818, 3956399, 3741355, 2277687, 1564837, 3395516, 6402750, 7159926, 4397966, 791025, -252885, 1265980, 2154095, 166992, -3323977, -5361498, -5115504, -4304590, -4197414, -3874199, -2248473, -416740, -389692, -2114349, -3524151, -3422204, -2506075, -1359404, 482352, 2622485, 2984442, 488381, -2828548, -4058651, -2851470, -1079742, -38117, 343676, 326122, 247481, 952091, 2442713, 2709061]
38648B709061k653129l840604j484628J509529J626914k05419o25448Q22051J694137
38639d47536R66910l4511n85634j242288j614728m87109J524575K180079R93953
38630A253711o3890K02029O57498K08423n05070o51540n13843m19006n2277N12010
38620F28045O84829O27312R10086Q26648p26260k510850j864592R59818K366318
38611A901354N79948j773193k008644j257490j508793j595281M91242L242948
38603a927909L381883J021106n33667J12019Q91814J26987j118415j361359r15542
38594c23083p26286q27678q88215q67317n14266M48343J283727Q65594l49646
38585a898827o31563L46793R68538M32673Q1596R08960J618602P25041q56174
$$ y = [2709061, 55932, -3784672, -5269300, -3759771, -2132857, -2338276, -2963724, -2141673, -447536, 519374, 484863, -100771, -1343059, -2957787, -3444896, -1920321, 259758, 1253711, 1189821, 1391850, 2049348, 2257771, 1752701, 1101161, 587318, 168312, 116035, 628045, 1312874, 1940186, 2850272, 3676920, 2950660, 439810, -1424782, -464964, 1901354, 2481302, 708109, -1300535, -2558025, -4066818, -5662099, -5170857, -1927909, 1453974, 2475080, 1941413, 2053432, 2945246, 3072233, 1953818, 592459, -323083, -1049369, -1877047, -2765262, -3632579, -4146845, -3698502, -2414775, -1549181, -1898827, -2530390, -2183597, -1215059, -782386, -700790, 208170, 1826772, 2551813, 1695639]
38576A695639j111345Q6577J024771P03623j45045l74068L93666J690170K431648
38567F395636J606511m36957j928442j761553r25384q30515j117672o09841L24301
38558G16084K46409q50536j466080r88337k66568K74487J042961J578403P63140
38549A049963o79250m40836J533608K176466J3281j992191r17573J271993R05678
38540B921139j189117j070863J438346K146771n13370k608185q72756K219899
38532B471864K481697O8425j790081j915005j560514j098428K38618J956456K602866
38523C455898K075812J169392m10778k879783m152636k140532J204436J846733
38515A68542k61497j041109J066838K549689O76127k077741k202732n15678j3438
$$ y = [1695639, 584294, 670871, 1695642, 2399265, 2254220, 1880152, 2273818, 3963988, 6395636, 8002147, 7565190, 5636748, 3875195, 2949811, 2119296, 1001624, 391783, 716084, 962493, 111957, -1354123, -2342460, -2609028, -2334541, -1291580, 286823, 1049963, 370713, -70123, 1463485, 3639951, 3653232, 1661041, 743468, 2015461, 2921139, 1732022, 661159, 2099505, 4246276, 3732906, 1124721, 251965, 2471864, 4953561, 5021986, 3231905, 1316900, -243614, -1342042, -1103424, 853032, 3455898, 5531710, 6701102, 6290324, 3410541, -742095, -2882627, -1678191, 168542, -92955, -1134064, -67226, 2482463, 3158590, 1080849, -1121883, -1637561, -1650999]
38506a650999p73256o27673N61382Q81305m6593o02375q2285N27168N68760L04870
38496i39696k28491r24403p34844P21738J476596k54947k599997k204239N45610
38487e142673K011568J040969K77427J060899J284685j9358k25650K050777L524068
38478E862712J288325j870339j599277R20808J014018j638148k626997l44121
38470A006981J544132N41237p23111M43070J939730O30897k050166k299682k650
38461A030438J439809O19782l49038O1745O11709Q5169o11896m78243k46616o46339
38451A516520p24446L06250J023116k72925k402189k356333M72046L077052K540896
38442C179987m10950k495865j719765Q15370K567852K095789r4657k446502l570428
$$ y = [-1650999, -2424255, -3051928, -2490546, -1609241, -1655834, -2258209, -2340494, -1813326, -1244566, -939696, -1168187, -2092590, -2827434, -2105696, -629100, -884047, -3484044, -5688283, -5142673, -3131105, -2090136, -1812709, -751810, 532875, 513517, 287867, 2338644, 5862712, 7151037, 5280698, 3681421, 4602229, 5616247, 3978099, 1351102, 1006981, 2551113, 3092350, 2369239, 2812309, 4752039, 5382936, 3332770, 1033088, 1030438, 2470247, 3090029, 2740991, 2802736, 3414445, 3499614, 2887718, 2409475, 2162859, 1516520, 792074, 1098324, 2121440, 1848515, -553674, -2910007, -2437961, 639091, 3179987, 2769037, 273172, -1446593, -631223, 1936629, 4032418, 3937761, 1491259, -2079169]
38433b079169k846958n21341K304838L912781K932648k35033l103620l108014
38425b743868m46981J739065R33401j445497j712137R87118L128332J589719j728236
38416C00916k437229L4636J804058O00380q87472L87860K717685K254767q80610
38407C894991k752495j524521K98957K03122q92057r56489j36047K07637M9001
38398a607901K84125P52467M67595o31981j520922j448704n81506M24340R06621
38389b955866O51738J93180J29346J67947k27395m82868K60674J133466M93683
38380f36095r48579o80915J232525J513102j044616k999928j471584J235757J515337
38371b284996J76795K21099J159886L45288j439876r47067J419590J741279p44292
$$ y = [-2079169, -4926127, -5447468, -3142630, 770151, 3702799, 3467766, 364146, -2743868, -3190849, -1451784, -518383, -1963880, -3676017, -2688899, 439433, 2029152, 300916, -2136313, -2101677, -297619, 302761, -584711, -196851, 2520834, 4775601, 3894991, 1142496, -382025, -83068, 120054, -772003, -1728492, -1864539, -1656902, -1607901, -1323776, -571309, -103714, -735695, -2256617, -3705321, -4286827, -3862487, -2955866, -2304128, -2110948, -1981602, -1813655, -2041050, -2523918, -2263244, -1129778, -636095, -1584674, -2265589, -1033064, 480038, -564578, -3564506, -5036090, -3800333, -2284996, -2108201, -1887102, -727216, -381928, -1821804, -2768871, -1349281, 391998, -352294]
38362c52294k299705j138905j23816j117065j539276O25591K693138J659354p06992
$$ y = [-352294, -2651999, -3790904, -3914720, -5031785, -6571061, -5945470, -3252332, -1592978, -2299970]
$$ [...]
##END NTUPLES=NMR SPECTRUM
##END=
