##TITLE=31Pdec_SR158(r)_rm
 , 24 sc
 21.2.2023
##JCAMPDX= 6.0         $$ Bruker NMR JCAMP-DX V2.0
##DATA TYPE= NMR SPECTRUM
##DATA CLASS= NTUPLES
##ORIGIN= UXNMR, Bruker Analytische Messtechnik GmbH
##OWNER= root
$$ XWIN-NMR		Version 3.5
$$ Tue Feb 21 17:12:39 2023 Russian Standard Time (UT+4h)  she@DPX200
##.OBSERVE FREQUENCY= 81.013821
##.OBSERVE NUCLEUS= ^31P
##.ACQUISITION MODE= SIMULTANEOUS
##.ACQUISITION SCHEME= undefined
##.AVERAGES= 24
##.DIGITISER RES= 16
##SPECTROMETER/DATA SYSTEM= spect
##.PULSE SEQUENCE= zgpg30
##.SOLVENT NAME= CDCl3
##.SHIFT REFERENCE= (INTERNAL, CDCl3, 0, 248.564)
##AUDIT TRAIL= $$ (NUMBER, WHEN, WHO, WHERE, WHAT)
$$ ##TITLE= Audit trail, XWIN-NMR		Version 3.5
$$ ##JCAMPDX= 5.01
$$ ##ORIGIN= Bruker BioSpin GmbH
$$ ##OWNER= she
$$ F:/spectra/data/she/nmr/P31/1/pdata/1/auditp.txt
$$ ##AUDIT TRAIL=  $$ (NUMBER, WHEN, WHO, WHERE, WHAT)
(   1,<2023-02-21 17:10:17.82 +0400>,<she>,<DPX200>,
      <created by zg, POWCHK disabled, PULCHK disabled
       configuration hash MD5:
       00 E9 B6 7A A2 85 ED C7 34 08 36 98 17 FE 4E 26
       data hash MD5: 32K
       67 A4 0E 06 FA A9 70 E8 62 ED 45 FA 21 A6 C9 F1>)
(   2,<2023-02-21 17:10:29.28 +0400>,<she>,<DPX200>,
      <Start of raw data processing
       efp BC_mod = 2 LB = 1 FT_mod = 6 PKNL = 1 PHC0 = -11065.06 PHC1 = 265.2102 SI = 64K 
       data hash MD5: 64K
       A0 DF 25 47 EF 2F 79 9E F9 1D E7 6A 78 30 55 74>)
(   3,<2023-02-21 17:10:40.90 +0400>,<she>,<DPX200>,
      <pk PHC0 = 14.47935 PHC1 = 0 
       data hash MD5: 64K
       9B 76 F1 48 71 E4 86 18 08 2B 55 D9 56 87 84 54>)
$$ ##END=
$$ 
$$ hash MD5
$$ EB 30 17 CE E3 A1 BF E6 F4 1C CB B3 C4 E7 8E 6D
##$RELAX= 
##$RELAX= 
##$RELAX= 
##$RELAX= 
##$RELAX= 
##$RELAX= 
##$RELAX= 
##$RELAX= 
##$RELAX= 
$$ Bruker specific parameters
$$ --------------------------
##$DU= <F:/spectra>
##$EXPNO= 1
##$NAME= <P31>
##$PROCNO= 1
##$TYPE= <nmr>
##$USER= <she>
##$AMP= (0..31)
100 100 100 100 100 100 100 100 100 100 100 100 100 100 100 100 100 100 
100 100 100 100 100 100 100 100 100 100 100 100 100 100 
##$AQSEQ= 0
##$AQ_mod= 1
##$AUNM= <au_zg>
##$AUTOPOS= <>
##$BF1= 81.014009
##$BF2= 200.13
##$BF3= 200.13
##$BF4= 200.13
##$BF5= 200.13
##$BF6= 200.13
##$BF7= 200.13
##$BF8= 200.13
##$BYTORDA= 1
##$CFDGTYP= 0
##$CFRGTYP= 5
##$CHEMSTR= <none>
##$CNST= (0..31)
1 1 145 1 1 1 1 1 1 1 1 1 1 1 1 1 1 1 1 1 1 1 1 1 1 1 1 1 1 1 1 1 
##$CPDPRG= <waltz16>
##$CPDPRG1= <>
##$CPDPRG2= <waltz16>
##$CPDPRG3= <>
##$CPDPRG4= <mlev>
##$CPDPRG5= <mlev>
##$CPDPRG6= <mlev>
##$CPDPRG7= <mlev>
##$CPDPRG8= <mlev>
##$CPDPRGB= <>
##$CPDPRGT= <>
##$D= (0..31)
0 1 0 0 0 0 0 0 0 0 0 0.03 2e-05 3e-06 0 0 0 0 0 0 0 0 0 0 0 0 0 0 0 0 
0 0 
##$DATE= 1676985017
##$DBL= (0..7)
120 120 120 11 120 120 24 19 
##$DBP= (0..7)
150 150 150 150 150 150 150 150 
##$DBP07= 0
##$DBPNAM0= <>
##$DBPNAM1= <>
##$DBPNAM2= <>
##$DBPNAM3= <>
##$DBPNAM4= <>
##$DBPNAM5= <>
##$DBPNAM6= <>
##$DBPNAM7= <>
##$DBPOAL= (0..7)
0.5 0.5 0.5 0.5 0.5 0.5 0.5 0.5 
##$DBPOFFS= (0..7)
$$ [...]
##$SUBNAM2= <"">
##$SUBNAM3= <"">
##$SUBNAM4= <"">
##$SUBNAM5= <"">
##$SUBNAM6= <"">
##$SUBNAM7= <"">
##$SUBNAM8= <"">
##$SUBNAM9= <"">
##$SW= 501.771253377433
##$SWIBOX= (0..15)
0 1 3 0 0 0 0 0 0 0 0 0 0 0 0 0 
##$SW_h= 40650.406504065
##$TD= 32768
##$TD0= 1
##$TE= 0
##$TE2= 300
##$TE3= 300
##$TEG= 300
##$TL= (0..7)
0 120 53 12 22 120 120 120 
##$TP= (0..7)
150 150 150 150 150 150 150 150 
##$TP07= 0
##$TPNAME0= <>
##$TPNAME1= <>
##$TPNAME2= <>
##$TPNAME3= <>
##$TPNAME4= <>
##$TPNAME5= <>
##$TPNAME6= <>
##$TPNAME7= <>
##$TPOAL= (0..7)
0.5 0.5 0.5 0.5 0.5 0.5 0.5 0.5 
##$TPOFFS= (0..7)
0 0 0 0 0 0 0 0 
##$TUNHIN= 0
##$TUNHOUT= 0
##$TUNXOUT= 0
##$USERA1= <user>
##$USERA2= <user>
##$USERA3= <user>
##$USERA4= <user>
##$USERA5= <user>
##$V9= 5
##$VALIST= <valist>
##$VCLIST= <CCCCCCCCCCCCCCC>
##$VD= 0
##$VDLIST= <DDDDDDDDDDDDDDD>
##$VPLIST= <PPPPPPPPPPPPPPP>
##$VTLIST= <TTTTTTTTTTTTTTT>
##$WBST= 1024
##$WBSW= 4
##$XGAIN= (0..3)
0 0 0 0 
##$XL= 0
##$YL= 0
##$YMAX_a= 10958
##$YMIN_a= -14832
##$ZGOPTNS= <>
##$ZL1= 120
##$ZL2= 120
##$ZL3= 120
##$ZL4= 120
##$ABSF1= 0
##$ABSF2= 0
##$ABSG= 0
##$ABSL= 0
##$ALPHA= 0
##$AQORDER= 0
##$ASSFAC= 0
##$ASSFACI= 0
##$ASSFACX= 0
##$ASSWID= 0
##$AUNMP= <proc_1d>
##$AZFE= 0.1
##$AZFW= 0.5
##$BCFW= 0
##$BC_mod= 2
##$BYTORDP= 0
##$COROFFS= 0
##$CY= -3
##$DATMOD= 1
##$DC= 0
##$DFILT= <>
##$DTYPP= 0
##$F1P= 0
##$F2P= 0
##$FCOR= 1
##$FTSIZE= 65536
##$FT_mod= 6
##$GAMMA= 0
##$GB= 0
##$INTBC= 1
##$INTSCL= 6.047779e-11
##$ISEN= 30
##$LB= 1
##$LEV0= 0
##$LPBIN= 0
##$MAXI= 10000
##$MC2= 0
##$MEAN= 0
##$ME_mod= 0
##$MI= 50
##$NCOEF= 0
##$NC_proc= -7
##$NLEV= 6
##$NOISF1= 182.463
##$NOISF2= 159.3651
##$NSP= 0
##$NTH_PI= 0
##$NZP= 0
##$OFFSET= 248.5645
##$PC= 4
##$PHC0= -11050.58
##$PHC1= 265.2102
##$PH_mod= 1
##$PKNL= yes
##$PPARMOD= 0
##$PSCAL= 0
##$PSIGN= 0
##$REVERSE= no
##$SF= 81.0140089999694
##$SI= 65536
##$SIGF1= 159.3651
##$SIGF2= -187.1042
##$SINO= 113.3802
##$SIOLD= 16384
##$SREGLST= <1H.CDCl3>
##$SSB= 0
##$STSI= 65536
##$STSR= 0
##$SW_p= 40650.406504065
##$SYMM= 0
##$S_DEV= 0
##$TDeff= 32768
##$TDoff= 0
##$TI= <>
##$TILT= no
##$TM1= 0
##$TM2= 0
##$TOPLEV= 0
##$USERP1= <user>
##$USERP2= <user>
##$USERP3= <user>
##$USERP4= <user>
##$USERP5= <user>
##$WDW= 1
##$XDIM= 65536
##$YMAX_p= 321908048
##$YMIN_p= -126669051
$$ End of Bruker specific parameters
$$ ---------------------------------
##NTUPLES= NMR SPECTRUM
##VAR_NAME=  FREQUENCY,     SPECTRUM/REAL,   SPECTRUM/IMAG
##SYMBOL=    X,             R,               I
##VAR_TYPE=  INDEPENDENT,   DEPENDENT,       DEPENDENT
##VAR_FORM=  AFFN,          ASDF,            ASDF
##VAR_DIM=   65536,         65536,           65536
##UNITS=     HZ,            ARBITRARY UNITS, ARBITRARY UNITS
##FACTOR=    0.620285442955139, 1,           1
##FIRST=     20137.2065510682, 0,            0
##LAST=      -20513.1999529968, 0,           0
##MIN=       -20513.1999529968, -126669051,  0
##MAX=       20137.2065510682, 321908048,    0
$$ Real data points
##PAGE= N=1
##DATA TABLE= (X++(R..R)), XYDATA
$$ [...]
$$ plain form
44324 2100617 3056627 3564209 1827548 -722752 -952327 1420731 3398523 3111029 2130102
44315 2130102 2513668 3785995 4162341 3020884 876495 -1555079 -3106973 -2604073 -763500
44306 -763500 72208 -615955 -345941 2405822 5205387 4986490 2598067 1271573 1862287
44297 1862287 2547654 2356911 1962503 1429434 180355 -887134 -115875 1870360 2504831
44288 2504831 1091903 -102913 883769 3404831 5544618 5912906 4023454 860409
44280 860409 -1016517 -72487 1746459 1565730 98448 485142 2882515 4102148 3157092
44271 3157092 2875125 4467349 4757700 1413486 -2751947 -3973645 -3084389 -3259192 -4486692
44262 -4486692 -4195317 -2009495 -79526 738683 1688145 3258613 4374539 4471316 4049784
$$ packed form
44324B100617R56010N07582j736661k550300k29575K373058J977792k87494r80927
44315B130102L83566J272327L76346j141457k144389k431574j551894N02900J840573
44306g63500Q35708o88163K70014K751763K799565k18897k388423j326494N90714
44297A862287O85367j90743l94408n33069j249079j067489P71259J986235O34471
44288B504831j412928j194816R86682K521062K139787L68288j889452l163045
44280H60409j876926R44030J818946j80729j467282L86694K397373J219633r45056
44271C157092k81967J592224K90351l344214m165433j221698Q89256j74803j227500
44262d486692K91375K185822J929969Q18209R49462J570468J115926R6777m21532
$$ plain form
44253 4049784 3230115 1822526 615732 622141 1348959 1660651 1781590 2461765 2916087
44244 2916087 1903269 152469 -820084 -1610074 -3678864 -5698290 -4659121 -892539
44236 -892539 1590407 730571 -951107 -763167 320753 286722 -196537 695099 2511491
44227 2511491 3213760 2257756 923427 345920 826621 2222738 3591468 3475961 1959988
44218 1959988 1245414 2617108 4140354 3315592 889482 -227704 892921 2422672
44210 2422672 2724881 1858914 326629 -1519578 -2759049 -2552509 -1612021 -1256083 -1173761
44201 -1173761 -199157 903067 88856 -2191767 -2754830 -256805 2681656 3399655 2693041
44192 2693041 2472079 2362966 1267758 422826 1771870 4333519 5309685 4356650 3744491
$$ packed form
44253D049784q19669j407589j206794O409P26818L11692J20939O80175M54322
44244B916087j012818j750800r72553p89990k068790k019426J039169L766582
44236h92539K482946q59836j681678J87940J083920l4031m83259Q91636J816392
44227B511491P02269r56004j334329n77507M80701J396117J368730j15507j515973
44218A959988p14574J371694J523246q24762k426110j117186J120625J529751
44210B422672L02209q65967j532285j846207j239471K06540R40488L55938Q2322
44201a173761R74604J102224q14211k280623n63063K498025K938461P17999p06614
44192B693041k20962j09113j095208q44932J349044K561649R76166r53035o12159
$$ plain form
44183 3744491 4355646 4614896 3859904 3704090 4885800 5500284 4101405 2360981 2572279
44174 2572279 4145232 4804166 4128049 3568200 3542567 2856941 1080935 -510152 -846618
44165 -846618 -353379 269802 1209689 2616766 3504392 2686136 506589 -1238110 -1228211
44156 -1228211 -8383 778792 344220 -444089 -389783 321471 477482 -149790 -253099
44147 -253099 927381 1962996 913316 -1803260 -3629420 -3057453 -1297997 -307646 -370949
44138 -370949 -617126 -1109919 -2989295 -6464457 -9773959 -10695900 -8569477 -4481366 -125666
44129 -125666 2891456 3352935 1386895 -890049 -1057175 797137 2143223 1481469 261942
44120 261942 206268 368550 -1034769 -3027411 -2917884 -644576 961839 776036 1185504
$$ packed form
44183C744491O11155K59250p54992j55814J181710O14484j398879j740424K11298
44174B572279J572953O58934o76117n59849k5633o85626j776006j591087l36466
44165h46618M93239O23181R39887J407077Q87626q18256k179547j744699R899
44156a228211J219828P87175m34572p88309N4306P11254J56011o27272j03309
44147b53099J180480J035615j049680k716576j826160N71967J759456R90351o3303
44138c70949k46177m92793j879376l475162l309502r21941K126423M088111M355700
44129a25666L017122M61479j966040k276944j67126J854312J346086o61754j219527
44120B61942n5674J62282j403319j992642J09527K273308J606415j85803M09468
$$ plain form
44111 1185504 3918195 6750387 6470455 3221916 -233072 -2091062 -2290937 -1094157
44103 -1094157 845491 1924233 1220038 -13365 -244272 -32521 -562508 -1024528 104141
44094 104141 2123087 3124858 3215183 3846412 4477643 3165214 502320 -413132 1381350
44085 1381350 3218044 2971682 1840302 1624954 1898186 1574920 1048776 888610 221835
44076 221835 -1661140 -3437578 -3258403 -1177729 1303102 3191943 4239820 4053392 2291045
44067 2291045 -488836 -2806471 -3004906 -416838 3335863 4886125 2606991 -923649
44059 -923649 -1877835 -7805 1931617 2872576 4083232 5272142 4265188 1453587 227568
44050 227568 1349698 1317267 -1343040 -2779900 -254002 2505708 1007245 -2491438 -2622791
$$ packed form
44111A185504K732691K832192k79932l248539l454988j857990j99875J196780
44103a094157J939648J078742p04195j233403k30907K11751n29987m62020J128669
44094A04141K018946J001771R0325O31229O31231j312429k662894r15452J794482
44085A381350J836694k46362j131380k15348K73232l23266n26144j60166o66775
44076B21835j882975j776438J79175K080674K480831J888841J047877j86428j762347
44067B291045k779881k317635j98435K588068L752701J550262k279134l530640
44059i23649r54186J870030J939422R40959J210656J188910j006954k811601j226019
44050B27568J122130l2431k660307j436860K525898K759710j498463l498683j31353
$$ plain form
44041 -2622791 429804 1862901 569118 417772 3109372 5366970 4474032 1970397
44033 1970397 226973 -756455 -1372881 -617815 1681656 3416947 2889532 1134726 240199
44024 240199 971101 2895403 5069782 5864340 3978967 457593 -1930790 -1885342 -590819
44015 -590819 625258 1712504 2710916 3217763 3472669 4073386 4407868 3424229 1993672
44006 1993672 2074755 3397818 3739030 2826424 2867394 4414201 4988704 3200800 1119699
43997 1119699 740736 967969 251880 -407916 368815 1358304 725221 -531988 90728
43988 90728 2699626 4845367 4841110 3366983 2052566 1824544 2360640 2378166 1074689
43979 1074689 -384102 -109722 1460048 1759508 103722 -902990 623246 2824998
$$ packed form
44041b622791L052595J433097j293783j51346K691600K257598q92938k503635
44033A970397j743424r83428o16426P55066K299471J735291n27415j754806q94527
44024B40199P30902J924302K174379P94558j885373l521374k388383M5448J294523
44015e90819J216077J087246R98412N06847K54906O00717L34482r83639j430557
44006A993672Q1083J323063L41212r12606M0970J546807N74503j787904k081101
43997A119699l78963K27233p16089o59796P76731R89489o33083j257209O22716
43988I0728K608898K145741m257j474127j314417k28022N36096J7526j303477
43979A074689j458791K74380J569770K99460j655786j006712J526236K201752
$$ plain form
43971 2824998 3044347 1630380 551268 156649 -135253 350591 2193513 3667270 2857411
43962 2857411 1042591 997320 2622704 3345553 2529990 2303327 3707483 4941651 4228974
43953 4228974 2154053 376068 -119874 1009558 3337053 4983568 4016443 1277693
43945 1277693 32731 1894313 4678009 5338324 3660202 1832497 1374812 1802257 1913807
43936 1913807 1374052 976283 1719627 3576163 5188043 5125239 3387339 1227738 -376406
43927 -376406 -1467494 -2317408 -2522562 -1246777 1628575 4587252 5129840 2259665 -1632677
43918 -1632677 -2663942 116449 3400490 3615238 988032 -1595949 -2467965 -2068297 -929687
43909 -929687 857114 2233793 1455534 -1513059 -4352572 -4891619 -3302947 -1263119 246004
$$ packed form
43971B824998K19349j413967j079112l94619k91902M85844J842922J473757q09859
43962B857411j814820m5271J625384P22849q15563k26663J404156J234168p12677
43953D228974k074921j777985m95942J129432K327495J646515r67125k738750
43945A277693j244962J861582K783696O60315j678122j827705m57685M27445J11550
43936A913807n39755l97769P43344J856536J611880o2804j737900k159601j604144
43927c76406j091088q49914k05154J275785K875352K958677N42588k870175l892342
43918a632677j031265K780391L284041K14748k627206k583981q72016L99668J138610
43909i29687J786801J376679p78259k968593k839513n39047J588672K039828J509123
$$ plain form
43900 246004 1608966 3369998 4895772 4626504 2003586 -1183996 -2427385 -1566476 -853507
43891 -853507 -1517701 -2041147 -961457 426045 23426 -1699617 -2354257 -874188 1700805
43882 1700805 3911999 4636588 3127014 241403 -1326970 -133863 1754661 1873474
43874 1873474 1360706 2755422 4960897 4463069 1384138 -113496 1592837 2898910
43866 2898910 841423 -2138717 -2199253 -16226 725037 -886341 -2117198 -1039889 994136
43857 994136 1770284 1237212 1268312 3089732 5583729 6473805 5286093 4246475 5200869
43848 5200869 6624525 5698130 2776279 1048375 1587722 1830041 47834 -1650838 -721417
43839 -721417 1765221 2788036 1581493 75819 123206 1899530 4210928 5245083 4010246
$$ packed form
43900B46004J362962J761032J525774k69268k622918l187582j243389Q60909P12969
43891h53507o64194n23446J079690J387502m02619j723043o54640J480069K574993
43882A700805K211194P24589j509574k885611j568373J193107J888524J18813
43874A873474n12768J394716K205475m97828l078931j497634J706333J306073
43866B898910k057487k980140o0536K183027P41263j611378j230857J077309K034025
43857I94136P76148n33072L1100J821420K493997Q90076j187712j039618R54394
43848E200869J423656r26395k921851j727904N39347K42319j782207j698672R29421
43839g21417K486638J022815j206543j505674M7387J776324K311398J034155j234837
$$ plain form
43830 4010246 1758931 616334 424756 -868166 -3168091 -3672706 -1677830 -457566
43822 -457566 -2050128 -3623292 -2191657 293452 557000 -148466 1363888 3889258 3602521
43813 3602521 1070030 711593 3268186 4486761 2192097 -747822 -2017776 -3113114
43805 -3113114 -4758911 -4219410 -469995 2401381 1000599 -1721003 -1048821 2019802
43797 2019802 2709392 158927 -1746920 -701097 1357281 2201233 2102445 1868072 1296534
43788 1296534 638961 979469 2079488 2078201 423789 -881134 -135669 1639065 2372246
43779 2372246 1704871 873982 829345 1528921 2386941 2605304 1695835 292047 -217148
43770 -217148 626347 1742442 2056334 1820217 1783684 1860954 1487242 800648 590177 1206417
$$ packed form
43830D010246k251315j142597j91578j292922k299925n04615J994876J220264
43822d57566j592562j573164J431635K485109K63548p05466J512354K525370k86737
43813C602521k532491l58437K556593J218575k294664k939919j269954j095338
43805c113114j645797N39501L749415K871376j400782k721602O72182L068623
43797B019802O89590k550465j905847J045823K058378Q43952r8788k34373n71538
43788A296534o57573L40508J100019j287j654412j304923P45465J774734P33181
43779B372246o67375q30889m4637O99576Q58020K18363r09469j403788n09195
43770b17148Q43495J116095L13892k36117l6533P7270l73712o86594k10471O16240
$$ plain form
43760 1206417 2145967 2713699 2697079 2311531 1687203 637061 -861026 -2110432 -2271542
43751 -2271542 -1656848 -1535693 -2114744 -1866279 58245 1950614 1776085 297770 -194380
43742 -194380 494286 854223 1264417 3649164 6949935 6816148 1748551 -3774188 -4911393
43733 -4911393 -2384767 142893 1820557 3835069 5000347 2884287 -1363205 -3816080
43725 -3816080 -3412184 -2623409 -2385174 -947091 1409136 1400415 -1548658 -3162590 -710386
43716 -710386 2459013 2267265 308345 667383 2990355 3537588 1683453 516397 1335152
43707 1335152 2027512 1344931 825507 1497559 2020562 1342125 477155 482467 1004483 1726372
43697 1726372 2845926 3263911 997128 -3303189 -5857282 -4481758 -1488391 -24708
$$ packed form
43760A206417R39550N67732j6620l85548o24328j050142j498087j249406j61110
43751b271542O14694J21155n79051K48465J924524J892369j74529j478315m92150
43742a94380O88666L59937M10194K384747L300771j33787n067597n522739j137205
43733d911393K526626K527660J677664K014512J165278k116060m247492k452875
43725c816080M03896P88775K38235J438083K356227q721k949073j613932K452204
43716g10386L169399j91748j958920L59038K322972N47233j854135j167056Q18755
43707A335152O92360o82581n19424O72052N23003o78437q64970N312N22016P21889
43697A726372J119554M17985k266783m300317k554093J375524K993367J463683
$$ plain form
43689 -24708 115979 633728 835527 -1107177 -4098651 -4772368 -2284256 477382 1154608
43680 1154608 899492 1853847 3584406 3829614 1888838 -447582 -1252381 -469250 731890
43671 731890 1668533 2534843 3507692 4256701 4408726 3913734 2803533 1231494 38424
43662 38424 433520 2365279 3919079 3426469 1748927 1236353 2640703 4433877 5185423
43653 5185423 5087953 4774900 4189300 3415834 3301265 4178850 4984015 4788949 4435027 5368231
43643 5368231 7310608 8407099 7671504 6168047 5415947 5385067 4701419 2669069 509441
43634 509441 142444 1832298 3718940 4051842 3184810 2607269 2686291 2596945 2113634 1965073
43624 1965073 2336993 2443988 1875487 1089811 333262 -553016 -1009366 -111189 1402192
$$ packed form
43689b4708J40687N17749K01799j942704k991474o73717K488112K761638O77226
43680A154608k55116R54355J730559K45208j940776k336420q04799P83131J201140
43671G31890R36643Q66310R72849P49009J52025m94992j110201j572039j193070
43662C8424L95096J931759J553800m92610j677542n12574J404350J793174P51546
43653E185423r7470l13053n85600p73466j14569Q77585Q05165j95066l53922R33204
43643E368231J942377J096491p35595j503457p52100l0880o83648k032350k159628
43634E09441l66997J689854J886642L32902q67032n77541P9022q9346m83311j48561
43624A965073L71920J06995n68501p85676p56549q86278m56350Q98177J513381
$$ plain form
43615 1402192 1223228 -1434777 -4408963 -5326972 -4274037 -2572935 -607125 1446504
43607 1446504 2196605 585222 -1861264 -2417482 -566713 1633187 2347366 1583947 234687
43598 234687 -969071 -1552195 -1584478 -1749911 -2107460 -1386142 1028661 3060240 1957953
43589 1957953 -1715337 -4236468 -3290622 -425481 1772815 2962010 4106104 4776193
43581 4776193 3406566 -82585 -3522834 -4702412 -3473835 -1357338 291132 1164951
43573 1164951 1378632 823036 -323597 -917798 289768 2898705 4887489 4992798 4333847
43564 4333847 4863384 6696441 7858695 6495535 2713317 -1504706 -3719674 -2883907
43556 -2883907 -451914 809823 -231084 -1879285 -1974699 -496446 1246974 2955775
$$ packed form
43615A402192j78964k658005k974186r18009J052935J701102J965810K053629
43607A446504P50101j611383k446486n56218J850769K199900P14179p63419j349260
43598B34687j203758n83124l2283j65433l57549P21318K414803K031579j102287
43589A957953l673290k521131R45846K865141K198296J189195J144094O70089
43581D776193j369627l489151l440249j179578J228577K116497J648470Q73819
43573A164951K13681n55596j146633n94201J207566K608937J988784J05309o58951
43564D333847N29537J833057J162254j363160l782218m218023k214968Q35767
43556b883907K431993J261737j040907j648201r5414J478253J743420J708801
$$ plain form
43548 2955775 5116189 7045843 7267418 5918819 4821663 4658881 3930796 1635460 -631390
43539 -631390 -677687 1152810 2366949 1521302 -270922 -1198472 -1129053 -1473115 -2976306
43530 -2976306 -4412120 -3991042 -1785944 168402 531672 450865 1758830 4054175 4978481
43521 4978481 3379163 856777 -304470 282349 1326023 1969641 2673152 3938827 4944213
43512 4944213 4249719 2009649 648930 2272577 5602585 6933423 4607496 1071292
43504 1071292 -522730 -296808 -541323 -1727859 -1978225 -348456 1691678 2697069 3248754
43495 3248754 4365418 5251383 4129734 907612 -2179571 -2821909 -1052145 886510
43487 886510 1071573 -14524 -419746 457271 1128866 538045 -104197 690122 1936386
$$ packed form
43548B955775K160414J929654K21575j348599j097156j62782p28085k295336k266850
43539f31390m6297J830497J214139q45647j792224r27550O9419l44062j503191
43530b976306j435814M21078K205098J954346L63270q0807J307965K295345R24306
43521D978481j599318k522386j161247N86819J043674O43618P03511J265675J005386
43512D944213o94494k240070j360719J623647L330008J330838k325927l536204
43504A071292j594022K25922k44515j186536k50366J629769K040134J005391N51685
43495C248754J116664Q85965j121649l222122l087183o42338J769764J938655
43487H86510J85063j086097m05222Q77017O71595n90821o42242P94319J246264
$$ plain form
43478 1936386 1314698 -1324429 -3542124 -3608823 -2533980 -2229854 -2930862 -3173867 -1628573
43469 -1628573 1502022 4522238 5752706 5386258 5217049 5831632 5270698 2086229 -1416613
43460 -1416613 -1581554 1283884 2943556 1146264 -1395623 -1334025 577601 1296265 288907
43451 288907 -189462 932120 1820270 623041 -1538667 -1750884 828094 3419411 2763452
43442 2763452 -624170 -2845133 -1725934 354035 274437 -1093402 -784207 861637 554949
43433 554949 -2094072 -3215147 -630445 2526161 2563027 595258 118157 1458766 2109537
43424 2109537 1322841 895961 1699699 2454622 2241779 1799493 1769608 1509969 280680
43415 280680 -1636629 -3363819 -4091841 -3401335 -1787873 -531690 -151276 423050 2121800
$$ packed form
43478A936386o21688k639127k217695o6699J074843L04126p01008k43005J545294
43469a628573L130595L020216J230468l66448j69209O14583n60934l184469l502842
43460a416613j64941K865438J659672j797292k541887O1598J911626P18664j007358
43451B88907m78369J121582Q88150j197229k161708k12217K578978K591317o55959
43442B763452l387622k220963J119199K079969p9598j367839L09195J645844l06688
43433E54949k649021j121075K584702L156606L6866j967769m77101J340609O50771
43424B109537p86696m26880Q03738P54923k12843m42286k9885k59639j229289
43415B80680j917309j727190p28022O90506J613462J256183L80414N74326J698750
$$ plain form
43406 2121800 4027104 4706012 4356623 4040508 3697736 2863822 2521731 3849376 5592591
43397 5592591 5337638 3363051 2425944 3301356 3492055 1495773 -461677 129678 2040742
43388 2040742 2045841 -590635 -3530089 -4540437 -3436419 -1312778 599696 1592555 2134016
43379 2134016 3383118 5147083 5388706 3159844 796871 1116862 3373073 4611273
43371 4611273 4466237 5250720 6925736 5886585 755002 -3987834 -3475897 575371 2229201
43362 2229201 -375780 -3211747 -2942885 -1131202 -421695 -184664 1409994 3443461 3417309
43353 3417309 1152337 -1106732 -1842127 -1393595 -554541 -43227 -776667 -2630956 -3484465
43344 -3484465 -1673548 1076900 1609527 -51393 -822833 482257 1362267 -137371 -2169504
$$ packed form
43406B121800J905304O78908l49389l16115l42772q33914l42091J327645J743215
43397E592591k54953j974587r37107Q75412J90699j996282j957450N91355J911064
43388B040742N099k636476k939454j010348J104018K123641J912474R92859N41461
43379B134016J249102J763965K41623k228862k362973L19991K256211J238200
43371D611273j45036P84483J675016j039151n131583m742836N11937M051268J653830
43362B229201k604981k835967K68862J811683P09507K37031J594658K033467k6152
43353C417309k264972k259069p35395M48532Q39054N11314p33440j854289q53509
43344c484465J810917K750448N32627j660920p71440J305090Q80010j499638k032133
$$ plain form
43335 -2169504 -1917338 319664 1961624 1822621 977393 622795 769168 892813 732871
43326 732871 414247 308262 606517 945321 999138 1324377 2634089 4344813 5151767
43317 5151767 4978376 4720581 4110449 2064247 -450955 -550005 2407582 5336909 5786817
43308 5786817 5327290 6346583 7738023 6794739 3883673 1861943 1454899 494188 -2077056
43299 -2077056 -4328748 -4229174 -2239517 -200653 746433 505363 -287960 -419825 754449
43290 754449 1936342 1027222 -1872731 -4002493 -3278765 -999749 -211402 -1979606 -4239615
43281 -4239615 -4274527 -1731627 1100589 1928749 991504 507419 1811931 3955232 5293457
43272 5293457 5340867 4514205 3233228 2167224 2271839 3430667 4006634 3025875 1935084
$$ packed form
43335b169504K52166K237002J641960j39003q45228l54598J46373J23645j59942
43326G32871l18624j05985K98255L38804N3817L25239J309712J710724Q06954
43317E151767j73391k57795o10132k046202k515202r9050K957587K929327M49908
43308E786817m59527J019293J391440r43284k911066k021730m07044r60711k571244
43299b077056k251692R9574J989657K038864R47086k41070p93323j31865J174274
43290G54449J181893r09120k899953k129762P23728K279016P88347j768204k260009
43281d239615l4912K542900K832216Q28160r37245m84085J304512K143301J338225
43272E293457M7410q26662j280977j066004J04615J158828N75967r80759j090791
$$ plain form
43263 1935084 2684325 4735993 5685419 4588689 3041265 2850664 3972720 5046211 5042965
43254 5042965 4115658 3303137 3395341 3944691 3937145 3526522 3926128 5149303 5466055 4105091
43244 4105091 2796895 3121440 3952457 3517536 2584895 3191508 5131533 6194906 5385843
43235 5385843 3655014 1959030 836110 1274066 3464740 5188322 4200012 1916512
43227 1916512 1703325 3539636 3811187 1050470 -1606359 -1163643 1075794 2116432 1637822
43218 1637822 1462292 2294252 3186359 3280279 2343939 345901 -2081184 -3422719 -2743633
43209 -2743633 -891746 525632 745945 -19312 -1056857 -1228763 241553 2401752 3195811
43200 3195811 2127127 941999 877239 849922 -325368 -1443326 -503109 2118683 4106424
$$ packed form
43263A935084P49241K051668R49426j096730j547424j90601J122056J073491l246
43254E042965r27307q12521R2204N49350p546m10623L99606J223175L16752j360964
43244D105091j308196L24545Q31017m34921r32641O06613J940025J063373q09063
43235E385843j730829j695984j122920M37956K190674J723582r88310k283500
43227A916512k13187J836311K71551k760717k656829M42716K239437J040638m78610
43218A637822j75530Q31960Q92107R3920r36340j998038k427085j341535O79086
43209b743633J851887J417378K20313p65257j037545j71906J470316K160199P94059
43200C195811j068684j185128o4760k7317j175290j117958R40217K621792J987741
$$ plain form
43191 4106424 4516963 4712161 5690151 6247425 4903655 2638442 2109331 4050362 5926729
43182 5926729 5227826 3066643 2655279 4551076 5903553 5025837 3866109 4175603 4056600
43173 4056600 1405513 -1398323 -379245 3504758 5270667 3395101 1729641 2873363
43165 2873363 4279947 3273257 1823964 2889560 4966946 4269283 708293 -2085177
43157 -2085177 -2086589 -904081 -429805 -280187 705692 2326254 3264747 2538243 313081
43148 313081 -2116238 -3121569 -2008369 541201 3343946 5486239 6251152 5400512 3875905
43139 3875905 3009439 2576445 1057170 -1465278 -2342101 344077 4743169 7082189 5919015
43130 5919015 3273903 1941692 2739272 4226071 4463401 3087679 1657155 1598371 2376242
$$ packed form
43191D106424M10539J95198R77990N57274j343770k265213n29111J941031J876367
43182E926729o98903k161183m11364J895797J352477q77716j159728L09494j19003
43173D056600k651087k803836J019078L884003J765909j875566j665460J143722
43165B873363J406584j006690j449293J065596K077386o97663l560990k793470
43157b085177j412J182508M74276J49618R85879J620562R38493p26504k225162
43148C13081k429319j005331J113200K549570K802745K142293P64913q50640j524607
43139C875905q66466m32994j519275k522448q76823K686178M399092K339020j163174
43130E919015k645112j332211P97580J486799K37330j375722j430524n8784P77871
$$ plain form
43121 2376242 2767429 3159020 4578169 5895298 4750480 1562237 -374459 267854 932863
43112 932863 -402640 -1934982 -1349607 289200 716096 360750 1045615 2392651 2590484
43103 2590484 1645052 968217 560936 -597541 -1952961 -1852003 -242663 1520266 3126686
43094 3126686 5126155 6746357 6606746 5548636 6025376 8252814 9458793 7789472
43086 7789472 4873955 3366480 3456574 3140971 1266120 -816836 -836487 1454034 3580844
43077 3580844 3392895 2220166 3120620 5946016 6875658 4049273 797961 940351 3259141
43068 3259141 3736469 1636405 -9151 883115 3362254 5555050 6099207 4113006 559234
43059 559234 -1080820 1408208 5144373 5485649 2680178 1246058 2724859 3558189 1315815
$$ packed form
43121B376242L91187L91591J419149J317129j144818l188243j936696O42313O65009
43112I32863j335503j532342N85375J638807M26896l55346O84865J347036J97833
43103B590484r45432o76835m07281j158477j355420J00958J609340J762929J606420
43094C126686J999469J620202j39611j058110M76740K227438J205979j669321
43086G789472k915517j507475R0094l15603j874851k082956j9651K290521K126810
43077C580844j87949j172729R00454K825396R29642k826385l251312J42390K318790
43068C259141M77328k100064j645556Q92266K479139K192796N44157j986201l553772
43059E59234j640054K489028L736165L41276k805471j434120J478801Q33330k242374
$$ plain form
43050 1315815 -1356044 -1291409 321107 609816 -77837 717626 3059294 4440154 3763547
43041 3763547 2965459 4270979 7337078 9642362 9135370 6347714 3962962 3968430 5291661
43032 5291661 4940185 1510754 -3209130 -6174225 -5842694 -3077306 -162897 1090954
43024 1090954 979796 1413262 3215422 4725412 4133454 2188557 959778 761365 327169
43015 327169 -480284 -330499 1291084 3371150 4855572 5150440 3593046 475063 -1806339
43006 -1806339 -940546 2051192 3907119 3232976 1348831 -431711 -1699093 -1542609 654587
42997 654587 2999746 2755415 375661 -1197427 -1241600 -1660179 -2518331 -1448565 1496751
42988 1496751 2805456 1133565 -160093 1516119 3779813 3380326 1177841 -99752
$$ packed form
43050A315815k671859O4635J612516K88709o87653P95463K341668J380860o76607
43041C763547p98088J305520L066099K305284n06992k787656k384752N468J323231
43032E291661l51476l429431m719884k965095L31531K765388K914409J253851
43024A090954j11158M33466J802160J509990n91958j944897j228779j98413m34196
43015C27169q07453J49785J621583K080066J484422K94868j557394l117983k281402
43006a806339Q65793K991738J855927o74143j884145j780542j267382J56484K197196
42997F54587K345159k44331k379754j573088m4173m18579q58152J069766K945316
42988A496751J308705j671891j293658J676212K263694l99487k202485j277593
$$ plain form
42980 -99752 -229338 -410404 -247159 969877 2004621 1713153 1431265 2471711 3274734
42971 3274734 2111211 642631 1417444 3482447 3992771 2879018 2371356 2839200 2614028
42962 2614028 1412547 695731 902741 1172802 1508176 2617827 4013825 4642933 4764256
42953 4764256 4917223 4115882 1680662 -441076 -261638 654361 -234617 -1466450 539809
42944 539809 5155868 7771155 6664441 5040813 5244706 5500506 4197227 3209983 4347350
42935 4347350 5832275 5222473 3363953 2660578 3278808 3613534 3083782 2235259 1276457
42926 1276457 447319 683184 2141757 3212838 2675152 1690171 1988751 3253585 4074504
42917 4074504 4373585 4921619 5384221 4966218 4357449 4846193 5815735 5394988 3767627
$$ packed form
42980i9752j29586j81066J63245J217036J034744k91468k81888J040446Q03023
42971C274734j163523j468580P74813K065003N10324j113753n07662M67844k25172
42962B614028j201481p16816K07010K70061L35374J109651J395998O29108J21323
42953D764256J52967q01341k435220k121738J79438R15999q88978j231833K006259
42944E39809M616059K615287j106714j623628K03893K55800j303279r87244J137367
42935D347350J484925o09802j858520p03375O18230L34726n29752q48523r58802
42926A276457q29138K35865J458573J071081n37686r84981K98580J264834Q20919
42917D074504K99081N48034M62602m18003o08769M88744R69542m20747j627361
$$ plain form
42908 3767627 3633652 6583304 10751844 13255088 13779888 14406235 16471182 19008636 20336503
42899 20336503 20020686 18746771 17067767 15102840 13016608 10851305 8179713 5118948
42891 5118948 3511423 5300168 9237160 11300357 9728608 7572770 8048261 9292024
42883 9292024 7171485 2321190 70046 2724741 6106237 5752441 3010188 1982789
42875 1982789 3141062 3728819 2970207 2784866 3581936 3223698 1039015 -395712 899900
42866 899900 3163251 3560096 2206396 1352217 1777730 2366217 2660556 3344400 4040882
42857 4040882 3065534 313627 -1620877 -715538 1540142 2234244 1042095 163075 852724
42848 852724 2198192 3220445 3927788 3978976 2626177 712259 370050 1604861 1624917
$$ packed form
42908C767627j33975K949652M168540K503244N24800O26347K064947K537454J327867
42899B0336503l15817j273915j679004j964927k086232k165303k671592l060765
42891E118948j607525J788745L936992K063197j571749k155838M75491J243763
42883I292024k120539m850295k251144K654695L381496l53796k742253j027399
42875A982789J158273N87757p58612j85341P97070l58238k184683j434727J295612
42866H99900K263351L96845j353700q54179M25513N88487K94339O83844O96482
42857D040882r75348k751907j934504R05339K255680O94102j192149q79020O89649
42848H52724J345468J022253P07343N1188j352799j913918l42209J234811K0056
$$ plain form
42839 1624917 -739294 -2445127 -557534 3013799 4331494 3370023 3237439 4274177
42831 4274177 3446260 176423 -1661643 496737 3738395 3923618 1483026 22336
42823 22336 916418 2347412 2858980 3062050 3849902 4978278 5635019 5180995 3545143
42814 3545143 1895324 2193020 4752233 7060016 6728849 5005285 5379381 8940942 13105237
42805 13105237 15032929 14362738 12202348 9419379 6835360 5449691 5209264 4661798
42797 4661798 3002683 1539962 1860058 3282805 3698031 2716919 2370297 4228035 7193065
42788 7193065 9197512 10207499 11978915 14848920 16479388 14869220 11481096 9593793
42780 9593793 9821061 9346254 6318151 3018764 2853532 5371453 6660355 4584217 1314929
$$ packed form
42839A624917k364211j705833J887593L571333J317695r61471j32584J036738
42831D274177q27917l269837j838066K158380L241658J85223k440592j460690
42823B2336Q94082J430994N11568K03070P87852J128376O56741m54024j635852
42814C545143j649819K97696K559213K307783l31167j723564L74096L561561M164295
42805A3105237J927692o70191k160390k782969k584019j385669k40427n47466
42797D661798j659115j462721L20096J422747M15226r81112l46622J857738K965030
42788G193065K004447J009987J771416K870005J630468j610168l388124j887303
42780I593793K27268m74807l028103l299387j65232K517921J288902k076138l269288
$$ plain form
42771 1314929 -32258 784115 2031203 2991011 3934080 4051467 2037429 -1019017 -1748579
42762 -1748579 1264966 5099524 5997779 4105031 2792597 3866350 5605365 5716343
42754 5716343 4258090 2910925 2881088 4373878 6793883 8507731 7673488 4473787 1484277
42745 1484277 691540 1253461 1473352 1634339 2964578 4849729 5496132 4961186 5064921
42736 5064921 6210271 6665025 5449437 3719347 2627468 1969888 1800160 3123984 5620313
42727 5620313 6666204 4421188 511108 -1965484 -1931080 -461118 1157286 1875778 850079
42718 850079 -1025814 -795121 3006905 7389508 8087541 5169121 2657806 2659074 3025244
42709 3025244 1705539 357513 1615059 4795101 6744417 6058430 4325709 3418572
$$ packed form
42771A314929j347187Q16373J247088R59808R43069J17387k014038l056446p29562
42762a748579L013545L834558Q98255j892748j312434J073753J739015J10978
42754E716343j458253j347165k9837J492790K420005J713848q34243l199701k989510
42745A484277p92737N61921K19891J60987J330239J885151O46403n34946J03735
42736E064921J145350M54754j215588j730090j091879o57580j69728J323824K496329
42727E620313J045891k245016l910080k476592L4404J469962J618404P18492j025699
42718H50079j875893K30693L802026M382603O98033k918420k511315J268L66170
42709C025244j319705j348026J257546L180042J949316o85987j732721r07137
$$ plain form
42701 3418572 3364669 3264835 3061626 3640988 5524582 7848439 8753689 7058601 3662562
42692 3662562 840488 -157404 -235790 -662607 -884509 643015 3636107 5588586 4939174
42683 4939174 3350181 3422732 4898104 5051419 2873927 678315 559720 1267679 480322
42674 480322 -1277412 -1511282 181359 1759426 2384826 3356465 4714173 4121071 842142
42665 842142 -1964497 -1331435 1368089 3057448 3781159 5570110 7823230 7673234 4727241
42656 4727241 1851760 862391 707077 531533 1156621 2298865 1607425 -1565273 -4129319
42647 -4129319 -3293342 -510968 981083 757613 722597 1420674 1741950 1690298 2615773
42638 2615773 4513929 5405854 4059329 1740953 584303 1231997 2583962 3226812 2797873
$$ packed form
42701C418572n3903r9834k03209N79362J883594K323857R05250j695088l396039
42692C662562k822074r97892p8386m26817k21902J527524K993092J952479o49412
42683D939174j588993P2551J475372J53315k177492k195612j18595P07959p87357
42674D80322j757734k33870J692641J578067O25400R71639J357708n93102l278929
42665H42142k806639O33062K699524J689359P23711J788951K253120j49996k945993
42656D727241k875481r89369j55314j75544O25088J142244o91440l172698k564046
42647d129319Q35977K782374J492051k23470l5016O98077L21276n1652R25475
42638B615773J898156Q91925j346525k318376j156650O47694J351965O42850m28939
$$ plain form
42629 2797873 2189988 2353274 2974629 3078240 2915775 3814818 5654506 6330057 4910422
42620 4910422 3474059 4068848 5625260 6143664 6247051 7566701 8850016 7358047 3799799
42611 3799799 2041299 3409387 4981748 4626899 4073320 5068788 5837797 4137797 1388493
42602 1388493 671766 2167995 3510374 3672911 3697951 4024219 3633147 1918241 -427517
42593 -427517 -2325196 -2729985 -760746 2894596 5373466 4461755 1635967 275883 1212574
42584 1212574 2318818 2352967 2529728 3687814 4422987 3333005 1291740 93209 122096
42575 122096 614093 1213144 2095416 3202401 4207892 4752064 4331339 2774306 1133436
42566 1133436 990555 2386556 3608945 3598441 3249845 3554487 3895920 3390499 2677513
$$ packed form
42629B797873o07885J63286O21355J03611j62465Q99043J839688O75551j419635
42620D910422j436363N94789J556412N18404J03387J319650J283315j491969l558248
42611C799799j758500J368088J572361l54849n53579R95468P69009j700000k749304
42602A388493p16727J496229J342379J62537K5040L26268l91072j714906k345758
42593d27517j897679m04789J969239L655342K478870r11711k825788j360084R36691
42584A212574J106244L4149J76761J158086P35173j089982k041265j198531K8887
42575A22096M91997N99051Q82272J106985J005491N44172m20725j557033j640870
42566A133436j42881J396001J222389j0504l48596L04642L41433n05421p12986
$$ plain form
42557 2677513 2885493 3722129 4163910 4382856 5271964 6323507 5730552 2933472 -212220
42548 -212220 -1345086 43134 2400855 3600973 2446973 -585848 -3616203 -4620443
42540 -4620443 -2882710 491260 3328544 3969575 2747739 1838950 2812734 4320476 3460560
42531 3460560 -135830 -3100205 -2366878 810124 2552132 1402458 -179042 631809
42523 631809 3624284 6258608 6719459 5586948 4855937 5672738 7139286 7610749 6943547
42514 6943547 6383201 6068086 4420888 1107079 -1297343 -664026 1141719 835472 -1055113
42505 -1055113 -848610 2439095 5451552 5627217 4586569 4615798 4799942 3268464 1024617
42496 1024617 443275 1269258 1189021 -185496 -769852 557298 2469100 3517026 3876848
$$ packed form
42557B677513K07980Q36636M41781K18946Q89108J051543n92955k797080l145692
42548b12220j132866J388220K357721J200118j154000l032821l030355j004240
42540d620443J737733L373970K837284O41031j221836r08789R73784J507742q59916
42531C460560l596390k964375P33327L177002J742008j149674j581500Q10851
42523F31809K992475K634324M60851j132511p31011Q16801J466548M71463o67202
42514F943547n60346l15115j647198l313809k404422O33317J805745l06247j890585
42505a055113K06503L287705L012457J75665j040648K9229J84144j531478k243847
42496A024617n81342Q25983q0237j374517n84356J327150J911802J047926L59822
$$ plain form
42487 3876848 4231864 4572458 4648351 4372761 3590588 2627576 2785153 4609821 6000803
42478 6000803 4374931 863873 -371150 2123302 4806084 4151804 1337869 -321850
42470 -321850 -318633 -305866 -144762 1751128 4562099 5112477 2344416 -1115232 -2622175
42461 -2622175 -2180903 -625555 2108662 5403150 7053648 5957303 4013955 3485736
42453 3485736 3935019 3614125 2450316 1599771 1245049 948183 1126925 2023042 2268186
42444 2268186 851653 -496235 430101 2552151 3099348 2322999 3015354 5384642 6401170
42435 6401170 5043121 4199567 5753657 7495637 7134642 5986946 5943711 5776431 3689860
42426 3689860 1150038 737016 2016575 2876117 3295603 4313669 4765512 2903731 224287
$$ packed form
42487C876848L55016L40594P5893k75590p82173r63012J57577J824668J390982
42478F000803j625872l511058j235023K494452K682782o54280k813935j659719
42470c21850L217J2767J61104J895890K810971N50378k768061l459648j506943
42461b622175M41272J555348K734217L294488J650498j096345j943348n28219
42453C485736M49283l20894j163809q50545l54722k96866J78742Q96117K45144
42444B268186j416533j347888R26336K122050N47197p76349O92355K369288J016528
42435F401170j358049q43554J554090J741980l60995j147696m3235j67280k086571
42426C689860k539822m13022J279559Q59542M19486J018066M51843j861781k679444
$$ plain form
42417 224287 -277079 1014630 1198695 91513 211142 1541606 1047438 -1712429 -3104143
42408 -3104143 -1173447 1341500 1788942 1418253 1955386 2157517 871831 225432 2200796
42399 2200796 4683820 4670516 3270349 3601740 5341704 5479444 3566152 2227472 2799258
42390 2799258 4091985 5336726 6818226 7587946 6243650 4362700 5305515 8604089
42382 8604089 9445406 5652989 1640427 2521935 6872069 8791127 5807969 1264600
42374 1264600 -954116 -932543 -1007455 -1695239 -1057371 2415580 7498126 11123571 11240048
42365 11240048 8471615 5044893 2654326 1750836 2195278 3480319 4494289 4347795
42357 4347795 3693910 4111678 5827999 7193477 6922159 5667548 4651866 3918550 2983564
$$ packed form
42417B24287n01366J291709J84065j107182J19629J330464m94168k759867j391714
42408c104143J930696K514947M47442l70689N37133K02131j285686o46399J975364
42399B200796K483024j3304j400167L31391J739964J37740j913292j338680N71786
42390B799258J292727J244741J481500P69720j344296j880950R42815L298574
42382H604089Q41317l792417m012562Q81508M350134J919058k983158m543369
42374A264600k218716K1573p4912o87784O37868L472951N082546L625445J16477
42365A1240048k768433l426722k390567r03490M44442J285041J013970j46494
42357D347795o53885M17768J716321J365478k71318j254611j015682p33316r34986
$$ plain form
42348 2983564 2201506 2193559 2634526 2921752 3442496 4716104 5751742 5023089 3028231
42339 3028231 2024259 2812018 3615348 3012947 2211304 2907465 4254384 3974553 1877210
42330 1877210 171533 272151 1264243 2000322 2840763 4308947 5560094 5588178 4932129
42321 4932129 4726145 4726811 3733957 1600204 -491315 -1504949 -1181931 343488 2203505
42312 2203505 2586883 667838 -1433218 -644449 2879279 5669159 5558390 4099481 3344504
42303 3344504 2681786 870019 -781153 -48086 2375157 3558547 2711808 2172900 3460320
42294 3460320 4787848 3913298 1773714 1375450 3633480 6061375 5985352 3934555 2874962
42285 2874962 4380294 6707480 7216068 5743006 4322427 4068011 4120816 3831415 3926415
$$ packed form
42348B983564p82058p947M40967K87226N20744J273608J035638p28653j994858
42339C028231j003972P87759Q03330o02401q01643O96161J346919k79831k097343
42330A877210j705677J00618R92092P36079Q40441J468184J251147K8084o56049
42321D932129k05984O66r92854k133753k091519j013634L23018J525419J860017
42312B203505L83378j919045k101056P88769L523728K789880j10769j458909p54977
42303C344504o62718j811767j651172P33067K423243J183390q46739n38908J287420
42294C460320J327528q74550k139584l98264K258030K427895p6023k050797j059593
42285B874962J505332K327186N08588j473062j420579k54416N2805k89401R5000
$$ plain form
42276 3926415 4594881 4392598 2633279 1230162 2131578 4176466 4801898 3902748 3283270
42267 3283270 2795138 241540 -4359500 -7475933 -6509389 -3293030 -1371149 -1384053 -1023760
42258 -1023760 1426704 5295017 8767606 10425558 9684465 6968653 3744165 1726173
42250 1726173 1657795 2778518 3411212 2410814 522061 -133126 1265673 2680077 1764558
42241 1764558 -474371 -673777 2042025 4609104 4377883 2628327 2123551 3143744 4132529
42232 4132529 4813996 6082419 7528540 7683625 6668056 6276717 7079926 7468507 6256602
42223 6256602 4569072 4240860 5510648 7132053 7951469 7743447 7117083 7002403 7675761
42214 7675761 8195996 7562881 6391986 6289290 7355051 7684548 6053499 3875621 3357602
$$ packed form
42276C926415O68466k02283j759319j403117R01416K044888O25432q99150o19478
42267C283270m88132k553598m601040l116433R66544L216359J921881j2904L60293
42258a023760K450464L868313L472589J657952p41093k715812l224488k017992
42250A726173o8378J120723O32694j000398j888753o55187J398799J414404r15519
42241A764558k238929j99406K715802K567079k31221j749556n04776J020193R88785
42232D132529O81467J268423J446121J55085j015569l91339Q03209L88581j211905
42223F256602j687530l28212J269788J621405Q19416k08022o26364j14680O73358
42214G675761N20235o33115j170895j02696J065761L29497j631049k177878n18019
$$ plain form
42205 3357602 4482086 5124689 3962160 2110728 1559252 2664098 3805513 3517119 2438214
42196 2438214 2478928 4059088 5301793 4766700 3816861 4583636 6351849 6421926 4566381
42187 4566381 3686737 5009289 5695983 3440762 695502 957888 2830118 2159268 -594336
42178 -594336 -128876 5485101 11055893 11343259 8101216 6463627 7117347 6605850 4095278
42169 4095278 2921071 4878108 7138615 6523194 3813833 1851879 1609466 2224254 3188573
42160 3188573 4242981 4242918 2462718 559874 1117873 4150021 6780624 6797778 5179649
42151 5179649 4498466 5770777 7623709 8137634 6863738 4934731 3445822 2208143
42143 2208143 612175 -602196 290494 3352123 5992752 5903932 4128917 3583034 4970598
$$ packed form
42205C357602J124484O42603j162529j851432n51476J104846J141415k88394j078905
42196B438214M0714J580160J242705n35093r49839P66775J768213P0077j855545
42187D566381q79644J322552O86694k255221k745260K62386J872230o70850k753604
42178e94336M65460N613977N570792K87366l242043j637589O53720n11497k510572
42169D095278j174207J957037K260507o15421k709361j961954k42413O14788R64319
42160C188573J054408o3j780200j902844N57999L032148K630603J7154j618129
42151E179649o81183J272311J852932N13925j273896j929007j488909j237679
42143B208143j595968j214371Q92690L061629K640629q8820j775015n45883J387564
$$ plain form
42134 4970598 6171299 5887230 5703625 7306274 9369592 9215826 6835315 5118574 5930336
42125 5930336 7824916 8428977 7557842 6710867 6602248 6875545 7679104 9508908 11321357
42116 11321357 10828818 7624015 4417561 3858691 5368749 6625810 7069709 7993585 9869763
42107 9869763 11830224 13640488 15887883 17919565 17947025 16061542 14961017 16274597
42099 16274597 17944140 17029108 13880726 11646445 12314145 15001549 17868748 20102485
42091 20102485 21826565 23259683 24508522 25762249 27334797 29303944 30873712 30534712
42083 30534712 27725434 24013911 21375594 19590708 17140597 14547751 14226460 16311663
42075 16311663 17519208 15841725 13764622 14445783 16922161 18030468 17384514 17079725
$$ packed form
42134D970598J200701k84069j83605J602649K063318j53766k380511j716741Q11762
42125E930336J894580O04061q71135q46975j08619K73297Q03559J829804J812449
42116A1321357m92539l204803l206454n58870J510058J257061M43899R23876J876178
42107I869763J960461J810264K247395K031682K7460j885483j100525J313580
42099A6274597J669543r15032l148382k234281O67700K687404K867199K233737
42091B0102485J724080J433118J248839J253727J572548J969147J569768l39000
42083C0534712k809278l711523k638317j784886k450111k592846l21291K085203
42075A6311663J207545j677483k077103O81161K476378J108307o45954l04789
$$ plain form
42067 17079725 17423333 16500559 13918404 11802547 11518115 11885304 11287709 9609206 7633896
42058 7633896 6130928 5666567 5904345 5431122 3791291 2832348 4024823 5591800 5047208
42049 5047208 3534695 4128405 6424100 7026447 5664223 6241862 10378050 14151631 13601266
42040 13601266 9932486 6628576 4506433 2683397 1866247 3191244 5359321 6085167
42032 6085167 5404424 4896515 4594572 3283777 1175131 -212805 -489478 -588330 -805947
42023 -805947 -507696 452175 1654025 3189213 5338704 7448643 8424474 8065616 6920132
42014 6920132 5425665 4194280 4229482 5527896 6292008 5039048 2912931 2448121 4401008
42005 4401008 7024036 8167031 7160841 5064693 3797931 4407089 5633273 5147845
$$ packed form
42067A7079725L43608r22774k582155k115857k84432L67189n97595j678503j975310
42058G633896j502968m64361K37778m73223j639831r58943J192475J566977n44592
42049E047208j512513N93710K295695O02347j362224N77639M136188L773581n50365
42040A3601266l668780l303910k122143j823036q17150J324997K168077P25846
42032F085167o80743n07909l01943j310795k108646j387936k76673r8852k17617
42023h05947K98251R59871J201850J535188K149491K109939R75831l58858j145484
42014F920132j494467j231385L5202J298414P64112j252960k126117m64810J952887
42005D401008K623028J142995j006190k096148j266762O09158J226184m85428
$$ plain form
41997 5147845 2707128 663426 586700 1113954 391160 -1033732 -1331935 3673 2212726
41988 2212726 4565245 6153483 5913936 4426477 4077630 5787696 7409603 7259691 7120104
41979 7120104 9221420 12167737 12865232 11105432 9249492 8505162 8396762 8796413 9592904
41970 9592904 9542603 8385126 8622108 11859899 15047334 14407932 11655791 11515725 14005045
41961 14005045 14600966 11955673 9648491 9415353 8503301 5631291 3970914 5404384
41953 5404384 6889048 5952631 5217912 7403529 9809320 8521330 5139369 4308280 6428773
41944 6428773 7685971 6381154 4771248 4802748 5817119 6693999 7176312 6867414 5541756
41935 5541756 4508487 5284320 7022945 7585113 6917265 6886075 7908254 8434698 8031470
$$ packed form
41997E147845k440717k043702p6726N27254p22794j424892k98203J335608K209053
41988B212726K352519J588238k39547j487459l48847J710066J621907j49912j39587
41979G120104K101316K946317O97495j759800j855940p44330j08400L99651P96491
41970I592904n0301j157477K36982L237791L187435o39402k752141j40066K489320
41961A4005045N95921k645293k307182k33138r12052k872010j660377J433470
41953E404384J484664r36417p34719K185617K405791j287990l381961q31089K120493
41944F428773J257198j304817j609906L1500J014371Q76880M82313l08898j325658
41935E541756j033269P75833J738625N62168o67848l1190J022179N26444m03228
$$ plain form
41926 8031470 8295603 9892732 10913007 9338816 5711780 2508638 1930221 4620251
41918 4620251 9240662 12899227 13304149 11093369 9111182 9101843 10119894 10402412 9588298
41909 9588298 8483539 7496207 6079431 3596879 536106 -1281615 -290310 2787954
41901 2787954 5406622 6216174 6411294 7159865 7290939 5367458 2777309 2266759 3976165
41892 3976165 5548456 6049756 6996315 9019131 10286656 9423913 7691974 6816886 6628695
41883 6628695 6460489 7013402 8712712 9580476 7261053 2751253 -67212 1229675 5300433
41874 5300433 9142944 10999269 10914174 9859931 8985827 8800662 8508087 6864960 4162618
41865 4162618 2587766 3909554 7274888 10012257 10428457 9226909 8231059 8258203 8462257
$$ packed form
41926H031470K64133J597129J020275j574191l627036l203142n78417K690030
41918D620251M620411L658565M04922k210780j982187r339J018051K82518q14114
41909I588298j104759r87332j416776k482552l060773j817721R91305L078264
41901B787954K618668Q09552J95120P48571J31074j923481k590149n10550J709406
41892C976165J572291N01300R46559K022816J267525q62743j731939q75088j88191
41883F628695j68206N52913J699310Q67764k319423m509800k818465J296887M070758
41874E300433L842511J856325q5095j054243q74104j85165k92575j643127k702342
41865D162618j574852J321788L365334K737369M16200j201548r95850K7144K04054
$$ plain form
41856 8462257 7557741 5492308 3771461 3928121 5704094 7181083 6932773 5551459 4564333
41847 4564333 4368164 4186820 3882418 4509210 6553260 8698114 9323985 8636855 8270312
41838 8270312 9074227 10318306 10980344 10807161 10026112 9012936 8526547 9335365 11103804
41829 11103804 12362892 12147371 11142507 10704913 11212134 11922115 12115329 11798200 11394421
41820 11394421 11178399 11096235 11064475 11435410 12910040 15631291 18616020 20686390 21774912
41811 21774912 22540250 22911809 22207489 20816421 20322709 21266443 22070025 21261023 19698509
41802 19698509 19175008 19519827 18833647 16545114 14513064 14402028 15180803 14389179 11481192
41793 11481192 8775653 8721417 10865925 12324286 11260640 9060923 8419664 9855584
$$ packed form
41856H462257r04516k065433j720847J56660J775973J476989k48310j381314r87126
41847D564333j96169j81344l04402O26792K044050K144854O25871o87130l66543
41838H270312Q03915J244079O62038j73183p81049j013176m86389Q08818J768439
41829A1103804J259088k15521j004864m37594N07221P09981J93214l17129m03779
41820A1394421k16022q2164l1760L70935J474630K721251K984729K070370J088522
41811B1774912P65338L71559p04320j391068m93712R43734Q03582q09002j562514
41802A9698509n23501L44819o86180k288533k032050j11036P78775p91624k907987
41793A1481192k705539n4236K144508J458361j063646k199717o41259J435920
$$ plain form
41785 9855584 11242685 10781363 9247764 8771949 10276274 12881122 15290690 16956079
41777 16956079 18057220 18964791 19816189 20447963 20746777 20894036 20970014 20657111 19961700
41768 19961700 19806233 20848060 22038666 21858997 20939663 21532139 23894428 25360356 24199490
41759 24199490 22345844 22410325 23666437 23452646 21503678 20124128 20364676 20797811 20497641
41750 20497641 20651539 22085089 23266894 22470167 20684897 20580271 22964773 25764215
41742 25764215 26662339 25635967 24287554 23372645 22130192 20297876 19574592 21645758
41734 21645758 25136681 26523623 24765110 23139238 24965543 28999537 31192292 30108719
41726 30108719 28126493 27490484 27797225 28004510 28624570 30589900 33418906 35856084 37488900
$$ packed form
41785I855584J387101m61322j533599m75815J504325K604848K409568J665389
41777A6956079J101141R07571Q51398O31774K98814J47259P5978l12903o95411
41768A9961700j55467J041827J190606j79669r19334N92476K362289J465928j160866
41759B4199490j853646O4481J256112k13791j948968j379550K40548M33135l00170
41750B0497641J53898J433550J181805p96727j785270j04626K384502K799442
41742B5764215Q98124j026372j348413r14909j242453j832316p23284K071166
41734B1645758L490923J386942j758513j625872J826305M033994K192755j083573
41726C0108719j982226o36009L06741K07285O20060J965330K829006K437178J632816
$$ plain form
41717 37488900 38745571 39957818 41187389 42443646 43613495 44775889 46755844 50419157
41709 50419157 55211582 59621358 63460010 68208706 74406239 80352321 84698508 88920440
41701 88920440 95513078 104713826 114886536 125518590 137779909 152262885 168270111
41694 168270111 185778346 206236579 230422426 256651582 281812527 302985425 317316506
41687 317316506 321908048 315688841 300893308 281080653 257840347 230982275 201959938
41680 201959938 175034400 153789999 137667997 123408482 109313428 96568213 86567295
41673 86567295 78685588 71341848 64014763 57206522 51138797 45557078 40567805 36761796
41665 36761796 34465196 33438592 33258227 33398687 32954188 31034351 27868274 25095268
$$ packed form
41717C7488900J256671J212247J229571J256257J169849J162394J979955L663313
41709E0419157M792425M409776L838652M748696O197533N946082M346187M221932
41701H8920440O592638R200748J0172710J0632054J2261319J4482976J6007226
41694A68270111J7508235K0458233K4185847K6229156K5160945K1172898J4331081
41687C17316506M591542o219207j4795533j9812655k3240306k6858072k9022337
41680B01959938k6925538k1244401j6122002j4259515j4095054j2745215j0000918
41673H6567295p881707p343740p327085o808241o067725n581719m989273l806009
41665C6761796k296600j026604j80365J40460m44499j919837l166077k773006
$$ plain form
41657 25095268 24330939 25351339 26120262 24952446 22401279 20458095 19984052 19843243 18910351
41648 18910351 17794517 17573185 17846789 17672072 17731769 19403353 21791165 22214204 20260946
41639 20260946 18785118 19620490 20855356 20279898 19100301 19496752 20494814 19741586 18139996
41630 18139996 18752048 21422641 22662342 21493572 21231298 23783032 26058533 24801279
41622 24801279 21913329 21494841 23646169 25022871 24502800 24404211 26048906 27686176 27693041
41613 27693041 26842104 26090502 24763977 22762008 22318843 25057446 28670976 29333877 26962252
41604 26962252 25352441 26814839 29300191 29949011 29203574 29486071 31321247 33073520
41596 33073520 33817066 34158584 34374363 34045624 33918054 35852959 39918423 43438429 44363858
$$ packed form
41657B5095268p64329J020400P68923j167816k551167j943184m74043j40809r32892
41648A8910351j115834k21332K73604j74717N9697J671584K387812M23039j953258
41639B0260946j475828Q35372J234866n75458j179597L96451R98062p53228j601590
41630A8139996O12052K670593J239701j168770k62274K551734K275501j257254
41622B4801279k887950m18488K151328J376702n20071r8589J644695J637270O865
41613B7693041q50937p51602j326525k001969m43165K738603L613530O62901k371625
41604B6962252j609811J462398K485352O48820p45437K82497J835176J752273
41596C3073520P43546L41518K15779l28739j27570J934905M065464L520006R25429
$$ plain form
41587 44363858 44189964 46020875 50777457 56753507 62030737 65911624 68788358 72105087
41579 72105087 77811182 86410919 96113324 105156202 114081381 124192463 134794396 143979828
41571 143979828 151409052 158118455 164126200 168572865 171810849 174739994 176230358 174056576
41563 174056576 168614614 162760640 157417151 150474405 141101773 131948888 125358550 120340626
41555 120340626 115511771 112394887 113025822 116225492 119121158 121033731 123251630 126228070
41547 126228070 129787552 135121556 143576616 153799781 162702627 169004454 173341716 175245727
41539 175245727 172993886 166791386 159274268 151970957 143658289 133306341 122479404 113365896
41531 113365896 106088263 99494190 93391497 88493996 84961290 82343604 80508511 79580641
$$ packed form
41587D4363858j73894J830911M756582N976050N277230L880887K876734L316729
41579G2105087N706095Q599737R702405R042878Q925179J0111082J0601933R185432
41571A43979828P429224O709403O007745M446665L237984K929145J490364k173782
41563A74056576n441962n853974n343489o942746r372632r152885o590338n017924
41555A20340626m828855l116884O30935L199670K895666J912573K217899K976440
41547A26228070L559482N334004Q455060J0223165Q902846O301827M337262J904011
41539A75245727k251841o202500p517118p303311q312668j0351948j0826937r113508
41531A13365896p277633o594073o102693m897501l532706k617686j835093r27870
$$ plain form
41523 79580641 79316593 79299508 79284480 78629718 75980083 70532203 63405842 56909574 52492903
41514 52492903 50004527 48640714 47618606 45880966 42379311 37521645 33679238 33050168
41506 33050168 34932480 36112861 34408022 31014486 28705950 28508759 29227126 29663411
41498 29663411 29783217 29698782 29088159 28162931 27922860 28719654 29592769 29688104 29289626 28797614
41488 28797614 27974634 27182094 27983239 30982946 34094983 34778392 33407223 32526527 33018741
41479 33018741 33057134 31222012 28811215 28118988 29638537 31988594 33838052 34872189
41471 34872189 35204368 34846567 34026813 33462227 33723309 34318446 34005367 32453868 31065029
41462 31065029 31284833 32492499 32825594 31981867 31566488 32360984 33152845 33119687 33368645
$$ packed form
41523G9580641k64048j7085j5028o54762k649635n447880p126361o496268m416671
41514E2492903k488376j363813j022108j737640l501655m857666l842407o29070
41506C3050168J882312J180381j704839l393536k308536j97191P18367M36285
41498B9663411J19806q4435o10623r25228k40071P96794Q73115R5335l98478m92012
41488B8797614q22980p92540Q01145K999707L112037O83409j371169q80696M92214
41479C3018741L8393j835122k410797o92227J519549K350057J849458J034137
41471C4872189L32179l57801q19754n64586K61082N95137l13079j551499j388839
41462C1065029K19804J207666L33095q43727m15379P94496P91861l3158K48958
$$ plain form
41453 33368645 34647648 35444024 34478504 33543146 35177423 38414719 39777443 38343038
41445 38343038 36950022 37903168 40098940 41392378 41610313 41883817 42622600 43488608 44181005
41436 44181005 44105839 42356884 39197042 36671380 36532152 38093389 39145108 38537986 36903329
41427 36903329 35165790 33456956 31681911 30321848 30006173 30417445 30260222 28770239
41419 28770239 26909877 26314574 27190271 28309827 29170001 30651744 32903292 34263496
41411 34263496 33667048 32711096 33514661 35541586 36551720 36012741 35481377 35989709 37074828
41402 37074828 38178128 39112057 39386659 38922991 39011306 40544834 41914791 41112946 39339526
41393 39339526 39524789 41574145 42649548 42486430 44479914 50237333 56841340 61481241
$$ packed form
41453C3368645J279003P96376r65520r35358J634277L237296J362724j434405
41445C8343038j393016R53146K195772J293438K17935K73504P38783Q66008O92397
41436D4181005p5166j748955l159842k525662j39228J561237J051719o07122j634657
41427C6903329j737539j708834j775045j360063l15675M11272j57223j489983
41419B8770239j860362n95303Q75697J119556Q60174J481743K251548J360204
41411C4263496n96448r55952Q03565K026925J010134n38979n31364N08332J085119
41402C7074828J103300R33929K74602m63668Q8315J533528J369957q01845j773420
41393C9339526J85263K049356J075403j63118J993484N757419O604007M639901
$$ plain form
41385 61481241 65325645 70305162 75258476 78478373 81576847 87202394 94511013 100419938
41377 100419938 104398325 108690037 114230505 119399697 122802866 124609506 124926917 123222366
41369 123222366 119811111 115978936 112150357 107531934 101981597 96808538 93213475 91019366
41361 91019366 89465484 88615117 89585487 93427487 99539743 105338467 108445491 109280777
41353 109280777 110143114 111567816 111624772 109527742 107427840 107001718 106637395 104286427 101021401
41344 101021401 98978834 97478383 94367708 90017947 86606540 84147025 80666191 76045898
41336 76045898 72268598 69694361 66351478 61369313 56070448 51142552 45816751 40587265
41328 40587265 37576079 37011827 36287904 33932231 31712461 31140366 30629283 28327876 25547662
$$ packed form
41385F1481241L844404M979517M953314L219897L098474N625547P308619N908925
41377A00419938L978387M291712N540468N169192L403169J806640L17411j704551
41369A23222366l411255l832175l828579m618423n550337n173059l595063k194109
41361I1019366j553882q50367R70370L842000O112256N798724L107024Q35286
41353A09280777Q62337J424702N6956k097030k099902m26122l64323k350968l265026
41344A01021401k042567j500451l110675m349761l411407k459515l480834m620293
41336G6045898l777300k574237l342883m982165n298865m927896n325801n229486
41328D0587265l011186n64252p23923k355673k219770n72095n11083k301407k780214
$$ plain form
41319 25547662 24880944 26385971 27858591 27797176 26259473 23893529 21895792 21852340 23781111
41310 23781111 25181680 23747244 20299130 17511518 16576608 16748193 17327044 18223871 19064583
41301 19064583 19500135 20034441 20921445 20762806 18200705 14838441 14241047 17437685 21242147
41292 21242147 22017725 19777027 17453052 17104530 18173220 19083194 19221430 19005431 18801164
41283 18801164 18416290 17514754 16143900 14803032 14109750 14253976 14578626 14034713 12627253
41274 12627253 12095476 14056791 17418351 19164206 18447297 18222692 21241234 25822562
41266 25822562 27939708 26773436 25461876 26262140 27768208 27815718 26637320 25599750
41258 25599750 24732743 23354259 21922203 21573984 22605805 24676196 27630068 30867814
$$ packed form
41319B5547662o66718J505027J472620o1415j537703k365944j997737m3452J928771
41310B3781111J400569j434436l448114k787612r34910J71585N78851Q96827Q40712
41301A9064583M35552N34306Q87004j58639k562101l362264n97394L196638L804462
41292B1242147P75578k240698k323975l48522J068690R09974J38236k15999k04267
41283A8801164l84874r01536j370854j340868o93282J44226L24650n43913j407460
41274A2627253n31777J961315L361560J745855p16909k24605L018542M581328
41266B5822562K117146j166272j311560Q00264J506068M7510j178398j037570
41258B5599750q67007j378484j432056l48219J031821K070391K953872L237746
$$ plain form
41250 30867814 32839423 32611679 31230372 30145932 28994312 26523981 23265540 21500856
41242 21500856 22384104 24412241 25148954 23621556 20733747 17981738 16160311 15159034
41234 15159034 14847157 15765623 18231332 20826873 21020987 17991690 13919191 11614427
41226 11614427 11570814 12212818 12335185 12178999 12445495 13267227 14144561 14344850 13525238
41217 13525238 12286119 11696174 11959813 12116387 11380200 10131447 9296846 9474623 10774296
41208 10774296 12460876 12712142 10362254 7319515 7261774 10902155 14578136 15082081 13880318
41199 13880318 14353476 16596112 17845970 17089676 16094278 16036396 16158756 16293660 17919137
41190 17919137 21465721 24695944 25337985 24033574 23302928 24448561 26626951 28340800
$$ packed form
41250C0867814J971609k27744j381307j084440j151620k470331l258441j764684
41242B1500856Q83248K028137P36713j527398k887809k752009j821427j001277
41234A5159034l11877R18466K465709K595541J94114l029297m072499k304764
41226A1614427m3613O42004J22367j56186K66496Q21732Q77334K00289q19612
41217A3525238j239119n89945K63639J56574p36187j248753q34601J77777J299673
41208A0774296J686580K51266k349888l042739n7741L640381L675981N03945j201763
41199A3880318M73158K242636J249858p56294r95398n7882J22360J34904J625477
41190A7919137L546584L230223O42041j304411p30646J145633K178390J713849
$$ plain form
41182 28340800 28778679 28022995 26879529 26499750 27491807 29132559 29757889 28333922 25752072
41173 25752072 24194476 24776445 26113254 25938851 23924940 21873687 21189050 21495934 21976880
41164 21976880 22523143 22964344 22684948 21837190 21540651 22124690 22716113 23228114 24699509
41155 24699509 26701276 26949297 25074615 23998317 25286374 26076663 23836303 21379268
41147 21379268 22810693 26508680 27258916 24393483 22356289 23147763 23817824 22601536
41139 22601536 22050526 23728766 24671149 22402814 19602057 20051250 22845722 24386412
41131 24386412 23963404 23621822 23991132 23914836 23404824 23585482 23985647 22911360 20671316
41122 20671316 19824668 21676933 24551250 26183173 26251595 25828816 25543352 25210029 24737558
$$ packed form
41182B8340800M37879p55684j143466l79779R92057J640752O25330j423967k581850
41173B5752072j557596N81969J336809j74403k013911k051253o84637L06884M80946
41164B1976880N46263M41201k79396q47758k96539N84039N91423N12001J471395
41155B4699509K001767K48021j874682j076298J288057P90289k240360k457035
41147B1379268J431425L697987P50236k865433k037194P91474O70061j216288
41139B2601536n51010J678240R42383k268335k800757M49193K794472J540690
41131B4386412m23008l41582L69310p6296n10012J80658M00165j074287k240044
41122B0671316q46648J852265K874317J631923O8422m22779k85464l33323m72471
$$ plain form
41113 24737558 24561770 24962783 25272213 24404480 22468494 21058959 21166813 21735617 21626465
41104 21626465 21975897 24473326 28033871 29953990 30156830 31112260 33250288 34074461 32928730
41095 32928730 32885785 35861902 39254930 40077515 39494355 40286558 42404718 44308591 46452016
41086 46452016 49849570 53035184 54266012 55355725 59369602 65465741 70059024 72591632
41078 72591632 76052953 81817326 88100048 94055144 101313037 110195381 118111483 123600664
41070 123600664 128932136 136489262 144926533 151271424 155224991 159061733 164035606 168699209
41062 168699209 170551558 168279187 162582225 155406204 148157442 140528901 131434138 120813718
41054 120813718 109777736 99364514 90190861 82900746 77660228 73484961 69315602 65321341
$$ packed form
41113B4737558j75788M01013L09430q67733j935986j409535J07854N68804j09152
41104B1626465L49432K497429L560545J920119K02840R55430K138028Q24173j145731
41095C2928730m2945K976117L393028Q22585n83160P92203K118160J903873K143425
41086D6452016L397554L185614J230828J089713M013877O096139M593283K532608
41078G2591632L461321N764373O282722N955096P257893Q882344P916102N489181
41070A23600664N331472P557126Q437271O344891L953567L836742M973873M663603
41062A68699209J852349k272371n696962p176021p248762p628541r094763j0620420
41054A20813718j1035982j0413222r173653p290115n240518m175267m169359l994261
$$ plain form
41046 65321341 61798736 57578968 51519542 45044958 40863913 39284403 38139967 36328761
41038 36328761 34800269 33765442 31839765 28855558 26734072 26162046 24933656 21429035
41030 21429035 17603171 16314368 17182797 17363133 15570995 13288111 12270848 12460271
41022 12460271 12453088 11203876 9296084 8707032 10636825 13433178 13867359 10958345 7263506
41013 7263506 5710016 6472878 7834330 8705287 9010110 8686824 7824376 7243912 7693059
41004 7693059 8737362 9323419 9158939 8897453 9270392 10448560 11848667 12357818 11349601
40995 11349601 9608524 8530430 8426652 8542445 8573347 8834333 9019517 8453348 7675634
40986 7675634 7901419 8663317 8193522 6682365 6572892 8443698 9264534 6709791 2960890
$$ packed form
41046F5321341l522605m219768o059426o474584m181045j579510j144436j811206
41038C6328761j528492j034827j925677k984207k121486n72026j228390l504621
41030B1429035l825864j288803Q68429J80336j792138k282884j017263J89423
41022A2460271p183j249212j907792n89052J929793K796353M34181k909014l694839
41013G263506j553490P62862J361452Q70957L04823l23286q62448n80464M49147
41004G693059J044303N86057j64480k61486L72939J178168J400107N09151j008217
40995A1349601j741077j078094j03778J15793L0902K60986J85184n66169p77714
40986G675634K25785P61898m69795j511157j09473J870806Q20836k554743l748901
$$ plain form
40977 2960890 1792138 3585489 5835890 7282030 8683401 10187245 10735968 10091263
40969 10091263 9200765 8459263 7498376 6652876 6700448 7093729 6441692 5081969 5249400
40960 5249400 7924882 11033616 11785534 9925358 7817036 7706146 9399303 10624816
40952 10624816 9753043 8028467 8186269 10491846 11667423 9152857 5135980 4118878
40944 4118878 7040631 10342135 11026853 10038994 9637395 9842872 9471901 9137971 10648459
40935 10648459 13627064 15029645 12890595 9114443 7265984 8289527 9862788 9903447
40927 9903447 9084089 9093635 9821291 9864191 9083792 8705561 8988159 8852794 8218409 8517397
40917 8517397 9869807 9912822 7277151 4564491 5445762 9586312 12870177 12553694 10040590
$$ packed form
40977B960890j168752J793351K250401J446140J401371J503844N48723o44705
40969A0091263q90498p41502r60887q45500M7572L93281o52037j359723J67431
40960E249400K675482L108734P51918j860176k108322j10890J693157J225513
40952A0624816q71773j724576J57802K305577J175577k514566m016877j017102
40944D118878K921753L301504O84718r87859m01599K05477l70971l33930J510488
40935A0648459K978605J402581k139050l776152j848459J023543J573261M0659
40927I903447q19358R546P27656M2900p80399l78231K82598j35365o34385K98988
40917H517397J352410M3015k635671k712660Q81271M140550L283865l16483k513104
$$ plain form
40908 10040590 8241221 8120741 8648378 8707155 7976326 6688206 5456797 5127488 6221295
40899 6221295 8407330 10549839 11351184 10317476 8289877 6673641 6034933 5993254 6446183
40890 6446183 7766994 9445448 9979351 9053444 8477139 9648148 11322627 11575514 10902314
40881 10902314 11258159 12645734 13035564 11648074 9988715 9171550 8433475 7286376 7181301
40872 7181301 9391464 12400107 13219551 11079695 8371534 7625021 8593980 9142594 8540391
40863 8540391 8562563 10681215 13283401 13382138 10858694 8884322 9441195 10568938 9604031
40854 9604031 7290452 6349107 7149402 7524907 6507263 5523076 5575401 5713688 5151350
40845 5151350 4843129 5743232 6975529 6989066 5562449 3643661 1999736 983745 1039105
$$ packed form
40908A0040590j799369j20480N27637N8777p30829j288120j231409l29309J093807
40899F221295K186035K142509Q01345j033708k027599j616236o38708m1679M52929
40890F446183J320811J678454N33903r25907n76305J171009J674479K52887o73200
40881A0902314L55845J387575L89830j387490j659359q17165p38075j147099j05075
40872G181301K210163L008643Q19444k139856k708161p46513R68959N48614o02203
40863H540391K2172K118652K602186R8737k523444j974372N56873J127743r64907
40854I604031k313579r41345Q00295L75505j017644r84187N2325J38287n62338
40845E151350l08221R00103J232297J3537j426617j918788j643925j015991N5360
$$ plain form
40836 1039105 2428683 4541599 6047360 5912998 4323809 2677959 2366110 3303946 4161760
40827 4161760 4364452 4914111 6388060 7249244 5791498 3147822 2377576 4494785 7197219
40818 7197219 7957049 6799392 5344690 4414791 3563783 2308424 1051586 904218 2642910
40809 2642910 5577357 7783098 8009996 6973338 6197748 6247467 6806214 7516070 7651273
40800 7651273 6100730 3180335 1315865 2047714 3502479 3148884 1922153 2591932 4769131
40791 4769131 5210293 3192908 1697970 2271168 2541596 725608 -848966 581682 3621929
40782 3621929 4852672 3869200 3167858 3917865 4603987 3685839 1516061 -422692 -741832
40773 -741832 1201391 4576232 7157352 7210154 5229477 3169143 2331882 2600492 3202972
$$ packed form
40836A039105J389578K112916J505761j34362j589189j645850l11849R37836Q57814
40827D161760K02692N49659J473949Q61184j457746k643676p70246K117209K702434
40818G197219P59830j157657j454702r29899q51008j255359j256838j47368J738692
40809B642910K934447K205741K26898j036658p75590M9719N58747P09856J35203
40800G651273j550543k920395j864470P31849J454765l53595j226731O69779K177199
40791D769131M41162k017385j494938N73198K70428j815988j574574J430648L040247
40782C621929J230743r83472p01342P50007O86122r18148k169778j938753l19140
40773g41832J943223L374841K581120N2802j980677k060334q37261K68610O02480
$$ plain form
40764 3202972 3565460 3756557 4411852 5792199 6984357 6820274 5377490 3539926 1587326
40755 1587326 -226414 -404794 2068754 5080775 5429055 3637046 3354457 5408919 6424821
40746 6424821 4768686 3574783 5314481 7427287 6838012 5223721 5584035 6634794
40738 6634794 5472412 3429620 3880118 5801832 5340126 3114841 3864491 8325624 11478632
40729 11478632 10469065 8618472 8968683 9047732 5860612 1985844 2066887 5694395 8273813
40720 8273813 7718245 6221310 5779932 5586154 4394446 2791312 2164363 2974195 4619643
40711 4619643 5972362 5918231 4379988 2854799 3067506 5100504 7502718 8953265 9095507
40702 9095507 8168222 6780071 5834674 5799116 6143198 6138413 5897862 5910057 5985302 5680093
$$ packed form
40764C202972L62488J91097O55295J380347J192158j64083j442784j837564j952600
40755A587326j813740j78380K473548L012021L48280j792009k82589K054462J015902
40746F424821j656135j193903J739698K112806n89275j614291L60314J050759
40738F634794j162382k042792M50498J921714m61706k225285P49650M461133L153008
40729A1478632j009567j850593L50211P9049l187120l874768Q1043L627508K579418
40720H273813n55568j496935m41378j93778j191708j603134o26949Q09832J645448
40711D619643J352719n4131j538243j525189K12707K032998K402214J450547J42242
40702I095507r27285j388151r45397l5558L44082m785k40551J2195P5245l05209
$$ plain form
40692 5680093 5537399 6723977 9234908 11440011 11872171 10832807 9810250 9820105 10753710
40683 10753710 11891967 12407881 11562941 9203776 6341664 4650711 4818269 5642498 5340382
40674 5340382 3622176 1859913 1345984 2261620 4340823 7209447 9477415 8963853 5291490
40665 5291490 1414311 821782 3451563 5984778 6153025 4970779 4316090 4214681 3720137
40656 3720137 3099881 3494247 4958822 6289993 6658586 6259366 5425407 4345187 3851629
40647 3851629 5112509 7707783 9108075 7465585 4463749 3738568 6215628 8651046
40639 8651046 7749815 4364875 2074934 2487358 3880518 4222155 3472496 2562578 2001629
40630 2001629 2254478 3841140 6061005 6991324 5790416 3831924 2698739 2408651 2533461
$$ packed form
40692E680093j42694J186578K510931K205103M32160j039364j022557R855R33605
40683A0753710J138257N15914q44940k359165k862112j690953J67558Q24229l02116
40674E340382j718206j762263n13929R15636K079203K868624K267968n13562l672363
40665E291490l877179n92529K629781K533215J68247j182246o54689j01409m94544
40656C720137o20256L94366J464575J331171L68593l99220q33959j080220m93558
40647C851629J260880K595274J400292j642490l001836p25181K477060K435418
40639H651046r01231l384940k289941M12424J393160L41637p49659r09918n60949
40630B001629K52849J586662K219865R30319j200908j958492j133185k90088J24810
$$ plain form
40621 2533461 3401480 4845017 5424471 4654762 4548316 6975161 10765866 13500076 14862008
40612 14862008 15871024 16146688 14907407 13681461 14546385 16059315 14681115 10522449
40604 10522449 7774598 8358782 9013219 6714391 3553783 3278157 5483975 6708764
40596 6708764 5962801 5695642 7380924 9106909 8477327 6024469 4375896 4669972 5017386
40587 5017386 3067780 -338824 -1382311 2106912 7455245 10243485 9699086 8674756
40579 8674756 8757996 8491152 6901659 5514403 5430935 5348046 4410741 4327970 6215324 7742453
40569 7742453 6399327 3751945 3180404 4671780 5312588 4265759 3696433 4659248 5378316
40560 5378316 4425976 2936725 2507359 2831187 2562561 1337976 235420 898331 3992488
$$ packed form
40621B533461Q68019J443537N79454p69709j06446K426845L790705K734210J361932
40612A4862008J009016K75664j239281j225946Q64924J512930j378200m158666
40604A0522449k747851N84184O54437k298828l160608k75626K205818J224789
40596F708764p45963k67159J685282J725985o29582k452858j648573K94076L47414
40587E017386j949606l406604j043487L489223N348333K788240n44399j024330
40579H674756Q3240k66844j589493j387256q3468q2889r37305q2771J887354J527129
40569G742453j343126k647382n71541J491376O40808j046829n69326R62815P19068
40560E378316r52340j489251m29366L23828k68626j224585j102556O62911L094157
$$ plain form
40551 3992488 7640108 8338608 5113756 1668033 1973269 4692117 5192926 2567833 580336
40542 580336 1172300 1581480 -175123 -1241834 1362502 5216882 5705513 2785974 563896
40533 563896 1254938 3423963 5626494 7877020 9367882 8497690 6021180 4874548 5703482
40524 5703482 5630743 2979919 250882 232869 1691667 1655667 153586 -366711 749007
40515 749007 1862930 2395242 3604299 5631344 6521668 5209055 3257828 2338124 1823441
40506 1823441 520364 -642996 342693 3448944 6347740 7250719 6648253 6084023 6323990
40497 6323990 7021242 7313342 6419050 4323643 2168040 1361730 2028271 2911973 3129396
40488 3129396 3304801 4315969 5472397 5043619 2712791 484110 445319 2217775 3582882
$$ packed form
40551C992488L647620O98500l224852l445723L05236K718848N00809k625093j987497
40542E80336N91964M09180j756603j066711K604336L854380M88631k919539k222078
40533E63896O91042K169025K202531K250526J490862q70192k476510j146632Q28934
40524E703482p2739k650824k729037j8013J458798l6000j502081n20297J115718
40515G49007J113923N32312J209057K027045Q90324j312613j951227r19704n14683
40506A823441j303077j163360R85689L106251K898796R02979o02466n64230K39967
40497F323990O97252K92100q94292k095407k155603q06310O66541Q83702K17423
40488C129396J75405J011168J156428m28778k330828k228681l8791J772456J365107
$$ plain form
40479 3582882 3396236 2650834 2386617 1992580 720170 -216127 1063812 3906105 5200007
40470 5200007 3308847 383323 -283340 1863046 4465872 5153694 3575887 1236255
40462 1236255 317891 2026191 5020655 6115933 3766531 341033 -421402 2154937
40454 2154937 5249611 6301362 5493816 4316246 3411350 2691659 2342751 2611517 3148820
40445 3148820 3334211 2979669 2298483 1451319 396629 -945720 -2345854 -2975538 -1996028
40436 -1996028 83616 1369339 832414 -108326 471573 2134366 2828777 2026036 1025203
40427 1025203 290451 -1010120 -2388918 -1716784 1238636 3472771 2777773 947611 710252
40418 710252 1395554 565515 -1363442 -1631422 -58443 73218 -2906150 -5926813 -4960902
$$ packed form
40479C582882j86646p45402k64217l94037j272410r36297J279939K842293J293902
40470E200007j891160k925524o66663K146386K602826O87822j577807k339632
40462A236255r18364J708300K994464J095278k349402l425498p62435K576339
40454B154937L094674J051751q07546j177570r04896p19691l48908K68766N37303
40445C148820J85391l54542o81186q47164j054690j342349j400134o29684R79510
40436a996028K079644J285723n36925r40740N79899J662793O94411q02741j000833
40427A025203p34752j300571j378798O72134K955420K234135o94998j830162k37359
40418G10252O85302q30039j928957k67980J572979J31661k979368l020663R65911
$$ plain form
40409 -4960902 -185993 4540858 6441091 6290304 6414127 7688417 8929349 8529177 6175564
40400 6175564 3024087 475235 -858675 -959285 89524 1733229 2678822 2140951 1175194
40391 1175194 1492854 2875347 3275757 2010641 1177358 2592233 4632889 4097425 718712
40382 718712 -2276150 -2399746 -783727 88347 -66011 387162 1978135 3156864 2423849
40373 2423849 222041 -1585814 -1323424 1477978 5667132 8764134 8621923 5474771
40365 5474771 1895703 366252 1299467 3440191 5227748 5424514 3595895 882185
40357 882185 -538020 286889 2032390 3173635 4115924 5832137 7208365 5904470 2049094
40348 2049094 -915577 -131651 3114472 4953801 3578540 1204695 1197000 3924358 6215954
$$ packed form
40409d960902M774909M726851J900233j50787J23823J274290J240932m00172k353613
40400F175564l151477k548852j333910j00610J048809J643705R45593n37871r65757
40391A175194L17660J382493M00410j265116q33283J414875K040656n35464l378713
40382G18712k994862j23596J616019Q72074j54358M53173J590973J178729p33015
40373B423849k201808j807855K62390K801402M189154L097002j42211l147152
40365E474771l579068j529451R33215K140724J787557J96766j828619k713710
40357H82185j420205Q24909J745501J141245R42289J716213J376228j303895l855376
40348B049094k964671P83926L246123J839329j375261k373845p695K727358K291596
$$ plain form
40339 6215954 5072358 1164286 -2205679 -3069011 -2173823 -526402 2117412 5277011
40331 5277011 6614300 4911143 2516888 2334704 3650348 3779306 2809913 3229612 5145524
40322 5145524 5686962 3792168 1953559 1920658 2084056 1013574 492273 2497212 5535857
40313 5535857 6682158 5540669 3744746 2117838 835025 895818 2602171 3634530
40305 3634530 1625679 -1827595 -2565745 709945 4919089 6768357 6157922 4854728
40297 4854728 3748801 2471957 637663 -1375986 -2512194 -1884366 37042 1552029
40289 1552029 1699331 1372487 1600221 1728703 715778 -652984 -661412 666417 1623892
40280 1623892 1438454 1124292 1582000 2314095 2336681 1324141 -273434 -1483833 -1455918
$$ packed form
40339F215954j143596l908072l369965q63332Q95188J647421K643814L159599
40331E277011J337289j703157k394255j82184J315644J28958r69393M19699J915912
40322E145524N41438j894794j838609l2901J63398j070482n21301K004939L038645
40313E535857J146301j141489j795923j626908j282813O0793J706353J032359
40305C634530k008851l453274p38150L275690M209144J849268o10435j303194
40297D854728j105927j276844j834294k013649j136208O27828J921408J514987
40289A552029J47302l26844K27734J28482j012925j368762q428J327829R57475
40280A623892j85438l14162M57708P32095K2586j012540j597575j210399K7915
$$ plain form
40271 -1455918 -619469 -528924 -1525036 -1535405 1186754 4919052 6053548 3535312 -85647
40262 -85647 -1836822 -886425 1701079 3877861 3570025 763937 -1516176 -398550 2855641
40253 2855641 4421155 3354851 2599341 4048866 5707837 5171683 3261992 2206147
40245 2206147 2200136 1959087 1330990 1262119 1952221 2789863 3602760 4606931 5599553 6280244
40235 6280244 6769941 6892820 5820213 3542422 1780001 2038437 3425512 3856922 2952413
40226 2952413 2196929 2430455 2781323 2384325 1846898 2355124 4064737 5943549 6821171
40217 6821171 6273631 4827459 3603440 3496897 4354352 5042075 4661161 3731745 3718359
40208 3718359 4990386 5733452 3920842 399560 -1402254 299574 2999319 3062248 728299
$$ packed form
40271a455918Q36449R0545r96112j0369K722159L732298J134496k518236l620959
40262h5647j751175R50397K587504K176782l07836k806088k280113J117626L254191
40253B855641J565514j066304p55510J449525J658971n36154j909691j055845
40245B206147o011k41049o28097o8871O90102Q37642Q12897J004171R92622O80691
40235F280244M89697J22879j072607k277791j762421K58436J387075M31410r04509
40226B952413p55484K33526L50868l96998n37427N08226J709613J878812Q77622
40217F821171n47540j446172j224019j06543Q57455O87723l80914r29416j3386
40208C718359J272027P43066j812610l521282j801814J701828K699745O2929k333949
$$ plain form
40199 728299 -155600 2580131 6572903 8186804 6869822 4915800 4078522 4070486 3986174
40190 3986174 3667066 3365972 3012870 2350693 1487491 986132 1395981 2691887 4126900
40181 4126900 4697845 3879575 2031172 190295 -633271 -261494 483102 630500 20664
40172 20664 -880010 -1768285 -2375279 -1940080 -154218 1411398 617815 -1963019 -3039604
40163 -3039604 -1005582 1587720 1670646 -21962 -578575 522595 1296671 1037388 1261944
40154 1261944 2700773 3845790 3082893 468671 -2884965 -5529369 -5813463 -3215324
40146 -3215324 334757 2252569 2417398 2711571 3797491 4649093 5078520 5997064 6947013
40137 6947013 6235223 4119949 3011466 3633355 3879097 2681991 2069436 3610128 5464920
$$ packed form
40199G28299q83899K735731L992772J613901j316982j954022q37278q036q4312
40190C986174l19108l01094l53102o62177q63202n01359M09849J295906J435013
40181D126900N70945q18270j848403j840877q23566L71777P44596J47398o09836
40172B0664r00674q88275o06994M35199J785862J565616p93583k580834j076585
40163c039604K034022K593302Q2926j692608n56613J101170P74076k59283K24556
40154A261944J438829J145017p62897k614222l353636k644404k84094K598139
40146c215324L550081J917812J64829K94173J085920Q51602M29427R18544R49949
40137F947013p11790k115274j108483O21889K45742j197106o12555J540692J854792
$$ plain form
40128 5464920 5147011 3131872 1547981 1012466 890035 1201802 2138565 2796904 2314258
40119 2314258 1369516 985425 790880 -81722 -1318774 -1978390 -1852885 -1231263 -256116
40110 -256116 732049 1410740 2483042 4717415 6586609 5400869 1725276 -323221 1130431
40101 1130431 2688239 816648 -2916808 -4797591 -4547820 -4248692 -3686739 -1021201 2865759
40092 2865759 4793447 3916061 2433693 1665427 696980 -813225 -1577867 -1018100 -81969
40083 -81969 749462 1929210 2999797 2672842 1210454 492133 1181223 1853311 1412656
40074 1412656 460318 -159892 -365182 -57258 912795 1796462 1696423 1310028 2056447
40065 2056447 3459067 3443646 1361867 -1337295 -3503618 -5083624 -5426789 -3476223 -332029
$$ packed form
40128E464920l17909k015139j583891n35515j22431L11767R36763O58339m82646
40119B314258r44742l84091j94545q72602j237052o59616J25505O21622R75147
40110b56116R88165O78691J072302K234373J869194j185740l675593k048497J453652
40101A130431J557808j871591l733456j880783K49771K99128N61953K665538L886960
40092B865759J927688q77386j482368p68266r68447j510205p64642N59767R36131
40083h1969Q31431J179748J070587l26955j462388p18321O89090O72088m40655
40074A412656r52338o20210k05290L07924R70053Q83667j00039l86395P46419
40065B056447J402620j5421k081779k699162k166323j580006l43165J950566L144194
$$ plain form
40056 -332029 944849 -767913 -3083300 -3587615 -2894706 -2864485 -3487224 -3157696 -1094490
40047 -1094490 1688031 3276383 2357034 -344293 -2181019 -1416826 296397 17593 -2153740
40038 -2153740 -3157968 -1459173 1233034 3197120 4640514 5336924 3561675 -550286
40030 -550286 -3355094 -2125058 887653 1657759 93200 -597782 678173 1522223 288497
40021 288497 -1257874 -712511 1404351 2299595 447082 -2464633 -3166765 -313742 3725234
40012 3725234 5142796 2952415 2017 -844697 -227332 -618308 -2218003 -2705268 -1005814
40003 -1005814 910216 892611 -388703 -784772 -69868 -178067 -2027916 -3824739 -3439813
39994 -3439813 -1332554 274164 502945 374314 318319 -791856 -3273053 -5166919 -4667297
$$ packed form
40056c32029J276878j712762k315387n04315O92909L0221o22739L29528K063206
40047a094490K782521J588352r19349k701327j836726P64193J713223k78804k171333
40038b153740j004228J698795K692207J964086J443394O96410j775249m111961
40030e50286k804808J230036L012711P70106j564559o90982J275955Q44050j233726
40021B88497j546371N45363K116862Q95244j852513k911715p02132K853023M038976
40012C725234J417562k190381k950398q46714O17365l90976j599695m87265J699454
40003a005814J916030j7605j281314l96069P14904j08199j849849j796823L84926
39994c439813K107259J606718K28781j28631n5995j110175k481197j893866M99622
$$ plain form
39985 -4667297 -2629996 -915640 534807 2761679 4822985 4517515 2030247 189686
39977 189686 478059 1105805 31993 -2064818 -3046590 -2056823 131967 2320141 3460567
39968 3460567 3069572 1861982 1083512 776003 -156045 -1851423 -2984061 -2878605 -2510655
39959 -2510655 -2657885 -2670366 -1938433 -953938 26681 1639157 3613654 4152175 2537894
39950 2537894 615496 4831 -428265 -2278436 -4336222 -4098572 -1516972 1307354 3484930
39941 3484930 5706081 7496738 6973822 3961226 966040 -51627 -107446 -1157140 -2977107
39932 -2977107 -3567552 -2074081 48135 902008 331400 -269414 -38543 246957 -342545
39923 -342545 -949055 197827 2897295 4550287 3425872 978358 -313990 -220225 -243052
$$ packed form
39985d667297K037301J714356J450447K226872K061306l05470k487268j840561
39977A89686K88373O27746j073812k096811r81772R89767K188790K188174J140426
39968C460567l90995j207590p78470l07509r32048j695378j132638J05456L67950
39959b510655j47230j2481P31933R84495R80619J612476J974497N38521j614281
39950B537894j922398o10665m33096j850171k057786K37650K581600K824326K177576
39941C484930K221151J790657n22916l012596k995186j017667n5819j049694j819967
39932b977107n90445J493471K122216Q53873n70608o00814K30871K85500n89502
39923c42545o06510J146882K699468J652992j124415k447514j292348R3765k2827
$$ plain form
39914 -243052 -739952 -596111 483828 1377949 1526520 1759218 2564700 3033284 2305049
39905 2305049 796732 -916699 -3207552 -6036796 -7389802 -4997644 210654 4054716
39897 4054716 3513154 259518 -1428029 163241 2549078 2696646 707895 -1048440
39889 -1048440 -1189098 -189012 1262955 2957788 4243070 4071537 2409379 382517
39881 382517 -1263547 -2568672 -2972066 -1199891 2573961 5870136 6477276 5011536 3777629
39872 3777629 3787976 4046613 3300594 1411240 -800961 -2247304 -2254604 -1161128 -76614
39863 -76614 314577 409204 906240 1861642 2781843 3107196 2384358 636866 -1173058 -1779558
39853 -1779558 -1007765 123458 776848 908475 526472 -406552 -1123815 -554291 808044
$$ packed form
39914b43052m96900J43841J079939Q94121J48571K32698Q05482M68584p28235
39905B305049j508317j713431k290853k829244j353006K392158N208298L844062
39897D054716n41562l253636j687547J591270K385837J47568j988751j756335
39889a048440j40658J000086J451967J694833J285282j71533j662158k026862
39881C82517j646064j305125m03394J772175L773852L296175O07140j465740j233907
39872C777629J0347K58637p46019j889354k212201j446343p300J093476J084514
39863g6614L91191R4627M97036R55402R20201L25353p22838j747492j809924o06500
39853a779558P71793J131223O53390J31627l82003r33024p17263N69524J362335
$$ plain form
39844 808044 958728 -944507 -3237096 -3864533 -2642779 -644862 1379008 3020339 3785931
39835 3785931 3629390 3057253 2163231 683535 -634453 -368602 1226442 2044702 1226591
39826 1226591 510694 1357264 2754768 3314700 3452733 3710489 2993442 702179 -1208660
39817 -1208660 -824162 518342 179412 -1793650 -3186278 -3111011 -2373989 -1171915 890698
39808 890698 2935945 3432809 2456105 1334049 578849 71184 375693 1650158 2240823
39799 2240823 864972 -765873 -224431 1689396 2349026 1799365 2292134 3673924 3102013
39790 3102013 -167278 -3257975 -3867664 -2922196 -2077168 -1413275 -702193 -403577 -307156
39781 -307156 573246 1909349 2060764 790912 -322189 -662696 -1192869 -1772462 -759668
$$ packed form
39844H08044J50684j903235k292589o27437J221754J997917K023870J641331P65592
39835C785931j56541n72137q94022j479696j317988K65851J595044Q18260q18111
39826A226591p15897Q46570J397504N59932J38033K57756p17047k291263j910839
39817a208660L84498J342504l38930j973062j392628P5267P37022J202074K062613
39808H90698K045247M96864r76704j122056p55200n07665L04509J274465N90665
39799B240823j375851j630845N41442J913827O59630n49661M92769J381790n71911
39790C102013l269291l090697o09689R45468Q45028O63893P11082K98616R6421
39781c07156Q80402J336103J51415j269852j113101l40507n30173n79593J012794
$$ plain form
39772 -759668 1782197 3298461 2334697 343318 -1145129 -2453581 -3713419 -3722681 -2323469
39763 -2323469 -1303088 -1442458 -1233770 20014 562196 -715530 -2243102 -2594905 -2585090
39754 -2585090 -2700412 -1438370 1501918 3340489 2296265 862992 1962119 4243830
39746 4243830 4554242 3024495 2155514 2430703 2424149 2129416 2701277 3624997 3323220 2023033
39736 2023033 1184226 774877 -82887 -584972 588597 2214795 1804450 -355218 -1494121
39727 -1494121 -617328 466895 483255 251454 576962 1070168 1472623 2059504 2550121
39718 2550121 2539917 2836638 4320293 5847389 5552864 3833414 2644641 2346588 1902382
39709 1902382 1619849 2552349 3516460 2247652 -347641 -792275 1530114 3271697 2436216
$$ packed form
39772g59668K541865J516264r63764j991379j488447j308452j259838r262J399212
39763b323469J020381j39370K08688J253784N42182j277726j527572l51803R815
39754b585090j15322J262042K940288J838571j044224j433273J099127K281711
39746D243830L10412j529747q68981K75189o554k94733N71861R23720l01777j300187
39736B023033q38807m09349q57764n02085J173569J626198m10345k159668j138903
39727a494121Q76793J084223J6360k31801L25508M93206M02455N86881M90617
39718B550121j0204K96721J483655J527096k94525j719450j188773k98053m44206
39709A902382k82533R32500R64111j268808k595293m44634K322389J741583q35481
$$ plain form
39700 2436216 1029961 927117 872785 -191079 -268323 2321777 5401297 5906341 4500221
39691 4500221 4176257 5602317 6749547 6332069 5024490 3686225 2547863 1952486 2200162
39682 2200162 2819005 3140407 3070137 2402931 502364 -2128480 -3321209 -1947091 67869
39673 67869 307633 -675297 -614878 697959 1408232 888724 404922 446316 -18573 -1087598
39663 -1087598 -1160093 368259 1814966 2038143 2645637 5346195 8392807 8273242 4794684
39654 4794684 1941467 2729955 5227355 5433285 2793046 414194 137767 247364 -916961
39645 -916961 -1710032 146597 3344855 4436679 2932154 1876227 2993603 4203693
39637 4203693 3186104 966225 112032 1011091 1863728 1407408 7623 -1324482 -1708604
$$ packed form
39700B436216j406255j02844n4332j063864p7244K590100L079520N05044j406120
39691D500221l23964J426060J147230m17478j307579j338265j138362n95377K47676
39682B200162O18843L21402p0270o67206j900567k630844j192729J374118K014960
39673F7869K39764r82930O0419J312837P10273n19508m83802M1394m64889j069025
39663a087598p2495J528352J446707K23177O07494K700558L046612j19565l478558
39654D794684k853217P88488K497400K05930k640239k378852k76427J09597j164325
39645i16961p93071J856629L198258J091824j504525j055927J117376J210090
39637D203693j017589k219879q54193Q99059Q52637m56320j399785j332105l84122
$$ plain form
39628 -1708604 -787943 586807 751908 -688998 -1952285 -1295620 630587 1802627 1527035
39619 1527035 947060 1284370 2524336 3503187 2781485 127361 -2525849 -2818181 -1158989
39610 -1158989 -515382 -2127449 -3469994 -2046357 811575 2158799 1779936 1684489 2475255
39601 2475255 3007743 2852381 2362674 1042466 -1238699 -2093106 932114 5931723 8210693
39592 8210693 6554671 4366842 3989144 3834219 2538230 1992405 3789206 5841304 5395871
39583 5395871 3025615 952780 -366834 -1222167 -439803 2479112 4708974 3229855
39575 3229855 -358983 -1719604 41917 1641903 1055290 95668 815119 2498277 3542981
39566 3542981 3838368 3871843 3472945 2780593 2755009 3459323 3356690 1594254 -338720
$$ packed form
39628a708604R20661J374750J65101j440906j263287O56665J926207J172040k75592
39619A527035n79975L37310J239966R78851p21702k654124k653210k92332J659192
39610a158989O43607j612067j342545J423637K857932J347224l78863r5447P90766
39601B475255N32488j55362m89707j320208k281165q54407L025220M999609K278970
39592H210693j656022k187829l77698j54925j295989n45825J796801K052098m45433
39583E395871k370256k072835j319614q55333P82364K918915K229862j479119
39575C229855l588838j360621J761521J599986n86613r59622P19451J683158J044704
39566C542981K95387L3475l98898o92352k5584P04314j02633j762436j932974
$$ plain form
39557 -338720 -502767 1051067 2900002 4263776 5163673 5416440 4783498 3749558 3232160
39548 3232160 3728096 5099289 6608453 6958519 5309513 2652093 1015499 849463 621702
39539 621702 -315159 -287809 1878400 4281564 4249381 2192837 931437 1638813 2621115
39530 2621115 2126025 423290 -1233156 -2116398 -2084470 -1400678 -790725 -599257 65865
39521 65865 2004817 3861984 3212659 63861 -2619097 -2711694 -1564558 -1704198 -3367899
39512 -3367899 -4793441 -4930880 -4284698 -3571325 -2929577 -2313326 -1676560 -885468 -93508
39503 -93508 163505 -138618 -89317 919143 2110804 2370647 1844871 1532034 1724275 1865874
39493 1865874 1618029 1109049 485114 122108 744020 2227056 2915673 1566571 -559988
$$ packed form
39557c38720j64047J553834J848935J363774Q99897K52767o32942j033940n17398
39548C232160M95936J371193J509164L50066j649006k657420j636594j66036k27761
39539F21702r36861K7350K166209K403164l2183k056544j261400P07376R82302
39530B621115m95090j702735j656446q83242L1928O83792O09953J91468O65122
39521F5865J938952J857167o49325l148798k682958r2597J147136j39640j663701
39512c367899j425542j37439O46182P13373O41748O16251O36766P91092P91960
39503i3508K57013l02123M9301J008460J191661K59843n25776l12837J92241J41599
39493A865874k47845n08980o23935l63006O21912J483036O88617j349102k126559
$$ plain form
39484 -559988 -1296198 -856488 -1311043 -2693892 -2294613 1067779 4445512 4382401 1565540
39475 1565540 -313849 541954 2432595 3088543 2134472 442272 -1218271 -2284966 -2368721
39466 -2368721 -1708246 -876890 201311 2019435 4039298 4624316 3104399 1074487 788551
39457 788551 2657248 4953273 5687664 4297556 1813082 -111823 -483885 354407 1427196
39448 1427196 2486715 4071564 5994110 6747665 5368863 3262446 2813525 4224184
39440 4224184 5128342 3833275 1653719 990297 2006596 2685803 1899467 836271 1012442
39431 1012442 2235666 3373233 4074859 4591965 4640439 3866301 3125591 3765367 5499489
39422 5499489 6480649 5945397 5338204 5969845 6897880 6401359 4571481 2972244 2422002
$$ packed form
39484e59988p36210M39710m54555j382849L99279L362392L377733o3111k816861
39475A565540j879389Q55803J890641O55948r54071j692200j660543j066695q3755
39466b368721O60475Q31356J078201J818124K019863N85018j519917k029912k85936
39457G88551J868697K296025P34391j390108k484474j924905l72062Q38292J072789
39448A427196J059519J584849J922546P53555j378802k106417m48921J410659
39440D224184R04158j295067k179556o63422J016299O79207p86336j063196J76171
39431A012442J223224J137567P01626N17106M8474p74138p40710O39776J734122
39422E499489R81160n35252o07193O31641R28035m96521j829878j599237n50242
$$ plain form
39413 2422002 2689983 3865179 6114725 8125578 7808863 5114015 2415342 1355987
39405 1355987 1012395 246810 79487 1854457 4247602 4461925 2190915 221383 594419
39396 594419 1920002 1519798 -896240 -2941295 -2562195 -309697 1586878 1845437 1345411
39387 1345411 1705278 3131008 4271159 4067605 2844314 1310179 -417121 -2043175
39379 -2043175 -2442972 -1071074 698128 1140826 613656 725382 1387161 812706 -1197033
39370 -1197033 -2150394 -158264 3313850 5335272 4953236 3406037 1892312 650726
39362 650726 -229928 -434780 165889 1377622 2663265 3019620 1808369 161026 228132
39353 228132 2199090 3597643 2776964 1404809 1625207 2450522 1645838 -24319 212103
$$ packed form
39413B422002K67981J175196K249546K010853l16715k694848k698673j059355
39405A355987l43592p65585j67323J774970K393145K14323k271010j969532L73036
39396E94419J325583m00204k416038k045055L79100K252498J896575K58559n00026
39387A345411L59867J425730J140151k03554j223291j534135j727300j626054
39379b043175l99797J371898J769202M42698n27170J11726O61779n74455k009739
39370a197033r53361J992130L472114K021422l82036j547199j513725j241586
39362F50726q80654k04852O00669J211733J285643L56355j211251j647343O7106
39353B28132J970958J398553q20679j372155K20398Q25315q04684j670157K36422
$$ plain form
39344 212103 2236061 2726677 414213 -1712113 -909954 1448459 2470700 1909329 1450503
39335 1450503 1550004 1474170 1529833 2886755 5434264 7576199 8078984 6920394 4635260
39326 4635260 1928374 -402359 -2015535 -3002808 -2832863 -588190 2813731 4304017
39318 4304017 2294599 -769783 -1614665 -710420 -1071581 -3257025 -4585160 -3413145 -1336793
39309 -1336793 -411189 -573317 -788683 -795892 -742949 -701809 -1226877 -2746307 -3952596 -2864097
39299 -2864097 -118229 1230796 300790 111786 2899058 6217766 6350513 3669328 1515704
39290 1515704 1012989 386707 -1045192 -1696266 -947082 -462400 -1249289 -1967049 -1483402
39281 -1483402 -926911 -1612324 -2703509 -2697423 -1838898 -1201871 -469181 1293805 3287202
$$ packed form
39344B12103K023958M90616k312464k126326Q02159K358413J022241n61371m58826
39335A450503R9501p5834N5663J356922K547509K141935N02785j158590k285134
39326D635260k706886k330733j613176r87273J69945K244673L401921J490286
39318D304017k009418l064382q44882R04245l61161k185444j328135J172015K076352
39309a336793R25604j62128k15366p209N2943M1140n25068j519430j206289J088499
39299b864097K745868J349025r30006j89004K787272L318708J32747k681185k153624
39290A515704n02715o26282j431899o51074P49184M84682p86889p17760M83647
39281a483402N56491o85413j091185O086Q58525O37027P32690J762986J993397
$$ plain form
39272 3287202 3615521 2306480 1703123 3334490 5996245 7605820 7499550 5993303 3127767
39263 3127767 -600508 -3149925 -2481298 799177 3862672 4988949 5109095 5587183 5968860
39254 5968860 5041797 3092550 1697268 1688866 2511126 3299210 3474389 2529857 518216
39245 518216 -1265337 -1404842 -393892 -289587 -1918699 -3585262 -3148988 -423360 3055261
39236 3055261 5687363 6620368 5869733 4437696 3598982 3411125 2637623 663539 -1409252
39227 -1409252 -2151280 -1303126 639340 2991974 4247543 2580589 -1487623 -4352241
39219 -4352241 -3175763 535075 3120454 3473671 3209420 2997062 1743188 -484128 -1622996
39210 -1622996 -561076 1330316 2446562 2732328 2476451 1461954 297892 471810 1813298
$$ packed form
39272C287202L28319j309041o03357J631367K661755J609575j06270j506247k865536
39263C127767l728275k549417O68627L280475L063495J126277J20146M78088L81677
39254E968860r27063j949247j395282q402Q22260P88084J75179r44532k011641
39245E18216j783553j39505J010950J04305j629112j666563M36274K725628L478621
39236C055261K632102R33005p50635j432037q38714j87857p73502j974084k072791
39227a409252p42028Q48154J942466K352634J255569j666954m068212k864618
39219d352241J176478L710838K585379L53217k64251k12358j253874k227316j138868
39210a622996J061920J891392J116246K85766k55877j014497j164062J73918J341488
$$ plain form
39201 1813298 1931654 -305596 -2648324 -2621554 -1095497 -581503 -1303687 -1303693 321865 2467023
39191 2467023 3875861 4141597 3290813 2002467 1625543 2317209 2031995 -616307 -3458127
39182 -3458127 -3397918 -1281019 -791449 -2370945 -2085140 1958112 5641751 4182512 -934194
39173 -934194 -3886563 -2370705 41140 -348862 -2510176 -3198661 -2134155 -2108438 -4347371
39164 -4347371 -6128116 -4195906 561083 3589663 2054551 -1674760 -3001372 -743284
39156 -743284 1775520 1250435 -1601879 -3344959 -2006730 1197915 3840477 4798489 4671883
39147 4671883 4508414 4661159 4750361 4322532 3266246 1703585 -78526 -1494143 -2045975
39138 -2045975 -2162073 -2914495 -4306048 -4696280 -2950503 -327051 1221086 1883851 3137615
$$ packed form
39201A813298J18356k237250k342728K6770J526057N13994p22184oJ625558K145158
39191B467023J408838K65736q50784j288346l76924O91666k85214k648302k841820
39182c458127O0209K116899M89570j579496K85805M043252L683639j459239n116706
39173i34194k952369J515858K411845l90002k161314o88485J064506K5717k238933
39164d347371j780745J932210M756989L028580j535112l729311j326612K258088
39156g43284K518804n25085k852314j743080J338229L204645K642562R58012j26606
39147D671883j63469J52745Q9202m27829j056286j562661j782111j415617n51832
39138b045975j16098p52422j391553l90232J745777K623452J548137O62765J253764
$$ plain form
39129 3137615 4468413 3583301 357258 -2152892 -1953425 -951302 -1645634 -3067932 -2559413
39120 -2559413 -210475 1297261 700772 -630291 -1379500 -1743495 -1937157 -1435408 -330027
39111 -330027 271078 -198195 -1140198 -1990818 -2683813 -2949118 -2825218 -3751936 -6904419
39102 -6904419 -10173222 -9484372 -4210968 1198928 2541055 591038 -1263608 -1861620
39094 -1861620 -2182218 -2135805 -577137 2065016 3888092 4100298 3324086 1747927 -562480
39085 -562480 -1808709 149632 4081460 5826017 3476794 -188828 -1588899 -449959
39077 -449959 1289315 2497494 2921449 2048260 146250 -707894 1126809 4216385 5626686
39068 5626686 4695886 3387647 3194419 3561224 3387050 2392230 805693 -830067 -1330821
$$ packed form
39129C137615J330798q85112l226043k510150J99467J002123o94332j422298N08519
39120b559413K348938J507736n96489j331063p49209l63995j93662N01749J105381
39111c30027O01105m69273r42003q50620o92995k65305J23900r26718l152483
39102f904419l268803O88850N273404N409896J342127j950017j854646n98012
39094a861620l20598M6413J558668K642153J823076K12206p76212j576159k310407
39085e62480j246229J958341L931828J744557k349223l665622j400071J138940
39077d49959J739274J208179M23955q73189j902010q54144J834703L089576J410301
39068E626686r30800j308239j93228L66805j74174r94820j586537j635760n00754
$$ plain form
39059 -1330821 250414 3071682 5004956 4994084 3906214 2941463 2349609 1878903 1310487
39050 1310487 322057 -1052758 -1708415 -507805 1753064 2848338 2006879 893475 1148712
$$ packed form
39059a330821J581235K821268J933274j0872j087870r64751n91854m70706n68416
39050A310487r88430j374815o55657J200610K260869J095274q41459j113404K55237
$$ [...]
##END NTUPLES=NMR SPECTRUM
##END=
