##TITLE=31Pdec_SR157_r3
 , 64 sc
 17.2.2023
##JCAMPDX= 6.0         $$ Bruker NMR JCAMP-DX V2.0
##DATA TYPE= NMR SPECTRUM
##DATA CLASS= NTUPLES
##ORIGIN= UXNMR, Bruker Analytische Messtechnik GmbH
##OWNER= root
$$ XWIN-NMR		Version 3.5
$$ Fri Feb 17 14:05:18 2023 Russian Standard Time (UT+4h)  she@DPX200
##.OBSERVE FREQUENCY= 81.013821
##.OBSERVE NUCLEUS= ^31P
##.ACQUISITION MODE= SIMULTANEOUS
##.ACQUISITION SCHEME= undefined
##.AVERAGES= 64
##.DIGITISER RES= 16
##SPECTROMETER/DATA SYSTEM= spect
##.PULSE SEQUENCE= zgpg30
##.SOLVENT NAME= CDCl3
##.SHIFT REFERENCE= (INTERNAL, CDCl3, 0, 248.564)
##AUDIT TRAIL= $$ (NUMBER, WHEN, WHO, WHERE, WHAT)
$$ ##TITLE= Audit trail, XWIN-NMR		Version 3.5
$$ ##JCAMPDX= 5.01
$$ ##ORIGIN= Bruker BioSpin GmbH
$$ ##OWNER= she
$$ F:/spectra/data/she/nmr/P31/1/pdata/1/auditp.txt
$$ ##AUDIT TRAIL=  $$ (NUMBER, WHEN, WHO, WHERE, WHAT)
(   1,<2023-02-17 14:03:39.43 +0400>,<she>,<DPX200>,
      <continue with go, POWCHK disabled, PULCHK disabled
       configuration hash MD5:
       00 E9 B6 7A A2 85 ED C7 34 08 36 98 17 FE 4E 26
       data hash MD5: 32K
       BA 0B 8A 5D EA 2D DD 94 7A D9 A6 20 0E 13 BA 4B>)
(   2,<2023-02-17 14:03:40.89 +0400>,<she>,<DPX200>,
      <Start of raw data processing
       efp BC_mod = 2 LB = 1 FT_mod = 6 PKNL = 1 PHC0 = -10967.1 PHC1 = 44.81271 SI = 64K 
       data hash MD5: 64K
       9F A5 A9 6D 5C F1 6B 00 84 D9 8B E0 6B C9 A7 B6>)
(   3,<2023-02-17 14:03:56.96 +0400>,<she>,<DPX200>,
      <pk PHC0 = -0.3860866 PHC1 = 0 
       data hash MD5: 64K
       89 BF B0 73 61 61 8D 39 E4 D3 6B DB 85 FF 09 BD>)
(   4,<2023-02-17 14:04:30.37 +0400>,<she>,<DPX200>,
      <pk PHC0 = -29.4355 PHC1 = 83.39999 
       data hash MD5: 64K
       D6 58 A3 99 6B E9 D6 57 E0 9B B9 64 AD BF A4 8B>)
(   5,<2023-02-17 14:04:34.39 +0400>,<she>,<DPX200>,
      <abs ABSG = 5 
       data hash MD5: 64K
       67 E5 BB D3 84 9E 7E 20 76 14 61 BE AD 4A EE F2>)
(   6,<2023-02-17 14:04:51.65 +0400>,<she>,<DPX200>,
      <pk PHC0 = 0.6130367 PHC1 = 0 
       data hash MD5: 64K
       D4 F5 3A E3 89 1D 27 2E 24 44 75 9D B3 F2 D9 03>)
$$ ##END=
$$ 
$$ hash MD5
$$ FC 51 8B 94 77 29 59 E0 8E 9D AA 09 D8 0B 8E 98
##$RELAX= 
##$RELAX= 
##$RELAX= 
##$RELAX= 
##$RELAX= 
##$RELAX= 
##$RELAX= 
##$RELAX= 
##$RELAX= 
$$ Bruker specific parameters
$$ --------------------------
##$DU= <F:/spectra>
##$EXPNO= 1
##$NAME= <P31>
##$PROCNO= 1
##$TYPE= <nmr>
##$USER= <she>
##$AMP= (0..31)
100 100 100 100 100 100 100 100 100 100 100 100 100 100 100 100 100 100 
100 100 100 100 100 100 100 100 100 100 100 100 100 100 
##$AQSEQ= 0
##$AQ_mod= 1
##$AUNM= <au_zg>
##$AUTOPOS= <>
##$BF1= 81.014009
##$BF2= 200.13
##$BF3= 200.13
##$BF4= 200.13
##$BF5= 200.13
##$BF6= 200.13
##$BF7= 200.13
##$BF8= 200.13
##$BYTORDA= 1
##$CFDGTYP= 0
##$CFRGTYP= 5
##$CHEMSTR= <none>
##$CNST= (0..31)
1 1 145 1 1 1 1 1 1 1 1 1 1 1 1 1 1 1 1 1 1 1 1 1 1 1 1 1 1 1 1 1 
##$CPDPRG= <waltz16>
##$CPDPRG1= <>
##$CPDPRG2= <waltz16>
##$CPDPRG3= <>
##$CPDPRG4= <mlev>
$$ [...]
##$SUBNAM3= <"">
##$SUBNAM4= <"">
##$SUBNAM5= <"">
##$SUBNAM6= <"">
##$SUBNAM7= <"">
##$SUBNAM8= <"">
##$SUBNAM9= <"">
##$SW= 501.771253377433
##$SWIBOX= (0..15)
0 1 3 0 0 0 0 0 0 0 0 0 0 0 0 0 
##$SW_h= 40650.406504065
##$TD= 32768
##$TD0= 1
##$TE= 0
##$TE2= 300
##$TE3= 300
##$TEG= 300
##$TL= (0..7)
0 120 53 12 22 120 120 120 
##$TP= (0..7)
150 150 150 150 150 150 150 150 
##$TP07= 0
##$TPNAME0= <>
##$TPNAME1= <>
##$TPNAME2= <>
##$TPNAME3= <>
##$TPNAME4= <>
##$TPNAME5= <>
##$TPNAME6= <>
##$TPNAME7= <>
##$TPOAL= (0..7)
0.5 0.5 0.5 0.5 0.5 0.5 0.5 0.5 
##$TPOFFS= (0..7)
0 0 0 0 0 0 0 0 
##$TUNHIN= 0
##$TUNHOUT= 0
##$TUNXOUT= 0
##$USERA1= <user>
##$USERA2= <user>
##$USERA3= <user>
##$USERA4= <user>
##$USERA5= <user>
##$V9= 5
##$VALIST= <valist>
##$VCLIST= <CCCCCCCCCCCCCCC>
##$VD= 0
##$VDLIST= <DDDDDDDDDDDDDDD>
##$VPLIST= <PPPPPPPPPPPPPPP>
##$VTLIST= <TTTTTTTTTTTTTTT>
##$WBST= 1024
##$WBSW= 4
##$XGAIN= (0..3)
0 0 0 0 
##$XL= 0
##$YL= 0
##$YMAX_a= 24599
##$YMIN_a= -52066
##$ZGOPTNS= <>
##$ZL1= 120
##$ZL2= 120
##$ZL3= 120
##$ZL4= 120
##$ABSF1= 248.5645
##$ABSF2= -253.2056
##$ABSG= 5
##$ABSL= 3
##$ALPHA= 0
##$AQORDER= 0
##$ASSFAC= 0
##$ASSFACI= 0
##$ASSFACX= 0
##$ASSWID= 0
##$AUNMP= <proc_1d>
##$AZFE= 0.1
##$AZFW= 0.5
##$BCFW= 0
##$BC_mod= 2
##$BYTORDP= 0
##$COROFFS= 0
##$CY= -3
##$DATMOD= 1
##$DC= 0
##$DFILT= <>
##$DTYPP= 0
##$F1P= 0
##$F2P= 0
##$FCOR= 1
##$FTSIZE= 65536
##$FT_mod= 6
##$GAMMA= 0
##$GB= 0
##$INTBC= 1
##$INTSCL= 6.047779e-11
##$ISEN= 30
##$LB= 1
##$LEV0= 0
##$LPBIN= 0
##$MAXI= 10000
##$MC2= 0
##$MEAN= 0
##$ME_mod= 0
##$MI= 50
##$NCOEF= 0
##$NC_proc= -7
##$NLEV= 6
##$NOISF1= 182.463
##$NOISF2= 159.3651
##$NSP= 0
##$NTH_PI= 0
##$NZP= 0
##$OFFSET= 248.5645
##$PC= 4
##$PHC0= -10996.32
##$PHC1= 128.2127
##$PH_mod= 1
##$PKNL= yes
##$PPARMOD= 0
##$PSCAL= 0
##$PSIGN= 0
##$REVERSE= no
##$SF= 81.0140089999694
##$SI= 65536
##$SIGF1= 159.3651
##$SIGF2= -187.1042
##$SINO= 113.3802
##$SIOLD= 16384
##$SREGLST= <1H.CDCl3>
##$SSB= 0
##$STSI= 65536
##$STSR= 0
##$SW_p= 40650.406504065
##$SYMM= 0
##$S_DEV= 0
##$TDeff= 32768
##$TDoff= 0
##$TI= <>
##$TILT= no
##$TM1= 0
##$TM2= 0
##$TOPLEV= 0
##$USERP1= <user>
##$USERP2= <user>
##$USERP3= <user>
##$USERP4= <user>
##$USERP5= <user>
##$WDW= 1
##$XDIM= 65536
##$YMAX_p= 422653993
##$YMIN_p= -24092991
$$ End of Bruker specific parameters
$$ ---------------------------------
##NTUPLES= NMR SPECTRUM
##VAR_NAME=  FREQUENCY,     SPECTRUM/REAL,   SPECTRUM/IMAG
##SYMBOL=    X,             R,               I
##VAR_TYPE=  INDEPENDENT,   DEPENDENT,       DEPENDENT
##VAR_FORM=  AFFN,          ASDF,            ASDF
##VAR_DIM=   65536,         65536,           65536
##UNITS=     HZ,            ARBITRARY UNITS, ARBITRARY UNITS
##FACTOR=    0.620285442955139, 1,           1
##FIRST=     20137.2065510682, 0,            0
##LAST=      -20513.1999529968, 0,           0
##MIN=       -20513.1999529968, -24092991,   0
##MAX=       20137.2065510682, 422653993,    0
$$ Real data points
##PAGE= N=1
##DATA TABLE= (X++(R..R)), XYDATA
$$ [...]
44429C025252k766095m705861p33205K843563R17470j888540J07746L382690J622217
$$ 3025252 259157 -4446704 -5179909 -2336346 -1418876 -3307416 -3199670 183020 1805237
44420A805237k879881k962071J543572M135779K119451q79162k039144k130704
$$ 1805237 -1074644 -4036715 -2493143 1642636 3762087 2882925 843781 -1286923
44412a286923j531845L46113J781792M79372j726722j235667R99979J269976K78004
$$ -1286923 -2818768 -2472655 -690863 -211491 -1938213 -3173880 -2173901 -903925 -625921
44403f25921J761242M300186K281009l858715o381531j958811K959944K456757
$$ -625921 1135321 5435507 7716516 3857801 -2523730 -4482541 -1522597 934160
44395I34160j91259N83407L118072K349387j238100l238220k956001k928376k863501
$$ 934160 742901 1326308 4444380 6793767 5555667 2317447 -638554 -3566930 -6430431
44386f430431m47964K912759L280537Q24757l12232J061668J640435m54014l052380
$$ -6430431 -6878395 -3965636 -685099 139658 -172574 889094 2529529 2075515 -976865
44377i76865m038148l621695j897432J279747L361453J191287k829155k283073
$$ -976865 -5015013 -8636708 -10534140 -9254393 -5892940 -4701653 -7530808 -9813881
44369i813881L459335O853893L016608k672038k688999J597481L168672N05218
$$ -9813881 -6354546 499347 3515955 843917 -1845082 -247601 2921071 3426289
44361C426289j324522L88585K399978J483519j134066k668396k406798j278995
$$ 3426289 2101767 2490352 4890330 6373849 5239783 2571387 164589 -1114406
44353a114406n20798j209423k754222k363133J090941L793169J634434k749208
$$ -1114406 -1635204 -2844627 -5598849 -7961982 -6871041 -3077872 -1443438 -4192646
44345d192646k807492J961459M841405K163551j442717j106744Q32749J04388
$$ -4192646 -7000138 -5038679 -197274 1966277 523560 -583184 249565 353953
44337C53953j596662j0510L453674L386011r06352m345605l754698j292284L68199
$$ 353953 -1242709 -1253219 2200455 5586466 4680114 334509 -3420189 -4712473 -4344274
44328d344274J312757J562668l16828l553450m102790k11803L955963L537446
$$ -4344274 -3031517 -1468849 -1785677 -5339127 -9441917 -9653720 -5697757 -2160311
44320b160311l24943k455197r74796J039268R45800p4487L584P23596P19678N20854
$$ -2160311 -2485254 -4940451 -5915247 -4875979 -3930179 -4004666 -4001082 -3277486 -2557808 -2036954
44310b036954J361850K342743J410102j084233k383754j325369J00385J40374
$$ -2036954 -675104 1667639 3077741 1993508 -390246 -1715615 -1615230 -1474856
44302a474856k04155L45520O92052m51650j697181j247865m06332j250145k039011
$$ -1474856 -1679011 -1333491 -641439 -1093089 -2790270 -4038135 -4444467 -5694612 -7733623
44293g733623N96889N137356N858161J143517l712653m114763k074162j580491
$$ -7733623 -7136734 -1999378 3858783 5002300 1289647 -2825116 -4899278 -6479769
44285f479769k209043j262472R29687K203918K753289L813825L940238R88591
$$ -6479769 -8688812 -9951284 -9021597 -6817679 -4064390 -250565 3689673 4678264
44277D678264l348445n213403m007636k209258o66410J653266L786679L234056
$$ 4678264 1329819 -3883584 -7891220 -10100478 -10766888 -9113622 -5326943 -2092887
44269b092887M20331j557670j840463k174888k269650J82603L956566M194391
$$ -2092887 -1672556 -3230226 -5070689 -7245577 -9515227 -9332624 -5376058 -1181667
44261a181667n9624l311084j522341K100883K830124J541522J496473J660951
$$ -1181667 -1241291 -4552375 -6074716 -3973833 -1143709 397813 1894286 3555237
44253C555237r92702m653403m362542j43156K426026O90861j382739j21544J981632
$$ 3555237 2562535 -2090868 -6453410 -6596566 -4170540 -3479679 -4862418 -4983962 -3002330
44244c002330Q53402k086776k021665J480294L427052P44383l126898k966608
$$ -3002330 -2148928 -4235704 -6257369 -4777075 -1350023 -605640 -3732538 -6699146
44236f699146J264004M695342L736471l10693l561066l497138m69252L003303
$$ -6699146 -5435142 -739800 2996671 2685978 -875088 -4372226 -4841478 -1838175
44228a838175L984154J641368j476941j976682K62107K025100J127122j134875
$$ -1838175 2145979 3787347 2310406 333724 595831 2620931 3748053 2613178
44220B613178k550765k729647k049264k77157J872945J994032p82596l507136
$$ 2613178 62413 -2667234 -4716498 -4993655 -3120710 -1126678 -1909274 -5416410
44212e416410k878434M25044L266577M252756L711438J345368k552356m936598
$$ -5416410 -8294844 -7869800 -4603223 -350467 3360971 4706339 2153983 -2782615
44204b782615l084086Q82331K482972J308162P28531J624390J380742m13019n73194
$$ -2782615 -5866701 -4984370 -2501398 -1193236 -464705 1159685 2540427 2127408 1554214
44195A554214J734769K660386j10891l118180k407067L38070N66057k498879n303516
$$ 1554214 3288983 5949369 5838478 2720298 313231 651301 1217358 -1281521 -6585037
44186f585037m716335r29634L219903M297152J224913k732689l113724j63762
$$ -6585037 -11301372 -12231006 -9011103 -4713951 -3489038 -6221727 -9335451 -9499213
44178i499213J552591M61186M58545L619958N323103J229663m633673m671821
$$ -9499213 -7946622 -7485436 -7026891 -3406933 1916170 3145833 -1487840 -6159661
44170f159661J263197N607233L608850j181731k902590o30328K010287J738709
$$ -6159661 -4896464 710769 4319619 3137888 235298 -395030 1615257 3353966
44162C353966j286954l770317k415602J942844M241701J261768l481872l932817
$$ 3353966 2067012 -1703305 -4118907 -2176063 2065638 3327406 -154466 -4087283
44154d087283L53289L926036L106719k4642j991933k407075k422529j865397k25071
$$ -4087283 -3733994 192042 3298761 3274119 1282186 -1124889 -3547418 -5412815 -5637886
44145e637886J503421K042199J630638J108937M00086p43464j529993j008465
$$ -5637886 -4134465 -2092266 -461628 647309 1047395 303931 -1226062 -2234527
44137b234527M84796J747668K088345J639780Q35474P1196n34350j228834k024902
$$ -2234527 -1749731 -2063 2086282 3726062 4561536 4632732 4098382 2869548 844646
44128H44646k217633j321479k05055j15566p02533m14808R88427J792097P01382
$$ 844646 -1372987 -2694466 -2899521 -3015087 -3717620 -4132428 -3144001 -1351904 -650522
44119f50522j347283k391343j574983L95184K095833K275568P08171j376612k303009
$$ -650522 -1997805 -4389148 -5964131 -5568947 -3473114 -1197546 -489375 -1865987 -4168996
44110d168996j628557k38711J147449K506289L349301K372874p47549l925517
$$ -4168996 -5797553 -6036264 -4888815 -2382526 966775 3339649 2592100 -1333417
44102a333417m226519j023783K997259M304033J866310k059621m297694l544090
$$ -1333417 -5559936 -6583719 -3586460 717573 2583883 524262 -3773432 -7317522
44094g317522q44418J921361L350009K895573J103156n45026r32441m28634N719
$$ -7317522 -8161940 -6240579 -2890570 5003 1108159 563133 -369308 -797942 -792223
44085g92223K43953L49785n05524k390311k787967M17752M399624L842539j252227
$$ -792223 -548270 -198485 -704009 -3094320 -5882287 -5464535 -1064911 2777628 1525401
44076A525401m619552k493395J236147J712408M45225J401602L550694L071977
$$ 1525401 -3094151 -5587546 -4351399 -2638991 -2193766 -792164 2758530 5830507
44068E830507M84271o60134o80230k801420n892882n097842l09646K831308J915141
$$ 5830507 6314778 5654644 4974414 2172994 -3719888 -8817730 -9127376 -6296068 -4380927
44059d380927R46252K230246K097601j502551l797514q47957L170533K478209
$$ -4380927 -3434675 -1204429 893172 -609379 -4406893 -5254850 -2084317 393892
44051C93892j056355j884386k80360m06246j521106O17932M635090M349754o46957
$$ 393892 -662463 -2546849 -2827209 -3233455 -4754561 -4136629 498461 4848215 4201258
44042D201258l437699q14461J883909K05835k393961j536423M41223m80395k474161
$$ 4201258 763559 -50902 1833007 2038842 -355119 -1891542 -1450319 -1930714 -4404875
44033d404875j724695J94516m43198j978508k58258L069881K849688o7067J75600
$$ -4404875 -6129570 -5935054 -6378252 -8356760 -8615018 -5545137 -2695449 -2762516 -2586916
44024b586916L654009L605057j716606m765706n31338N049990M380885m47204
$$ -2586916 1067093 4672150 2955544 -1810162 -2341500 2708490 7089375 6642171
44016F642171k601057j794528k573283m581756l212396J198487L144368J269254
$$ 6642171 4041114 2246586 -326697 -4908453 -8120849 -6922362 -3777994 -2508740
44008b508740K44789K022317K550516l20191k460280o07714J927033J071436j297337
$$ -2508740 -2263951 -241634 2308882 1988691 -471589 -1079303 847730 1919166 621829
43999F21829j317765J5157p01698k635113k016374J171179K889056J316412q42172
$$ 621829 -695936 -680779 -1382477 -4017590 -6033964 -4862785 -1973729 -657317 -1499489
43990a499489r09225K97838N89614l79094j141357m05517J557051K886479J726597
$$ -1499489 -2408714 -2110876 -1521262 -1900356 -3041713 -3447230 -1890179 996300 2722897
43981B722897j509998m074940l788776j291797J110658J805269O69230j068016
$$ 2722897 1212899 -2862041 -6650817 -7942614 -6831956 -5026687 -4357457 -5425473
43973e425473j333890P25848K869204K078217r88837k714616k143842k124822
$$ -5425473 -6759363 -6033515 -3164311 -1086094 -2074931 -4789547 -6933389 -9058211
43965i058211l609555l275198O00862M233943L934355J778896J424559J789781
$$ -9058211 -12667766 -15942964 -15342102 -11108159 -7173804 -5394908 -3970349 -2180568
43957b180568p997k344239j565053J133492J389832p30942r14454J765951L324274
$$ -2180568 -2188565 -4532804 -6097857 -4964365 -3574533 -4305475 -5219929 -3453978 -129704
43948a29704J668585n44263j088109j219235j998955k112082j158333j048897
$$ -129704 1538881 994618 -93491 -1312726 -3311681 -5423763 -6582096 -7630993
43940g630993k247963k312668l0380K384566K955677K543258K182218J182730
$$ -7630993 -9878956 -12191624 -12222004 -9837438 -6881761 -4338503 -2156285 -973555
43932i73555l67336n66432Q48293J234224o05959j921398l35231K153834K247668
$$ -973555 -1340891 -1907323 -1059030 175194 -430765 -2352163 -2687394 -533560 1714108
43923A714108J11579j712265k264384k277471j726823M1268K380602L564688K662409
$$ 1714108 1825687 113422 -2150962 -4428433 -6155256 -6113988 -3733386 -168698 2493711
43914B493711J61877k599453m017141l296291j404248J73694J448234K884562
$$ 2493711 2655588 56135 -3961006 -7257297 -8661545 -8487851 -7039617 -4155055
43906d155055K935229k17390m281281m187171O91214M442151K288616k794933
$$ -4155055 -1219826 -1437216 -5718497 -9905668 -9214454 -4772303 -2483687 -5278620
43898e278620m354151j049472K634270L126135J681528J335194K515826K892263
$$ -5278620 -9632771 -10682243 -8047973 -4921838 -3240310 -1905116 610710 3502973
43890C502973P99225k130604k533397K05044K454687R37536k555734l706634j882198
$$ 3502973 4302198 2171594 -361803 -156759 2297928 3235464 679730 -3026904 -4909102
43881d909102k88148m27222o28070l25257j099120k348948q46574L363808N409297
$$ -4909102 -5197250 -5624472 -6252542 -6577799 -7676919 -10025867 -10872441 -7508633 -2099336
43872b099336K705519q98014j416359p34212k144738l919455k447871J165580
$$ -2099336 606183 -291831 -1708190 -2442402 -4587140 -8506595 -10954466 -9788886
43864i788886K965900K488578K021279J277663j618260m784273l986265M07710
$$ -9788886 -6822986 -4334408 -2313129 -1035466 -2653726 -7437999 -11424264 -11016554
43856a1016554L146865J698485n55582j31917J719927J951160J50407k038920
$$ -11016554 -7869689 -6171204 -6726786 -6858703 -5138776 -3187616 -3037209 -5076129
43848e076129l395998l177134q61898K408692L967621K850140J339632J726684
$$ -5076129 -8472127 -11649261 -12511159 -10102467 -6134846 -3284706 -1945074 -218390
43840b18390K969755K413852j60587k250469k178471j064701p18703j033654p66268
$$ -218390 2751365 5165217 5004630 2754161 575690 -489011 -1207714 -2241368 -3007636
43831c007636j54651q52584k862199l476917q11251L018503M380151K891047J172018
$$ -3007636 -3162287 -4014871 -6877070 -10353987 -11165238 -8146735 -3766584 -875537 296481
43822B96481M20946o08665k063238j973416L8707J310788K19026j171885p07087
$$ 296481 717427 108762 -1954476 -3927892 -3889185 -2578397 -2359371 -3531256 -4238343
43813d238343K43170n72617k123330j561440J369905M055431M448306K742026
$$ -4238343 -3995173 -4567790 -6691120 -8252560 -6882655 -2827224 1621082 4363108
43805D363108K66103j585413j945764j280205r01744j010816n66324L25602k9033
$$ 4363108 4629211 3043798 1098034 -182171 -1083915 -2094731 -2661055 -2335453 -2364486
43796b364486j921623l051842j766839N81052J955233K233858K054191J180194
$$ -2364486 -4286109 -7337951 -9104790 -8523738 -6568505 -4334647 -2280456 -1100262
43788a100262m74418k028236k808245k459623J6125M216646N843291J213941n439621
$$ -1100262 -1574680 -3602916 -6411161 -8870784 -8854659 -4638013 1205278 2419219 -3020402
43779c020402n549336J270714N532639J901447k978521j916087J483224N24644
$$ -3020402 -8569738 -7299024 -1766385 135062 -2843459 -4759546 -3276322 -2751678
43771b751678k342023n60056M096492M502365O53872j226450l05177j304790l722175
$$ -2751678 -5093701 -5653757 -1557265 2945100 3598972 2372522 2067345 762555 -2959620
43762b959620j845241L543420M429497q54737l751245O20445N224938K502358
$$ -2959620 -4804861 -1261441 3168056 2313319 -1437926 -817481 4407457 6909815
43754F909815m017739o177844l117340Q7190J161830J468927J278211J41538j23417
$$ 6909815 2892076 -3285768 -6403108 -6315918 -5154088 -3685161 -2406950 -2265412 -2388829
43745b388829K098123M297691K747943j729444m515955l058700O94000L082382
$$ -2388829 -290706 4006985 6754928 5025484 509529 -2549171 -1855171 1227211
43737A227211K099525j251785l816385l446239j517691p01389q10883K69544K110766
$$ 1227211 3326736 2074951 -1741434 -5187673 -6705364 -7406753 -8217636 -7948092 -5837326
43728e837326K164924O12106K26443J002439M818k482755k296935J295051L391377
$$ -5837326 -3672402 -3060296 -2833853 -1831414 -1826596 -4309351 -6606286 -5311235 -1919858
43719a919858J276192j121297k3419K180116J830735K39332L60583J047648m93413
$$ -1919858 -643666 -1764963 -1788382 391734 2222469 2461801 2822384 3870032 3376619
43710C376619l227710l692113j074533K309462L842327J987970k430162n039309
$$ 3376619 148909 -3543204 -4617737 -2308275 1534052 3522022 1091860 -3947449
43702c947449k034239L180890K902538l268479o470202j785372M026205L535099
$$ -3947449 -5981688 -2800798 101740 -3166739 -9636941 -11422313 -7396108 -3861009
43694c861009R8258O97294L484218J791122l478492n214694j842271J350167J684478
$$ -3861009 -3762751 -3065457 418761 2209883 -1268609 -6483303 -8325574 -6975407 -5290929
43685e290929J555528J782096L62396j901111j655064Q02447J994934J683160
$$ -5290929 -3735401 -1953305 -1590909 -3492020 -5147084 -4344637 -2349703 -666543
43677f66543K269413K563367m18144l918062k057034L573889M724484n89175m863306
$$ -666543 1602870 4166237 3748093 -169969 -2227003 1346886 6071370 5482195 618889
43668F18889l380869p76825j464062k137115P42186L510616J809510j515126j661522
$$ 618889 -2761980 -3538805 -5002867 -7139982 -6397796 -2887180 -1077670 -2592796 -4254318
43659d254318m2164n32767j816747m33050J874217R73406j802378j617058J473502
$$ -4254318 -4296482 -4829249 -6645996 -7079046 -5204829 -4231423 -6033801 -7650859 -6177357
43650f177357K844444J302291J40874K27399j268667m161747l784724J251313
$$ -6177357 -3332913 -2030622 -1889748 -1662349 -2931016 -7092763 -10877487 -9626174
43642i626174N417013L902180n12198k243370j039689n65121j210848J04053L340511
$$ -9626174 -4209161 -306981 -819179 -3062549 -4102238 -4667359 -5878207 -5774154 -2433643
43633b433643M062898L64118l475089l146046o16794m07206k078017j371038K126403
$$ -2433643 1629255 1993373 -1481716 -4627762 -5244556 -5651762 -7729779 -9100817 -6974414
43624f974414L912248J906291l96549j42752M62180q41953j519076J090613L908555
$$ -6974414 -3062166 -1155875 -1552424 -1695176 -1232996 -2074949 -3594025 -2503412 1405143
43615A405143K437907j447353j948523J586016L878790J821086k078908m605441
$$ 1405143 3843050 2395697 447174 2033190 5911980 7733066 5654158 1048717
43607A048717n029610k975869J598717N423161M234057o02198k993408j079179
$$ 1048717 -3980893 -6956762 -5358045 65116 4299173 3696975 703567 -375612
43599c75612L59282j514351k774251j4201L286775K519565m40272p71591J373763
$$ -375612 -16330 -1530681 -4304932 -4319133 -1032358 1487207 1046935 275344 1649107
43590A649107J939429j05900j955802j941930j041908j44341O73321Q15510k0589
$$ 1649107 3588536 3482636 1526834 -415096 -1457004 -1601345 -928024 -112514 -133103
43581a33103o26965k31078j50188j164761j298401R81103L437787L064327N15440
$$ -133103 -760068 -991146 -1141334 -2306095 -3604496 -2623393 814394 3878721 4394161
43572D394161j504952k276560k388356j347363O85825J221883o69358j454604
$$ 4394161 2889209 612649 -1775707 -3123070 -2437245 -1215362 -1884720 -3339324
43564c339324J418208L979706J226432m148925n124431j192059J403638K35906
$$ -3339324 -1921116 2058590 3285022 -863903 -5988334 -7180393 -5776755 -5540849
43556e540849j83409K496594L768871L00217l533226k060096K955409N072803
$$ -5540849 -5724258 -3227664 541207 841424 -2691802 -4751898 -1796489 3276314
43548C276314K183789j781398k942583j544738j82282m61138j666379j760182
$$ 3276314 5460103 3678705 736122 -808616 -990898 -1452036 -3118415 -4878597
43540d878597P2633J966854J679147j20952j029750q90161j455284k177978m24276
$$ -4878597 -4805964 -2839110 -1159963 -1280915 -2310665 -3200826 -4656110 -6834088 -7258364
43531g258364L182781M094137O91205k303358m47995L719001M368618M53842l708770
$$ -7258364 -4075583 18554 709759 -1593599 -2041594 1677407 6046025 6499867 2791097
43522B791097m505876k240886Q17750K573764J840663n30693j725206j92726J960371
$$ 2791097 -1714779 -3955665 -3137915 -564151 1276512 745819 -979387 -1172113 788258
43513G88258J764924m49824j944308j746352j426749k030362k582239j887404
$$ 788258 2553182 2103358 159050 -1587302 -3014051 -5044413 -7626652 -9514056
43505i514056j34656J600970K425037K161307J416072Q15502P6175j183759j804760
$$ -9514056 -9648712 -8047742 -5622705 -3461398 -2045326 -1229824 -1153649 -2337408 -4142168
43496d142168k17934K382050K556861m56952k915705j517984K048139L629183
$$ -4142168 -4360102 -1978052 578809 121857 -2793848 -4311832 -2263693 1365490
43488A365490J801339j477003l617524k988435K47375L137553K149021j865446
$$ 1365490 3166829 1689826 -1927698 -4916133 -4668758 -1531205 617816 -1247630
43480a247630l835595j581319J022068P23835J32295J982713K941438o44097m686383
$$ -1247630 -5083225 -6664544 -5642476 -4918641 -4786346 -2803633 137805 -506292 -5192675
43471e192675k758590K851625M009275k23341k380612P87771L507397J371659
$$ -5192675 -7951265 -5099640 -1090365 -1313706 -3694318 -2906547 600850 1972509
43463A972509j785679j413650N33728O35084J43626J009556J068155j443415l127294
$$ 1972509 186830 -1226820 -693092 -58008 85618 1095174 2163329 719914 -2407380
43454b407380p36857K576898J941873j428801k609417o37766J390732J796486
$$ -2407380 -3144237 -567339 1374534 -54267 -2663684 -3301450 -1910718 -114232
43446a14232J072493p64202l021536k837547N16742K449706o59425m646074l054692
$$ -114232 958261 194059 -2827477 -5665024 -5148282 -2698576 -3358001 -8004075 -11058767
43437a1058767K723054N507236L198918N21201K58123m8795j831975k637737j233692
$$ -11058767 -8335713 -2828477 370441 891642 1149765 1100970 -731005 -3368742 -4602434
43428d602434J38067L07426Q29869J768724J053732p25311m36574J339003K42598
$$ -4602434 -4464367 -4156941 -3327072 -1558348 -504616 -1229927 -1666501 -327498 -84900
43419h4900l798170m978538r18446L055590K724897J510521L216861M483478R67459
$$ -84900 -3883070 -8861608 -9780054 -6724464 -3999567 -2489046 727815 5211293 6178752
43410F178752l971198m216745j017006l50358k345243j494510K967403M920571
$$ 6178752 2207554 -2009191 -3026197 -3376555 -5721798 -7216308 -4248905 671666
43402F71666J273976k733168j339955L434456N056717J314316l516467m400386
$$ 671666 1945642 -787526 -2127481 1306975 6363692 7678008 4161541 -238845
43394b38845j157590J902948J245202j704263k652929m23211J688411J342827
$$ -238845 -1396435 506513 1751715 47452 -2605477 -3028688 -1340277 2550
43386B550N10757J119524J084257j432473l184913o50497K793237J112466m021863
$$ 2550 513307 1632831 2717088 1284615 -1900298 -2550795 242442 1354908 -2666955
43377b666955m617843J004940M682154P43022m925096l525417L650728P356132
$$ -2666955 -7284798 -6279858 -1597704 -854682 -5779778 -9305195 -5654467 1701665
43369A701665L451175k395846l387279n0525K010818k8074l287732l632460j015602
$$ 1701665 5152840 2756994 -630285 -680810 1330008 1301934 -1985798 -5618258 -6633860
43360f633860R60968L16610o90209N24569K458936J817971j042471k536805j373819
$$ -6633860 -5672892 -5356282 -6046491 -5521922 -3062986 -1245015 -2287486 -4824291 -6198110
43351f198110J54768O45202J223751J894805P27257j663917j485312J818151L227183
$$ -6198110 -6043342 -5398140 -4174389 -2279584 -1552327 -3216244 -4701556 -2883405 343778
43342C43778q0730l137249m78135M573490M304486j632899n719373l753605K733
$$ 343778 263048 -2874201 -3352336 1221154 5525640 3892741 -1826632 -5580237 -5577504
43333e577504M31353j358136j455851M96288J846634J367819J18549p60562q80309
$$ -5577504 -5146151 -6504287 -7960138 -7463850 -5617216 -4249397 -4130848 -4891410 -5771719
43324e771719j68873Q14507R17298k16828j605051k303688k215525j272708N68573
$$ -5771719 -5940592 -5126085 -4208787 -4425615 -6030666 -8334354 -10549879 -11822587 -11254014
43315a1254014K133864J797882K02013J63267K695431M970573L751382n02587
$$ -11254014 -9120150 -7322268 -7120255 -6956988 -4261557 709016 4460398 3957811
43307C957811m335434n071806k905591k58288L02594j285826j849091J165783
$$ 3957811 -377623 -5449429 -8355020 -8613308 -8310714 -9596540 -11445631 -10279848
43299a0279848N065609M346693j238290m971304k107518L166521L706494m94608
$$ -10279848 -5214239 -867546 -2105836 -7077140 -9184658 -6018137 -2311643 -2806251
43291b806251l253426j719990O82689R61228P41843K067635L418045K475876j23783
$$ -2806251 -6059677 -7779667 -7096978 -6135750 -5393907 -3326272 91773 2567649 2443866
43282B443866k112896k425020j034526J671192L746443K509016j520776m024499
$$ 2443866 330970 -2094050 -3128576 -1457384 2289059 4798075 3277299 -747200
43274g47200k503318j1291n24345k898362k951243j7952K454237K324685J098557
$$ -747200 -3250518 -3261809 -3786154 -6684516 -9635759 -9653711 -7199474 -4874789 -3776232
43265c776232N92631M83786N7257r3973P43160K081306K827968K174929n0110
$$ -3776232 -3183601 -2699815 -2642558 -2736531 -1993371 87935 2915903 5090832 5040722
43256E040722k704038l519750j669620M22040j15859k459555l131139r14113J864515
$$ 5040722 2336684 -1183066 -2852686 -2430646 -2546505 -5006060 -8137199 -9051312 -7186797
43247g186797K943910K328899P84719r66849j309050P78551K789094R37523l620327
$$ -7186797 -4242887 -1913988 -1129269 -2096118 -3405168 -2626617 162477 1100000 -2520327
43238b520327m989908j018139K711790P79848l861645m241678L95039L965680
$$ -2520327 -7510235 -8528374 -5816584 -5036736 -8898381 -13140059 -12745020 -8779340
43230h779340K562241q10656j360202J433243M431471M971297K805982n76308
$$ -8779340 -6217099 -7027755 -8387957 -6954714 -2523243 2448054 5254036 4677728
43222D677728l305529m350237l809257j984030R09255L558415L774452J339903
$$ 4677728 1372199 -2978038 -6787295 -8771325 -7862070 -4303655 -529203 810700
43214H10700j018312j286703q63532j321844r20509K050084M547369K323665k719523
$$ 810700 -207612 -1494315 -2357847 -3679691 -4600200 -2550116 1997253 4320918 1601395
43205A601395m209389o74524K345868J019897j509706j328554j27457j286827
$$ 1601395 -2607994 -3282518 -936650 83247 -1426459 -2755013 -2882470 -4169297
43197d169297l452480k802939N98094L191760L219525J693423o58251l451931
$$ -4169297 -7621777 -10424716 -9826622 -6634862 -3415337 -1721914 -2380165 -5832096
43189e832096m546579j964498K267219L917049K300145P30141J009158J192154
$$ -5832096 -10378675 -12343173 -10075954 -6158905 -3858760 -3128619 -2119461 -927307
43181i27307k80415j820179j690768p90704m77511l9393J482239K823744K185762
$$ -927307 -1207722 -3027901 -4718669 -5509373 -5986884 -6026277 -4544038 -1720294 465468
43172D65468K05125r21031o13356k95357q39016j273366l79112J345038J865420
$$ 465468 670593 -250438 -863794 -1159151 -1998167 -3271533 -3650645 -2305607 -440187
43163d40187j23472l155609m020927j725582N78958m33569l109267k677458J583684
$$ -440187 -563659 -3719268 -7740195 -9465777 -8886819 -9320388 -12429655 -15107113 -13523429
43154a3523429M875169M070898K296045L208391M422629J492588l875018n469874
$$ -13523429 -8648260 -4577362 -2281317 927074 5349703 6842291 2967273 -2502601
43146b502601j964107J234160M69564j419223j012612K14724k79380j095389Q8041
$$ -2502601 -4466708 -3232548 -2762984 -4182207 -5194819 -4980095 -5259475 -6354864 -6266823
43137f266823J720884J120323m21545L4862J424596L13496k826042m014552k183353
$$ -6266823 -4545939 -3425616 -3847161 -3812299 -2387703 -2074207 -4900249 -8914801 -11098154
43128a1098154k93627J94309J053725K686693K703264O49214m25840Q58095J708695
$$ -11098154 -11391781 -11197472 -10143747 -7457054 -4753790 -4104576 -4530416 -3672321 -1963626
43119a963626J27202j647462j214524L04574J322939K586051L958732K655698
$$ -1963626 -1836424 -3483886 -4698410 -4393836 -3070897 -484846 3473886 6129584
43111F129584j609863l928342j160757K388188J530166j401147j067487J259306
$$ 6129584 4519721 591379 -569378 1818810 3348976 1947829 880342 2139648
43103B139648L13505k933024k314878K418442M372631R82368j804071K8163J915534
$$ 2139648 2453153 -479871 -2794749 -376307 3996324 4978692 3174621 3202784 5118318
43094E118318o72762l875231j995392K608728L141266j096923m415160l555896
$$ 5118318 4445556 570325 -1425067 1183661 4324927 3228004 -1187156 -4743052
43086d743052r00474Q07688J814268K818142L042302J910641J39104j426833k351370
$$ -4743052 -5643526 -4835838 -3021570 -203428 2838874 4749515 4888619 3461786 1110416
43077A110416k145660q28144N85611J459717K278714K744317J161845k200890
$$ 1110416 -1035244 -1863388 -1277777 181940 2460654 5204971 6366816 4165926
43069D165926l495572k41221L922841L374366j467769m432600k138518J643633
$$ 4165926 670354 429133 4351974 7726340 6258571 1825971 -312547 1331086
43061A331086J508855k558289n585781l698026J652222N373519M334950R01865
$$ 1331086 2839941 281652 -5304129 -9002155 -7349933 -1976414 2358536 3260401
43053C260401k12840J626704K379041L9018j776642J87691K782619J029673l591366
$$ 3260401 3047561 4674265 7053306 7092324 5315682 5503373 8285992 9315665 5724299
43044E724299n023307j882996J038815Q52659K46138J475894K222425L14306j982863
$$ 5724299 700992 -1182004 -143189 709470 955608 2431502 4653927 4968233 2985370
43035B985370j925213r46856j600955k703081j538111J102743K122891J109707
$$ 2985370 1060157 113301 -1487654 -4190735 -5728846 -4626103 -2503212 -1393505
43027a393505K77799J70446o92930j903218p97680K884517N223175L004810j664402
$$ -1393505 -1115706 -945260 -1638190 -3541408 -4339088 -1454571 3768604 6773414 5109012
43018E109012l842045j824151J326114K107172N82397o26792j54417O14554k26969
$$ 5109012 1266967 -557184 768930 2876102 3458499 2831707 2677290 3291844 3064875
43009C064875k456049l898280k863881P8054K617355K816494J006641m00941M04985
$$ 3064875 608826 -3289454 -6153335 -6075281 -3457926 -641432 365209 -35732 369253
43000C69253K197284K117662k30397j852460o09861J450801J056103j327588k112156
$$ 369253 2566537 4684199 4453802 2601342 1991481 3442282 4498385 3170797 1058641
42991A058641L09147L634068M867002L225318k35741l652712m837358l026229
$$ 1058641 1367788 5001856 9868858 13094176 12858435 9205723 4368365 1342136
42983A342136m56655K1319j017497o04801J431251J839284m84830k166946p43999
$$ 1342136 885481 906800 -110697 -715498 715753 2555037 2070207 -96739 -840738
42974h40738J250347P47384m57238J013694L572569K470253k317159n034421k162124
$$ -840738 409609 1156993 699755 1713449 5286018 7756271 5439112 404691 -1757433
42965a757433K679297M038892J697470m41856m72122j44529j003378k040422k022922
$$ -1757433 921864 4960756 6658226 6216370 5744248 5599719 4596341 2555919 532997
42956E32997j799529k559096l105562j108960K982033N426652L655761k35963
$$ 532997 -1266532 -3825628 -6931190 -8040150 -5058117 368535 4024296 3788333
42948C788333k031759m97909J895191K786147K140782N37672k117706m900045
$$ 3788333 1756574 1258665 3153856 5940003 8080785 8618457 6500751 1600706
42940A600706n108689j417000L325278M690051J842218j707754k583176j056323
$$ 1600706 -3507983 -4924983 -1599705 3090346 4932564 3224810 641634 -414689
42932d14689M50536Q36580R53459J381764J199201l85420k163886k071334j34742
$$ -414689 35847 872427 1825886 3207650 4406851 4021431 1857545 -213789 -348531
42923c48531J236582O07322k93994Q15632L088251L548220J380936j011278j485021
$$ -348531 888051 1495373 1201379 2017011 5105262 8653482 10034418 9023140 7538119
42914G538119o29331j16322l87106r18703j389581j624351j381057q21699l28438
$$ 7538119 6908788 6792466 6405360 5486657 4097076 2472725 1091668 269969 -58469
42905e8469K62169J060268J009909p46834k514964j590778J434939K813686J115787
$$ -58469 203700 1263968 2273877 1527043 -987921 -2578699 -1143760 1669926 2785713
42896B785713n03403O75857K618560J929742p48306j953472o64790P80504M64666
$$ 2785713 2282310 2958167 5576727 7506469 6758163 4804691 4139901 4920405 5385071
42887E385071j025742k105142j810724j39130J792749K404338J477727L28170
$$ 5385071 4359329 2254187 443463 304333 2097082 4501420 5979147 6307317
42879F307317n42637j969719l242892j650853K881480N789032L770983p6793r93970
$$ 6307317 5764680 3794961 552069 -1098784 1782696 7571728 11342711 11265918 10271948
42870A0271948K17024l41727k104781j092245K280220L043409n504k204193r46817
$$ 10271948 10488972 10147245 8042464 6950219 9230439 12273848 12268344 10064151 9117334
42861I117334M12905p75462j712992J96925K067309N11697k226914k198337n03749
$$ 9117334 9530239 8754777 7041785 7238710 9306019 9817716 7590802 5392465 4888716
42852D888716p05172k007667r69160J429335P48126k856535l750137L77816M268023
$$ 4888716 4183544 2175877 1206717 2636052 3384178 527643 -3222494 -2844678 1423345
42843A423345K655378k052688l563727o36452K042426J170540r81425p42669J481524
$$ 1423345 4078723 2026035 -1537692 -2174144 -131718 1038822 57397 -685272 796252
42834G96252K265490N93679m83138J580647M622146M250520j81230m533594n173783
$$ 796252 3061742 3655421 3172283 4752930 9375076 13625596 13444366 8910772 3736989
42825C736989k985561r82119n9525R46781K402401L252916K623529M15093k863511
$$ 3736989 751428 -230691 -290216 656565 3058966 6311882 8935411 9350504 6486993
42816F486993n272446l783029K045543P542949P129057J174420m151505m417086
$$ 6486993 1214547 -2568482 -522939 7020010 14149067 15323487 11171982 6754896
42808F754896j496945M09155L71819K25331O65840O84505O090m35069l32709l62052
$$ 6754896 5257951 5667106 6038925 6264256 6930096 7614601 7620691 7185622 6852913 6490861
42798F490861o23221m03100L21011O62372L87703K14672J68160p17732k295374
$$ 6490861 5867640 5464540 5785551 6447923 6835626 7050298 7218458 6500726 4205352
42789D205352k605642o35086J662761J872785M88421l69099n94192j570217k463490
$$ 4205352 1599710 964624 2627385 4500170 4988591 4619492 4025300 2455083 -8407
42780h407p79744K637497L227832n37596l868920k462315Q29979O98877j983382
$$ -8407 -788151 1849346 5077178 4539582 670662 -1791653 -961674 -262797 -2246179
42771b246179k073060P84653J813383m8095k58572K470458K839718j619972m626616
$$ -2246179 -4319239 -3534586 -1721203 -1769298 -2027870 442588 3282306 1662334 -2964282
42762b964282m72180O171364O826409J759419j682090q65594K2920j249945k105222
$$ -2964282 -3436462 2734902 9561311 11320730 9638640 8773046 8795966 7546021 5440799
42753E440799j521895j717046k218872L47457M587128M046208k148949n763791
$$ 5440799 3918904 2201858 -17014 330443 4917571 8963779 6814830 1051039
42745A051039j312191N186558N295955M38140j959678l95558M67227r01278j286730
$$ 1051039 -261152 4925406 10221361 10659501 8699823 8304265 8771492 7870214 6583484
42736F583484J56426M11906j109639j070353J616456L457849J997418o74327j739409
$$ 6583484 6739910 7151816 6042177 4971824 6588280 10046129 12043547 11369220 9629811
42727I629811j187217j20058R19608Q15423j289022l117994j331959K449510K472238
$$ 9629811 8442594 8322536 9242144 10057567 8768545 5650551 4318592 6768102 9240340
42718I240340k382011n782025l114444J427035J538570j403375j178019K880186
$$ 9240340 6858329 1076304 -2038140 -611105 927465 -475910 -1653929 1226257
42710A226257M770350J130654l975395n158308k420351L86526R38438k245o74202
$$ 1226257 5996607 7127261 3151866 -2006442 -4426793 -4040267 -3101829 -3104074 -3778276
42701c778276k5695J735670L056486K359915L61869j05383K101335L942506J731222
$$ -3778276 -3803971 -2068301 988185 3348100 3709969 3604586 5705921 9648427 11379649
42692A1379649l020423m173663R48965O499986M745782l042621p139973k254769
$$ 11379649 8359226 4185563 5134528 11634514 16380296 13337675 6197702 3942933
42684C942933N157528O263189K076409J94483K294938L029316R02793J129023
$$ 3942933 9100461 15363650 17440059 17634542 19929480 22958796 23861589 24990612
42676B4990612N266001O995348L208533J189261P585021J7086413K1186837K2700998
$$ 24990612 30256613 37251961 40460494 41649755 49234776 66321189 87508026 110209024
42668A10209024K9844502L8234489L2268658P305365k0825939l4117597l1757259
$$ 110209024 140053526 178288015 210556673 217862038 197036099 162918502 131161243
42661A31161243k5004622k0162448j5179772r032130n259353n953713q407162
$$ 131161243 106156621 85994173 70814401 61782271 56522918 50569205 42162043
42654D2162043r027606p074906m076554k120846k540726m193843l897769o01367
$$ 42162043 33134437 26059531 21982977 19862131 17321405 13127562 9229793 8628426
42646H628426K395325J905274k64780k58995J467512R63366k359618m096439j259515
$$ 8628426 11023751 12929025 12664245 12405250 13872762 14836128 12476510 8380071 7120556
42637G120556L201025M340802J491980j552892j611099M73488J578877M40490
$$ 7120556 10321581 14662383 16154363 14601471 12990372 13463860 15042737 15483227
42629A5483227r21537k83173J339027J225604l51715K6111L307666N537727L582282
$$ 15483227 14561690 14278517 15617544 16843148 16491433 16517544 19825210 25362937 28945219
42620B8945219L08283L41551K922828L603079J731001R08680K018004J500962
$$ 28945219 29253502 29595053 32517881 36120960 37851961 38760641 40778645 42279607
42612D2279607j790378l365002J10497M960312N500450K049992l85524L40185
$$ 42279607 40489229 37124227 37234724 42195036 47695486 49745478 49359954 49700139
42604D9700139J825905K344503L141379M683839M627033J628147j598963j690012
$$ 49700139 51526044 53870547 57011926 61695765 66322798 67950945 66351982 64661970
42596F4661970M95702J083061j432826m591780n762689n009445l473574j414038
$$ 64661970 65157672 66240733 64807907 60216127 54453438 49443993 45970419 44556381
42588D4556381M83288L7033l448878o415581m680316K79547K335540r37618m553558
$$ 44556381 45039669 45076702 41627824 35212243 30531927 30811474 33147014 32209396 27655838
42579B7655838l177609J152766K112716j730867n137317l745969M08036K426398
$$ 27655838 24478229 25630995 27743711 26012844 20875527 17129558 17537594 19963992
42571A9963992Q54280j743821l005889l100035k870567j713973J242434M441528
$$ 19963992 20818272 19074451 16068562 12968527 10097960 8383987 9626421 14067949
42563A4067949M413116J99571m177307m019017j41785K240394R85388m55200N77801
$$ 14067949 18481065 18680636 14503329 10484312 10342527 12582921 13568309 13113109 13690910
42554A3690910J419442o52437k428715P27752O563036Q146058M059655M35636
$$ 13690910 15110352 14457915 12029200 12756952 19319988 27466046 31525701 31961337
42546C1961337J672944M672193M902474L589614N044159R798621J4680860J8735990
$$ 31961337 33634281 38306474 43208948 46798562 51842721 61641342 76322202 95058192
42538I5058192K5234567L6397705M7312422M6877551K7140672o643286l6983180
$$ 95058192 120292759 156690464 204002886 250880437 278021109 271377823 234394643
42531B34394643m8555316m1703098k9221331k1113235j7099889j3591438j0975753
$$ 234394643 185839327 144136229 114914898 93801663 76701774 63110336 52134583
42524E2134583j0615212j0035613o287043j225498J158415P23284K99438M30478
$$ 52134583 41519371 31483758 25196715 23971217 25129632 25852916 26152354 26582832
42516B6582832p03515k940675l814728k563019j150046j152456k267841l735391
$$ 26582832 25879317 22938642 19123914 16560895 15410849 14258393 11990552 8255161
42508H255161m721597l726847l17201K920953K985546P92973j5188J465489K299947
$$ 8255161 3533564 -193283 -510484 2410469 5396015 6188988 6173800 7639289 9939236
42499I939236N29960k017549k805482j852925o33187J44983L56693j02512m55014
$$ 9939236 10469196 8451647 5646165 3793240 3160053 3305036 3661729 3559217 3104203
42490C104203O96661K942652L496559O92806l071394l706380l66866L482787M091808
$$ 3104203 3800864 6743516 10240075 10932881 7861487 4155107 3788241 7271028 11362836
42481A1362836J496860r24454n52143J559666K383183J173336O61563L184661
$$ 11362836 12859696 11935242 11383099 12942765 15325948 16499284 17160847 20345508
42473B0345508O821830P211393L033733k153887m138389k675730r31638j341158
$$ 20345508 27167338 34378731 37412464 35258577 31120188 28444458 27512820 26171662
42465B6171662l348281m838567m394150j953103J365442L310395J748839k470411
$$ 26171662 22823381 17984814 13590664 11637561 13003003 16313398 18062237 15591826
42457A5591826m869965k120683K711525L036262k170414o088682l494891J521638
$$ 15591826 10721861 8601178 11312703 14348965 12178551 6089869 2594978 4116616
42449D116616J894851j540182j972947J953441M121516J209697k355475k325555
$$ 4116616 6011467 4471285 2498338 4451779 8573295 9782992 7427517 5101962
42441E101962q31503r28865j020578O02940J101374j572555l440438p12249K918473
$$ 5101962 4270459 3341594 2321016 2923956 4025330 2452775 -987663 -1699912 1218561
42432A218561J945920j477787j252106K036109K348127j131517k850980n73460
$$ 1218561 3164481 1686694 434588 2470697 4818824 3687307 836327 262867
42424B62867J697523J537837J372765K196081J191386j916249k880012l62220
$$ 262867 1960390 3498227 4870992 7067073 8258459 6342210 3462198 3099978
42416C099978R79703j530224l497827q43000K920332K124685k086884l725164
$$ 3099978 4079681 2549457 -948370 -1791370 1128962 3253647 1166763 -2558401
42408b558401p29036L011126L447835O95633j987785j569104J611908L447519
$$ -2558401 -3287437 -276311 3171524 3867157 1879372 310268 1922176 5369695
42400E369695P97027l424093l484973N56994K545086o8565k126553N45731M216173
$$ 5369695 6166722 2742629 -742344 -185350 2359736 2291171 164618 710349 4926522
42391D926522L611942J70305j523817j332573j600721j119119K260888N362434
$$ 4926522 8538464 8708769 7184952 5852379 4251658 3132539 5393427 10755861
42383A0755861L048018l084966n902633k680126J900920L179129J722924J81883
$$ 10755861 13803879 10718913 4816280 2136154 4037074 7216203 8939127 9121010
42375I121010n45531p14675p04932j364851k708500k600228K26574K816202J526875
$$ 9121010 8575479 7860804 7155872 5791021 3082521 482293 708867 3525069 5051944
42366E051944j970418k748596j91379J477592L60778o42919N12275J905323J785784
$$ 5051944 3081526 332930 141551 1619143 1979921 1337002 1849277 3754600 5540384
42357E540384J341605J506660J088843m9585J67939K087598K969352J546141K82773
$$ 5540384 6881989 8388649 9477492 9427907 9595846 11683444 14652796 16198937 16481710
42348A6481710J139077K834758M268859O417205Q395218O346701j86136n259117
$$ 16481710 17620787 20455545 24724404 31141609 39536827 45883528 45697392 40438275
42340D0438275m411687j611429k983861o997466p362119l535408j014349j557282
$$ 40438275 36026588 34415159 31431298 24433832 17071713 13536305 12521956 10964674
42332A0964674o68766L555711O064335K784954k653163m575780l370382k869836
$$ 10964674 10295908 13851619 19915954 22700908 20047745 15471965 12101583 9231747
42324I231747k844546j27437M159670M793844N19774l557037l480673j554306
$$ 9231747 6387201 6259764 10419434 15213278 15733052 12176015 8695342 7141036
42316G141036j239246j406869K30260J501676r45993m642527l707454J719166
$$ 7141036 5901790 4494921 4725181 6226857 5280864 638337 -3069117 -1349951
42308a349951M587794J261840k891402j646942K892799L979321K42905l094447
$$ -1349951 3237843 4499683 1608281 -38661 2854138 6833459 7076364 3981917
42300C981917j981463J985085M826491M369538R66876l021225m310153j830753
$$ 3981917 2000454 3985539 8812030 13181568 14148444 11127219 6817066 4986313
42292D986313J275502J243403j178978k028350j37043J530489O91862j481025
$$ 4986313 6261815 7505218 6326240 4297890 4160847 5691336 6383198 4902173
42284D902173k939266k943519j164617K068428M015164J748909k793144l949185
$$ 4902173 1962907 -980612 -2145229 -76801 3938363 5687272 2894128 -1055057
42276a055057j69774L406664K574310O252J20210J920522J696828J7946M63983
$$ -1055057 -1224831 2181833 4756143 4762395 4882605 6803127 8499955 8517901 8981884
42267H981884K743412K814903m4933j724172j22101J336075n65785l503777l252688
$$ 8981884 11725296 14540199 14495266 12771094 12648993 13985068 13419283 9915506 6662818
42258F662818q906K405383K182100J019076N06955J19645p80893j379827q60359
$$ 6662818 6653912 9059295 11241395 12260471 12767426 12887071 12106178 10726351 9865992
42249I865992J28581M69261J17188j06347L59443J342165K026439J397239n71434
$$ 9865992 9994573 10463834 10581022 10474675 10834118 12176283 14202722 15599961 15028527
42240A5028527k149512j540329M28751R57526p31121k018677q34391J106011J152580
$$ 15028527 12879015 11338686 11767437 12724963 11993842 9975165 9140774 10246785 11399365
42231A1399365l0835J0705J094292J008640j43092j15017J013218P28391r58630
$$ 11399365 11368530 11379235 12473527 13482167 13339075 13224058 14237276 14965667 14007037
42222A4007037q99865J496292K560302N28140j169693K12166J999901J042628
$$ 14007037 13107172 14603464 17163766 17691906 16522213 16734379 18734280 19776908
42214A9776908q21602q31884q58129l280947m765989r36116M978619N620335Q24700
$$ 19776908 18955306 18123422 17265293 13984346 9218357 8282241 13260860 18881195 19705895
42205A9705895k095745J64152K617315R70825k061771k427729q43312K69075J082710
$$ 19705895 17610150 17774302 20391617 21362442 19300671 16872942 16029630 16298705 17381415
42196A7381415K035487J396819j227376k553428l19565K726339K812779L68155
$$ 17381415 19416902 20813721 19586345 17032917 16713352 19439691 22252470 22620625
42188B2620625j738429k476696k226979p06638J595000K193434j62588k880584
$$ 22620625 20882196 18405500 16178521 15471883 17066883 19260317 19097729 16217145
42180A6217145k742561r4014K210123K278288J24353k663413l142559J75263L860111
$$ 16217145 13474584 13380570 15590693 17868981 17993334 15329921 12187362 12362625 16222736
42171A6222736K806840j934151l580134J30000L012187L06805l564226k345664
$$ 16222736 19029576 17095425 13515291 13645291 16657478 16964283 13400057 11054393
42163A1054393K159012L852896J958628K49197j52377n80472j45959K057868K540563
$$ 11054393 13213405 17066301 19024929 19274126 19121749 18541277 18395318 20453186 22993749
42154B2993749j786369o596104n434838k43065J505006j023717j605876J367278
$$ 22993749 21207380 14611276 9176438 8933373 10438379 9414662 7808786 9176064
42146I176064K306768q58159k622522K83883L378076K702371J042529J350696
$$ 9176064 11482832 10624673 8002151 8286034 11664110 14366481 15409010 16759706
42138A6759706J070513j701008k899762N88256M299755L042254m08407m69204
$$ 16759706 17830219 16129211 13229449 13817705 18117460 21159714 20751307 20282103
42130B0282103J425987l9912l804547l614328J292166M549736K538834r65500
$$ 20282103 21708090 21668178 17863631 14249303 15541469 20091205 22630039 21664539
42122B1664539j793536j060312j203384j267585M29959K332140J839212m95758
$$ 21664539 19871003 18810691 17607307 16339722 16769681 19101821 20941033 20445275
42114B0445275j875966j215795R8415P00991O74947P58228J318577J982286J750698
$$ 20445275 18569309 17353514 17451929 18152920 18827867 19586095 20904672 22886958 24637656
42105B4637656O352k180860k593417m24876K393903L243398J712974l09347j008231
$$ 24637656 24644008 22463148 19869731 19444855 21838758 25082156 26795130 26485783 25477552
42096B5477552k11583J154635K136480K161157J364728Q77538J797035L257819
$$ 25477552 25265969 26420604 28557084 30718241 32082969 32960507 34757542 38015361
42088C8015361K683417p89613m178516l949122r42058N59604j090747k749531
$$ 38015361 40698778 39909165 35730649 31781527 30839469 31399073 30308326 27558795
42080B7558795j617578O00192J106945Q72440K455479M604251L368313j432193
$$ 27558795 25941217 26541409 27648354 28520794 30976273 35580524 38948837 37516644
42072C7516644m851555l124035J645383M627345L955977J689872N24269J063607
$$ 37516644 32665089 29541054 31186437 35813782 39769759 41459631 41983900 43047507
42064D3047507J892838J578203M65117R877K42783m78994k266008k580006l94573
$$ 43047507 44940345 46518548 46983665 46993542 47236325 46757331 44491323 41911317 41516744
42055D1516744J109020o37373k435733L24119N666940P019034K924650j143543
$$ 41516744 42625764 41988391 39552658 39876777 45543717 52562751 55487401 54343858
42047E4343858j445112m04755o77749q63668O8688j56597k038748j760079J904775
$$ 54343858 52898746 52493991 51816242 50952574 51021262 50864665 48825917 47065838 48970613
42038D8970613L454406j044659o233084m742501J335443L810774J088739o38212
$$ 48970613 52425019 51380360 45147276 40404775 41740218 45550992 46639731 46001519
42030D6001519J435551K540859q49798n041470n215149k208326L55499J612836
$$ 46001519 47437070 49977929 49128131 44086661 38871512 36663186 37018685 38631521
42022C8631521K495659K351725K40877k317687k990432j728985N3905J905540
$$ 38631521 41127180 43478905 43719782 41402095 38411663 36682678 36736583 38642123
42014C8642123L691659M060228K116965l58089q82415J08338J3668j747314k684954
$$ 38642123 42333782 46394010 48510975 48152886 47270471 47378809 47392477 45645163 42960209
42005D2960209q50414K446260M493848M496426L974029M520360O071343P106519
$$ 42960209 42109795 44556055 49049903 53546329 57520358 62040718 68112061 75218580
41997G5218580N906285J908549l359578o776366o126368k656023k66523j230872
$$ 75218580 81124865 83033414 79673836 72897470 66771102 64115079 63848556 62617684
41989F2617684l420853l191017n58583O56243j599620m273296l310679N68420
$$ 62617684 59196831 56005814 55447231 56103474 54503854 50230558 46919879 47488299
41981D7488299K969926K159902J101915K256409L331157P80088m081981n821409
$$ 47488299 50458225 52618127 53720042 55976451 59307608 60087696 56005715 50184306
41973E0184306j936843L763500O108728M506166J992528M82108l4349J048432
$$ 50184306 48247463 52010963 58119691 62625857 64618385 65100493 65066144 66114576
41965F6114576M274067O980823N204793j3166k474599P68805N039601N344263
$$ 66114576 70388643 77369466 82574259 82561093 80086494 80855299 85894900 91239163
41957I1239163L851607N229182Q077826P515785M366727M432898Q648453J1265786
$$ 91239163 95090770 100319952 108397778 115913563 120280290 124713188 133361641 144627427
41949A44627427R406429P581107R865212J3627323J4774734J4146451J4532027
$$ 144627427 154033856 161614963 171480175 185107498 199882232 214028683 228560710
41942B28560710J5549438J5714348J6044775J7559692J8443507J7507074J7054491
$$ 228560710 244110148 259824496 275869271 293428963 311872470 329379544 346434035
41935C46434035J8354543J7954951J3090224P160615M618562L816776R23664k146151
$$ 346434035 364788578 382743529 395833753 402994368 407612930 411429706 412353370 410207219
41927D10207219q86625K611610J539768m548831p999690l917397L489303P487686
$$ 410207219 409320594 411932204 413471972 408923141 400923451 397006054 400495357 407983043
41919D07983043O542812L352923O64103J39056J674248K297808p82741n276037
$$ 407983043 414525855 417878778 418542881 418681937 420356185 422653993 421871252 416595215
41911D16595215o106470l338069k758254o991326j1463273j2050201j1611110
$$ 416595215 410488745 407150676 404392422 397401096 385937823 373887622 362276512
41904C62276512j4699331j9651501k0898226j7152063j2882888j2297371j5026130
$$ 362276512 347577181 327925680 307027454 289875391 276992503 264695132 249669002
41897B49669002j7539382j6745272j2487592p655050n122061m243540k127137
$$ 249669002 232129620 215384348 202896756 195241706 190119645 185876105 183748968
41890A83748968J362727K825268Q27325r48127J562966P234580J1369241J1027873
$$ 183748968 185111695 187936963 188764288 187816161 189379127 196613707 207982948 219010821
41882B19010821O438943j011486r360391j5743858j8194498j7523641j5796654
$$ 219010821 225449764 224438278 215077887 199334029 181139531 163615890 147819236
41875A47819236j3668943j0817136q058585o950807p407575p345791n138662j704931
$$ 147819236 134150293 123333157 115274572 108323765 100916190 93570399 88431737 86726806
41867H6726806K90894n29622k258844j865767K55617J03070l727461o269711k409176
$$ 86726806 87017700 86488078 84229234 82363467 82619084 82722154 78994693 72724982 70315806
41858G0315806M963731Q217696N861123M151007O913422J0311601J0697352J1523040
$$ 70315806 75279537 83497233 89358356 93509363 100422785 110734386 121431738 132954778
41850A32954778J7414695K5677319K9393506K6497362K0486226J3642267M715271
$$ 132954778 150369473 176046792 205440298 231937660 252423886 266066153 270781424
41843B70781424o780894j8039908k5395926k7118228k4146456j9732725j7161829
$$ 270781424 264000530 245960622 220564696 193446468 169300012 149567287 132405458
41836A32405458j6164733j3420603q257947m875418o159647q607604p436280l892957
$$ 132405458 116240725 102820122 94562175 89686757 83527110 74919506 67483226 63590269
41828F3590269k535298l435998k900246q72389j322114m730517o115311k449634
$$ 63590269 61054971 57618973 54718727 53846338 52524224 47793707 41678396 39228762
41820C9228762K740595M620828L105537J114937j50435j352092k432696k536889
$$ 39228762 41969357 46590185 49695722 50810659 50660224 49308132 46875436 44338547
41812D4338547j611328l73010O92573J295110J021289j57841j514779k034027
$$ 44338547 42727219 42354209 43046782 44341892 45363181 45205340 43690561 41656534
41804D1656534j020218J364562L721094M437728L761824L570081M274129L964122
$$ 41656534 40636316 42000878 45721972 50159700 53921524 57491605 61765734 65729856
41796F5729856K051170J179095L030611M793630L246480K05504k11944J892548
$$ 65729856 67781026 68960121 71990732 76784362 80030842 80236346 80024402 81916950
41788H1916950K982734K224734J862713K042354N60427k030133k325027J50383
$$ 81916950 84899684 87124418 88987131 91029485 91589912 89559779 87234752 87385135
41780H7385135K037300J870401J595198J411730j158807n306313o027529j975062
$$ 87385135 89422435 91292836 92888034 94299764 93140957 87834644 81807115 79832053
41772G9832053J476609M42573j677518o92566J409632R30814q97160j319391j785362
$$ 79832053 81308662 81751235 80073717 79381151 80790783 81721597 80824437 79505046 77719684
41763G7719684m073335m656978j98465M415273J842041n469113p652891k229403
$$ 77719684 73646349 68989371 68790906 73206179 75048220 69579107 61926216 59696813
41755E9696813K435457N50487k865853j441743K237416J993188j298574j459485
$$ 59696813 62132270 62682757 59816904 58375161 60612577 62605765 61307191 59847706
41747E9847706K895075O392441M727422m62195m982421o527516m998310j534760
$$ 59847706 62742781 69135222 73862644 73400449 68418028 61890512 56892202 55357442
41739E5357442J517010J805951n78802l021063l409283k314747j791244k929134
$$ 55357442 56874452 58680403 58101601 55080538 51671255 49356508 47565264 44636130
41731D4636130m910270n733464l793079L62256L709080L242054o88659m297697
$$ 44636130 39725860 33992396 30199317 30561573 34270653 37512707 36824048 32526351
41723C2526351m245516j088947J731884J859369R5506j333361j487011j108185
$$ 32526351 28280835 27191888 28923772 30783141 30878647 29545286 28058275 26950090
41715B6950090j013305j070988p73400q3058N46280O16928q956q13698r02492
$$ 26950090 25936785 24865797 24092397 24009339 24555619 25172547 25163591 24349893 23447401
41706B3447401j09250N02000J01291l77397L75972J367642J87975k903803m326223
$$ 23447401 23338151 23840151 23941442 23564045 23940017 25307659 25495634 22591831 18265608
41697A8265608k141144P21594O50277j187966q56201J998792L630161K067343
$$ 18265608 16124464 16846058 17496335 16308369 15452168 17450960 21081121 23148464
41689B3148464k63410q30429n27954j065279j518241Q3441L290903N492237M814051
$$ 23148464 22885054 22054625 21526671 20461392 18943151 19026592 22317495 27809732 32623783
41680C2623783J542429k209061l383165l95280L996547M372747p75794o103778
$$ 32623783 34166212 31957151 28573986 28178706 32175253 36548000 35772206 29668428
41672B9668428n556472J81398N252776O211440M556785K559458O77712m75012
$$ 29668428 24111956 24293354 29546130 35757570 40314355 42873813 43551525 43076513
41664D3076513N09804L081405M365582L104752J354835P91570J60596j545492
$$ 43076513 43586317 46667722 51033304 54138056 55492891 56284461 56445057 54899565
41656E4899565k165335L46632L655851L585618J00519k605596j970862Q3965Q16736
$$ 54899565 52734230 53080862 56736713 60322331 60422850 57817254 55846392 55930357 56747093
41647E6747093M04089N51856J295377J112225m80436j989195j740027O9174J371273
$$ 56747093 57151182 57703038 58998415 60110640 59630204 57641009 55900982 55970156 57341429
41638E7341429L46238k343794l790490j944872J652225L101932M19796m008436
$$ 57341429 57687667 55343873 51553383 49608511 51260736 54362668 54782464 50774028
41630E0774028n753490l000155J511876L478473J816599l47766n6331J259027
$$ 50774028 45020538 42020383 43532259 47010732 48827331 48479565 48423234 49682261
41622D9682261q4120l998612n753851k482306K198872K818130m63627k446543
$$ 49682261 49598141 45599529 39845678 37363372 39562244 42380374 41916747 39470204
41614C9470204l90001K690300K875176L79583j786231j972171q75304K98022R30562
$$ 39470204 39080203 41770503 44645679 45025262 43239031 41266860 40391556 40689578 41620140
41605D1620140P91914k3311r64989j312885o83060M83427Q46700m64912j966081
$$ 41620140 42412054 42388743 41423754 40110869 39427809 39911236 40757936 40293024 38326943
41596C8326943j021059J847193K311398j457284m422511j045553N719255P651550
$$ 38326943 37305884 39153077 41464475 40007191 35584680 34539127 40258382 47909932
41588D7909932L196029n96837N20221J956191o99823l598998j510414K694349
$$ 47909932 51105961 50509124 51029345 52985536 52285713 48686715 47176301 49870650
41580D9870650K800837j10038K58272M543176O915111M829223K014366J007932
$$ 49870650 52671487 52561449 52819721 57362897 64278008 69107231 71121597 72129529
41572G2129529o3872j650638o51881L333721N940026N245237N042967P361776
$$ 72129529 72065657 70415019 69763138 73096859 79036885 84282122 89325089 96686865
41564I6686865P832133L393085q56086J286780P251679R650829P503546O527852
$$ 96686865 104518998 107912083 107055997 108342777 115594456 125245285 132748831 139276683
41556A39276683R356508J2280764J2141191J0501098R614388R170824Q813280
$$ 139276683 148633191 160913955 173055146 183556244 193170632 202341456 211154736
41549B11154736R825119J2326997J3958045J3147653J1212599R928770R398136
$$ 211154736 220979855 233306852 247264897 260412550 271625149 281553919 290952055
41542B90952055R255119R435689Q869885O148888K465942R81506K116011K633193
$$ 290952055 300207174 309642863 318512748 324661636 327127578 328109084 330225095 332858288
41534C32858288Q79852o14253o1128k77363m020839q335956q184665m339060k839871
$$ 332858288 333738140 333123887 333062759 332785396 328764557 320428601 312243936 307904876 305065005
41525C05065005o486610j1169134j1864557q843901o111217o214847q673476j1814781
$$ 305065005 298578395 287409261 275544704 266700803 260589586 254374739 245701263 233886482
41517B33886482j4001852j3911018j1534197q745060p515107p584824p031582
$$ 233886482 219884630 205973612 194439415 185694355 178179248 170594424 163562842
41510A63562842n287296m396992o391906j0002155j1390960q660755m432336k638882
$$ 163562842 158275546 153878554 147486648 137484493 126093533 117432778 113000442 110361560
41502A10361560l584662m277298l473839l468615n682500p445306n785489k265431
$$ 110361560 106776898 102499600 99025761 95557146 89874646 82429340 76643851 74378420
41494G4378420p27711j627837k305078j997576k327902k991096j776520L47236
$$ 74378420 73650709 72022872 69717794 67720218 65392316 62401220 60624700 60971936
41486F0971936o21439m585956n807352j802537J577572j055782n522843m515336
$$ 60971936 60350497 55764541 49957189 48154652 49732224 48676442 43153599 38638263
41478C8638263L07005R81017l316369m668715L65305M793969K315820l097494
$$ 38638263 38945268 39926285 36609916 31941201 32306506 37100475 39416295 36318801
41470C6318801m265054j578393j58883m51121J007728L612991K902740j331006
$$ 36318801 32053747 30475354 30316471 29865350 30873078 34486069 37388809 36057803
41462C6057803l659179j183242K077209J236836k715819m826502k729268Q96475
$$ 36057803 32398624 31215382 33292591 34529427 31813608 26987106 24257838 25154313
41454B5154313J781790r79821l576346j859846K764588M219114m6250m908824
$$ 25154313 26936103 25956282 22379936 20520090 23284678 27503792 27457542 22548718
41446B2548718m652875r76645O48033j28712N87904K671693J809900k045093l342731
$$ 22548718 17895843 16919198 17567231 17438519 18026423 20698116 22508016 20462923 17120192
41437A7120192L012K959810J728261n23465r2437Q96238o23457k336169o96989
$$ 17120192 17123204 20083014 21811275 21287810 21195373 22091611 21468154 19131985 18434996
41428A8434996K233965J802769j798137m208965l261515l96253K399861L335338
$$ 18434996 20668961 22471730 20673593 16464628 13203113 12806860 15206721 18542059
41420A8542059R20522k967135l197391J397638M763545K509094n02272J873181
$$ 18542059 19462581 16495446 13298055 14695693 19459238 21968332 21466060 23339241
41412B3339241N978015M097796j940683l501535k29139o62448o437802q002871
$$ 23339241 29317256 33415052 31474369 27972834 27743695 27081247 20643445 12640574
41404A2640574n55161O739681M433762l090347n412964j437338J695968O46687
$$ 12640574 12085413 18825094 23258856 20168509 14755545 13318207 15014175 15660862
41396A5660862j519826k235464j755061j47839K257288L057616J214858p7430
$$ 15660862 14141036 11905572 10150511 10002672 12259960 15317576 16532434 16455004
41388A6455004J429553K360738l97517k990776n61915L473761K131753l410400
$$ 16455004 17884557 20245295 19847778 16857002 16295087 19768848 21900601 18490201
41380A8490201n382378j679100K167824L125664L813854M639890J953411l572248
$$ 18490201 13107823 11428723 13596547 16722211 20536065 25175955 27129366 23557118
41372B3557118n344277j075151L153382K782200J181429J941433K453973O44796
$$ 23557118 18212841 17137690 20291072 23073272 24254701 26196134 28650107 29294903
41364B9294903Q39074O070784J0642935Q031077J479578j192203L31800J00088
$$ 29294903 30133977 36204761 46847696 54878773 56358351 55166148 55497948 55598036
41356E5598036l431204o184983o475409o338335n506987j727537K792337K685616
$$ 55598036 52166832 45981849 39506440 33168105 27661118 25933581 28725918 31411534
41348C1411534j864651m595596k741776n67266j444802k829831j888646l66953
$$ 31411534 29546883 24951287 22209511 21642245 20197443 17367612 15478966 15112013
41340A5112013m78499q06272K17382R43431J0527o31260M19967Q52355r94905
$$ 15112013 14633514 13827242 14044624 14988055 14998582 14367322 14787289 15639644 14644739
41331A4644739k135167L62593L481503J959793l577189o871931m272567J012074
$$ 14644739 12509572 12872165 16353668 18313461 14736272 7864341 3591774 4603848
41323D603848L466953J530073j481187j416379K134105N164629L834074n82073
$$ 4603848 8070801 9600874 8119687 6703308 8837413 14002042 17836116 17254043
41315A7254043l234639k115106j7394M12747q3465m82017j751930l603805k995958
$$ 17254043 14019404 11904298 11886904 12299651 12216186 11734169 9982239 6378434 3382476
41306C382476P89967L350137J423892j621478j263599P22332J38121j320070J031294
$$ 3382476 4172443 7522580 8946472 7324994 6061395 6783727 6921848 5601778 6633072
41297F633072N187385M095362k339130n302630j03749O291948N527974k56615
$$ 6633072 11820457 15915819 13576689 8274059 8170310 14462258 19990232 19733617
41289A9733617k863912l94520J621005q7116k204948j129764J327147J061526
$$ 19733617 16869705 16475185 18096190 18009074 15804126 14674362 16001509 17063035
41281A7063035k059778l878606j655921J853807J582466k799543n336324j231192
$$ 17063035 15003257 11124651 9468730 11322537 12905003 10105460 4769136 3537944
41273C537944N995560Q396296M064519p88139j070196Q46554O38575p95174j16855
$$ 3537944 9533504 17929800 21994319 21206180 20135984 20982538 21621113 20825939 20709084
41264B0709084J802993J440439q08721j092288J188815K379246R69753J7765J427223
$$ 20709084 22512077 23952516 23143795 22051507 23240322 25619568 26589321 26607086 28034309
41255B8034309K327305L5968k913712k373701J056030L137394K341264J231188
$$ 28034309 30361614 30397582 27483870 25110169 26166199 29303593 31644857 32876045
41247C2876045J559688J698085J76047j233875k26748K051043K365922J08251
$$ 32876045 34435733 36133818 36309865 35075990 34849242 36900285 39266207 39374458
41239C9374458j911980j667260o16989j097129k768602l372573k046037j37089
$$ 39374458 37462478 35795218 35178229 34081100 31312498 27939925 25893888 25756799
41231B5756799Q28191M73781p19723j546918n15673J981165K640220r08613n489586
$$ 25756799 26584990 27058771 26339048 24792130 24276457 26257622 28897842 27989229 22499643
41222B2499643n174390M29037M552265K180237k992927m068714o21135J786544
$$ 22499643 17325253 17754290 22306555 24486792 21493865 17425151 16804016 18590560
41214A8590560L74161j707361j291312M51468J124122Q18843O43155M08579p3766
$$ 18590560 18964721 17257360 15966048 16417516 17541638 18360481 19003636 19412215 19338449
41205A9338449K52345J529664J707442l29974k255720j437721R63195J794226
$$ 19338449 19590794 21120458 22827900 22497926 20242206 18804485 19767680 21561906
41197B1561906P06512J32033Q87460Q97708j123241l219127k637467O94768M151538
$$ 21561906 22268418 22400451 23287911 24185619 23062378 19843251 17205784 17900552 22052090
41188B2052090N131610L327095P92388j69791M96550P80402l06488j238113q36156
$$ 22052090 27183700 30510795 31303183 31133392 31629942 32410344 32103856 30865743 30029587
41179C0029587q10991k898728m842795k886122J998682M467980K306962m89092
$$ 30029587 29218596 26319868 21477073 18590951 20589633 25057613 27364575 26875483
41171B6875483p7084J678359J172200o06121k64K766935L565054P69292k197959
$$ 26875483 26798399 28476758 29648958 29042837 29042573 31809508 35374562 36143854 33945895
41162C3945895j624003J947777M920811M576112J275118j881229j698586J450036
$$ 33945895 32321892 34269669 39190480 43766592 45041710 43160481 41461895 42911931
41154D2911931L404378J417408j860581k333482p36848p86251k063111l35048
$$ 42911931 46316309 47733717 45873136 43539654 42802806 42016555 39953444 39618396
41146C9618396M311618N689964O34508n277160n197705k80761L091096K427682
$$ 39618396 43930014 49619978 50254486 44977326 39779621 39498860 42589956 45017638
41138D5017638N97896M1500L82092J042755K017603K334274J226058L05550J290052
$$ 45017638 45615534 45657034 46039126 47081881 49099484 51433758 52659816 52965366 54255418
41129E4255418K434240Q40813k519349m078092l350094l057955l874704l673062
$$ 54255418 56689658 57530471 55011122 50933030 47582936 44524981 40650277 36977215
41121C6977215k275963k152713l500989l393109j206507j97990j768016k763356
$$ 36977215 34701252 32548539 29047550 25654441 24447934 24249944 22481928 19718572
41113A9718572r46307J212178J075883M8512M1660j72570j348564n87444L550981
$$ 19718572 18772265 19984443 21060326 21108838 21150498 20977928 19629364 19041920 22592901
41104B2592901O363219L078498l021576m818443k074151j089017l878201m939257
$$ 22592901 28956120 32034618 29013042 24194599 22120448 21031431 17153230 12213973
41096A2213973o77191M466862M874747J709786l59281o51754j624557k790870
$$ 12213973 11536782 16003644 20878391 22588177 22228896 21577142 19952585 17161715
41088A7161715j076979K970071M478718J282803k377446j781209J570790K620658
$$ 17161715 16084736 19054807 23533525 24816328 22438882 20657673 22228463 24849121
41080B4849121M16400j064117K94030J484936k54388k526257j586554J340282
$$ 24849121 25265521 24201404 24495434 25980370 25725982 23199725 21613171 22953453
41072B2953453J766251j016425k976922j709180L51725K89555j257073k103851
$$ 22953453 24719704 23703279 20726357 19017177 19368902 19658457 18401384 16297533
41064A6297533j600954l4174K236495L424387J201597l080222m358190o58119
$$ 16297533 14696579 14662405 16898900 20323287 21524884 18444662 14086472 13428353
41056A3428353L321588K677366o95218j527662R41468L060667K954780J855713
$$ 13428353 16749941 19427307 18732089 17204427 18145895 21206562 24161342 26017055
41048B6017055L25344k066354l736819k380647P42100K131134J658969K331895
$$ 26017055 26342399 24276045 20539226 18158579 18900679 21031813 22690782 25022677
41040B5022677M223839L688820k23001l504996l341821k034419k264637k602970
$$ 25022677 29246516 32935336 32712335 29207339 25865518 23831099 21566462 18963492
41032A8963492j001745P32170p9530j853138p19589L341711N957670M041567n60875
$$ 18963492 17961747 18693917 18614387 16761249 16041660 19383371 25341041 29382608 28821733
41023B8821733l619161l128352q06815L12903o53251j686650q23946J036418J539268
$$ 28821733 25202572 22074220 21267405 21580308 20927057 19240407 18416461 19452879 20992147
41014B0992147K73162j105199j567284j348969l87743J368329K481994J567968
$$ 20992147 21265309 20160110 18592826 17243857 16856114 18224443 20706437 22274405
41006B2274405j70844r11085j732900m207440n577637j955742L806654M275762
$$ 22274405 22103561 21192476 19459576 15252136 9674499 7718757 11525411 15801173
40998A5801173j111651m155374n44819L252586Q61075l462954k358058K352540
$$ 15801173 14689522 10534148 9989329 13241915 14102990 10640036 8281978 10634518
40990A0634518L462146N15642r40125J43254j88130j925521q80082K351878K279367
$$ 10634518 14096664 14612306 13672181 13815435 13627305 11701784 10821702 13173580 15452947
40981A5452947j367242k326367J166319K942101r0592k311120K75719K349283
$$ 15452947 14085705 11759338 12925657 15867758 15777166 13466046 13741765 16091048
40973A6091048j395245o225393m706491J125294L523223J481586N87809K211799
$$ 16091048 14695803 8470410 3763919 4889213 8412436 9894022 10481831 12693630
40965A2693630J687972k446388n268057l292140P05648K756527K609376J671763
$$ 12693630 14381602 11935214 6667157 3375017 4080665 6837192 9446568 11118331
40957A1118331L70486n88202k2153J152451N41432j497303j882378j5684J078061
$$ 11118331 11488817 10900615 10878462 12030913 12572345 11075042 9192664 9176980 10255041
40948A0255041Q2819m50148R02642J665393K22269p84626R84296L194455K619593
$$ 10255041 10337860 9887712 10790354 12455747 12678016 11893390 12877686 16072141 18691734
40939A8691734L28509o18269j78478l28112j170962j670037k293346l329880k662633
$$ 18691734 19020243 18401974 18223496 17895384 16724422 15054385 12761039 9431159 6768526
40930F768526P81739L440127J671263j741350j064901L216954M703827J016955
$$ 6768526 7550265 10990392 12661655 10920305 9855404 13072358 17776185 18793140
40922A8793140k629342j741940J058670J199424o77568q68852Q49084J168010
$$ 18793140 16163798 14421858 15480528 16679952 16002384 15133532 15982616 17150626
40914A7150626j312466m138061m553083k644635m81393N89705J180445K467160
$$ 17150626 15838160 11700099 7147016 4502381 4020988 4610693 5791138 8258298
40906H258298L788586K833783p17239l383604k222758L42949k49909l233320l007105
$$ 8258298 12046884 14880667 14163428 10779824 8557066 8900015 8650106 5416786 2409681
40897B409681K071963O437397N193130P80006j540804j150347j060669k205676
$$ 2409681 4481644 10919041 16112171 16892177 15351373 14201026 13140357 10934681
40889A0934681k914534k365083r08147J650530M842711O087926L674893j62377
$$ 10934681 8020147 5655064 4746917 6397447 11240158 17328084 21002977 20840600
40881B0840600k122804k146021j810720n97740K374739M797346L835600J047276
$$ 20840600 18717796 16571775 14761055 14163315 16538054 21335400 25171000 26218276
40873B6218276R9094P21862j56006k176177k046786j31535n75403l907348n347057
$$ 26218276 26317370 27039232 26883226 24707049 22660263 22528728 21953325 18045977 12698920
40864A2698920k379459J341132K132040J398020J643001J894765O37028n63549
$$ 12698920 10319461 11660593 13792633 15190653 16833654 18728419 19365447 18801898
40856A8801898j42488O6653j614392k828024j126538Q84583p06587m016468l455096
$$ 18801898 18659410 18726063 17111671 14283647 13157109 14041692 13335105 9318637 5863541
40847E863541J508166N052251L487144K22599p1748J534385O39135l140955n307095
$$ 5863541 7371707 12423958 15911102 16133701 16061953 17596338 18235473 15094518 9787423
40838I787423l023119R48798K426969J399511Q32614J480653J484290Q35421J909911
$$ 9787423 6764304 7713102 10140071 11539582 12372196 13852849 15337139 16172560 18082471
40829A8082471M254097L444807j771593n486732k557901K846480K746840k762429
$$ 18082471 22336568 25781375 24009782 18523050 15965149 18811629 21558469 18796040
40821A8796040o198625m397247j664023n54955J974405O416078P045360J358187
$$ 18796040 12597415 8200168 6536145 5981190 7955595 14371673 21417033 22775220
40813B2775220l953368k653707J415321J467178o75627J243832N635007M672652
$$ 22775220 18821852 16168145 17583466 19050644 18375017 19618849 25253856 29926508
40805B9926508k485834p362468m670117O55448J800390r59801l218163l254630
$$ 29926508 27440674 20078206 15408089 16063537 17863927 16904126 13685963 10431333
40797A0431333j884185P05567L838477M656025J502961k464949k563849J177078
$$ 10431333 8547148 9252715 13091192 17747217 19250178 16785229 14221380 15398458
40789A5398458M043101K843380n25673k387010j983136j224377q85112M86181
$$ 15398458 19441559 22284939 21759266 19372256 17389120 16164743 15279631 15765812
40781A5765812L257817M649818K277270j510391k034091J063294L117986J318099
$$ 15765812 19023629 23673447 25950717 24440326 22406235 23469529 26587515 27905614
40773B7905614j401887j274051R47818K275551K116231J466061K38016j051523
$$ 27905614 26503727 25229676 26177494 28453045 30569276 32035337 32273353 31221830
40765C1221830M22965N558404R557562P278815J021158k041001M66395M034852
$$ 31221830 31644795 37203199 46760761 54039576 55060734 53019733 53486128 57520980
40757E7520980M764355L791580L368783L182237K268626J142901N34058N39721
$$ 57520980 62285335 66076915 69445698 72627935 74896561 76039462 76573520 77113241
40749G7113241J537455L313172L562237O33620k615235j835125J956381L172762
$$ 77113241 78650696 81963868 85526105 86159725 83544490 81709365 83665746 86838508
40741H6838508r3031l503468l454413j741086j198498j209846k84197O16610J33225
$$ 86838508 86745477 83242009 79787596 78046510 76848012 75638166 75353969 75970579 76103804
40732G6103804j069419k174355l594192m650653l215678K73035J892007l26825
$$ 76103804 75034385 72860030 69265838 64615185 61399507 61672542 63564549 63237724
40724F3237724l360882l998116l230949l150376k902102j014642J102923J307722
$$ 63237724 59876842 55878726 52647777 49497401 46595299 45580657 46683580 47991302
40716D7991302J00089r19535j663270k246599j760521o69760j325524l647820
$$ 47991302 48091391 47171856 45508586 43261987 41501466 40831706 39506182 35858362
40708C5858362l897320n70561K504440K309157J397324K333442K256290j329613
$$ 35858362 31961042 31390481 33894921 36204078 37601402 39934844 42191134 40861521
40700D0861521l898545l16839N416359N083183r06700m212707j759589N33019
$$ 40861521 36962976 36646137 42062496 47145679 46238979 42026272 40266683 40799702
40692D0799702j472487l993015k935864n11240l22225j459781j411296l13150
$$ 40799702 39327215 35334200 32398336 31887096 31564871 30105090 28693794 28380644
40684B8380644J088493L385629N310552L274618k295704m903310o74205N244318
$$ 28380644 29469137 32854766 38165318 41439936 39144232 34240922 33566717 38811035
40676C8811035O048271L033065J942747K881699J268074k604795k897158J979840
$$ 38811035 44859306 47892371 49835118 52716817 53984891 51380096 48482938 50462778
40668E0462778O005990M548527Q50848L1191J448205J533872P03230K143233N402410
$$ 50462778 56468768 61017295 61868143 61899334 63347539 64881411 65584641 67727874 73130284
40659G3130284O463483M192952K076661K442732L039986J529603Q783J696843
$$ 73130284 79593767 83786719 85863380 88306112 91346098 92875701 92884484 94581327
40651I4581327N050831N100370M46463m551462n487744k945068j95644J678059
$$ 94581327 99632158 104732528 105178991 100627529 95139785 92194717 91999073 93677132
40643I3677132L635488M899244K744858l113622q382847q421246l775423L39468
$$ 93677132 97312620 102211864 104956722 101843100 93460253 85039007 81263584 81603052
40635H1603052J66515k566298l560004j595729M90631J61601j682100k825074
$$ 81603052 81769567 79203269 75643265 74047536 74538167 74699768 73017668 70192594
40627G0192594l120937l884780m993347m876559l240276j755051j675278k330000
$$ 70192594 67071657 63186877 58193530 53316971 50076695 48321644 46646366 44316366
40619D4316366k361537j252614M88342J549912N51026k075527l599781k256345
$$ 44316366 41954829 40702215 41190557 42740469 43291495 41215968 37616187 35359842
40611C5359842j35216l17709k065408k294997j200343j846750l807723k550645
$$ 35359842 35224626 34906917 32841509 30546512 29346169 27499419 23691696 21141051
40603B1141051K865597O653124M197191j201724l426542j791494P7892N62321
$$ 21141051 24006648 30659772 34856963 33655239 30228697 28437203 28515095 29077416
40595B9077416O39731M50449k80556k34141J105225J198986j355920l066424p78334
$$ 29077416 29717147 30167596 29887040 29652899 30758124 31957110 30601190 27534766 26756432
40586B6756432K100944M80062l583397l735614K44356K181293l55008k883346
$$ 26756432 28857376 29337438 25754041 22018427 22262783 24444076 24089068 21205722
40578B1205722k010146J54996J196653J762661J912462R7537k257448j162211
$$ 21205722 19195576 19350572 20547225 22309886 24222348 24319885 22062437 20900226
40570B0900226K754742L597405o06843m226036k776676O22532J315810m6991q80484
$$ 20900226 23654968 27252373 26645530 22419494 19642818 20265350 21581160 21534169 20653685
40561B0653685j540453k497645j765865M86934J13665l538277m175985J661552
$$ 20653685 19113232 16615587 14849722 15336656 15450321 11912044 7736059 9397611
40553I397611P227524N106347j008993k361270J081928K095621j001298k645218
$$ 9397611 16625135 21731482 20722489 18361219 19443147 21538768 20537470 17892252
40545A7892252o02879Q61260n73313j621637l1254J789449J776685J182111Q45376
$$ 17892252 17289373 18150633 17577320 15955683 15924429 17713878 19490563 20672674 21518050
40536B1518050l50724j906097j500899M70518R57901k83439k73143J383068J629862
$$ 21518050 21167326 19261229 17760330 18230848 19188749 18905310 18632167 20015235 21645097
40527B1645097m5755l60013J540076K225399L22345p64411J216004L927719N411920
$$ 21645097 21599342 21239329 22779405 25004804 25327149 24562738 25778742 29706461 35118381
40518C5118381P245670R859009R829546N412407L63957j427511j386489k926169
$$ 35118381 42364051 52223060 62052606 67465013 67828970 66401459 65014970 62088801
40510F2088801o074558q535393r036514p132634k980759O56083R8385l567227
$$ 62088801 56014243 47478850 38442336 31309702 28328943 28985026 29083411 25516184
40502B5516184m929862k290299P4260j33925L73820K706317J924243l662730o761389
$$ 25516184 20586322 18296023 18370283 18236358 18610178 21316495 23240738 19578008 12816619
40493A2816619k052769L707540J645089m470869m053758L011078O489825K474035
$$ 12816619 10763850 14471390 16116479 11645610 7591852 10602930 17092755 19566790
40485A9566790j548553m3134K566389R83599k431513l005236j157212K38444R71777
$$ 19566790 18018237 17975103 20541492 21525091 19093578 16088342 14931130 15169574 16141351
40476A6141351J845591J897287P31400J76930R33857J034966j94767n18982P55030
$$ 16141351 17986942 19884229 20615629 20792559 21726416 22761382 22566615 22047633 22802663
40467B2802663R38999j014010k055324m15621J006181j01440j210337K06059J779829
$$ 22802663 23741662 22727652 20672328 20256707 21262888 21161448 19951111 20157170 21936999
40458B1936999P07568o47622J209543M226224L734449R0136k155734j481519l71979
$$ 21936999 22644567 21996945 23206488 27432712 31167161 31257297 29101563 27620044 27248065
40449B7248065J98835J678386L213161J629104k556065m161880p10482L349520
$$ 27248065 27446900 29125286 32338447 33967551 31411486 27249606 26539124 29888644
40441B9888644K739034j385287l572876j608176J448722K161689Q19266Q8957
$$ 29888644 32627678 31242391 27669515 26061339 27510061 29671750 30491016 30579973
40433C0579973J260364K825090K516402L49869q72666J197579M937139N890803
$$ 30579973 31840337 34665427 37181829 37531698 36659032 37856611 42793750 48684553
40425D8684553K057054l329031n586662m130011k344212k376603k519537n69890
$$ 48684553 50741607 47412576 41825914 37695903 35351691 32975088 30455551 29885661
40417B9885661K455702L808620K794262R78069l53368n47647J672352O617781
$$ 29885661 32341363 36149983 38944245 39922314 39568946 39021299 40693651 47311432
40409D7311432J1023731J0808671P044358N013036N958199M699232j599852p420445
$$ 47311432 58335163 69143834 76188192 81201228 87159427 91858659 90258807 82838362
40401H2838362o640780k090333q51126k935737k376541J598820K966478n73635
$$ 82838362 76197582 74107249 73256123 70320386 67943845 69542665 72509143 71935508
40393G1935508l695672k778889j655303l996126o581435n361409k786088l147660
$$ 71935508 68239836 65460947 63805644 59809518 53228083 47866674 45080586 41932926
40385D1932926m768608l145344R32727K641281R19160o52589r784J253434J499359
$$ 41932926 37164318 34018974 34951701 37592982 38512142 37859553 37849769 39103203 40602562
40376D0602562O41323j389463m029710m668161j522161K866529M563921L604131
$$ 40602562 41243885 39854422 35824712 31156551 29634390 32500919 37064840 40668971
40368D0668971K724320K152098P5557k719069l518338k552513k420950k909114
$$ 40668971 43393291 45545389 45620946 42901877 39383539 36831026 34410076 31500962
40360C1500962j399783J464157J895593n29701j898800p72056m16955k238595
$$ 31500962 30101179 31565336 33460929 32931228 31032428 30260372 29843417 27604822
40352B7604822k701946l4224J363425k183400o495761m883940J795801O037711
$$ 27604822 24902876 24868652 26232077 24048677 17552916 12668976 14464777 20502488
40344B0502488L893453o64747k021930M60412L346150L756479J516637j589060
$$ 20502488 24395941 23731194 21709264 22169676 25515826 29272305 30788942 29199882
40336B9199882l284723k395968K8603J542536P32721j408772k725774k188001
$$ 29199882 25915159 23519191 23547794 25090330 25823051 24414279 21688505 19500504
40328A9500504o66068L82836M95809J94723r1649k39959J94230J485299K432632
$$ 19500504 18834436 19217272 19713081 19907804 19816155 19576196 19770426 21255725 23688357
40319B3688357J208001j787985l687739k855145r26693K01622J107368K475539
$$ 23688357 24896358 23108373 19420634 16565489 15638796 15840418 16947786 19423325
40311A9423325K511718j45320k971478k756366o72241k8551l83522J145274L523432
$$ 19423325 21935043 21789723 18818245 16061879 15389638 15361087 14977565 16122839 19646271
40302A9646271K669740q14636j059561L800869P611258M998363o08440k208737
$$ 19646271 22316011 21501375 20441814 24242683 31853941 36852304 36243864 34035127
40294C4035127R55800L523315J855622k555725o355522p323931m812584k78174
$$ 34035127 34990927 38514242 40369864 37814139 31458617 24134686 19322102 19043928
40286A9043928K984889K931626R79626n72263j859760l910640n379001l917667
$$ 19043928 22028817 24960443 25940069 25367806 23508046 19597406 14218405 10300738
40278A0300738j51438K605659K525540Q64621m81170q45401j91386J281786K497686
$$ 10300738 10149300 12754959 15280499 16145120 15663950 14818549 14627163 15908949 18406635
40269A8406635K048321K7661j552528o81475K457585N126480M148947o69346n400092
$$ 18406635 20454956 20482617 18930089 18248614 20706199 25832679 29981626 29312280 23912188
40260B3912188n835317k599069l76188j556206l270911k108010R72844K812783
$$ 23912188 18076871 15477802 15101614 13545408 10274497 8166487 9139331 11952114
40252A1952114K924155L079734L335728J907124j068903k705461j231299J412962
$$ 11952114 14876269 17956003 21291731 23198855 22129952 19424491 18193192 19606154
40244A9606154K150857P15543n04806k69874l88914k579975m593250k347054L485290
$$ 19606154 21757011 22472554 21967748 21697874 21308960 18728985 14135735 11788681 15273971
40235A5273971O571543L214793j726298j555690K248282K818651o27133j718991
$$ 15273971 21845514 25060307 23334009 21778319 24026601 26845252 26218119 24499128
40227B4499128J747791L570831l48260m681262l236615J183168J957983q41439
$$ 24499128 26246919 29817750 29469490 24788228 21551613 22734781 24692764 23851325
40219B3851325k016848j26041J960395K997893L308745R41308n156074r746193
$$ 23851325 21834477 21708436 23668831 26666724 29975469 30916777 25760703 16014510
40211A6014510o610923J328735M810615J438122j680304J75056K782943J405578
$$ 16014510 9403587 10732322 15542937 16981059 15300755 15475811 18258754 19664332
40203A9664332j433624j230206R34434J244000k49888p18752L80246J536586K460433
$$ 19664332 18230708 17000502 17934936 19178936 18929048 18210296 18590542 20127128 22587561
40194B2587561L492860L530038J880501N99159J736702L586677K826729n83041
$$ 22587561 26080421 29610459 31490960 32090119 33826821 37413498 40240227 39657186
40186C9657186l639023m691192m618455l971143k036274P20606J923416L32101
$$ 39657186 36018163 31326971 26708516 22737373 20701099 21421705 23345121 23677222
40178B3677222k021229k278527n27129M61424p91618k424466k123278o25360k52372
$$ 23677222 21655993 19377466 18850337 19311761 18520143 16095677 13972399 13347039 13094667
40169A3094667o88592O31736L378009L289362j427229n971967m883862J74821
$$ 13094667 12406075 13037811 16415820 19705182 18277953 12305986 7422124 7596945
40161G596945K828430Q24426k101119k665876j643614o17834M68230J412549J115268
$$ 7596945 10425375 11249801 9148682 6482806 4839192 4221358 4689588 6102137 7217405
40152G217405o601j76062M61336R2975p91764K89436K813933L142727P67403k27045
$$ 7217405 7210804 7034742 7496078 7589053 6797289 7086725 9900658 13043385 13810788 13583743
40142A3583743J900131L197420P86359j901673r91644R43417p11577m277437l963771
$$ 13583743 15483874 18681294 19467653 17565980 16574336 17517753 16806176 12528739 8564968
40133H564968Q29775M318488K831443n24692j203378O21436J449858l19615k833924
$$ 8564968 9394743 13713231 16544674 16019982 14816604 15438040 16887898 16568283 13734359
40124A3734359l623368k353435n22895Q15515K047374L317406L182323P29611
$$ 13734359 10110991 7757556 7234661 8050176 10097550 13414956 16597279 17326890
40116A7326890j861510j636668M91139P55965j445804k468760n04298J551010
$$ 17326890 15465380 13828712 14319851 15075816 13630012 11161252 10656954 12207964
40108A2207964J413129J127536K327553K187226j505498n001730l640228N53439
$$ 12207964 13621093 14748629 17076182 19263408 17757910 12756180 9115952 9669391
40100I669391K037739M38519j25038R05450n7368l192329l884272l97622L027661
$$ 9669391 11707130 12145649 12020611 12926061 12868693 9676364 5792092 5394470 8422131
40091H422131K970928J471021J286865J332931o9149j553611j594638j361527
$$ 8422131 11393059 12864080 14150945 15483876 15414727 13861116 12266478 10904951
40083A0904951j516004O8153L727932M982465Q02351m223990l538692J667878
$$ 10904951 9388947 9457100 13185032 18167497 18969848 14745858 11207166 12875044
40075A2875044M419050K549314P25220J471502J153459k451383m739117j089765
$$ 12875044 17294094 19843408 20568628 22040130 23193589 20742206 16003089 14913324
40067A4913324N094539O602376K458547j569125j698974k16660k27338r56723
$$ 14913324 20007863 26610239 29068786 27499661 25800687 25584027 25356689 24399966
40059B4399966l17838J118503J296787l2012j385564j817588j478256q04011m01789
$$ 24399966 24082128 25200631 26497418 26465406 25079842 23262254 21783998 20979987 20578198
40050B0578198q38351j566578j192517K81587R85407J14678m45266Q78174K477390
$$ 20578198 19739847 18173269 16980752 17262339 18247746 18362424 17917158 18795332 21272722
40041B1272722J914439l69196k241676l410518m689276m786789j648363L020398
$$ 21272722 23187161 22817965 20576289 17165771 12476495 7689706 6041343 9061741
40033I061741M500873J409206k047733j753150J200667K977718K232344O49458
$$ 9061741 13562614 14971820 12924087 11170937 12371604 15349322 17581666 18231124
40025A8231124j06099K35341J267115K131262J552593r07416l855810n177485
$$ 18231124 18125025 18360366 19627481 21758743 23311336 22403920 18548110 13370625
40017A3370625l912960p92526K418274L948877L317055J831660J090532J173287
$$ 13370625 9457665 8665139 11083413 15032290 18349345 20181005 21271537 22444824
40009B2444824J155717O94001j70627j648854k788815j007854M009801P461698
$$ 22444824 23600541 24294542 24123915 22475061 19686246 18678392 22688193 30149891
40001C0149891M650471j745773m592037k383954n92595k006997k492741P66825
$$ 30149891 34800362 33054589 28462552 26078598 25486003 23479006 20986265 21753090
39993B1753090L515254J662903j501999j296280O2116j780475m138269j280588
$$ 21753090 25268344 26931247 25429248 24132968 24195084 22414609 18276340 16995752
39985A6995752M463258M742959j434590n316653j768482L095268J934084k863084
$$ 16995752 21459010 26201969 24767379 19450726 17682244 20777512 22711596 19848512
39977A9848512m124436j208167L30110j698116l314039j375175J736934K123694
$$ 19848512 15724076 14515909 14846019 13147903 9833864 8458689 10195623 12319317
39969A2319317l06125k586999k738261j064929J378072L608477M379178K897183
$$ 12319317 12013192 9426193 6687932 5623003 7001075 10609552 14988730 17885913
39961A7885913K69477j203542q17320k39672p33116j267179q10990n82429j570930
$$ 17885913 18155390 16951848 16134528 15894856 15161740 13894561 13083571 12501142 10930212
39952A0930212j637626J283391M381367L191745o77179r05388L317304N085279
$$ 10930212 9292586 10575977 14957344 18149089 17471910 16566522 19883826 24969105
39944B4969105R09238k780110K29668N257100L873093k430218m835994j575519
$$ 24969105 25878343 23098233 23327901 28585001 32458094 30027876 25191882 23616363
39936B3616363J33328k828894m242051J77458M749401K762891k762023m008757
$$ 23616363 23749691 20920797 16678746 16856204 21605605 24368496 21606473 17597716
39928A7597716k91424J898400o72304l894475l393135p20996k01155k434069l743208
$$ 17597716 17306292 19204692 18532388 14637913 11244778 10523782 10322627 7888558 4145350
39919D145350j459421K447709M006712K426711O72288O98171P22778j008615k339301
$$ 4145350 2685929 5133638 9140350 11567061 12239349 12937520 13660298 12651683 10312382
39910A0312382m70124K548351K011897k068382m453999k375253P72576J216045
$$ 10312382 9842258 12390609 14402506 12334124 7880125 5504872 6277448 7493493
39902G493493R5353K43551J146525N51727j192093j799871p27778O19598J372240
$$ 7493493 7588846 7832397 8978922 9530649 8338556 6538685 5810907 6430505 7802745
39893G802745J569474J058788J40320K20679J652367K058663o24957m183014m095877
$$ 7802745 9372219 10431007 10571327 10792006 12444373 14503036 13878079 9695065 5599188
39884E599188L51865M571401M252930M64369k360328k296248j646593k642827
$$ 5599188 5951053 10522454 14775384 15239753 12879425 10583177 8936584 6293757
39876F293757l608306j390969L247640N563751L014454j130674k316460o11485
$$ 6293757 2685451 1294482 4542122 10105873 13120327 11989653 9673193 9061708
39868I061708O68759M27963K31386K43232j097368l152226k904331J73880K572700
$$ 9061708 9730467 10158430 10389816 10633048 9535680 6383454 3479123 3653003 6225703
39859F225703J622936r78115k095415j062454Q39440K447381K833933J540212
$$ 6225703 7848639 6870524 4775109 3712655 4552095 6999476 9833409 11373621
39851A1373621j09904j25348Q67231J33750k446521l431700j146480J399295J137608
$$ 11373621 11263717 11138369 12005600 12139350 9692829 6261129 5114649 6513944 7651552
39842G651552n91211q44773L09637Q55157L42879l80812j075167j283281L47076
$$ 7651552 7060341 6215568 6525205 7380362 7723241 7342429 6267262 4983981 5331057
39833E331057L402872M531316J754056k044285k923358j294161l27427p22585
$$ 5331057 8733929 13265245 15019301 12975016 10051658 8757497 8430070 7707485
39825G707485o89487L9744q3086j159657j573745q39493N2593R08809K338185
$$ 7707485 7017998 7057742 6974656 5814999 4241254 3401761 3454354 4363163 6701348
39816F701348L662617L279326J112854j290614k889808l591732l108630j238444
$$ 6701348 10363965 13643291 14756145 13465531 10575723 6983991 3875361 2636917
39808B636917J171035L051340M120986L861240J187822k980544m780938j738093
$$ 2636917 3807952 6859292 10980278 14841518 16029340 13048796 8267858 6529765
39800F529765L330842N380375K919527j570129n256772o302058l640396J129821
$$ 6529765 9860607 15240982 18160509 16590380 11333608 5031550 1391154 2520975
39792B520975L398084Q74623k350090j194007K673616L466858M30124j532652
$$ 2520975 5919059 6793682 4443592 3249585 5923201 9390059 9820183 8287531
39784H287531k78990P53909n85600j433303M29303K220251P27070k572815m157541
$$ 8287531 8008541 8762450 8176850 6743547 7172850 9393101 10120171 7547356 3389815
39775C389815l304708j565524J4965Q18223L02633k98347J310443M273033M442672
$$ 3389815 85107 -1480417 -1465452 -647229 -344596 -642943 667500 4940533 9383205
39766I383205O82008k497662j646774K27442q19559k420330J26670M959327N397607
$$ 9383205 10065213 7567551 5920777 6148219 5328660 2908330 3035000 7994327 13391934
39757A3391934K73208l998608l056338l84944o02866j988938j93765L764802M497274
$$ 13391934 13665142 9666534 6610196 6225252 5622386 3633448 3439683 7204485 11701759
39748A1701759L85269m020729m510322k269547o41753Q6021J747867L900317L892464
$$ 11701759 12087028 8066299 3555977 1286430 644677 730698 2478565 6378882 10271346
39739A0271346J297972q53788l54218J109755P75608j182326k438983j955475
$$ 10271346 11569318 10715530 10361312 11471067 12246675 11064349 8625366 6669891
39731F669891n11387J161812K503019K176000m29165l104225k880098j79177J707170
$$ 6669891 6158504 7320316 9823335 11999335 11570170 8465945 5585847 5406670 7113840
39722G113840J374785N98540N08623m3011j128678m90165K096550K717851j014191
$$ 7113840 8488625 9087165 9595788 9552777 8424099 7933934 10030484 12748335 11734144
39713A1734144n022141l852612J039120L092473K91901k312915q63935J717741
$$ 11734144 6712003 2859391 3898511 6990984 7282885 4969970 4106035 5823776
39705E823776J269880q20753p50529O65375m50404l427831k933413K260114N859790
$$ 5823776 7093656 6272903 5522374 6187749 5737345 2309514 -623899 1636215 7496005
39696G496005K771545k912572l452305J453557M761107K724356m88536l81904
$$ 7496005 10267550 7354978 3902673 5356230 10117337 12841693 12353157 11971253
39688A1971253J104430L237k464804j936938J710343L914083K193015p98543j768283
$$ 11971253 13075683 13078920 10614116 8677178 10387521 14301604 16494619 15696076 13927793
39679A3927793r04668q7945K99466Q29737J023846n3923j853771k586976j460170
$$ 13927793 13023125 12935180 13234646 14064383 15088229 15034306 13180535 10593559 9133389
39670I133389K34740O16998m53872j081695J38757J808385J360499r58225j893420
$$ 9133389 9368129 9985127 9531255 8449560 8588317 10396702 11757201 10798976 8905556
39661H905556L5892J960415R37247j353505j234144J108433K041138K51968j636944
$$ 8905556 8941448 10901863 11839110 10485605 9251461 10359894 12401032 12653000 11016056
39652A1016056j509146l18957N27051J073590J032694p12571l305306l590799
$$ 11016056 9506910 9187953 9715004 10788594 11821288 11108717 7803411 4212612
39644D212612n72516K360486J916746n06511j174987O86086K582171K752090J908964
$$ 4212612 3640096 6000582 7917328 7410817 6235830 6921916 9504087 12256177 14165141
39635A4165141J210931O13562l76162j581784k259695j847950n08289R87419K030606
$$ 14165141 15376072 15989634 15613472 14031688 11771993 9924043 9415754 10403173 12433779
39626A2433779K521903K081212j32012l588498n416190l378141O72010K684792
$$ 12433779 14955682 17036894 16904882 13316384 7900194 4522053 5194063 7878855
39618G878855J544665k53182q79707j007429j059811j03266J441695J279972j049175
$$ 7878855 9423520 9170338 8290631 7283202 6223391 6120125 7561820 8841792 7792617
39609G792617k873702k291576m96733J122005K900977M338186L318697N4812j963862
$$ 7792617 4918915 2627339 2130606 3252611 6153588 10491774 13810471 13865283 11901421
39600A1901421j421362j465680l540023l618003R91847N545527M373546k8621
$$ 11901421 10480059 9014379 5474356 1856353 2848200 8393727 12767273 12738652
39592A2738652j071943J305104J475801j677933l224825j176484M77855o58672
$$ 12738652 11666709 12971813 14447614 12769681 9544856 8368372 8846227 8187555
39584H187555j578966n5770J393603N91791o15196p21232j472575l223780k549850
$$ 8187555 6608589 6552819 7946422 8538213 7923017 7201785 5729210 2505430 -44420
39575d4420J598642M237291J548640k486495j954408J959316L570747J743453
$$ -44420 1554222 5791513 7340153 4853658 2899250 4858566 8429313 10172766
39567A0172766J89214K00729o82205k892039l398278r44477J828340K539152J669955
$$ 10172766 10361980 10562709 9880504 6988465 3590187 2645710 4474050 7013202 8683157
39558H683157L96450o78541l41017J944287L374095O67846l993713m756220r17633
$$ 8683157 9079607 8401066 8060049 10004336 13378431 14046277 10052564 5296344 4378711
39549D378711J473592q69200l088970l84270L542326K169807l072923m640195
$$ 4378711 5852303 4983103 1894133 1509863 5052189 7221996 4149073 -491122
39541d91122l43270L787273K908875l59965j373755l53378m02822j736653j685213
$$ -491122 -834392 2952881 5861756 5501791 4128036 3774658 3371836 1635183 -50030
39532e0030P39981L305381L519587J351463j169080k168923j631616r87688q92807
$$ -50030 689951 3995332 7514919 8866382 7697302 5528379 3896763 2909075 2016268
39523B016268k40801J549577K481848N52730k378394k470674M01929K506904K314921
$$ 2016268 1775467 3325044 5806892 6359622 3981228 1510554 1912483 4419387 6734308
39514F734308K312501L246822J647314l573060o854335l456719K415811L129300
$$ 6734308 9046809 12293631 13940945 10367885 3513550 56831 2472642 5601942
39506E601942j083870l242260j011823O04777j148637k094095J001181M369781
$$ 5601942 4518072 1275812 263989 868766 -279871 -2373966 -1372785 2996996
39498B996996L500858M85314M4774J754781J521328j285384l169465k103001L33658
$$ 2996996 6497854 6983168 7027942 8782723 10304051 9018667 5849202 3746201 4079859
39489D079859K057600K458100J558153j05873j126791q64989o10780j213328j109277
$$ 4079859 6137459 8595559 10153712 10047839 8921048 8056059 7445279 6231951 5122674
39480E122674Q92032K697747J892787k7038R463J328612N66242k522900m393276
$$ 5122674 6014706 8712453 10605240 10578202 10587665 11916277 12482519 9959619 5566343
39471E566343k972031M7483K434510L531717K915814M22195k071901k195993p40686
$$ 5566343 2594312 2641795 5076305 8608022 11523836 11946031 9874130 7678137 6937451
39462F937451m57563j263844o50666J031385O07221j668763j356970K503633M488040
$$ 6937451 6479888 5216044 4565378 5596763 6203984 4535221 3178251 5681884 10169924
39453A0169924J063185l242173k670156Q90564J571918q36375j370915J192267
$$ 10169924 11233109 7990936 5320780 6211344 7783262 6946887 5575972 6768239
39445F768239K442567k034k640833j885575O81457J461190J67605p79323l68695
$$ 6768239 9210806 9208772 6567939 4682364 5363821 6825011 6992616 6213293 5844598
39436E844598Q375r63628k659843l072873q66137K724394M443577K669311m8756
$$ 5844598 5852973 4889345 2229502 -843371 -1709508 1014886 5458463 8127774 8079018
39427H079018j01550J862646J650454j814422l981000j144144L353749L154886
$$ 8079018 7977468 9840114 11490568 9676146 5695146 4551002 7904751 11059637
$$ [...]
##END NTUPLES=NMR SPECTRUM
##END=
