##TITLE=31Pdec_SR157_r
 , 64 sc
 16.2.2023
##JCAMPDX= 6.0         $$ Bruker NMR JCAMP-DX V2.0
##DATA TYPE= NMR SPECTRUM
##DATA CLASS= NTUPLES
##ORIGIN= UXNMR, Bruker Analytische Messtechnik GmbH
##OWNER= root
$$ XWIN-NMR		Version 3.5
$$ Thu Feb 16 14:49:50 2023 Russian Standard Time (UT+4h)  she@DPX200
##.OBSERVE FREQUENCY= 81.013821
##.OBSERVE NUCLEUS= ^31P
##.ACQUISITION MODE= SIMULTANEOUS
##.ACQUISITION SCHEME= undefined
##.AVERAGES= 64
##.DIGITISER RES= 16
##SPECTROMETER/DATA SYSTEM= spect
##.PULSE SEQUENCE= zgpg30
##.SOLVENT NAME= CDCl3
##.SHIFT REFERENCE= (INTERNAL, CDCl3, 0, 248.564)
##AUDIT TRAIL= $$ (NUMBER, WHEN, WHO, WHERE, WHAT)
$$ ##TITLE= Audit trail, XWIN-NMR		Version 3.5
$$ ##JCAMPDX= 5.01
$$ ##ORIGIN= Bruker BioSpin GmbH
$$ ##OWNER= she
$$ F:/spectra/data/she/nmr/P31/1/pdata/1/auditp.txt
$$ ##AUDIT TRAIL=  $$ (NUMBER, WHEN, WHO, WHERE, WHAT)
(   1,<2023-02-16 14:49:00.60 +0400>,<she>,<DPX200>,
      <continue with go, POWCHK disabled, PULCHK disabled
       configuration hash MD5:
       00 E9 B6 7A A2 85 ED C7 34 08 36 98 17 FE 4E 26
       data hash MD5: 32K
       6C 31 4D BD C2 A7 70 E6 49 E6 16 2A 12 8D 83 4D>)
(   2,<2023-02-16 14:49:02.96 +0400>,<she>,<DPX200>,
      <Start of raw data processing
       efp BC_mod = 2 LB = 1 FT_mod = 6 PKNL = 1 PHC0 = -10965.48 PHC1 = 16.21271 SI = 64K 
       data hash MD5: 64K
       72 67 FD 00 62 37 E4 6B 58 AC 7D 14 56 C1 9E 04>)
(   3,<2023-02-16 14:49:19.48 +0400>,<she>,<DPX200>,
      <pk PHC0 = 8.205255 PHC1 = 3.6 
       data hash MD5: 64K
       0B 0D 8B 9A E2 CB 2D 7D 19 68 42 3B 41 F0 70 FA>)
(   4,<2023-02-16 14:49:22.54 +0400>,<she>,<DPX200>,
      <abs ABSG = 5 
       data hash MD5: 64K
       08 C7 02 CE D6 F5 28 E8 D5 8A FA D8 CD A6 9F 08>)
$$ ##END=
$$ 
$$ hash MD5
$$ 46 A2 B1 BD 6E D9 7D FF A7 BD 2A 22 8C BE 58 EE
##$RELAX= 
##$RELAX= 
##$RELAX= 
##$RELAX= 
##$RELAX= 
##$RELAX= 
##$RELAX= 
##$RELAX= 
##$RELAX= 
$$ Bruker specific parameters
$$ --------------------------
##$DU= <F:/spectra>
##$EXPNO= 1
##$NAME= <P31>
##$PROCNO= 1
##$TYPE= <nmr>
##$USER= <she>
##$AMP= (0..31)
100 100 100 100 100 100 100 100 100 100 100 100 100 100 100 100 100 100 
100 100 100 100 100 100 100 100 100 100 100 100 100 100 
##$AQSEQ= 0
##$AQ_mod= 1
##$AUNM= <au_zg>
##$AUTOPOS= <>
##$BF1= 81.014009
##$BF2= 200.13
##$BF3= 200.13
##$BF4= 200.13
##$BF5= 200.13
##$BF6= 200.13
##$BF7= 200.13
##$BF8= 200.13
##$BYTORDA= 1
##$CFDGTYP= 0
##$CFRGTYP= 5
##$CHEMSTR= <none>
##$CNST= (0..31)
1 1 145 1 1 1 1 1 1 1 1 1 1 1 1 1 1 1 1 1 1 1 1 1 1 1 1 1 1 1 1 1 
##$CPDPRG= <waltz16>
##$CPDPRG1= <>
##$CPDPRG2= <waltz16>
##$CPDPRG3= <>
##$CPDPRG4= <mlev>
##$CPDPRG5= <mlev>
##$CPDPRG6= <mlev>
##$CPDPRG7= <mlev>
##$CPDPRG8= <mlev>
##$CPDPRGB= <>
##$CPDPRGT= <>
##$D= (0..31)
0 1 0 0 0 0 0 0 0 0 0 0.03 2e-05 3e-06 0 0 0 0 0 0 0 0 0 0 0 0 0 0 0 0 
0 0 
##$DATE= 1676544459
##$DBL= (0..7)
120 120 120 11 120 120 24 19 
##$DBP= (0..7)
150 150 150 150 150 150 150 150 
##$DBP07= 0
##$DBPNAM0= <>
##$DBPNAM1= <>
$$ [...]
##$SUBNAM3= <"">
##$SUBNAM4= <"">
##$SUBNAM5= <"">
##$SUBNAM6= <"">
##$SUBNAM7= <"">
##$SUBNAM8= <"">
##$SUBNAM9= <"">
##$SW= 501.771253377433
##$SWIBOX= (0..15)
0 1 3 0 0 0 0 0 0 0 0 0 0 0 0 0 
##$SW_h= 40650.406504065
##$TD= 32768
##$TD0= 1
##$TE= 0
##$TE2= 300
##$TE3= 300
##$TEG= 300
##$TL= (0..7)
0 120 53 12 22 120 120 120 
##$TP= (0..7)
150 150 150 150 150 150 150 150 
##$TP07= 0
##$TPNAME0= <>
##$TPNAME1= <>
##$TPNAME2= <>
##$TPNAME3= <>
##$TPNAME4= <>
##$TPNAME5= <>
##$TPNAME6= <>
##$TPNAME7= <>
##$TPOAL= (0..7)
0.5 0.5 0.5 0.5 0.5 0.5 0.5 0.5 
##$TPOFFS= (0..7)
0 0 0 0 0 0 0 0 
##$TUNHIN= 0
##$TUNHOUT= 0
##$TUNXOUT= 0
##$USERA1= <user>
##$USERA2= <user>
##$USERA3= <user>
##$USERA4= <user>
##$USERA5= <user>
##$V9= 5
##$VALIST= <valist>
##$VCLIST= <CCCCCCCCCCCCCCC>
##$VD= 0
##$VDLIST= <DDDDDDDDDDDDDDD>
##$VPLIST= <PPPPPPPPPPPPPPP>
##$VTLIST= <TTTTTTTTTTTTTTT>
##$WBST= 1024
##$WBSW= 4
##$XGAIN= (0..3)
0 0 0 0 
##$XL= 0
##$YL= 0
##$YMAX_a= 37717
##$YMIN_a= -73901
##$ZGOPTNS= <>
##$ZL1= 120
##$ZL2= 120
##$ZL3= 120
##$ZL4= 120
##$ABSF1= 248.5645
##$ABSF2= -253.2056
##$ABSG= 5
##$ABSL= 3
##$ALPHA= 0
##$AQORDER= 0
##$ASSFAC= 0
##$ASSFACI= 0
##$ASSFACX= 0
##$ASSWID= 0
##$AUNMP= <proc_1d>
##$AZFE= 0.1
##$AZFW= 0.5
##$BCFW= 0
##$BC_mod= 2
##$BYTORDP= 0
##$COROFFS= 0
##$CY= -3
##$DATMOD= 1
##$DC= 0
##$DFILT= <>
##$DTYPP= 0
##$F1P= 0
##$F2P= 0
##$FCOR= 1
##$FTSIZE= 65536
##$FT_mod= 6
##$GAMMA= 0
##$GB= 0
##$INTBC= 1
##$INTSCL= 6.047779e-11
##$ISEN= 30
##$LB= 1
##$LEV0= 0
##$LPBIN= 0
##$MAXI= 10000
##$MC2= 0
##$MEAN= 0
##$ME_mod= 0
##$MI= 50
##$NCOEF= 0
##$NC_proc= -7
##$NLEV= 6
##$NOISF1= 182.463
##$NOISF2= 159.3651
##$NSP= 0
##$NTH_PI= 0
##$NZP= 0
##$OFFSET= 248.5645
##$PC= 4
##$PHC0= -10957.28
##$PHC1= 19.81271
##$PH_mod= 1
##$PKNL= yes
##$PPARMOD= 0
##$PSCAL= 0
##$PSIGN= 0
##$REVERSE= no
##$SF= 81.0140089999694
##$SI= 65536
##$SIGF1= 159.3651
##$SIGF2= -187.1042
##$SINO= 113.3802
##$SIOLD= 16384
##$SREGLST= <1H.CDCl3>
##$SSB= 0
##$STSI= 65536
##$STSR= 0
##$SW_p= 40650.406504065
##$SYMM= 0
##$S_DEV= 0
##$TDeff= 32768
##$TDoff= 0
##$TI= <>
##$TILT= no
##$TM1= 0
##$TM2= 0
##$TOPLEV= 0
##$USERP1= <user>
##$USERP2= <user>
##$USERP3= <user>
##$USERP4= <user>
##$USERP5= <user>
##$WDW= 1
##$XDIM= 65536
##$YMAX_p= 479211972
##$YMIN_p= -101060520
$$ End of Bruker specific parameters
$$ ---------------------------------
##NTUPLES= NMR SPECTRUM
##VAR_NAME=  FREQUENCY,     SPECTRUM/REAL,   SPECTRUM/IMAG
##SYMBOL=    X,             R,               I
##VAR_TYPE=  INDEPENDENT,   DEPENDENT,       DEPENDENT
##VAR_FORM=  AFFN,          ASDF,            ASDF
##VAR_DIM=   65536,         65536,           65536
##UNITS=     HZ,            ARBITRARY UNITS, ARBITRARY UNITS
##FACTOR=    0.620285442955139, 1,           1
##FIRST=     20137.2065510682, 0,            0
##LAST=      -20513.1999529968, 0,           0
##MIN=       -20513.1999529968, -101060520,  0
##MAX=       20137.2065510682, 479211972,    0
$$ Real data points
##PAGE= N=1
##DATA TABLE= (X++(R..R)), XYDATA
$$ [...]
46361 4986973 1725333 -3035872 -6751422 -7842348 -7165488 -6211534 -4656472 -1376092
46353 -1376092 2535791 4327071 3728570 3664794 5242347 4967261 -137128 -6857379 -9045424
46344 -9045424 -5579718 -1286594 -83638 -869640 -825933 432142 1163703 -281342 -4173116
46335 -4173116 -8333149 -8555755 -2909424 4448801 7129615 4477817 1937136 2867922
46327 2867922 4490785 3604794 1583724 685918 -375850 -3157595 -5077631 -2861615
46319 -2861615 1797816 4537096 4757913 5326480 6916027 7339326 6328167 6379487 8044872
46310 8044872 8378572 5545554 1790938 64063 109448 -201097 -1285098 -1466843 442165
46301 442165 3414691 5152947 4575420 3173325 3094729 3811564 2518923 -1162937 -3288791
46292 -3288791 -773114 3499386 4079266 331839 -3279525 -3840665 -2947139 -2633220 -2382411
46283 -2382411 -1685195 -2145635 -4798915 -7673079 -8155359 -6149798 -3247432 -433759 1677316
46274 1677316 1879755 -353680 -3478730 -5328890 -5371694 -4494268 -3470702 -2785771 -3037331
46265 -3037331 -4158296 -4859735 -4086428 -2555385 -1698268 -1493484 -682500 845529 1269165
46256 1269165 -689433 -3210488 -2839841 844151 3395848 388667 -6131051 -8848680
46248 -8848680 -4034299 3392902 5863314 2020756 -3382583 -6539440 -7423478 -6450337
46240 -6450337 -3213871 551245 1202515 -1520502 -2930976 370482 5478502 7157821
46232 7157821 4691701 1834014 1344522 2466425 3250226 2973883 2262014 2292267 3685574
46223 3685574 5277785 4752533 1432826 -2536921 -4681352 -4569878 -2804996 392687
46215 392687 3841854 4606141 1307955 -2775097 -2864228 1188375 4476539 3037343 -1987217
46206 -1987217 -6729808 -8945792 -8800363 -7018588 -4104499 -972943 1081411 1362685
46198 1362685 127845 -2060628 -4537838 -5741876 -3358047 3047796 9622965 10724687
46190 10724687 5271161 -1073540 -2250907 764961 1678923 -2364487 -7015063 -6618155
46182 -6618155 -1093425 4763442 6964550 5574771 3419672 2955384 3915576 3704862 972442
46173 972442 -1679395 -599804 3466306 5660098 3286596 -1200003 -4496389 -6423678
46165 -6423678 -7835500 -7824307 -5637154 -2800727 -648069 1901274 5266242 6356981
46157 6356981 2400547 -4006435 -7329300 -5739523 -2248040 -91294 -26187 -1410739
46149 -1410739 -2820184 -2005499 1843801 5976747 6644042 3364021 -1493516 -6258929
46141 -6258929 -10342375 -12149364 -10034202 -5174490 -680788 1975837 3299846 3411345
46133 3411345 2191455 938775 816001 456389 -1723849 -3916456 -3333338 -1176695 -860047
46124 -860047 -1995783 -1103513 1818217 2838962 913853 -385309 520493 395771 -2578651
46115 -2578651 -4930996 -3529542 -581431 694023 1359601 3518130 5219454 3461237
46107 3461237 -5852 -753024 1637631 3351999 2205602 -315601 -2748901 -5508038
46099 -5508038 -8319596 -9064353 -6707462 -3398230 -2138779 -3308979 -4570960 -3826855
46091 -3826855 -1487191 391307 819722 903395 1835662 2978715 3030580 2056528 837484
46082 837484 -637191 -1965991 -978855 3425470 8069944 8764076 6294256 5150517 6480271
46073 6480271 6938285 4947344 2979117 2384787 1206118 -1019555 -1645053 -477631 -1291311
46064 -1291311 -4633544 -5098768 -156140 4114435 1779909 -3545471 -4667600 -1958130
46056 -1958130 -1178964 -3367778 -4796596 -5018667 -6827414 -8981469 -7051667 -1972518
46048 -1972518 -136173 -3511140 -6548979 -5019174 -1757601 -1068235 -2787207 -4678351
46040 -4678351 -6059384 -6214269 -3219623 2760875 8052047 9553871 7789229 4854428
46032 4854428 2369993 2027855 4307786 5798578 2058371 -5590890 -10455297 -9159198
46024 -9159198 -5530530 -4092059 -4393051 -4232827 -3960284 -4417118 -4330754 -2789266 -1113925
46015 -1113925 157097 2600503 5853812 6264603 2540598 -1163071 -1107065 730680 570196
46006 570196 -1604755 -3911736 -6231350 -8058586 -6411781 -438060 5057316 5275192
45998 5275192 1727800 -1446601 -3920415 -6693326 -6865661 -1745785 4197501 4009491
45990 4009491 -989482 -2580899 1891716 5827181 3964939 -3615 243801 4715836
45982 4715836 8323250 7906232 4747117 1925062 1462404 2857094 3280123 568361 -3628456
45973 -3628456 -5530464 -4091266 -1824543 -727984 -237952 257141 -154150 -1812200 -3193094
45964 -3193094 -2876764 -1029661 1666826 4638055 6529918 5823287 3022843 505570
45956 505570 -220712 433818 1681388 3005644 3436731 2280437 490874 -590365 -1370421
45947 -1370421 -2777796 -3798778 -2937283 -1320695 -1285743 -2507770 -2729014 -1638301 -585478
45938 -585478 716270 3284065 5533876 5310885 4402879 5851573 7485433 4445403 -1759924
45929 -1759924 -3964745 -474814 2169755 231609 -1401384 1144025 2983555 -1159147
45921 -1159147 -7126244 -7512913 -3132477 -360812 -340821 859870 3206515 2242739 -2446084
45912 -2446084 -5863586 -5561246 -4380752 -4050586 -2284620 1783864 4816690 4459429 2787027
45903 2787027 2037460 909835 -2082876 -4811062 -4056545 129040 4658470 6426116
45895 6426116 4094257 -908280 -4271356 -2419601 2472512 3939417 -572294 -5782344
45887 -5782344 -5211237 666240 5791965 6373530 4089541 2013034 576406 -1446518
45879 -1446518 -4018239 -5623764 -5526894 -4865368 -4887777 -4855410 -3030986 171462 1718345
45870 1718345 -272779 -3656060 -4786351 -3031413 -981424 -760479 -2003913 -3247465
45862 -3247465 -3578351 -2893190 -1823782 -1247538 -959532 339685 2655915 3748424 2260722
45853 2260722 165506 -201635 149950 -944302 -2512964 -2036641 -209712 39114 -1331203
45844 -1331203 -1830836 -1728210 -3951724 -8067512 -9627329 -7139650 -4587155 -4688540 -4714136
45835 -4714136 -2204853 30193 -1013612 -2609281 -791692 2147811 628957 -5074492
45827 -5074492 -8537142 -6296082 -2268442 -1846025 -5498450 -9834049 -11922611 -10723331
45819 -10723331 -6525844 -1053847 2997390 4046443 2797106 723032 -1771325 -4850734
45811 -4850734 -7530972 -7722899 -4619933 -587379 600769 -1852973 -4278440 -2964808
45803 -2964808 892699 3086572 2654607 2756162 4716973 5234095 1782351 -2612424 -3327571
45794 -3327571 -537741 1837245 1880464 781165 -555976 -2153091 -2765135 -884409 1910218
45785 1910218 2134785 -477594 -2256941 -929872 1291250 1314772 -616261 -1954549 -1252982
45776 -1252982 1023328 3692920 5412381 5006762 2506440 -585738 -2587728 -2613956 -326460
45767 -326460 3847764 7770008 8418040 4857864 -408680 -4020854 -5082340 -5097365 -5260578
45758 -5260578 -5100730 -3919311 -2382955 -1646087 -1257910 549998 3784206 5425136 3158230
45749 3158230 -541824 -898916 2473277 4662622 2510819 -805528 -813115 1512817 1755432
45740 1755432 -896753 -2776013 -1548919 862544 1628157 189508 -2580751 -5716515
45732 -5716515 -7805227 -7551144 -5580010 -3937268 -3294858 -2370403 -355392 1979077 3845471
45723 3845471 5186949 5678832 4972443 4034854 4079851 4109716 2038154 -1465824 -3069604
45714 -3069604 -1483403 632777 562107 -1166285 -2589327 -3040919 -2712171 -1740505 -1200963
45705 -1200963 -2853883 -6328129 -8567242 -7684589 -5400417 -3994965 -2955134 -764317
45697 -764317 1807406 2691467 1643067 105232 -1227491 -2652383 -3868142 -4065771 -3411314
45688 -3411314 -3039822 -3716506 -5324698 -7143597 -7958327 -6748519 -4013056 -1540739 -341162
45679 -341162 74340 48694 -830627 -2043883 -1876901 19326 1692442 1700774 885817 97475
45669 97475 -1491194 -4014662 -5221204 -3520779 -850075 -103755 -1398714 -3181445 -5058059
45660 -5058059 -6735794 -6102811 -1857103 3181075 4871158 3065053 874218 -396747
45652 -396747 -1841866 -3097218 -2150009 605151 2045882 1028086 13219 921692 2543290
45643 2543290 3263655 3270148 2699679 754262 -1578053 -1039008 3238335 7160376 6526539
45634 6526539 2469860 -759612 -1711517 -2159672 -2676941 -1536051 1589686 3958823 3139405
45625 3139405 75052 -2602077 -3940987 -4860109 -5756230 -5576080 -3476541 -373294 1769502
45616 1769502 1866258 564278 -589356 -451887 1083466 3250503 5085881 6210568 6906233
45607 6906233 7182587 6187544 3315233 -361914 -2863900 -3495830 -3050874 -1837629 701163
45598 701163 3831391 5028063 3069972 107424 -1001449 -216733 448259 30469 -899124
45589 -899124 -1883699 -2794654 -3157806 -2982949 -3316350 -4285764 -4081951 -2130164 -1436207
45580 -1436207 -4426991 -7918971 -6597954 -1051653 2497929 1091159 -1291245 -619446
45572 -619446 1505817 2003852 1813542 3097601 4115663 1758163 -2456932 -3763572 -1176167
45563 -1176167 1172212 232300 -2139488 -2721607 -1220520 672007 2281827 4034811
45555 4034811 5743953 6530779 6064607 4901297 3853493 3448986 3452732 2577338 -483385
45546 -483385 -5027547 -8065057 -7121219 -3145461 328694 1065420 313888 684220 2646739
45537 2646739 4135737 3346215 762690 -1789546 -3035336 -2791167 -1756090 -1394197 -2770153
45528 -2770153 -4575458 -3758088 465277 4785440 6075183 5938111 7895130 11069862
45520 11069862 10907058 6579505 3112976 4072491 6157984 4444614 -25624 -2174830
45512 -2174830 -781467 147981 -2205085 -5853401 -7836545 -8249243 -8649945 -8997626 -8420861
45503 -8420861 -7449988 -7167449 -6939031 -5242938 -2611642 -1516611 -2649228 -3322469 -1182782
45494 -1182782 1882787 1983802 -1003786 -2819306 -887334 1861458 1421293 -1394468
45486 -1394468 -2736390 -1931784 -1970736 -4137067 -6304668 -7219842 -8362595 -10046540 -9620293
45477 -9620293 -5928386 -2180569 -1613528 -3228398 -4647712 -6102544 -8159253 -8580874
45469 -8580874 -5815938 -3052385 -3737243 -5027717 -1566469 5206675 8026518 4548670
45461 4548670 606578 859389 2334825 576113 -2964115 -3919544 -1573296 1877398
45453 1877398 5557302 8980470 9363773 4757291 -1458793 -3853898 -2232340 -1420437
45445 -1420437 -3841596 -6476784 -6028580 -3459722 -1823132 -2180814 -3322037 -3851860 -3307086
45436 -3307086 -2300162 -2121123 -3134301 -3644586 -1946887 690040 1317757 -175737 -466479
45427 -466479 2210839 4936217 3949263 2291 -2471500 -1018522 2050431 2902680 892495
45418 892495 -927312 183877 3052593 4019827 1855449 -500424 -216938 1180133 183834
45409 183834 -3156238 -5176128 -4027572 -1991025 -1625846 -2569016 -3394940 -3945384 -4284792
45400 -4284792 -3854619 -3307942 -4627516 -7556897 -8630545 -6059453 -2796518 -1912710 -1821864
45391 -1821864 170823 2238304 812959 -2663959 -3257923 -455182 883931 -1756445
45383 -1756445 -4918147 -4845049 -2366376 -56401 1636383 3071778 3466768 2656371 2163150
45374 2163150 2484425 1840514 -642123 -3196983 -4458036 -5203206 -5450421 -3438214 329802
45365 329802 1967005 26550 -1521662 346376 2475734 1163515 -971488 385328
45357 385328 2873912 749099 -5001781 -7283848 -3823803 -333778 -1097427 -2830641
45349 -2830641 -925347 3286476 5202519 3444986 267339 -2307663 -3992008 -5236962
45341 -5236962 -6489832 -7473438 -6816600 -4013933 -1343927 -1118198 -1499608 1126279 5589303
45332 5589303 6482582 2420189 -1232438 -228095 2627025 2722444 729724 171631 868720
45323 868720 -407343 -4074652 -6793615 -6295263 -4154574 -3393892 -4943399 -6507384 -4507956
45314 -4507956 1783305 8022286 8945342 4991793 1565548 1000089 -342269 -4848840
45306 -4848840 -8383903 -6377356 -1521438 -230269 -3412633 -5762119 -3437781 1834286
45298 1834286 6100216 7140037 5200201 2476723 1505942 2088932 1116233 -2537708 -5290945
45289 -5290945 -4000422 -1260612 -1520158 -4035510 -4463057 -2109008 -548088 -1600160
45281 -1600160 -3551242 -5151550 -6598123 -6530765 -2995640 2080391 4197552 2899388
45273 2899388 2342899 4179071 4823256 1712452 -2323728 -3472251 -1906851 95421
45265 95421 1501631 1583233 -834489 -4339487 -4358019 1088166 7532286 9274522 6525558
45256 6525558 4132091 4660863 6075867 5696506 3550694 1538798 1121280 2267871 3915373
45247 3915373 5356731 7002830 8953344 9350123 6139213 554906 -3447404 -3784888
45239 -3784888 -2099321 -595698 369137 825989 205418 -973299 -1118552 -470503 -1099406
45230 -1099406 -2772031 -2344039 747521 2153070 -1210657 -5978920 -7011551 -4450874
45222 -4450874 -1984828 -424744 2178325 5468079 6986994 7059409 8407044 10388642
45214 10388642 8642106 2182928 -3589020 -3809688 -778368 -254044 -3228327 -5211120
45206 -5211120 -3260177 -263771 -1002414 -5846452 -10040510 -8933130 -2934215 2989141
45198 2989141 4393561 1540983 -1594248 -2104397 -1172616 -1903113 -4795671 -6787139 -5338796
45189 -5338796 -2103558 -804275 -2083978 -2942433 -1742078 -926790 -2931414 -5851298
45181 -5851298 -6102617 -3760808 -1804134 -999896 476819 2382140 1696536 -2170623 -5316541
45172 -5316541 -4567408 -1690568 -114134 -172498 -246411 -314972 -1305899 -2432288 -2211652
45163 -2211652 -1324706 -1805640 -3831109 -5570027 -5911531 -5362391 -4500791 -3389984 -2437447
45154 -2437447 -2218323 -2361211 -1822360 -321458 1289396 1866261 634692 -2332475 -5583543
45145 -5583543 -6967852 -5673795 -3055460 -966567 -57406 -37770 -502863 -1044955 -1602962
45136 -1602962 -2797229 -4530447 -4600427 -1146160 3390809 3866952 -954858 -6388427 -7813654
45127 -7813654 -5702523 -3142808 -1758400 -2198294 -4992261 -7968262 -6459589 119177
45119 119177 5234811 3276215 -2310819 -4151407 -1718494 -778413 -3466413 -5800235
45111 -5800235 -5324267 -4556190 -5259732 -5295305 -3553253 -2657587 -3806643 -3786517 -695551
45102 -695551 1679163 -483668 -4446253 -4817921 -1680516 379884 210132 1644214 6466829
45093 6466829 10454435 8696525 2147885 -3526421 -4440140 -2021802 -509386 -2173521
45085 -2173521 -5221740 -6085513 -3606310 -534343 -405205 -3420528 -6473939 -7124196 -6142163
45076 -6142163 -5627208 -6018027 -6227250 -5789176 -5128501 -4020885 -1789444 617706 837324
45067 837324 -1535115 -3651615 -3076025 -1054078 -111106 -49068 899444 2223601 1911170
45058 1911170 448993 183221 684103 -1004587 -4743167 -6454485 -4547819 -2612046
45050 -2612046 -3164889 -3279314 -127725 3222211 2379616 -1026249 -1933742 104174 911888
45041 911888 -1161077 -3397219 -4040058 -4555652 -5767012 -5955522 -4158533 -2174599 -2094438
45032 -2094438 -4151583 -7415992 -10352449 -10868750 -8388525 -5536693 -5093756 -5998411 -5423208
45023 -5423208 -3698712 -3226341 -3432307 -1640938 1250900 1321020 -1476267 -2402284 531030
45014 531030 3393228 2924603 1225008 958407 675882 -1331451 -2640334 -561893 2667072
45005 2667072 3054242 1083671 525419 2444882 4271685 3947708 1697656 -1544641 -4479520
44996 -4479520 -4935096 -1857690 2612976 5284309 5361462 3773941 579040 -4057757 -7422524
44987 -7422524 -6336036 -1715959 1912341 1865080 -244267 -1885284 -2812427 -3795167 -4309800
44978 -4309800 -3245585 -853776 1583243 3630027 5831155 7792833 7560787 4192666
44970 4192666 225626 -565447 1656630 2278729 -1419131 -5764659 -5527847 -1517775 744392
44961 744392 -667817 -1795048 422677 3648223 4413827 3061531 1977360 2075322 3495995
44952 3495995 6768095 10581062 11302193 7764791 3972517 3849429 5744412 5681371 3800416
44943 3800416 3386018 4931798 5530698 3825770 1905380 2137590 4772062 8348054 10192576
44934 10192576 7551750 898572 -5066745 -6574295 -5488242 -5678408 -6728897 -5754786
44926 -5754786 -3817950 -4642928 -7212070 -6157197 -970214 1597423 -2509589 -7895646
44918 -7895646 -7446343 -2515287 45533 -1770091 -3718123 -3190127 -2503342 -3374155 -3264556
44909 -3264556 88493 3925340 3697605 -387487 -3228689 -1329030 2906038 4442051
44901 4442051 1938332 -791360 206733 3783775 4787661 449862 -5723909 -7683485
44893 -7683485 -3855239 1286776 2976585 1619529 1034293 2562238 3453555 1269858
44885 1269858 -2466246 -4216989 -2478364 1356315 4856467 6003117 4226528 1629453
44877 1629453 1715137 4884814 6807688 4021536 -435464 -924258 2103548 2339177 -2733619
44868 -2733619 -7767636 -7636880 -4748295 -4201567 -5347075 -3420996 2284312 7238490
44860 7238490 8329239 6928318 4768541 1178398 -3966223 -8095367 -9037175 -7855322
44852 -7855322 -6441976 -4285517 -187683 4099742 5010961 2098735 -758202 -340046
44844 -340046 1496435 437507 -3977397 -7243226 -5791859 -1685377 408493 -766786
44836 -766786 -2583452 -3024962 -2587443 -1895486 -669258 326636 -627737 -3076744 -4145258
44827 -4145258 -2652437 -696887 104901 765265 1671847 919835 -1453475 -1367727 3235107
44818 3235107 7367255 4975642 -1995441 -5753045 -3008223 1930113 4274353 3854541
44810 3854541 2361096 415628 -862723 456749 3606895 4695261 2116351 -634665
44802 -634665 -118758 1867708 1486216 -823303 -1035071 2125872 5221230 5134788 3136208
44793 3136208 2302075 2814262 2115088 -858583 -3968294 -5042838 -4758641 -4758680 -4462976 -2436999
44783 -2436999 -323446 -1844041 -6822743 -9609765 -6021794 532129 3055706 -294650
44775 -294650 -4869310 -6350546 -5325661 -4436351 -4185717 -3473423 -2466887 -2685992 -4443576
44766 -4443576 -5728874 -4387172 -946028 1787258 2328394 2400660 3804266 4779386 2394853
44757 2394853 -1895882 -2982174 579163 3836705 2214930 -2402045 -5122885 -4488185
44749 -4488185 -2210212 631942 3210143 3111807 -679341 -4468601 -3852864 13757 2335312
44740 2335312 1847340 1497875 2409815 2043841 -864055 -3654516 -3422215 -549832 2322199
44731 2322199 2828833 401631 -2810467 -3301282 -480588 2019143 1621976 703418 1850298
44722 1850298 2737727 857237 -130181 4197199 9813778 8964364 2954053 700029 4052092
44713 4052092 4933145 -247462 -3882834 -17476 5593342 5301228 1528567 778027 2082835
44704 2082835 467965 -2675386 -2078958 1299018 1705365 -1264447 -2463432 -681979
44696 -681979 -165410 -2109821 -2461986 73573 916767 -2718873 -6934156 -7252009 -4938467
44687 -4938467 -3748296 -3996816 -3353202 -1004350 1974676 4570798 5839876 4719275
44679 4719275 1914536 336203 1626158 3634107 3254311 528491 -1976404 -2791193
44671 -2791193 -2494033 -1760676 -647279 246539 -165621 -1784195 -3177696 -3714999 -4550865
44662 -4550865 -6565050 -8409778 -8027544 -5622192 -3607256 -3641750 -5161658 -6896507 -8048190
44653 -8048190 -7552573 -4372159 255335 2896064 1923840 -377882 -1435431 -1808626 -2589999
44644 -2589999 -2077421 1119225 3719521 1394891 -4182313 -7033684 -5450781 -3542421
44636 -3542421 -3748731 -3639189 -1876541 -1594743 -4716291 -7705366 -6751366 -3525476 -2162685
44627 -2162685 -3557749 -5947094 -8224928 -9407017 -7612704 -2981820 837259 1256428
44619 1256428 400505 1288343 3092639 3398662 2484422 1911731 1315722 -43994 -984555
44610 -984555 -865981 -1590907 -3799565 -4225644 -694081 3493223 4416757 3353952 2961896
44601 2961896 1496373 -3001298 -6127724 -2285979 5469706 8657058 5742482 3328560
44593 3328560 4662889 5225536 1810222 -1656600 -993041 1619860 2033850 536985 -200166
44584 -200166 -107276 -847921 -2352461 -3277529 -3235097 -2493291 -1080487 480233 1306396
44575 1306396 1718603 2548305 2756583 666473 -2276734 -2614601 -334114 774049 -768246
44566 -768246 -1992787 -1154114 -994224 -3597013 -6064297 -4983556 -2128984 -1669056 -3656660
44557 -3656660 -4329477 -2121265 187408 -264053 -2379028 -2440221 1197408 5588930 6214285
44548 6214285 2712156 -156901 1183367 4017498 3632376 809327 355745 2952779
44540 2952779 4115697 2024695 557394 2331263 4185023 2929214 816838 1087395
44532 1087395 2028867 421278 -1940425 -557417 4257205 7229557 5484321 1897752
44524 1897752 350965 868383 849778 -833761 -2513390 -2038285 383924 2211680 1725608
44515 1725608 217040 -251478 -95523 -742694 -847426 2301673 7467740 9735630 7215821
44506 7215821 3403567 1293864 -471681 -3233832 -4640290 -2913247 -970283 -2084950
44498 -2084950 -4387513 -3960828 -991663 1421081 2470653 3324118 3475672 1935158 569719
44489 569719 1636934 3089949 1040205 -3810084 -6913919 -6678065 -5729718 -5420006 -4120779
44480 -4120779 -1744907 -917887 -1933210 -1093816 3385810 7507303 6516314 1234452 -3493782
44471 -3493782 -4871497 -4007477 -2901063 -2124656 -1303096 -153368 1252506 2598280 3644718
44462 3644718 4457845 4937823 4374977 2240525 -789308 -3348078 -4493763 -3625166 -437886
44453 -437886 3566804 4831098 1516804 -2981908 -3110974 1953226 7008793 7091336 2739165
44444 2739165 -1894093 -3934505 -3313078 -1118763 1643276 4217936 6341143 8226259
44436 8226259 9827616 10529695 9962773 8706358 7776886 7482586 6806832 4115367 -824107
44427 -824107 -5519578 -6802517 -4761548 -2955611 -3603254 -4564563 -3066241 -450954 -255234
44418 -255234 -2853600 -5463227 -6878709 -8467887 -10272051 -9893763 -6377324 -2039129
44410 -2039129 889627 2655232 3778924 3478688 2081530 2160070 4856763 7326831 6427892
44401 6427892 3160863 781039 -903 -1012231 -2849616 -4270351 -5070036 -6485034
44393 -6485034 -8231332 -7926564 -4752260 -1587235 -1646488 -4162111 -5430022 -3938839 -2482423
44384 -2482423 -4230726 -7996356 -9245185 -5802508 -712718 1576866 429139 -1202506
44376 -1202506 -1118953 280230 2080250 3999335 4809655 2328571 -3243784 -7860036 -7708494
44367 -7708494 -3822274 -637470 -525664 -1720505 -1547914 222938 1817084 1877856 597972
44358 597972 -926433 -1785202 -1855791 -1632711 -1543967 -1619829 -1889028 -2591777 -3565089 -3862556
44348 -3862556 -2655740 -316533 1986075 3546669 4308089 4047407 2445973 188104
44340 188104 -1118790 -880934 -531392 -1462007 -2507337 -1176951 2498683 5371299 5443859
44331 5443859 4708713 5659873 6693451 4287192 -891430 -4095279 -3415865 -2420505 -3995020
44322 -3995020 -5757492 -4856546 -3448379 -4676681 -6238142 -3957129 -13985 -602816
44314 -602816 -5447119 -7196170 -3187765 -295178 -3996502 -9352483 -8920791 -4458847
44306 -4458847 -3195093 -5503686 -4591090 2032740 8542190 9721421 7352368 5151207
44298 5151207 2924044 -620636 -3501842 -3203672 -1258849 -1160446 -3113658 -4257654 -3345940
44289 -3345940 -2213301 -2675705 -4261066 -5230611 -4305366 -1337605 2499548 5226988 5746693
44280 5746693 4899627 4113253 3399943 1611297 -1547576 -4599979 -5454286 -3203740 927398
44271 927398 4203459 4403313 1553221 -2511746 -5964089 -7741938 -7233491 -4764270 -2164663
44262 -2164663 -1051817 -489941 1706801 5223104 7181111 6388193 5047753 5197451 6100829
44253 6100829 6595508 7228147 8090550 7342749 4482636 2512786 3744839 5668070 4456337
44244 4456337 657246 -2422605 -4275530 -6685993 -8774553 -7538042 -3407170 -575368
44236 -575368 -966621 -1986010 -1277144 137931 651087 383590 -558691 -2735488 -5056341
44227 -5056341 -5176947 -3330748 -2245909 -2210578 -291488 4065533 7090197 6495784 4843865
44218 4843865 4486454 3642512 876345 -879052 983189 3701046 3382632 1207656 727792
44209 727792 1773245 1981157 1941508 3587829 5441479 4828110 3235473 3950341 5619058
44200 5619058 3968633 -700738 -3564206 -2718299 -988786 -215273 554821 738633 -1934772
44191 -1934772 -6047200 -6702605 -2909057 474653 21201 -2164912 -3559644 -4990908
44183 -4990908 -6660558 -5750723 -1523215 1838297 1311141 -156900 1072985 3040945
44175 3040945 1700155 -2264769 -4799454 -4638243 -3830702 -3542059 -3119432 -2368400 -1690085
44166 -1690085 -917485 -369005 -1502170 -4233179 -5651578 -3975934 -1528995 -892103 -617164
44157 -617164 1614306 3881213 2568224 -1307721 -3018442 -1147280 636646 -555441
44149 -555441 -2933295 -3419253 -2244460 -2205690 -4377298 -6111134 -3941172 1472576 4625130
44140 4625130 1455868 -4446977 -5588709 -916214 2275885 -1117746 -6569853 -7052752
44132 -7052752 -3331086 -1520165 -3137484 -3953265 -1794615 691604 1626291 2830017
44124 2830017 5414973 6520038 2860159 -4546935 -10805027 -11521258 -6834401 -1876414
44116 -1876414 -1952531 -6041431 -7397189 -2649848 2951686 3011138 -618730 -1304229 1861175
44107 1861175 3688176 2289304 1696672 3963395 5285847 2610331 -1317745 -2711272
44099 -2711272 -2253229 -2514562 -3195634 -2209732 771778 4350331 7025654 7133624 3575587
44090 3575587 -1683775 -4295442 -2486562 828747 2251613 1701295 654478 -529547
44082 -529547 -1643061 -1641560 -704981 -987842 -3386494 -5805481 -6424194 -6221389 -6346291
44073 -6346291 -5739697 -3806252 -2709031 -3865215 -4470347 -1324240 3289587 3743324 -935772
44064 -935772 -4985327 -3105141 2891103 6585328 4872044 1213373 683970 3503012
44056 3503012 5375236 3841251 1477856 1379099 2203383 828873 -1879109 -2144809 321967
44047 321967 1421060 -1032633 -4054257 -4064127 -1428236 1229538 2379417 1666426 -671438
44038 -671438 -2971738 -3284201 -2475441 -3276391 -5214512 -4247083 754266 5128559 4743208
44029 4743208 1568434 -306186 -889364 -2565213 -4762801 -4812815 -2789469 -1454366 -1850790
44020 -1850790 -2133857 -566271 2595126 5671926 6412505 3562174 -856156 -2754726
44012 -2754726 -1215337 25006 -1494717 -2754070 -275299 3858956 5492504 5297885
44004 5297885 6812352 9251197 8363181 4189205 1829209 3299488 4196003 774884
43996 774884 -4280832 -6190003 -4632220 -2682722 -1749021 -1032960 -558427 -1315319 -2608754
43987 -2608754 -2058278 979592 3725597 2970807 -855856 -3893479 -3458651 -1312262 -1031563
43978 -1031563 -2843726 -3373663 -879250 1983483 2270062 1295449 2488657 6128641 9070356
43969 9070356 9187641 7555637 6228679 5830003 5457027 3668276 -57674 -3786736 -4208204
43960 -4208204 -802033 2485154 1787110 -1880142 -4754305 -5595245 -5545704 -4140875 116916
43951 116916 5233341 6338559 2266521 -2122237 -2146138 1074760 3381489 3522501 3569239
43942 3569239 4672805 5192497 3276919 -258586 -2335198 -727625 3296056 5805199
43934 5805199 4220532 166971 -2396313 -1416614 1818163 4821783 6034039 5149450
43926 5149450 2975773 1174318 971849 1959880 2891854 3268991 3206733 2393903 521891
43917 521891 -1658870 -2968306 -3210495 -3121140 -3541426 -5231265 -8125209 -9943286 -7683829
43908 -7683829 -2149484 1405629 -341329 -4002171 -4217254 -1016175 1523324 2216954
43900 2216954 3513620 6013876 7332518 6685285 5800946 4600603 841649 -4663034
43892 -4663034 -7290401 -5054436 -1468919 191483 1153362 3072012 4163852 3068914
43884 3068914 2754097 6114295 10461228 11114415 8670153 7914499 10310880 12141766 10324602
43875 10324602 6156073 2448140 136181 -1095345 -1330247 -933866 -747870 -513593 1479532
43866 1479532 5806349 9905369 10219466 6269695 1372822 -1199856 -1841283 -3260402
43858 -3260402 -6031843 -7454379 -5482675 -1745610 956904 2316272 3329526 3152390
43850 3152390 515958 -2639779 -2941467 -1007204 -951186 -3770155 -5644380 -4474040 -3590604
43841 -3590604 -6006571 -8848627 -7522951 -2802553 498299 439977 -502783 -239910 226718
43832 226718 -769146 -2985478 -4676773 -4256695 -1797185 293528 -660091 -3721379 -4459273
43823 -4459273 -745168 3760705 4501197 2301961 1369986 2630298 3189380 1879019 1046565
43814 1046565 2176990 3409357 2794094 1264770 822574 1698512 2667152 2852386 2257892
43805 2257892 1432258 1095379 1431669 1902685 2393516 3539396 4719719 3372679 -1337743
43796 -1337743 -5598523 -4994353 -822115 1344731 -498325 -2312302 -426987 3349156
43788 3349156 5105498 4387547 3817629 4956552 6814587 7528324 6118667 3477189 2186189
43779 2186189 3855078 6371586 6165684 3677631 3245812 6125950 7510426 3516925
43771 3516925 -2272616 -3610959 -657340 887474 -1108329 -2425791 206107 3872853
43763 3872853 4014892 892905 -1334789 -74994 3507436 6377224 5783517 855892
43755 855892 -5960806 -10078457 -9282224 -6289389 -5090940 -5811876 -5533148 -3506181 -2484172
43746 -2484172 -4243990 -6463333 -5708695 -1925934 1826023 3259935 2812319 2104599 2130978
43737 2130978 3243280 5458067 7702274 7473429 2825451 -4723957 -10292203 -9948606
43729 -9948606 -4835356 161333 1845837 1287585 684295 42609 -1278729 -1876795 -265863
43720 -265863 1506441 -139424 -4582893 -6925661 -4612661 -627885 1505957 2384152
43712 2384152 3909003 5107023 4221042 2536866 2223766 2069940 -487718 -4157390 -4968683
43703 -4968683 -2329581 347576 1243791 2074848 3686759 4007551 2037845 204782 731460
43694 731460 2719101 4706482 7065899 9695990 10291884 7626547 4289292 3485189 4879294
43685 4879294 5960681 5767604 4918744 3626074 2068559 1280755 1477160 1037931 -684808
43676 -684808 -1332871 1183738 5000677 6559201 5170678 2750472 486818 -1432999
43668 -1432999 -2217974 -1640814 -1579259 -3338735 -4746915 -3261026 -630665 -529095 -2490856
43659 -2490856 -2620991 -62563 1842256 1297016 447476 911311 1095941 -362859 -2125552
43650 -2125552 -2890909 -3319366 -3490884 -1776613 1728885 3882661 2991245 1687065 2723536
43641 2723536 4730449 5166700 4871852 5943821 6936946 4431432 -1098285 -4879437 -3951329
43632 -3951329 -786546 273572 -1771912 -4146761 -3985020 -1357534 1245517 1898878
43624 1898878 1088964 196854 -833336 -2567917 -3438427 -996220 3479937 4901412 1005112
43615 1005112 -3648418 -3336138 1008746 3137279 -124450 -5252727 -7021456 -4292776
43607 -4292776 -4420 2619581 2853641 2489447 3535260 5499487 5634218 2767276 -316763
43598 -316763 -79809 3088916 5555578 5346811 4100646 4087407 5344430 6194081 5187502
43589 5187502 2383967 -290138 -549138 1118091 1035657 -2888904 -7315386 -7346004 -3323879
43580 -3323879 -167795 -277859 -1231433 -981484 -835168 -1671023 -1496710 640864 1969722
43571 1969722 301830 -2035189 -1876321 -78740 909947 1754282 4172305 6189915 4547369
43562 4547369 1007135 928954 5037510 7541942 4104819 -2339769 -5904459 -4800378
43554 -4800378 -1843334 -298348 -1331674 -3773979 -4633018 -1431508 4500268 8643697
43546 8643697 8383155 5634543 3293635 1529226 -542309 -1911332 -1033566 1512353
43538 1512353 4213522 6934652 9460848 9415930 5089897 -474995 -1915099 1671963
43530 1671963 5433158 4814832 286681 -4557194 -6985797 -6252977 -3103655 438977
43522 438977 2393663 3002236 4271777 6734121 8308947 7146688 3951048 648612
43514 648612 -1607308 -2268058 -1045990 1069139 2019123 1126485 -48490 -292045 -477021
43505 -477021 -1480478 -2235834 -1640921 -855941 -1680966 -3770487 -5370504 -5904517 -6166872
43496 -6166872 -6989546 -9183307 -13165179 -16732093 -15356286 -7783091 405924 2738583
43488 2738583 253224 -697482 1262869 199145 -7269325 -15097003 -14838557 -6280154
43480 -6280154 3135426 7399515 6295198 2119207 -3195163 -7374155 -8250446 -6420604
43472 -6420604 -4967748 -5327430 -5433288 -3053657 854020 3424159 3268387 1472556 32475
43463 32475 -38133 316820 -857796 -3539998 -4328080 -382398 5339030 6172632 320088
43454 320088 -6182090 -7507934 -5626787 -5892073 -7805478 -5957396 352235 4629527
43446 4629527 2231939 -3146904 -5183659 -3236031 -1108068 -403981 330168 1262139 650452
43437 650452 -1456444 -2696778 -2148401 -1524705 -1994041 -2645149 -2816692 -3048646 -2704710
43428 -2704710 280505 5521592 8874146 7547636 4371846 3939830 5975806 6115763
43420 6115763 2882615 -30488 333658 1358862 -1270051 -6632925 -9071985 -5854883
43412 -5854883 -1130499 -282384 -2458981 -1929007 3497211 8914677 8710690 3844674 80406
43403 80406 373949 2116891 1781091 -668395 -2975163 -3991213 -4205221 -3884585 -2313907
43394 -2313907 818624 3775765 3247169 -2466720 -10501874 -15143404 -13596045 -8737734
43386 -8737734 -4881752 -2697122 -540607 1205934 748041 -1158995 -1800078 -832609 -172944
43377 -172944 299611 2464167 5025944 4025232 -284658 -2450602 -258000 1220798
43369 1220798 -2198984 -6643614 -6345763 -2863826 -1884480 -3576358 -3121023 101065 870645
43360 870645 -3319422 -7942179 -7802526 -3394134 1278011 3741799 3697966 1431773 -1923721
43351 -1923721 -4120268 -3730422 -1653531 133835 539120 -211657 -1163245 -1574054 -1904234
43342 -1904234 -3193562 -4700287 -3739671 500730 4769273 5749680 4604412 4677769 6290790
43333 6290790 7340195 7775465 9330288 11362634 11203689 8669750 6240337 4681007
43325 4681007 2627223 726853 1641657 5051335 7088405 6015310 4187137 2949590
43317 2949590 189511 -4727887 -7826891 -5498901 355279 4970804 6205322 5238298
43309 5238298 4068181 4149962 5418016 5493212 2323035 -1810964 -2350444 797008 2912218
43300 2912218 2084013 1995236 4698731 6063264 2405731 -2860798 -3889268 -354628 3615045
43291 3615045 5436177 4770773 1245568 -3967565 -6777255 -4762555 -967353 632377
43283 632377 537654 612475 -656555 -4398614 -6336327 -2169921 4303346 5399841 575415
43274 575415 -3544828 -3277354 -1076089 945201 3292982 4346393 784717 -5495226
43266 -5495226 -7713494 -3830205 358830 310458 -1185753 -227235 1700034 1578719 460393
43257 460393 768463 1677494 1367303 893476 1965849 3399875 3210013 1924021 826085
43248 826085 -594686 -2479098 -2548551 461033 3609206 3321513 230429 -2554527 -3975482
43239 -3975482 -4729658 -4433207 -2396446 302781 2473356 4883725 7835054 8707560 5388148
43230 5388148 480697 -1551169 -176965 1766890 3059814 4529782 5429896 3733817
43222 3733817 74307 -2560391 -3529480 -5316027 -8756808 -10832060 -8724637 -3738006
43214 -3738006 263595 814227 -1581618 -4498334 -5573483 -4325614 -2172861 -299603
43206 -299603 1481224 3013891 2912057 1087622 -48515 599546 258907 -2940668 -5188563
43197 -5188563 -2080599 3169625 2985100 -3112604 -7120162 -4312481 373337 1054300
43189 1054300 -323706 876884 3123300 1763718 -1822799 -1255220 5064343 11371344
43181 11371344 12728360 10765459 9578677 10058912 10613413 10465150 9673167 7809208 4907546
43172 4907546 2537328 2018437 2318458 1353634 -979135 -2485079 -1585011 344611 239393
43163 239393 -2960548 -6491210 -6661443 -3561320 -1227705 -2229929 -4021407 -2740704
43155 -2740704 906071 2630244 855666 -1436930 -1647162 -928895 -1162854 -1530087 -416939
43146 -416939 1293004 1355562 -487830 -2392908 -2988829 -2527439 -2134928 -3049542 -5562040
43137 -5562040 -7639694 -6122486 -790625 4317599 5397056 3076835 283411 -1913896
43129 -1913896 -3509365 -2822040 1253892 5348854 4710576 357630 -1472900 1979212
43121 1979212 6333922 6880563 4747766 3534019 3510436 2772163 1482304 1132789 1279701
43112 1279701 587148 -105896 820440 2245391 1638167 -607363 -1633857 -867962 -824793
43103 -824793 -2509414 -3221954 -451167 4280523 7115634 6168277 3030090 841334 1496887
43094 1496887 4058460 5701830 4821899 2789273 1705803 1352898 152041 -1609196
43086 -1609196 -2028793 -1021623 -865179 -2695203 -4781502 -5169922 -3935874 -1871710 877942
43077 877942 3547453 4184044 2166468 -195941 -385046 1144275 2177432 2035116 1775444
43068 1775444 1911304 1946441 1811389 1800349 1159462 -1225901 -4307243 -5024846 -2172150
43059 -2172150 1326654 1685149 -895657 -2539425 -884692 2081193 3364915 3282537 4353710
43050 4353710 6929335 8665495 8394602 7687222 7648738 6891436 4382735 1912330 1490776
43041 1490776 2270541 2474901 2443739 2932659 2407870 -276512 -2186695 84204 3943935
43032 3943935 3207418 -2666818 -7190443 -6197437 -3222910 -2884328 -3941725 -2943983 -734257
43023 -734257 -416719 -1437722 -636066 2284589 4908036 6809319 9642294 12764688 12999685
43014 12999685 9301567 4246425 350154 -2076448 -3132577 -2640641 -1781450 -2147554
43006 -2147554 -2434407 474511 6018580 9361667 8321125 7148095 10133320 14515139
42998 14515139 14191615 8846924 4444084 4657445 6588874 6398330 4857755 4474324 4491621
42989 4491621 2858969 1333288 3839806 9641113 12568358 8726458 1585936 -2832893
42981 -2832893 -3049929 -1629213 22119 2593468 5614233 7025612 6221308 4645121
42973 4645121 3180886 1693626 1305538 3962976 8902419 12504679 12926977 12238893 12557757
42964 12557757 12700811 10562996 6598151 2856801 332119 -800533 -27106 2308348
42956 2308348 4122549 4122686 4081240 6380885 10095997 11710069 9488034 5406974 2702371
42947 2702371 2623452 3693923 3706067 2522513 2520442 5368340 9145618 10592639 9603901
42938 9603901 8789529 8981549 8715894 8210157 9399107 11076993 9105303 3647701 986612
42929 986612 4718564 10031402 11081611 9483375 10116188 12518477 12861363 11602494 12270507
42920 12270507 14262398 13654067 10473487 8724427 9377825 9527904 8616308 9333570 11782988
42911 11782988 12745392 11635482 11389570 12418072 11576563 8527772 7213657 9180088
42903 9180088 11156092 11261281 11816230 13641451 13511697 10279849 7797341 8262649 8203767
42894 8203767 5076426 2558266 4561666 8540849 9757181 8422020 7743890 8226335
42886 8226335 8625567 9538295 11519796 12510210 11346237 10736072 12614361 14165417 13033202
42877 13033202 12361848 15026837 16933188 13022049 6757201 5779331 10071767 12632019
42869 12632019 11031996 9823043 11048288 10953049 8187429 7393865 11255614 15601011
42861 15601011 16278318 15205268 15491123 15757883 14055455 12976560 15379671 18183615
42853 18183615 16292981 11107932 9414811 13767265 18854378 18805915 14626173 12343292
42845 12343292 15668166 22356921 27165750 27095450 23646470 20554902 19846726 20349353 19754209
42836 19754209 17395766 14706866 13416236 13836525 15022075 16319807 18113044 20553030
42828 20553030 22280049 21767379 19720475 18383832 18273596 17679906 15997111 15076989 16020829
42819 16020829 17149513 16974577 16755332 17912897 19347262 19921709 21050451 23546138
42811 23546138 24411991 20978766 16321414 15702482 18716239 20184395 18621753 18254878
42803 18254878 21495848 24529859 22819998 17312348 12592902 11382590 12967036 15189031
42795 15189031 16248848 15720022 14750160 14551910 15062498 16187597 18794993 22194957 22725060
42786 22725060 18569482 14140093 14711917 17935937 16773823 10760618 7429958 10927150
42778 10927150 16034728 16721181 14568976 14347403 16120485 16813224 16209579 16470640 17840126
42769 17840126 18954181 19820625 21155130 22207000 21878033 20463732 18428258 15680411
42761 15680411 13642297 14871892 18573152 20068060 17351508 14501142 15564154 18813332
42753 18813332 20488694 20428345 20130686 19066308 17278661 17866421 21951742 24762823 22177536
42744 22177536 17876673 18107408 22412593 25962686 28119632 31263127 33408458 30446715
42736 30446715 24863159 23568555 26719316 27347368 23436738 21413191 24637378 27109388
42728 27109388 23613500 18818657 19831492 24912995 26529810 22564249 17992440 16730065
42720 16730065 17372468 17107089 15746493 15031291 16155958 18453118 19728635 18583878
42712 18583878 16760877 17406609 20457482 22310418 21186505 19788822 20650201 21812036
42704 21812036 20061439 16293810 14332538 15515224 17398659 17384048 15263922 12409721
42696 12409721 10443695 10810806 14155219 19609337 25091023 28383565 28325253 25787626
42688 25787626 23154550 21730824 20324982 17951213 16688053 18957399 22747663 23404971
42680 23404971 20315104 17576730 17151004 16000168 12089568 8679213 9315626 12177451
42672 12177451 13269482 12555668 12949721 15113370 17102250 17977945 18387132 18432468 17889344
42663 17889344 17737254 18972927 20804832 22080290 23028347 23497139 21641690 17224574
42655 17224574 13990264 15122771 18150128 18417970 16183192 15706618 18146582 20327536
42647 20327536 20598989 20783469 21236438 19010258 13352936 8925187 10208361 15355417
42639 15355417 18897584 18860548 17935242 18381236 19034363 17978611 15793998 14579138 14787429
42630 14787429 14800089 13772897 13280887 14928518 17438557 18123362 16869009 16204449 17108781
42621 17108781 17567104 16463972 16047188 18421168 21982804 23902847 24218274 24711364 25373106
42612 25373106 24954110 23783606 23117047 22721767 21871631 21530371 22598101 23304074 21678995
42603 21678995 19396836 19420432 20818323 20055640 16863834 14472336 14172593 14177811 14150394
42594 14150394 16155022 20149462 22938017 22940817 22058089 21712643 21189603 20980513 23086711
42585 23086711 26350001 26377254 22421937 19469916 20594412 22162065 20400448 18074149
42577 18074149 19868399 24877105 28819322 30789966 32601943 33856416 33098445 32071177
42569 32071177 33360575 35142297 33811381 30849891 31094458 34351148 35037009 31258091
42561 31258091 28251405 30508380 35621436 38971782 40285642 42034140 44599110 46837849
42553 46837849 49394194 53951870 60335269 67167460 74589704 83946499 95420174 108185402
42545 108185402 122755105 141657843 167898987 203182563 245761134 287789701 315978815
42538 315978815 318650773 294554202 254561959 213901204 182152726 159679225 142007772
42531 142007772 126328612 113473343 104582193 97917705 90560410 82564250 77295958 77034306
42523 77034306 79789370 81499804 80330170 77778759 76386527 77482127 80656528 84327927
42515 84327927 86907043 88085575 88844635 89841706 90376542 89670169 88631153 89179526 91608925
42506 91608925 93433602 91527775 85461998 78454317 74644315 75187870 77258849 77165246
42498 77165246 74026623 69820278 66409755 63833359 61479179 59331068 57213178 53951663
42490 53951663 48560349 41918163 36363667 33704288 34062327 36267541 38701815 39973547
42482 39973547 39487225 37585309 35070382 32793323 31706605 32608279 35159995 37375711
42474 37375711 36788633 32572126 26644696 22484993 22137717 23884661 23624372 19636781
42466 19636781 15344451 15607922 20439455 24629722 24221218 20971383 19004858 19414085
42458 19414085 20594930 22115036 24898691 28071511 28879544 26250627 21945014 17767743
42450 17767743 14221059 12442233 14318614 19050358 22353922 21393874 18399378 16975106
42442 16975106 16978302 16306431 16048203 19423293 25669267 29434365 27741517 23970880 22750228
42433 22750228 23938804 24644796 24862001 27145954 31436919 34177749 33364593 31308505
42425 31308505 30836977 31317262 30790381 30339871 33241017 39991772 47198301 52464584 57906619
42416 57906619 66748667 78269838 89258416 99871370 114361162 135303099 161215267
42409 161215267 192139976 232687796 283274118 329969215 350807282 335404082 294262284
42402 294262284 246419218 202528248 163422383 129691915 104790491 89393258 79417953
42395 79417953 71373431 65288074 60951385 55590951 47690635 39789479 34708912 31391291
42387 31391291 27326113 23422570 23323647 28055684 33563218 34253540 28447847 20185584
42379 20185584 15372261 15650688 16920741 15166393 12218419 12753334 16537052 18215784
42371 18215784 15646893 13586434 16476002 21673617 23551127 21227875 18099599 15993952
42363 15993952 14304354 13554765 15238505 18425701 20459375 21005064 21966166 23570319
42355 23570319 24164065 23968051 25317787 28652217 31813148 34129473 37749927 43723760
42347 43723760 49811559 53428816 53990044 51395234 45434187 38110708 33219612 31518665
42339 31518665 29245251 23802193 18208458 17019268 19924766 22484364 21787130 18453844
42331 18453844 14176949 10435361 9215053 11885969 16750964 19882817 19267155 16839647
42323 16839647 15828411 16992847 18068118 16603287 13032288 10601703 11748674 14944070
42315 14944070 16422367 15057062 13738533 15205220 18269253 19533987 17663131 14544335
42307 14544335 12926026 13959790 16535025 18385051 18387310 17772129 17919669 17366247 13407295
42298 13407295 7085922 3622700 6197817 11599426 14030828 11501534 6734177 3561854
42290 3561854 4174718 8031010 11663041 11513790 8652876 8132401 11642757 14186559 11411615
42281 11411615 6951973 7674538 13898927 19826213 22401454 23749557 24902846 23428794
42273 23428794 18942892 15508022 15870172 17560638 17489547 16668870 17248827 18028105 16592756
42264 16592756 13975101 13648904 16637247 20283212 21690896 20699626 19550743 20360743
42256 20360743 22528699 22824651 19423935 15377142 15468013 19522656 22195447 20439178
42248 20439178 17635803 18314392 22028951 25174074 26170737 25832278 24776584 23590338
42240 23590338 23763458 25422771 25882698 23639305 21980498 24733347 29718181 30918431
42232 30918431 26921786 22735850 22501226 24603553 25681171 25857310 27413336 30765640
42224 30765640 34718915 39473792 46527859 55546862 63430266 67353824 67726153 67090332
42216 67090332 66330617 63218309 55645846 45572177 37989599 35596693 36053277 35312762
42208 35312762 32266050 29055274 28074476 29798911 32427784 32735565 28770829 22726504
42200 22726504 19196769 19298868 19098898 15987199 13588687 16648630 23336142 27398424
42192 27398424 26955506 26097944 27604110 29083517 27669827 24184992 20735669 17888251
42184 17888251 16328266 17879634 22300835 25862408 25728242 23445380 21729084 20302296
42176 20302296 17816439 15663215 16273756 18763476 19711985 18008345 16061031 16062496 17423082
42167 17423082 18380309 18438696 18667044 20542238 24653699 29950393 34445525 36890637 37073320
42158 37073320 34677912 29813946 25166821 24919606 29732835 35039458 36535023 35237667
42150 35237667 34494632 34310068 32505130 30028921 30420514 33869845 36059673 33947312
42142 33947312 29258039 25199739 23098040 23553292 27214452 32064032 33158118 28341826
42134 28341826 22222338 21216587 25884259 31173979 33256886 32746852 31436037 29529826
42126 29529826 27303709 26656926 28943995 32685994 35232226 35951178 36290166 37126496 37602224
42117 37602224 36844036 35766079 36442940 39870825 44635038 47790966 47127258 42868310
42109 42868310 37479340 33954709 34092722 37718171 42770349 46203854 45900416 42574850
42101 42574850 39419863 39080571 41181966 43528109 45231674 47292270 50193719 52831232
42093 52831232 54587158 56602362 59450872 61191766 60109180 58406362 60155487 65468685
42085 65468685 69736787 69691747 67479682 66938620 68162511 68266009 66030648 62982875 60494430
42076 60494430 58475744 56906005 56222818 55778730 54052481 51110705 48987498 48672246
42068 48672246 48409778 46324169 43469376 42664792 44879178 48177248 50034254 49489126
42060 49489126 47075291 43957127 41681069 41731568 44128786 46603613 46323944 43074958
42052 43074958 40050258 40526701 44003142 46773158 46458666 44630043 44139197 45049838 44750738
42043 44750738 41746495 37760208 35652861 36323839 38416709 40548912 42847871 45888428
42035 45888428 48621428 48538821 44714499 39914034 38047445 39499739 40923128 40407472
42027 40407472 40628788 44823856 51191082 54259162 51680004 46904672 44352149 44293856
42019 44293856 44101910 42901131 42678180 44968036 48351725 50163915 49858308 49509654 50868590
42010 50868590 52939377 53372732 51762272 50267667 50853655 53160042 55489764 56634706
42002 56634706 56182224 54484819 53217467 54386341 57433154 58805612 56156571 51735979
41994 51735979 49651587 50843987 52960998 54216637 54751670 54775618 54294163 54666553 57484568
41985 57484568 61352674 62525275 59777896 56357283 55896316 58285862 60791350 61606588
41977 61606588 60993486 60091108 59779899 60110960 60318221 59863156 59242546 59005584 58855492
41968 58855492 59094987 61561090 66677999 70863930 70301732 66606779 64773076 65681953
41960 65681953 65280058 61840570 58986405 59698461 62100601 63646096 64889904 66120914
41952 66120914 64844929 60436531 57126968 58022980 59911713 58636006 55875413 55255757
41944 55255757 55349332 52939318 50279048 51756766 55239667 54684885 50605476 49572550
41936 49572550 52853662 54310311 51647988 50966004 56090732 61315768 60443488 56620024
41928 56620024 56487057 59305445 59085751 54666412 50820737 50659572 52745535 55073209
41920 55073209 56984379 57639585 56825689 56562357 58093194 58724724 56019336 53383704 55943685
41911 55943685 61896203 64369174 62120016 61643203 66857430 73143667 74986755 74183993
41903 74183993 76078706 81423897 86421097 88282904 86858056 82836263 77942642 75071036
41895 75071036 74852140 73950749 70153561 66970256 68924618 73940173 75447515 71610097
41887 71610097 67383355 66749020 67681503 66631493 64143914 63470820 65949874 69852298
41879 69852298 72425842 72093542 70127688 70340865 74946434 80791973 82694167 80609730
41871 80609730 79630581 82107961 84341143 82994923 80192923 79275572 79764650 80169593 81730626
41862 81730626 85021228 86672196 84656508 83344379 87218857 92575726 92675461 89044683
41854 89044683 89337354 94603875 97804328 96281304 96396572 102208067 108079506 108046546 105569026
41845 105569026 107404755 113060781 117289539 119307503 122600608 127939853 132952342 137179672
41837 137179672 142127129 147660764 153176646 160450323 170274778 178514132 181358247 182504649
41829 182504649 188440438 197957713 203835621 204658088 206946436 214316314 222424290 227377233
41821 227377233 231821130 238738266 245667982 250108789 255489271 266169797 280209518 292605558
41813 292605558 303108971 315563805 331180081 347338159 362161251 376022808 389032638
41806 389032638 400797352 412456568 425627476 439298811 450574893 458508073 464690392
41799 464690392 470088264 473776030 475143197 475294228 475652573 476443888 476806527 475534056
41791 475534056 471921221 466724960 461960401 459150446 458351280 459117821 461114668 463372527
41783 463372527 464769539 465969474 468697884 472153270 473034334 470949356 470499918 474722888
41775 474722888 479211972 477269135 469512578 463435589 463334784 465383239 464169990 460237748
41767 460237748 458510409 461508093 466789979 470237216 469750030 465585776 458272604 446985315
41759 446985315 430271889 408277727 383513808 358982409 336209022 315473103 296773002
41752 296773002 279652715 263209665 247398661 233332468 221394884 210544921 200620481
41745 200620481 193291895 188875989 184446945 177900350 171891235 170053591 170734131 169035951
41737 169035951 164828552 163812106 169365621 177663472 183105132 185094731 186705798 189391173
41729 189391173 192239810 194796159 197467743 199904350 201693209 204460248 211054852 222527397
41721 222527397 237558398 254701331 273126872 290619922 302806247 306026021 300442418
41714 300442418 289102288 274217292 255828432 234476240 213372533 195999736 182159657
41707 182159657 168685383 154395862 141963549 133679463 127675123 120566495 112273714
41700 112273714 105545615 101541561 98707913 95886911 93787859 92862234 92077992 90707389
41692 90707389 89491325 89048675 88577659 87135415 85193807 84069664 84381002 85529331
41684 85529331 86430653 86849367 88126228 91593050 95706901 96539488 92789460 88594789
41676 88594789 88839890 92980547 96536605 97684571 98733663 101435726 104771397 107766608
41668 107766608 110703366 112806997 112538758 111236832 112586441 117012364 120435465 120311145
41660 120311145 118910106 118545152 117949738 116394495 116972386 121511526 125760419 124555262
41652 124555262 119312333 115534314 114858594 114566426 113392999 112430094 111054029 107456677
41644 107456677 103290109 102507139 104848389 105419434 101929981 97654586 95588089 94276368
41636 94276368 91843598 90028733 91068595 93648648 95134766 95520265 96171333 96520766
41628 96520766 94987805 91975564 89323914 87512815 85482698 82630789 79394210 76524832
41620 76524832 74958758 75374359 76741154 76532787 73541245 69203705 65243620 61846196
41612 61846196 59271484 58761867 59844522 59232248 55267476 51410118 51844474 55071282
41604 55071282 55820467 52729602 49934272 50539351 52383369 51755708 48353730 44801364
41596 44801364 43386613 44764214 48007077 50520701 49639097 45807295 42738388 43052744
41588 43052744 45218909 46257673 45885535 45912144 46601846 46172215 44017872 42400839 43978929
41579 43978929 48507255 52787170 53808181 51692395 49403880 49526427 51764276 54080091
41571 54080091 55595418 57107796 59166786 61549860 64878546 70551117 77997026 83980951
41563 83980951 86342155 87013028 89537455 94771296 100942310 106845215 112596716 117807716
41555 117807716 121505777 123843674 125648050 126286587 124496071 121667370 121374055 124248144
41547 124248144 125934052 122469947 115963142 112070311 112501168 112989472 109279300 102624249
41539 102624249 97683860 96423603 96346784 94649372 91923772 90462618 90206409 88524772
41531 88524772 84155477 79426093 77390025 77906057 78041976 75905776 72680256 70828013
41523 70828013 71318779 72828800 73057239 70810289 67160563 64230180 62559066 60595746
41515 60595746 57440769 54697524 54090457 54499852 53622240 51854566 51793615 53843667 55161041
41506 55161041 53783977 51290622 50045673 49933617 49482467 48618666 48484626 49421839 50548369
41497 50548369 50739671 49207057 45987335 42550295 40843544 41101259 41847664 42546719 44396108
41488 44396108 47510377 49365870 47801176 44122457 41454173 41067258 41870560 42498785
41480 42498785 42450225 42114085 42861999 45957753 50342824 53019188 52675338 51018385 49461956
41471 49461956 47276821 44825425 45234424 49663499 53929901 53909428 51732436 51843433 53208917
41462 53208917 51487499 47745453 47962668 53185404 57155203 56024808 54012741 55860088
41454 55860088 59375761 60174225 59187559 59977826 61995199 62409018 62335018 64974831 68602919
41445 68602919 67895393 62853521 60404242 65034435 72740118 77171175 77846843 78725052
41437 78725052 81497903 84381661 86104828 87253239 88159797 88885168 91143948 96621363
41429 96621363 102799163 104412472 101025695 99534397 105751495 116215004 122817945 123962246
41421 123962246 125588754 131126609 136769801 139254626 142476075 151462823 163721831 172451435
41413 172451435 176266977 179849824 185889339 192310432 197567604 202798497 207717232 210166229
41405 210166229 211662537 217691510 229407702 240146251 244165863 244576337 248069362 255412570
41397 255412570 262329692 267085056 271512993 275933273 278565055 279621141 280973188 281542572
41389 281542572 277720664 269285428 260906270 256569832 255735127 255803651 255039969 252133538
41381 252133538 246446451 240297824 237878353 239973544 242296497 240816596 236302048 231781803
41373 231781803 228139240 224807827 222821482 223979399 227522298 230066151 229007320 224824818
41365 224824818 220378412 218780244 221114765 225199339 227319545 225977089 222974478 220278339
41357 220278339 217561005 214016617 210674696 208965272 208468734 208155452 208357791 208969360
41349 208969360 207124617 200192713 190683836 184431314 183225641 182656724 178499487 171915576
41341 171915576 166266106 161787491 156551959 150774804 146611350 144323346 141812623 138008850
41333 138008850 134009975 130494126 126459382 121245591 115731236 110749150 106202476 102489924
41325 102489924 100731481 100398814 98626818 93474038 86506485 80724898 77218786 75228521
41317 75228521 74014469 72861956 70482788 66480064 62657815 61084282 61580349 62667365
41309 62667365 63758893 64372858 62609018 57404644 51596306 49442405 51015917 52152645
41301 52152645 50449562 48279708 48783921 51423359 52861734 50502226 44417022 37578284
41293 37578284 34454340 37030619 41803530 43263809 40680252 38335864 38636986 39123599
41285 39123599 37825800 37067416 38923226 40749397 39156848 35551859 33624630 33683006
41277 33683006 33773275 34331197 36756587 38686274 36209021 30842323 29079257 33850299
41269 33850299 40889402 45110529 46436182 47084937 46758594 43771336 38872945 34897594
41261 34897594 33357416 33306177 33004068 31490176 29240643 28096327 29477319 31872299
41253 31872299 31492290 26718199 20842515 18831922 21736480 25579441 25881420 22470702
41245 22470702 19376678 20108201 23628354 25839031 24927716 23566034 24800568 27511929
41237 27511929 28134931 25905984 23740065 23974285 25742278 27067123 27467197 27757798 28805093
41228 28805093 30854546 32711053 31872575 27605179 23668989 25048175 31340227 36366057
41220 36366057 35537424 30665865 25835059 21816408 17616953 14991203 17071772 22990358
41212 22990358 27691607 27976153 26050069 25841366 27781639 28916910 27196133 23918205
41204 23918205 21807642 21796838 22487805 22435369 21884992 21750297 21826892 21273225 20438005 20649315
41194 20649315 22098017 23502407 24244394 25165835 26532817 26994876 25864349 24904533 26107360
41185 26107360 28716306 30290587 30031243 29137677 28311828 27099502 25855113 26129681 28159220
41176 28159220 29693059 28714056 26251330 25026926 25899211 27082739 26689108 24706248
41168 24706248 22437332 21330658 22640029 26745574 31965097 35318121 35730382 35573318
41160 35573318 37658056 41530370 44433638 45277437 45506276 46275296 47284496 48879006
41152 48879006 52794910 59674324 67866343 75861445 83961948 92420814 100340533 108207926
41144 108207926 119076724 134554705 151366489 164833113 174561250 183641108 192921403
41137 192921403 199280754 199802381 195188344 188494971 181987185 175263737 165477510 150243959
41129 150243959 131481477 114816511 103544463 95213888 86380298 78020571 72641069
41122 72641069 68528265 61917302 53655966 48351260 47098760 46292901 43975255 42069067
41114 42069067 41438349 40071005 37677077 36905432 38030170 37514886 34246246 32126956
41106 32126956 33521971 35083701 33674024 31701803 32257745 33188650 31023175 27397082
41098 27397082 26218854 26888622 25679232 22346102 20446268 21922042 25456250 29309010
41090 29309010 32177248 32486057 30425374 29280091 31174345 33294399 32251751 30067738
41082 30067738 31065343 34667359 36733599 36736249 37612853 39166273 38214678 35730567 36985280
41073 36985280 42784844 47013174 45858165 43763259 46370007 52403513 57127629 60051726
41065 60051726 64103335 69612138 74314692 78291346 84142319 92120661 99094514 103471454
41057 103471454 108316298 117948684 132852087 149200138 162863782 173250730 183473868
41050 183473868 196978864 213718404 229370760 238385567 238211206 231142008 222155134 214367789
41042 214367789 206447596 195117095 179915033 163802302 148946414 134613092 120507067
41035 120507067 109050913 101574868 94962225 85882092 76248230 69907829 65481295 58131678
41027 58131678 48161455 41689867 41450013 42686892 40614803 36682512 34212378 32667844
41019 32667844 30465484 29527688 32134136 35908849 36708021 34637716 32791387 31699822
41011 31699822 29698448 27602957 28032347 30364807 31157681 29982517 30279681 33341908
41003 33341908 35694573 34295109 30852766 28864341 29216669 30895660 33458007 36216907
40995 36216907 37015770 34771873 32111522 32622555 35922473 38172533 37746608 37793124 41811043
40986 41811043 48411881 52591838 51918024 49526178 50187362 54786381 60250566 64211639
40978 64211639 67437102 71145143 74257787 75149319 74664505 75030034 76230906 75753108 72211253
40969 72211253 67430011 64335464 63977037 64929808 64582126 61076690 55304925 50842633
40961 50842633 50319821 52027236 52059206 49579192 47257320 46304306 44645277 41406700 39406208
40952 39406208 40363912 40950270 37566839 32618516 31229335 33107545 33086999 29643513 27149804
40943 27149804 28257442 29515650 27439413 24287877 23894412 25298530 24999356 23105090
40935 23105090 22612995 24062755 25396991 26231476 27776724 28870238 26672181 21747508
40927 21747508 18144945 17451950 16841693 14430967 12576613 13676525 16201073 17671460
40919 17671460 18803576 21522181 24658744 24778479 20646413 14706737 10614872 10688688
40911 10688688 14807211 20247692 23304481 22374630 19099041 16135958 14868577 15342775
40903 15342775 16587242 16637215 14391726 11854501 12019916 14181169 14585150 12418976 11093186
40894 11093186 12153357 12610908 10894234 10506622 13809156 16748745 14919187 11065984
40886 11065984 10682579 13248910 14373518 14163300 16028895 18554714 16793235 11984454
40878 11984454 11662443 17871011 22827870 20016279 13389419 11072322 14641069 19228429
40870 19228429 20789946 19039883 15783793 13966688 16200526 21229705 24040130 22077205
40862 22077205 18840193 18645346 20700126 21720494 21788146 23404119 26179196 26727080 23845392
40853 23845392 20611721 20578234 23534846 25571596 23030875 16863272 12694066 14908389
40845 14908389 21171594 25573445 26675360 28089445 30769529 30703205 26805044 24964742
40837 24964742 29440404 35272208 35447781 31889895 32207164 37758024 42622403 43890784
40829 43890784 45159131 48440933 49913966 47007583 43872654 45232982 48705464 48240712
40821 48240712 43232861 39363149 40385010 42952703 41254247 34688213 28618801 27686677
40813 27686677 30545826 32751888 33340938 35342190 39616907 42174127 39949179 35972805
40805 35972805 35142534 37110350 37741607 36340153 36387217 38944053 40363793 38328041 36050051
40796 36050051 37664595 42089825 44452342 42304603 37910098 34767449 33793875 33348886
40788 33348886 32108468 31066505 32150571 35107415 37184647 36621180 34900045 34247347
40780 34247347 34619851 35100257 36488327 39799141 43679768 46541538 49985567 56202339
40772 56202339 62762341 64648430 61719193 59319925 60224106 60730600 57105075 51612078
40764 51612078 48740527 48544147 47463193 43881858 39520311 36408327 35138241 35214281
40756 35214281 35011504 32452781 27654089 23691472 22934846 24133360 25106223 26405658
40748 26405658 29505539 32929940 33731963 32296747 32217441 35106401 38511832 39637401
40740 39637401 38474593 36329051 33739429 31282957 30352823 31202175 31562913 29302124
40732 29302124 25827836 24745862 26983645 29185268 27933981 24150699 21678309 22268422
40724 22268422 24167492 25795712 28110533 31675765 33796464 31754465 27785096 27001957
40716 27001957 30127782 32241482 30220800 27553251 28823651 32548330 33642537 31225430
40708 31225430 29200048 29384100 29067135 26827205 26212692 30393090 36179980 37491014
40700 37491014 33486252 29206076 28267758 29101477 29673809 31791525 37354186 43018507
40692 43018507 43358326 39046260 37273433 42404018 49910960 52420405 49138844 45625106
40684 45625106 45632306 47425838 48461400 49667855 52988378 57180506 58817570 56793199
40676 56793199 53792888 53077716 54977379 57146924 57930008 58706895 62169854 68435425
40668 68435425 74244867 76769490 76895234 77552133 80232103 84927775 91974197 101220032
40660 101220032 110360045 117383787 124379728 135395005 150349668 165007491 177947172
40653 177947172 193347978 214662672 239238628 262220010 282726390 302532162 320821264
40646 320821264 334335233 341919313 345492086 346626419 344664979 338023239 325507330 307078982
40638 307078982 285102228 263646732 244559238 225728781 205515755 186824204 173385456
40631 173385456 163716104 153028445 140272034 128726108 119839928 111419502 102617382
40624 102617382 95708346 91203404 85910828 78382943 72007767 69443222 67805010 63469067
40616 63469067 58623169 58166896 61740265 63769899 61120456 56327285 52802025 50752612
40608 50752612 49012549 47622596 46814004 45703115 43797491 42362994 42806373 44557585
40600 44557585 45544635 44228645 40883704 37627661 37043672 39561691 42480170 43210103
40592 43210103 43060874 45352233 49791779 51995579 49677341 46002674 44830990 45833074
40584 45833074 47120412 49546069 54264827 58379572 58227499 56044878 57832876 64367865
40576 64367865 70018118 71818481 73780154 79317085 85141798 87392168 89181480 96014722
40568 96014722 106785250 116047575 123644149 134872647 150875928 165923165 176285379
40561 176285379 185796285 199568853 217244208 236136883 256799007 280999196 307042786
40554 307042786 331454993 353470997 374019492 391714161 403460945 407987544 405663667
40547 405663667 396121958 379366234 358098678 335552193 311986685 286658497 261902359
40540 261902359 240991127 222682637 202760853 181352777 163895601 153459741 146378537
40533 146378537 137437436 125725276 113232665 101168898 90396600 82675234 78440398
40526 78440398 75193251 70493260 64800716 59434615 54083867 48744645 45560130 45528614
40518 45528614 45575131 42685143 39216269 39612440 42729389 42576973 37312144 32406887 32617624
40509 32617624 35061861 33903401 29139602 26313673 28358899 32037997 33391220 33145074
40501 33145074 34233196 36104128 35068619 30295656 25979970 25575363 26379144 23307906
40493 23307906 17134711 14652025 19404817 26180729 27679136 23857439 20650666 20957011
40485 20957011 21695133 20107268 18322061 19454154 22376292 23228597 20457295 16000231
40477 16000231 12626227 12136923 15159293 20474412 24964311 26156409 24785532 23516038
40469 23516038 23545743 23917566 23640686 22642360 20841990 18309736 16525472 17363958 20079104
40460 20079104 21233580 18955229 15863296 16167902 20625178 25838219 28146074 26873583
40452 26873583 23974103 21873284 21881341 23553682 25076794 24997715 23938118 23889983 25471532
40443 25471532 26829965 26077647 24008684 23077423 23977240 24801965 23951868 22354398 21864363
40434 21864363 22688275 23659162 24004872 23231533 20293538 15298690 11584155 12999182 18465099
40425 18465099 22325210 21579307 19714108 21004231 23991898 24204894 21143743 18153980
40417 18153980 16577017 14912304 13490361 14664308 17533314 17936076 15625654 15942112
40409 15942112 21135944 25358028 23046577 17818598 16968334 20304820 21336597 17844652
40401 17844652 14028186 12409406 10903585 9017889 9821698 13331050 14615462 12072871
40393 12072871 11486532 17127600 24123510 25478413 22504348 21617695 23605947 23439243
40385 23439243 19787318 17458697 19494179 23081960 25113053 26313572 27398346 26116983
40377 26116983 21703134 18459962 20654091 26029226 28465516 26095373 23175967 24003430
40369 24003430 28006098 31536485 32297346 30875705 29213026 28814104 30136663 32829387
40361 32829387 36110623 38991874 40638773 41056238 41346096 42807002 45723141 49264198
40353 49264198 52365200 54530157 56367690 59654857 65840594 73751637 80107932 83625184
40345 83625184 87138349 93547465 100849911 104011782 101261838 95526151 89712697 83906520
40337 83906520 77825415 72632895 68868663 65396719 61892464 59679252 58585450 55940675
40329 55940675 50775429 46209609 45158644 46159952 46093210 44553497 42622116 39973136
40321 39973136 36873462 36595613 41262806 46972318 48139315 45894498 46793286 53018645
40313 53018645 59317356 60905150 59263762 57901616 56971355 55180653 53477103 53417945
40305 53417945 54223801 54234366 53291049 51538680 48338794 44706905 44102707 47913064 52651686
40296 52651686 54812240 56099403 60267565 67019567 73188361 78141109 83412536 88353281
40288 88353281 91256126 94065883 100337421 108297614 111851798 109811357 108155646 110555082
40280 110555082 112424248 108500416 101461663 97572744 96994998 94369889 87517874 79806195
40272 79806195 73907580 68259472 60867588 52884623 46987100 44637740 45603351 47941608
40264 47941608 48391780 45415202 41922001 42073283 45254086 46593376 43961331 40566171
40256 40566171 39207665 37909969 33846929 28438367 25362271 25593341 27331737 29161556
40248 29161556 30496013 30346993 28390439 26094713 24467865 22275196 19025861 17595764
40240 17595764 20247358 23781337 23214410 19498361 18566198 22413629 26286061 26196229 24306405
40231 24306405 24176872 24901587 23633059 20926194 19618324 20282557 21494414 23274389
40223 23274389 26531815 29756404 30012425 27548921 26260220 28588902 32314806 33630413
40215 33630413 31872716 30013064 31177217 35472538 40156986 42798432 43896775 45405081
40207 45405081 46855490 45251962 39959217 35129305 34645333 36490287 35527850 30864976
40199 30864976 26600845 25352519 25139142 23799052 22719418 23941960 26298405 27008990
40191 27008990 25406412 22789028 19931035 17035092 15305096 16311515 19813681 23558013
40183 23558013 25146353 23495837 19397443 15637772 15384998 18829847 22173744 21681570
40175 21681570 18316961 16559555 18682054 22088262 22958734 20970899 19040081 19060906
40167 19060906 19627605 18588277 16519438 15855293 16855138 16988267 15495794 15829057 20585978
40158 20585978 25931743 25446743 19262510 14616440 16155888 20397961 22264483 22607518
40150 22607518 25187185 29489029 31543323 30298606 28479161 27648900 26539823 24292527
40142 24292527 21913025 20416326 20329516 22562881 26868943 30346046 30839009 30662926 32850812
40133 32850812 34960862 31993373 25039351 20748428 21342411 21809951 19159652 17508597
40125 17508597 20005447 22110742 18705384 13064754 12121355 15891541 18264061 16538867
40117 16538867 13860471 12977635 13459695 14969268 17879179 20324727 19618154 17132463
40109 17132463 17106769 19956002 21378777 18996637 15347513 13189791 12415533 13058200 16632834
40100 16632834 22281600 25875638 25557387 24441089 25326918 26620284 26435211 26911977 30776099
40091 30776099 36735704 42002891 46436089 50254147 50713871 46036257 40403181 39469033
40083 39469033 41977488 41462388 36113461 31225208 30794536 32086869 30892757 27792320
40075 27792320 26071364 26485162 27292531 27547781 27576101 27432212 27058366 26916305 26837596
40066 26837596 25654553 23658525 23706843 27572009 32546580 34329111 32378186 29583323
40058 29583323 27294395 24191605 20453629 19255934 22155808 25847800 26266151 24044424
40050 24044424 22807645 23223607 22462713 19597731 17580199 18247592 18784563 16062991 12131539
40041 12131539 11568113 14333556 15438643 12350401 8905147 9817549 14113333 16887169
40033 16887169 16049324 14266691 14545947 16683966 18766394 20016009 20753679 20817009 19813750
40024 19813750 18718348 19409723 21689748 22087398 17687644 10987615 8282172 11814474
40016 11814474 15990022 14251621 8081849 5154005 8765941 13660046 13832861 10370502
40008 10370502 8724403 11331681 16233177 20630544 22288923 19396258 13122795 9170504
40000 9170504 12457891 20436021 25633008 24971608 22507220 22259049 22708030 20461177 15834418
39991 15834418 11948059 10500302 11057086 12975662 15581133 17373132 17157147 15567430
39983 15567430 14150557 13535318 13507285 13975838 14708116 14887339 14012051 12614757 11382512
39974 11382512 10426217 10001347 10759503 12543442 14216171 15436617 17057503 18871397
39966 18871397 18953774 16794106 15073139 16030485 17666017 16463202 13048510 11931257
39958 11931257 15418322 20638629 23492354 23243266 21919286 20969820 20223099 19251662 18190002
39949 18190002 17285673 16536324 15835359 15100476 14375650 13988731 14259178 14766304 14364470
39940 14364470 12593744 10990052 12111031 16561952 21405711 22687494 19864066 16574891
39932 16574891 16151594 17524925 17226333 14698739 13276841 15635431 20451795 24411729
39924 24411729 25639220 24123919 20659381 16869438 14752156 14540285 14254141 12928873
39916 12928873 12868753 16717703 23450822 29472951 32779185 33652003 32047492 27354030
39908 27354030 21017054 16638790 16344001 18728066 21136384 22419446 22766409 22381609
39900 22381609 21356545 19937099 18225430 16209366 14217268 12652979 11602063 11669408
39892 11669408 14334253 19546775 23661268 22671795 17856603 15157123 17669030 21558683
39884 21558683 21505382 17901114 15895759 18636256 24291434 29246987 31560100 31087019
39876 31087019 28614504 25869795 24892593 26209322 28159264 28672192 27396750 25676863
39868 25676863 24633771 23722296 21580955 18403834 16711673 18632354 22585863 24279355
39860 24279355 21670589 17550356 16097709 18039606 20697652 22029942 22813305 24804257
39852 24804257 28142366 31031069 31374512 28629924 24414854 21105903 19649173 19285485
39844 19285485 19379719 20064949 20554337 18886594 14996285 12163041 12910755 14880152 13951456
39835 13951456 10666683 9719672 12833487 16189912 16282917 14486647 13530780 12988583 11607434
39826 11607434 11271000 14336686 18658427 19941177 18625950 19705947 24973126 30017750
39818 30017750 30862986 29522247 29871305 31108966 29404679 24547376 20749032 20702976 22226829
39809 22226829 21798294 18988693 16083885 14908436 15323580 16028756 15960347 15311465 15399357
39800 15399357 16986536 18984180 19832399 19783246 20224862 20963964 20439459 19063449 19653949
39791 19653949 22993512 25349953 22898139 17020088 12372764 10671326 9634208 7915113
39783 7915113 7421201 9422755 11395041 10172292 6576347 4381043 5322559 7405043
39775 7405043 8249787 8200664 9209681 11641630 13327687 11953128 7928381 4277226 3380112
39766 3380112 4469042 5265820 5501956 6985521 10074223 12508860 12989693 13477274 15543228
39757 15543228 16501406 12916494 7166557 5969403 11271154 16756059 15969833 10660793
39749 10660793 7610597 9498547 13062430 15181957 16246436 17175335 17258716 16308986 15585050
39740 15585050 15008597 12629310 8713216 7028147 9358497 11892424 10743768 8384353
39732 8384353 9771550 13745938 14145683 9659114 6586809 9705601 15554713 18189720
39724 18189720 17434324 17039747 17655046 16860657 14921242 15213460 18393363 20493213 18385425
39715 18385425 13933890 10810467 9568948 8131623 5838277 4719023 6636312 10333771
39707 10333771 11991539 9039077 3457507 386061 2634346 7522195 10388068 10034011
39699 10034011 8665042 7533617 5785182 3621540 3224165 5354041 7734204 8223612
39691 8223612 7246098 5749715 3466666 1136149 1675477 6206981 10983203 11650421 9249606
39682 9249606 8452620 10654722 12708325 12535811 11920099 12495413 12591041 10326099 7220640
39673 7220640 6005655 6407349 5842636 3665722 2274154 3821424 7550426 10802810
39665 10802810 11604968 10018864 7724573 6353217 5693872 3946770 613164 -1566077
39657 -1566077 622818 6068019 9477781 7589241 3521202 2839241 6246767 8956678
39649 8956678 7579159 4717786 4968241 8454004 11058502 10287805 8054126 7244323 7880697
39640 7880697 7838773 5918235 3083120 1469342 2679756 6097984 8705701 8039574 5584574
39631 5584574 5213574 7641820 9085229 6995389 4270431 4907929 7776991 8621524 7027090
39622 7027090 6938280 10165650 13718767 14700876 13916676 12887811 11066698 8610495 8502346
39613 8502346 12236668 15789457 14191293 8998155 6781189 10038721 13804662 12697185
39605 12697185 7869939 4507620 4662349 5585856 4517081 2384682 1885548 3360575
39597 3360575 4112640 2036640 -1004203 -701171 4428241 10472188 12119557 8685537
39589 8685537 4645346 4327742 7785294 12129119 14880690 14907345 11919117 7117806 3528943
39580 3528943 3548480 6096196 7847043 7501913 7175123 8847579 11012071 10418209 6597711
39571 6597711 3003757 3159509 6644236 9807904 10193000 9180920 9668948 11899836 13074573
39562 13074573 11386724 8802103 8360500 9783409 10087389 8480936 7888767 10414151
39554 10414151 13875094 15239204 15527551 17849956 21428320 21753624 17468325 13137700
39546 13137700 13109935 15932875 17693165 17943039 18392255 17887804 13834475 8231495 7024527
39537 7024527 12076624 18203039 20327588 19682896 20069166 21484602 21402813 20014236 19799306
39528 19799306 20902835 20979797 19361959 17711278 16444702 14069088 10675636 8822705
39520 8822705 9909512 12397425 14502755 15903418 15908198 13090130 8318636 5292935 6113931
39511 6113931 8750014 10670097 12281083 14569408 16142196 15529414 14139420 13919982
39503 13919982 14248113 14217359 15400373 18322602 18761152 12917841 4709881 1793865 4742420
39494 4742420 6658663 4155909 1714910 3026716 5130153 5053842 5764962 10024583 13701445
39485 13701445 11787354 7035964 5486998 6455339 4874328 1706859 3101410 8946004
39477 8946004 11281755 6635737 1849856 3496170 8421600 10243304 9638707 11528414
39469 11528414 15552806 16304679 11851311 6259556 3745213 4786015 8024221 12045095
39461 12045095 14927589 15313892 14391485 14431366 15527143 15955059 14980827 12927052 9708093
39452 9708093 6149060 5146397 7778490 9730277 6260043 -90634 -2056306 2052379
39444 2052379 6303215 6379864 4908484 5358051 6452838 6205428 6453648 8960602 11130729
39435 11130729 10466864 9873230 13204010 18141475 19197184 16187882 13998054 14666936
39427 14666936 15380674 14406638 13515955 13541001 12527043 9867115 7882370 7523843 6638070
39418 6638070 4579093 4473972 8039184 11581640 10605111 6014051 2434422 2158746 3911512
39409 3911512 6155896 8258230 9065177 7526254 4881162 3800129 5016617 6665354
39401 6665354 7207699 7361049 8680690 11404094 14118903 14925570 12947942 9276129 6204403
39392 6204403 5051282 5145377 5312606 5469594 6004843 6477509 5992157 4428654 2653599
39383 2653599 1998930 3625397 7148719 9691858 8332532 4411715 3108920 7047504
39375 7047504 12543804 14505811 12919624 11389125 11013842 9760757 7275754 6001584
39367 6001584 6852490 7511995 6322036 4716984 4222822 3823402 2283346 935688 2038630
39358 2038630 5665045 9761387 12195137 11849767 9287161 7271186 8714127 12842328
39350 12842328 15352436 13839102 11020369 10758942 12931510 14578415 14413561 13467798
39342 13467798 12431764 11158590 10171973 10118796 10117068 8930709 7359144 7201183 8262584
39333 8262584 8713481 8079602 7523135 7469348 7442855 7994131 10028500 12210181 11937345
39324 11937345 9259122 6972512 6308531 5468076 3217916 926686 -70754 -199419 459319
39315 459319 2890203 6276630 7685005 6537588 6055130 7895207 8936756 6562856
39307 6562856 3599739 3839848 5719149 5433511 3874597 4586235 6304967 4178567 -1535207
39298 -1535207 -4647214 -2344244 860917 838904 -365787 125333 274639 -2503402 -5176051
39289 -5176051 -2625610 4879704 12300662 16101120 15788482 11286382 3733711 -2238121
39281 -2238121 -2179278 2135994 4607978 2885513 478878 631669 2393827 3605077 3706137
39272 3706137 2386214 -716748 -3505835 -2354752 2609172 6620353 6721074 5678973
39264 5678973 6973713 9145836 8424216 4615952 1013986 -11496 1547979 4839738
39256 4839738 8272589 9361331 7135820 3791352 1810136 802429 -633270 -1774393
39248 -1774393 -1261268 73514 979736 2600811 5911163 8132026 6176962 2464315
39240 2464315 2179940 5178644 6255395 4092786 3914863 9012118 15054140 16271629
39232 16271629 13058245 9706819 8063850 7274494 6874742 6169827 3106715 -2126961
39224 -2126961 -4756852 -1242580 4504838 5828197 2952386 2243106 6144599 10001707
39216 10001707 10185494 9461216 11380574 14259953 14700401 13429650 13120187 12903598 10060586
39207 10060586 6117376 6146180 11237865 15863723 14673767 9083275 4856041 5077097
39199 5077097 8113649 11651038 15836920 21483791 26936200 28725141 25551300 20325532
39191 20325532 17116256 16499085 15486243 12451707 10148441 11905624 16118679 17731583
39183 17731583 15533263 14430289 18268028 23347630 22980264 17100053 12616367 13792136
39175 13792136 17124558 17972157 17781138 20615941 25555633 27762798 25941628 23549801
39167 23549801 22573150 21180801 18580799 17183258 17782476 17171323 13602306 10593286
39159 10593286 11539039 14034874 14001530 12493108 13117414 14783531 13126776 8491575 6199337
39150 6199337 8054246 9446878 6780276 2498117 157065 -650194 -1178903 215978
39142 215978 4517396 8258153 8008930 6094861 6952487 9713641 9744450 6532794 4284845
39133 4284845 4417701 3285728 -818849 -3663026 -1283448 3801842 6481321 6271935
39125 6271935 6304531 6923708 5283782 1268317 -941715 1138967 4369970 4551029 2345559
39116 2345559 1642643 3641925 6005913 7350915 8928193 11121454 11670633 9281831
39108 9281831 6390825 5786455 6314061 4810091 1134263 -1785862 -2300652 -1276836 715034
39099 715034 3926182 6807222 6682186 4270118 3764650 6420439 7853490 4790256 1002385
39090 1002385 2070241 6575834 7917161 4335109 1629264 4521398 9863570 11162506
39082 11162506 6958948 1722077 -95837 1765602 4641209 6247563 6322806 6036130
39074 6036130 6407205 7365708 8259829 8758239 8834212 8527654 8448808 9621386 11600291
39065 11600291 11694072 7982621 2701570 525142 3354018 8613281 12797343 14721238
39057 14721238 14925933 13938783 12077632 9677822 6914627 4342099 3386775 4767262
39049 4767262 6732671 6831551 5162706 3615222 2331458 -12271 -2496112 -2336967 273999
39040 273999 1779206 1185540 2044111 6004418 8821872 6774561 3415355 4784253 10125928
39031 10125928 12941318 10531439 7147275 7132815 9581464 11130626 10301481 7399307
39023 7399307 3115776 -936976 -2533344 -1369827 239836 353530 -293473 214875 2510667
39014 2510667 5559975 7460158 6410122 2510582 -1202709 -1472952 946215 1804551
39006 1804551 -1086499 -4774587 -4883859 -902649 3586070 4993407 2991100 398550
38998 398550 545071 4185138 8665993 10663959 9582190 7379258 5554037 3929802
38990 3929802 2351375 1724505 2771441 4958569 6993045 7490671 5507235 1808325
38982 1808325 -793023 -88285 2805633 5037293 5685943 5730156 5207233 3338979 1112627
38973 1112627 431784 637605 -590643 -2470838 -1196742 4025595 8796689 9131192 5933636
38964 5933636 2194767 -814960 -2585840 -2192964 -583479 -747950 -2978987 -3274669 602937
38955 602937 4873819 5028358 2191733 262316 -374850 -1743561 -3230607 -2544894 -246823
38946 -246823 1296768 2328181 4616961 7039623 6884132 4907026 4489811 6064333 6799733
38937 6799733 5654075 4352747 3434310 1832200 558352 2209102 6176538 8613408
38929 8613408 7842199 5781453 3666410 847988 -1586808 -890353 2422697 4359657
38921 4359657 3561456 3104690 4817794 6655256 7483327 9317136 12351385 12934201 9702829
38912 9702829 6906594 7838057 9392981 7499113 4069545 3697402 6363490 8242567
38904 8242567 7655653 5922082 4153727 3149912 4616936 8604021 11443929 9959084
38896 9959084 6017708 3432330 2453653 1205418 330426 1615186 3630461 3478579 1833495
38887 1833495 1744379 3240814 3489947 1747885 129693 88778 1791573 5696840 10686046
38878 10686046 12336372 7999430 2098355 817804 2873674 2018919 -2144380 -3521745
38870 -3521745 -251226 2073364 231144 -1354948 1040387 3824464 2696877 -40000
38862 -40000 -257713 910335 629411 741997 4160153 8151072 7962329 4892364 3892314
38853 3892314 4625296 2364296 -2233199 -1993969 5902987 14511149 16307955 12801113
38845 12801113 10401268 10307908 8100417 2237577 -2493530 -1462639 3487352 6726663
38837 6726663 5979985 3981118 3502959 3770077 3016490 2158136 3291719 5626900 5998798
38828 5998798 3654859 1732012 2937137 6015384 7843326 7230111 5351158 4006020
38820 4006020 4560720 6954070 8835272 7780164 5300977 5748249 9544860 11027072
38812 11027072 6183325 -613011 -2096996 1731889 4215971 2088551 -664838 111621
38804 111621 2939318 4299415 4073689 4386246 5612888 6512396 6818629 7228295 7686841
38795 7686841 7509790 6545333 5035654 3237598 2071882 2798604 4951945 6091466 4995971
38786 4995971 3671914 4523714 6766203 7570634 5969996 3758835 2972876 4057295 6087215
38777 6087215 7352504 6281614 3337040 1444863 2860715 6118319 7962420 7836536
38769 7836536 8101479 9799759 10919223 9819213 7990710 7713517 8618047 8532098 6843902
38760 6843902 5167340 4977901 6098496 7496918 8362298 8237140 7014786 5136907 3414090
38751 3414090 2638128 3462728 6037284 9264811 11221338 11235480 10847092 11468515 11763335
38742 11763335 9281287 4800040 2830441 6407338 12706906 15808015 13651649 10398450
38734 10398450 10959708 14532833 15640254 11705046 7166141 8059923 14081201 19372909
38726 19372909 21033250 22599522 27209233 31468092 30249490 24991594 22099517 24070528
38718 24070528 27458208 29706645 32405917 36307957 38543924 37634163 36728512 38521252
38710 38521252 40944652 41527099 42006571 44170639 44940966 41227154 36655586 36809221 39481256
38701 39481256 36948767 27895531 19879815 18476206 20530971 20758443 19181485 18460469
38693 18460469 18515195 17794588 16508353 15010498 11799973 6414589 1780035 591346
38685 591346 1669642 2693295 3977383 6485803 8633109 8563347 7555898 7660421 7720847
38676 7720847 5306961 1174862 -1629050 -1934772 -628656 1891579 5182166 7169060
38668 7169060 6642788 5995377 7801008 10081925 9153351 6009658 5108823 7248010 8588792
38659 8588792 7064669 4963265 4272175 3961728 3124647 2649764 2458182 1104300 -623723
38650 -623723 -19712 2195618 1716492 -1919078 -2897837 2338267 8811634 9852115 6428709
38641 6428709 4389865 5231716 5411776 3279772 904629 -558392 -2036124 -3008532 -1812892
38632 -1812892 135186 -536747 -2981164 -2386101 1910633 4083261 629846 -3659293
38624 -3659293 -3043150 136484 -362198 -4193171 -4959887 -644819 3439564 3689990 3880957
38615 3880957 8174584 13280818 12688496 6152202 -237005 -2519450 -2433634 -2175779 -469143
38606 -469143 3929396 8393366 9395604 7533301 6457913 7481688 8104376 6095538
38598 6095538 2636440 504423 778389 2393671 3801325 3966729 2582054 530262
38590 530262 -325583 966122 2972106 3486911 2480932 1924780 2478169 2359664 674278
38581 674278 -97313 2787699 7921514 11244919 11458179 10756182 10102059 7716343 3709635
38572 3709635 2138625 5351361 9458518 9409972 6350289 5472410 7990622 10130001 9590053
38563 9590053 7970858 6411680 3857427 838797 107729 1668941 1836542 -399529
38555 -399529 -716337 3651000 8700540 9398124 6986107 5976150 6772416 6345051 4243181
38546 4243181 2756848 2227407 1208679 779738 3772277 9396932 13006296 12010505 8501364
38537 8501364 5469358 3794331 3477944 4510806 5801202 6108609 6305563 7784516 8946922
38528 8946922 7193677 4455090 5892314 11713149 15082452 10920889 2924833 -1545548
38520 -1545548 -680114 1372044 1435493 724219 1541825 3576476 4466393 2862047 94438
38511 94438 -1404730 -1240596 -1440225 -2740808 -2334663 2045314 7249304 7945526 4396589
38502 4396589 2340540 4326257 6248614 4729022 2973801 5435379 10497729 13218501
38494 13218501 12849081 12628251 13404421 12535862 9248595 6597249 6786868 7865411 6900569
38485 6900569 4301995 3022366 4412511 6539025 6758710 5034565 3806803 4541234
38477 4541234 5747486 5637305 5358306 7000896 9139986 8061184 3918444 1576691
38469 1576691 3630725 6669029 7220547 7398743 10506752 14267115 13722785 9204071 6007503
38460 6007503 6577987 8046272 7865213 7150921 7345181 7713218 7627852 7844656 8209874
38451 8209874 7507890 6745072 8687568 12458737 12965497 8616433 5447226 9166969 16096333
38442 16096333 17354971 10749597 3146863 990160 3557607 6880667 9618921 12297020
38434 12297020 14094920 13806418 12266790 11107131 10402193 9816998 10458891 12818009 14324420
38425 14324420 12397808 9123622 9079103 12646462 15644432 16222547 17504682 21438274
38417 21438274 24527971 23140090 19569240 18652477 20805498 22834498 23857617 25560157
38409 25560157 27399141 26527546 22799410 19546107 18711613 19010274 19416674 20471297 21308359
38400 21308359 19576312 15789026 13951591 16159624 20013364 22858461 24840146 26074216
38392 26074216 24973917 21883860 20446156 22397205 24633580 24557814 24511098 27014700 29267362
38383 29267362 27332279 23161670 22049526 24543789 26178533 24797355 23252789 24380913
38375 24380913 27394719 30290091 32815209 35929830 40032657 44098235 45800480 43680418
38367 43680418 40225252 40383169 45095273 49382681 49767452 49927149 54472986 60652579
38359 60652579 62654869 61979126 65884268 75633753 83971255 86124587 86512471 91386973
38351 91386973 100351255 108883388 114940655 119240384 122284669 124721833 128248544 133130418
38343 133130418 136814823 137366558 136248163 135745876 135944874 136093500 136314022 135842435 132270127
38334 132270127 124972706 116838971 110197899 103623409 95500830 88121263 84756764 84505404
38326 84505404 83532586 80242368 76081032 72220441 68507033 65038766 62019324 58572520
38318 58572520 54157608 50476010 49405291 49582973 47693640 42998632 38205534 35794055
38310 35794055 35517220 35607143 34706247 32577684 30270002 29259301 29266715 27905931 24104690
38301 24104690 20621234 20835063 23906022 25721217 24234383 21368929 19910130 20976845
38293 20976845 24235732 27898669 28755234 25322592 21035841 20829984 24057123 24839900
38285 24839900 20913869 17712537 20584517 26750582 29543265 28206946 28019837 31305826
38277 31305826 34025344 32733354 30050583 30289118 33154466 35407238 36484572 38511956
38269 38511956 41878608 44807865 47202855 51135160 56923766 62378845 67158074 74123536
38261 74123536 84062962 92461737 94930612 93236335 91725231 89570711 81968359 69127949
38253 69127949 58455399 55331224 55906377 52653407 44459032 37169569 35126466 36001965
38245 36001965 34567639 28840532 21305881 15645310 13456311 13548177 13682923 12983604 12451276
38236 12451276 12880701 13110520 11539804 8915035 7790090 8752710 8962348 5882096 1367039
38227 1367039 -53491 3016420 6828559 7293822 5049347 3758374 4350458 3781435 74460
38218 74460 -3974274 -3942896 731553 6228678 8549916 6687376 2298852 -1954722 -3877487
38209 -3877487 -3079431 -1067861 734393 2516095 4678937 6008330 5050183 2611502
38201 2611502 819414 115698 -611572 -1268801 -590999 990374 1459984 863948 1769411
38192 1769411 4715179 6253257 3838824 167348 -424229 1732687 2415013 97371
38184 97371 -1776471 30628 3945777 6009749 5211663 4125873 4668953 5477725 4401997
38175 4401997 2062299 1107029 2328907 3606842 3419956 3533298 6486987 11485142 14766645
38166 14766645 13741451 9106228 3207486 -1778782 -4060445 -2747516 1057042 4967977
38158 4967977 7577917 8977159 9161317 7598317 4621689 1590965 -719978 -2348218
38150 -2348218 -2628620 -545012 2805206 4350229 2939667 1234489 2031764 4071629
38142 4071629 3472586 -1148871 -6632740 -8559116 -5784424 -1441768 386031 -1246851
38134 -1246851 -3790185 -4736076 -4137637 -3001786 -1152972 1453140 2994699 2007987 149622
38125 149622 -172114 224840 -796200 -1807712 617665 5452896 7220598 3555098 -1773719
38116 -1773719 -4829987 -5854258 -5731501 -3154718 1526358 4098920 2103240 -833861
38108 -833861 -217044 2828457 4165547 2803165 455301 -2130953 -4125013 -2842032
38100 -2842032 2111239 5640375 3587669 -35612 1486822 6620514 7380323 1928327
38092 1928327 -2161550 1014848 7964158 12019799 11757523 9665013 6905406 3519637
38084 3519637 895890 257996 456449 9587 -346322 539146 1626295 1223884 -249943
38075 -249943 -1121057 -932484 -323355 502404 1688720 3034398 4450381 6060623 7200839
38066 7200839 6817064 5411987 4613534 4187790 2138745 -1011242 -1215971 3389719 8537605
38057 8537605 8932285 5416833 3229710 4142854 4581072 1878350 -1673881 -2758349 -1879535
38048 -1879535 -1621214 -1921953 -246636 3825524 7099871 6923600 4760162 3725098 3824814
38039 3824814 2307597 -1294690 -3475170 -1545679 2361124 4490694 4784824 5792302
38031 5792302 7426800 6878407 3945509 2230960 3485788 4561801 2528084 -390458
38023 -390458 -333189 2147279 3454398 2859657 2834541 4071228 4550573 3972348 4806861
38014 4806861 7572814 9107270 7796080 6875403 9326156 12479854 11801360 8071343
38006 8071343 6149790 7401259 8263744 6742359 5374352 5994753 6058928 3130755 -505318
37997 -505318 -1242507 538281 2307552 4222901 7689919 10617190 9259551 4783747
37989 4783747 3063432 6697530 11366178 11915906 8573193 4970893 2967912 2006667
37981 2006667 1602964 2029112 3542680 6263931 9563003 10954338 7847292 1542302
37973 1542302 -2910828 -2405882 833604 3030276 3566256 4066898 5208770 6738960 8664884
37964 8664884 10195448 9410092 6171548 3458884 3671135 5644484 7366636 8992946
37956 8992946 10550790 9667020 5309493 1308719 1799357 4915344 5591701 3375152 2493114
37947 2493114 4589981 6508923 6009409 5063420 5801287 6812569 5628763 2565439 222163
37938 222163 388483 2475904 4305178 4274380 3202020 3236900 4487590 4682434 3212247
37929 3212247 2603182 3912875 4112498 1293736 -1158616 -74806 1404781 -858910
37921 -858910 -3689591 -1068907 4872061 5962812 1186628 -1198917 3261960 8695435
37913 8695435 9184124 7600739 8693750 9955624 6317415 -286864 -3029869 230679
37905 230679 5317207 8432913 9384684 8705322 6277491 3467406 3232380 6782679 11631706
37896 11631706 13716447 11192145 6303525 3213708 3287364 3726511 2557925 2744812 7498493
37887 7498493 13348145 13706622 9070488 7041001 10938269 15208922 14694814 11771016
37879 11771016 10670629 11138353 12160352 15727475 21392674 22894235 16761678 9457119
37871 9457119 8900710 12935867 13686851 10041682 7733571 9127543 11019883 11695374 12709741
37862 12709741 13977278 13882639 13926512 16672583 19649383 18315026 14707324 15451519 20726405
37853 20726405 23281146 20032212 16714039 18237451 21719048 22682228 21730594 21016038
37845 21016038 19700887 17173424 15996686 17651833 19601390 20034198 20989822 23319646
37837 23319646 23618578 20398545 18256770 20806938 24164119 23395630 21295620 23791058
37829 23791058 29612010 32143447 30132809 28953162 31171244 33057152 31864775 30198725
37821 30198725 30699388 31665031 31025434 30543980 32692653 36254991 38280669 38545534 39270104
37812 39270104 41505259 43972160 44905311 43714387 41408193 40051710 40960294 43248963
37804 43248963 45443476 48188398 52951770 58044394 59458841 56996195 55867265 59610039
37796 59610039 64823147 66713358 66966886 70783325 77442179 80134583 76231852 71879798
37788 71879798 73396830 78694443 81374534 80107750 79052036 80593836 82680154 83290680
37780 83290680 83177973 83292119 83099579 82761553 83945568 86938921 89542053 90445211 91323704
37771 91323704 93734859 96077968 95799593 92961278 89472963 86216242 83178122 81257602
37763 81257602 81473242 82942265 83731885 83225712 81782588 78830646 73698580 68057697
37755 68057697 65005420 65285838 66462183 66412715 65772174 66013938 66698160 65988609 63175287
37746 63175287 59491616 56476436 54235302 51652472 48133162 44556279 42037817 40315059
37738 40315059 38453946 36813960 36615766 37415590 37087414 35087288 33571320 33941416 34395650
37729 34395650 32783654 30049367 28604317 28770249 29177159 29387983 29632497 29013917 26580587
37720 26580587 23443787 21516813 20994861 21204780 22527991 24847974 25755122 23673215
37712 23673215 21296505 21979538 23994365 23022676 19471540 17827191 18788925 18256968 15405173
37703 15405173 15231560 20091948 24660118 23708830 20038608 19426720 21473376 21478903 19138675
37694 19138675 19043559 22899933 26759019 26894036 24278050 21986600 21263566 21405707 21356818
37685 21356818 20508774 19358472 19435029 21175185 22501288 21339461 18647725 16680313
37677 16680313 15355603 13328316 11683131 12631647 14672573 13547039 9177656 7259133
37669 7259133 11421299 17392898 18427700 14157660 10202864 10144802 11824329 11887547 10660413
37660 10660413 10930830 13742274 17173294 18757811 17861637 15534755 12859097 10283911
37652 10283911 8562882 9079878 11955012 14478698 13472584 9583746 7247706 9389854
37644 9389854 13971372 17128724 17804041 17163655 15174372 10925313 5750412 2696087
37636 2696087 2450222 2719398 2466736 3862072 8510861 14283850 17914878 18778377 18045819
37627 18045819 16051237 13063943 11071029 11667416 12971214 11741918 8303633 6376575
37619 6376575 7943363 11196707 13850684 15429685 15677835 13992390 11648540 11322672
37611 11322672 12659656 11597837 6567220 2150814 3044232 6929867 7857188 5300237
37603 5300237 4684626 8609560 12580818 11591257 7121111 4479562 5558310 7679828
37595 7679828 8630592 9350972 11074454 12524233 11704657 9179244 7601362 8116316 8952531
37586 8952531 8276718 7086118 7860113 11000413 14228604 15429976 14573133 12730681 10915789
37577 10915789 10349748 12076094 15267736 17233393 16085191 12379642 7705841 3338264
37569 3338264 904113 2085182 6180460 9982419 11747664 13242791 15968985 17792668
37561 17792668 16131482 12398512 9854856 8654449 6915323 5575690 7607767 12412774
37553 12412774 15572023 15168760 14165322 14833299 14806077 11408068 6836219 5535292 7996146
37544 7996146 10487616 10519136 9704646 10628139 12937164 13961231 12465658 10272115 9665039
37535 9665039 10332270 10300411 9304272 8989048 9573072 9164288 7651362 8193953 12420335
37526 12420335 16912664 17689345 15806019 14764284 14623810 13306204 11925864 13262176
37518 13262176 15756716 14985992 11189469 9237349 10382208 10548273 8528630 9022679
37510 9022679 14269850 19059514 18621330 16077469 16773734 19677816 20227158 18243976 16848994
37501 16848994 15860206 12494677 7569792 5432045 7942063 12935275 18066680 22006387
37493 22006387 22754500 19457236 15541845 15540834 18888680 21110512 20835446 20812803 21816595
37484 21816595 20927800 17367589 15122347 17144898 20560284 20382848 15505832 8879438
37476 8879438 4049273 3446111 7797627 14869094 20223374 21218515 19439289 18150527
37468 18150527 18648851 20104765 21438871 21987149 21431854 20276250 19600939 19640588 19538720
37459 19538720 19005858 19056658 20538257 23029547 25625135 27630783 28167491 26507406 23364777
37450 23364777 20637204 19413212 19336716 20006397 21438851 22888365 22976036 21646500 20553067
37441 20553067 20972666 22683999 25114546 27867912 29821135 29759411 28580239 28837595 31216876
37432 31216876 33413087 33419918 31854930 29981925 27804205 25696202 25556537 28105745 30923027
37423 30923027 31601944 31227042 31995189 32824280 30778347 26417695 24168602 26659261 31579793
37414 31579793 35331016 37321432 38996656 40583331 41059153 40465052 40101622 40477309 40734832
37405 40734832 40431371 40448303 41336935 41815298 40190550 36982507 34864785 35670335 38404453
37396 38404453 40806903 42105811 43330478 45278563 47127830 47215789 44880542 41677840
37388 41677840 40739836 43964602 49400099 52791746 52817103 53196926 57656915 64292047 67945691
37379 67945691 67373313 66269820 67075564 68141413 68423650 70331158 74840536 77887964
37371 77887964 76088013 72969579 74110184 78094715 78712073 75617615 75633173 81751084
37363 81751084 87803891 87923874 85423852 86763013 91081600 92546100 90720571 91204559
37355 91204559 95999781 100124517 99618270 97271172 97680350 101115236 105306701 109444050
37347 109444050 112953955 113595084 110722892 108099021 109506673 113302419 115112889 114318324
37339 114318324 113671694 113766216 112796670 111592393 113708984 119352174 123793426 123781865 121584873
37330 121584873 120303660 118945880 115505194 111973724 111993782 114806570 115684288 112521383
37322 112521383 108608501 107775104 109208188 108875172 105046133 100573308 99205026 100617177
$$ [...]
##END NTUPLES=NMR SPECTRUM
##END=
