##TITLE=31Pdec_SR157_k3
 DMSO-d6, 24 sc
 21.2.2023
##JCAMPDX= 6.0         $$ Bruker NMR JCAMP-DX V2.0
##DATA TYPE= NMR SPECTRUM
##DATA CLASS= NTUPLES
##ORIGIN= UXNMR, Bruker Analytische Messtechnik GmbH
##OWNER= root
$$ XWIN-NMR		Version 3.5
$$ Tue Feb 21 13:54:38 2023 Russian Standard Time (UT+4h)  she@DPX200
##.OBSERVE FREQUENCY= 81.013821
##.OBSERVE NUCLEUS= ^31P
##.ACQUISITION MODE= SIMULTANEOUS
##.ACQUISITION SCHEME= undefined
##.AVERAGES= 24
##.DIGITISER RES= 16
##SPECTROMETER/DATA SYSTEM= spect
##.PULSE SEQUENCE= zgpg30
##.SOLVENT NAME= DMSO
##.SHIFT REFERENCE= (INTERNAL, DMSO, 0, 248.564)
##AUDIT TRAIL= $$ (NUMBER, WHEN, WHO, WHERE, WHAT)
$$ ##TITLE= Audit trail, XWIN-NMR		Version 3.5
$$ ##JCAMPDX= 5.01
$$ ##ORIGIN= Bruker BioSpin GmbH
$$ ##OWNER= she
$$ F:/spectra/data/she/nmr/P31/1/pdata/1/auditp.txt
$$ ##AUDIT TRAIL=  $$ (NUMBER, WHEN, WHO, WHERE, WHAT)
(   1,<2023-02-21 13:53:48.25 +0400>,<she>,<DPX200>,
      <created by zg, POWCHK disabled, PULCHK disabled
       configuration hash MD5:
       00 E9 B6 7A A2 85 ED C7 34 08 36 98 17 FE 4E 26
       data hash MD5: 32K
       2C 68 11 AE 40 F3 38 B5 19 66 8E 1D DA C3 4F F8>)
(   2,<2023-02-21 13:53:50.59 +0400>,<she>,<DPX200>,
      <Start of raw data processing
       efp BC_mod = 2 LB = 1 FT_mod = 6 PKNL = 1 PHC0 = -10872.03 PHC1 = -200.9872 SI = 64K 
       data hash MD5: 64K
       F4 91 A4 6E 52 DE 8A 6F 83 B7 EC 3B 7B 9D A3 DA>)
(   3,<2023-02-21 13:54:08.15 +0400>,<she>,<DPX200>,
      <pk PHC0 = 218.8671 PHC1 = -532.4012 
       data hash MD5: 64K
       36 37 62 97 0A B6 71 37 0A 5D 0A 6B DC 02 5C 15>)
(   4,<2023-02-21 13:54:12.98 +0400>,<she>,<DPX200>,
      <abs ABSG = 5 
       data hash MD5: 64K
       FD 48 10 B7 B8 EF E9 19 0B F1 BC 2B 25 E8 72 73>)
$$ ##END=
$$ 
$$ hash MD5
$$ 85 E6 6B 69 83 B9 6E 74 AB 0E C2 59 60 F5 28 46
##$RELAX= 
##$RELAX= 
##$RELAX= 
##$RELAX= 
##$RELAX= 
##$RELAX= 
##$RELAX= 
##$RELAX= 
##$RELAX= 
$$ Bruker specific parameters
$$ --------------------------
##$DU= <F:/spectra>
##$EXPNO= 1
##$NAME= <P31>
##$PROCNO= 1
##$TYPE= <nmr>
##$USER= <she>
##$AMP= (0..31)
100 100 100 100 100 100 100 100 100 100 100 100 100 100 100 100 100 100 
100 100 100 100 100 100 100 100 100 100 100 100 100 100 
##$AQSEQ= 0
##$AQ_mod= 1
##$AUNM= <au_zg>
##$AUTOPOS= <>
##$BF1= 81.014009
##$BF2= 200.13
##$BF3= 200.13
##$BF4= 200.13
##$BF5= 200.13
##$BF6= 200.13
##$BF7= 200.13
##$BF8= 200.13
##$BYTORDA= 1
##$CFDGTYP= 0
##$CFRGTYP= 5
##$CHEMSTR= <none>
##$CNST= (0..31)
1 1 145 1 1 1 1 1 1 1 1 1 1 1 1 1 1 1 1 1 1 1 1 1 1 1 1 1 1 1 1 1 
##$CPDPRG= <waltz16>
##$CPDPRG1= <>
##$CPDPRG2= <waltz16>
##$CPDPRG3= <>
##$CPDPRG4= <mlev>
##$CPDPRG5= <mlev>
##$CPDPRG6= <mlev>
##$CPDPRG7= <mlev>
##$CPDPRG8= <mlev>
##$CPDPRGB= <>
##$CPDPRGT= <>
##$D= (0..31)
0 1 0 0 0 0 0 0 0 0 0 0.03 2e-05 3e-06 0 0 0 0 0 0 0 0 0 0 0 0 0 0 0 0 
0 0 
##$DATE= 1676973227
##$DBL= (0..7)
120 120 120 11 120 120 24 19 
##$DBP= (0..7)
150 150 150 150 150 150 150 150 
##$DBP07= 0
##$DBPNAM0= <>
##$DBPNAM1= <>
$$ [...]
##$SUBNAM3= <"">
##$SUBNAM4= <"">
##$SUBNAM5= <"">
##$SUBNAM6= <"">
##$SUBNAM7= <"">
##$SUBNAM8= <"">
##$SUBNAM9= <"">
##$SW= 501.771253377433
##$SWIBOX= (0..15)
0 1 3 0 0 0 0 0 0 0 0 0 0 0 0 0 
##$SW_h= 40650.406504065
##$TD= 32768
##$TD0= 1
##$TE= 0
##$TE2= 300
##$TE3= 300
##$TEG= 300
##$TL= (0..7)
0 120 53 12 22 120 120 120 
##$TP= (0..7)
150 150 150 150 150 150 150 150 
##$TP07= 0
##$TPNAME0= <>
##$TPNAME1= <>
##$TPNAME2= <>
##$TPNAME3= <>
##$TPNAME4= <>
##$TPNAME5= <>
##$TPNAME6= <>
##$TPNAME7= <>
##$TPOAL= (0..7)
0.5 0.5 0.5 0.5 0.5 0.5 0.5 0.5 
##$TPOFFS= (0..7)
0 0 0 0 0 0 0 0 
##$TUNHIN= 0
##$TUNHOUT= 0
##$TUNXOUT= 0
##$USERA1= <user>
##$USERA2= <user>
##$USERA3= <user>
##$USERA4= <user>
##$USERA5= <user>
##$V9= 5
##$VALIST= <valist>
##$VCLIST= <CCCCCCCCCCCCCCC>
##$VD= 0
##$VDLIST= <DDDDDDDDDDDDDDD>
##$VPLIST= <PPPPPPPPPPPPPPP>
##$VTLIST= <TTTTTTTTTTTTTTT>
##$WBST= 1024
##$WBSW= 4
##$XGAIN= (0..3)
0 0 0 0 
##$XL= 0
##$YL= 0
##$YMAX_a= 2761
##$YMIN_a= -1642
##$ZGOPTNS= <>
##$ZL1= 120
##$ZL2= 120
##$ZL3= 120
##$ZL4= 120
##$ABSF1= 248.5645
##$ABSF2= -253.2056
##$ABSG= 5
##$ABSL= 3
##$ALPHA= 0
##$AQORDER= 0
##$ASSFAC= 0
##$ASSFACI= 0
##$ASSFACX= 0
##$ASSWID= 0
##$AUNMP= <proc_1d>
##$AZFE= 0.1
##$AZFW= 0.5
##$BCFW= 0
##$BC_mod= 2
##$BYTORDP= 0
##$COROFFS= 0
##$CY= -3
##$DATMOD= 1
##$DC= 0
##$DFILT= <>
##$DTYPP= 0
##$F1P= 0
##$F2P= 0
##$FCOR= 1
##$FTSIZE= 65536
##$FT_mod= 6
##$GAMMA= 0
##$GB= 0
##$INTBC= 1
##$INTSCL= 6.047779e-11
##$ISEN= 30
##$LB= 1
##$LEV0= 0
##$LPBIN= 0
##$MAXI= 10000
##$MC2= 0
##$MEAN= 0
##$ME_mod= 0
##$MI= 50
##$NCOEF= 0
##$NC_proc= -9
##$NLEV= 6
##$NOISF1= 182.463
##$NOISF2= 159.3651
##$NSP= 0
##$NTH_PI= 0
##$NZP= 0
##$OFFSET= 248.5645
##$PC= 4
##$PHC0= -10653.16
##$PHC1= -733.3884
##$PH_mod= 1
##$PKNL= yes
##$PPARMOD= 0
##$PSCAL= 0
##$PSIGN= 0
##$REVERSE= no
##$SF= 81.0140089999694
##$SI= 65536
##$SIGF1= 159.3651
##$SIGF2= -187.1042
##$SINO= 113.3802
##$SIOLD= 16384
##$SREGLST= <1H.CDCl3>
##$SSB= 0
##$STSI= 65536
##$STSR= 0
##$SW_p= 40650.406504065
##$SYMM= 0
##$S_DEV= 0
##$TDeff= 32768
##$TDoff= 0
##$TI= <>
##$TILT= no
##$TM1= 0
##$TM2= 0
##$TOPLEV= 0
##$USERP1= <user>
##$USERP2= <user>
##$USERP3= <user>
##$USERP4= <user>
##$USERP5= <user>
##$WDW= 1
##$XDIM= 65536
##$YMAX_p= 448578799
##$YMIN_p= -41806489
$$ End of Bruker specific parameters
$$ ---------------------------------
##NTUPLES= NMR SPECTRUM
##VAR_NAME=  FREQUENCY,     SPECTRUM/REAL,   SPECTRUM/IMAG
##SYMBOL=    X,             R,               I
##VAR_TYPE=  INDEPENDENT,   DEPENDENT,       DEPENDENT
##VAR_FORM=  AFFN,          ASDF,            ASDF
##VAR_DIM=   65536,         65536,           65536
##UNITS=     HZ,            ARBITRARY UNITS, ARBITRARY UNITS
##FACTOR=    0.620285442955139, 1,           1
##FIRST=     20137.2065510682, 0,            0
##LAST=      -20513.1999529968, 0,           0
##MIN=       -20513.1999529968, -41806489,   0
##MAX=       20137.2065510682, 448578799,    0
$$ Real data points
##PAGE= N=1
##DATA TABLE= (X++(R..R)), XYDATA
$$ [...]
41670h464913P05719N66561K130760J203158l355403m611252K199056J1311745
41662A685431J3948481Q926546R01952o812850j2037952j0824046k056487O867949
41654E99024O380311k321388p098093p49435Q228833O547775n018903j1672360
41646e104236m823791N876047O408576k039199o483247k133799K081222o95594
41638f914021m700064k093727M199028N630409R91261l195810k707141L41702
41630h448363K463778K779191K098764J309724P89907J51318n99309J04225K735729
41621C384964L641706o68496o496421o427802m52375L589428K111706J35356J084949
41612i6985J401616p19550p94886K484673L035161j109856k452148K223959M053475
$$ y = [-8464913, -7759194, -7192633, -5061873, -3858715, -7214118, -11825370, -9626314, 1685431, 15633912, 24560458, 25462410, 18649560, 6611608, -4212438, -6268925, 599024, 6979335, 4657947, -2440146, -3189581, 5039252, 11587027, 6568124, -5104236, -9928027, -4051980, 2356596, 317397, -6165850, -8299649, -6218427, -6914021, -11614085, -13707812, -9508784, -3878375, -2887114, -6082924, -8790065, -8448363, -5984585, -3205394, -1106630, 203094, 993001, 1144319, 545010, 649235, 3384964, 7026670, 6358174, -138247, -6566049, -7018424, -3428996, -1317290, -1181934, -96985, 1304631, 585081, -209805, 2274868, 5310029, 4200173, 1748025, 3971984, 8025459]
41603H025459k190249o472906m44804N569173r34406j0943242o897142O914794
41595g373323R560609k530514j0089386k715782O311345M367752j551704r72163
41587d993166K070562P2478k605752Q34300N429630L153872k437156l072500m16796
41578a964528j306331m027279k050725K602768K266907k460074l551386O71154
41570i819494L574418K180448J074710L223805N601169N487494L740756P84353
41562A5847659l682394o515758m018990O29617Q75704j732340Q99321Q303895
41554A0606714Q921325j788638j1149822o389212N824160Q496758j266680r442976
41546C811629o287778J656144L901513K44167k968555l287187k260605k21979
$$ y = [8025459, 5835210, -637696, -1082500, 4486673, 3552267, -7390975, -14288117, -7373323, 2187286, -343228, -10432614, -13148396, -6837051, -2469299, -4021003, -4993166, -2922604, -2850126, -5455878, -4621578, 808052, 3961924, 1524768, -1547732, -1964528, -3270859, -7298138, -9348863, -6746095, -4479188, -6939262, -10490648, -9819494, -6245076, -4064628, -2989918, 233887, 5835056, 11322550, 15063306, 15847659, 12165265, 5649507, 1630517, 2260134, 3135838, 1403498, 2302819, 10606714, 19528039, 17739401, 6589579, 200367, 6024527, 14521285, 13254605, 3811629, -2476149, -820005, 3081508, 3325675, 357120, -2930067, -5190672, -5412651]
41538e412651K508111K816382p60202l783509j962635J499156R83406j917913
41530f029855j324482K380567L382623J066825P35366L146883K876901q99825
41522E335003j786331K181398M009258j52713l887402j821176J178186j61356
41514D894867j490125J859296L978927j595070q011281m720122M072120N380707
41506D369319r35800k520704L485654N442133k128788q722406n785955n77206
41498g373753k251713n336739O67932J2333421J5823458O878553l620409m639430
41490A2481320K323791P362428M079856m410878r252376n274161K716250M860591
41482A4886821j799938r593105j0117340m005154J971002L793442K460121K83161
$$ y = [-5412651, -2904540, -88158, -848360, -4631869, -6594504, -5095348, -4111942, -6029855, -7354337, -4973770, -1591147, -524322, 211044, 3357927, 6234828, 5335003, 3548672, 5730070, 9739328, 9586615, 5699213, 3878037, 5056223, 4894867, 3404742, 5264038, 9242965, 7647895, -363386, -5083508, -1011388, 4369319, 3433519, 912815, 4398469, 9840602, 7711814, -1010592, -6796547, -7373753, -9625466, -14962205, -14294273, -1960852, 13862606, 20741159, 17120750, 12481320, 14805111, 22167539, 26247395, 21836517, 12584141, 7309980, 10026230, 14886821, 13086883, 3493778, -6623562, -10628716, -8657714, -4864272, -2404151, -2120990]
41474b120990r77961j14963J875991J590329k380051o337351n538314m4523N731061
41465h316772P735133M681654j790207o884688n310418K365811Q162532N364543
41457F007588k755620p010292m087968L86977P43329j671526k310971m03322J285714
41448i816091J476868J353848J201654k7830j127151J322442O781125Q193530
41440I358395L06240j1098255j3955182m541483P746353J1901417O920655l19189
41432F318951m145658l832139j994788k285193n490752o413132L03750R789210
41424g749751J0299352O32721n496958N23322Q068073L994840n883898o853721
41416b466020L1914J229331m635018n256812J395743K465557n226537o773732
$$ y = [-2120990, -3098951, -3213914, -1337923, 252406, -2127645, -8464996, -14003310, -14047833, -8316772, -581639, 4100015, 2309808, -4574880, -9885298, -7519487, 643045, 6007588, 3251968, -3758324, -7846292, -7459315, -6715986, -8387512, -10698483, -11101805, -9816091, -8339223, -6985375, -5783721, -5811551, -6938702, -5616260, 1164865, 9358395, 9664635, -1433620, -15388802, -19930285, -12183932, -282515, 6638140, 6318951, 2173293, -1658846, -3653634, -5938827, -11429579, -17842711, -17538961, -7749751, 2549601, 3182322, -2314636, -1791314, 6276759, 10271599, 4387701, -2466020, -2434106, -1204775, -5839793, -11096605, -9700862, -7235305, -12461842, -19235574]
41408a9235574M675849J2696278L133025j1350910j0546080J589205N243370k479817
41400a6274654n162144M046756J2080956Q165153j118553n234050l999510j389954
41392h886000K799301P067618M558959n457911j1185404l732276P821995Q344713
41384A330995q78172m688945J740650N144479m673484j7342389j5032724K836218
41376c1563372J8368189J7760493O189903k173364j979752N49043j042639n382113
41368G26388o828062l172798K268381N101374M593812L117810J570811k049985
41360E327731p772827j0190623m392063N742526J0839799Q052677L503323J324530
41352A2435073j866426p580987r041685j714862O539178N678515p86180j509481
$$ y = [-19235574, -14559725, -1863447, 1269578, -10081332, -20627412, -19038207, -13794837, -16274654, -21436798, -17390042, -5309086, 2856067, 1737514, -3496536, -7496046, -8886000, -6086699, 980919, 5539878, 81967, -11103437, -14835713, -7013718, 1330995, 452823, -4236122, -2495472, 2649007, -2024477, -19366866, -34399590, -31563372, -13195183, 4565310, 10755213, 8581849, 6602097, 7151140, 6108501, 726388, -6101674, -9274472, -7006091, -1904717, 2689095, 5806905, 7377716, 5327731, -2445096, -12635719, -17027782, -11285256, -445457, 7607220, 11110543, 12435073, 10568647, 2987660, -6054025, -7768887, -1229709, 4448806, 3662626, 2153145]
41344B153145L711829L424959n927298j2541117o440016N685885R911655L019589
41336B998631n890502p970560k890239L626227O188045M122757J327481J121975
41328B633815J811857j966k817803j645223L790074P300659M140157l297297q901625
41319C012648q806624l670602J850293K428296k024951n429975l808276r46982
41311a7396173j062558r08927L401026P041351L943167j107955J4015L273721
41303b802333q22003p932995n084068M974315M858202p925902j3637188j187673
41295b9559645J3626966J3272387L921399N07280J995269p16332m758083k216700
41287c927459K045137j658398q786128p685162n32351Q36916l667541k917099
$$ y = [2153145, 5864974, 9289933, 3362635, -9178482, -15618498, -9932613, -20958, 2998631, -2891871, -10862431, -13752670, -10126443, -3938398, 184359, 1511840, 2633815, 4445672, 4443706, 1625903, -19320, 3770754, 11071413, 15211570, 11914273, 3012648, -5793976, -9464578, -7614285, -5185989, -7210940, -12640915, -16449191, -17396173, -18458731, -19367658, -15966632, -8925281, -4982114, -6090069, -6076054, -2802333, -3624336, -11557331, -16641399, -11667084, -6808882, -14734784, -28371972, -29559645, -15932679, -2660292, 1261107, 1768387, 3763656, 3047324, -1710759, -3927459, -1882322, -3540720, -12326848, -20012010, -20544361, -19707445, -23374986, -26292085]
41279b6292085N475573J2417505J3377033J1457947N989173n530471j4912209
41272A982466j0048340M652752J1389902M653118k804654k525522j424651n015716
41264H59355o546069j021313M433671L267599K58292Q92084J351113k182193m937786
41255c625247l194232k255085n508960n647740K663413J0659301P932947o31017
41247C93380l040781P02886J108060l120476l776172J528788N733955N194000
41239D723640M579073O233877N107879j194054n965105k953636L751343N566780
41231A9849797J043200m359978p374622r312038j0003137o028118K511655Q448990
41223e224251N556552k143529m567650P87575N104392Q31769p103923q027729
$$ y = [-26292085, -20816512, -8399007, 4978026, 16435973, 22425146, 16894675, 1982466, -8065874, -3413122, 7976780, 12629898, 9825244, 7299722, 5875071, 859355, -5686714, -6708027, -2274356, 993243, 1251535, 2143619, 3494732, 1312539, -3625247, -6819479, -9074564, -14583524, -20231264, -17567851, -6908550, 1024397, 393380, -2647401, -1944515, -836455, -3956931, -7733103, -6204315, -470360, 4723640, 9302713, 15536590, 20644469, 19450415, 13485310, 10531674, 14283017, 19849797, 20892997, 16533019, 9158397, -153641, -10156778, -16184896, -13673241, -5224251, 332301, -1811228, -6378878, -5591303, -486911, 344858, -6759065, -14786794]
41215a4786794m89708O240794N392879O41741j412283r20554k319483n474657
41207a3128065m988503J417964Q125061P781599O51423n217969l896724R40494
41199h314720J235729l953908o481607L3704J1033112J5581336Q275202n605151
41191A1803697j5421418j4246105m475553M400336N482763J910262J358006M019648
41183e168364K696851m023148p439422k287635L780325J824268m167672m070794
41175a8855591K379735O700429N576648L094331Q81919l142507o599546m204732
41167a4169314J359329Q56468o558897j0060650l118490O498748Q566323M646840
41159a1979643L331955O414997P484025K397917n087216q610726o425043k090229
$$ y = [-14786794, -15276502, -9035708, -3642829, -3001088, -4413371, -5333925, -7653408, -13128065, -18116568, -16698604, -8573543, -791944, -140521, -5358490, -9255214, -8314720, -7078991, -11032899, -17514506, -17480802, -6447690, 9133646, 17408848, 11803697, -3617721, -17863826, -22339379, -17939043, -12456280, -10546018, -9188012, -5168364, -2471513, -6494661, -13934083, -16221718, -12441393, -10617125, -14784797, -18855591, -16475856, -9775427, -4198779, -1104448, -222529, -3365036, -9964582, -14169314, -12809985, -11953517, -18512414, -28573064, -31691554, -25192806, -16626483, -11979643, -8647688, -2232691, 5251334, 7649251, 2562035, -6048691, -12473734, -14563963]
41151a4563963N25578J329798K248148K724378M45479l091355k727401K338731
41143a0770607O151785N138871L358280L751028J774223m718798p348058P1281
41135b591995P606435K069197j0685352j2608562j398208N882512r2897p237049
41127a9055919k345424R339575J4218534R301609J613018l591221n552946m694882
41119g67656l219405m195571n716126j892357O795839J1508152P559450J140244
41111A1212570j284290k324433o499452j0862123r451028k068976O454884J1252185
41103c570663Q769695p30067r507264q551320k5883M788251K262598P36142M563184
41094a265327O042364l09064p160190o549476k418489j798184k697238l36800
$$ y = [-14563963, -14038385, -12708587, -10460439, -7736061, -7290582, -10381937, -13109338, -10770607, -4618822, 520049, 3878329, 7629357, 9403580, 4684782, -2663276, -2591995, 5014440, 7083637, -3601715, -16210277, -17608485, -11725973, -11818870, -19055919, -21401343, -12061768, 2156766, 11458375, 13071393, 9480172, 3927226, -767656, -3987061, -8182632, -13898758, -15791115, -8995276, 2512876, 10072326, 11212570, 9928280, 7603847, 1104395, -9757728, -19208756, -21277732, -14822848, -3570663, 5199032, 4468965, -5038299, -13589619, -13615502, -8827251, -6564653, -5828511, -1265327, 4777037, 4467973, -2692217, -9241693, -11660182, -13458366, -16155604, -16492404]
41086a6492404K834227K837449K119710K809870K84318p058280j0266237k806735
41078b5738082O975584P714967J830994j223834r86259k294319k369502M023083
41070a2067368J1249014R108557l64776n776620l810690j060021m03293J638284
41062a486913M768519M154722j04151k964305l395117m226161m744079k458521
41054a0456006K99457M92531J303280N517089P223982J177824n422391l461448
41046c325682J628871j090604p761914n561675M620329R560597O035950L103411
41038G209283K760370j901392q359023n325801N176569P553053o82960l732032
41030B698067L911199O469083m614776j3425464o055537N337503L390425n687112
$$ y = [-16492404, -13658177, -10820728, -8701018, -5891148, -5606830, -12665110, -22931347, -25738082, -18762498, -11047531, -9216537, -10440371, -11426630, -13720949, -16090451, -12067368, -818354, 8290203, 7925427, 2148807, -1661883, -2721904, -3125197, -1486913, 3281606, 7436328, 7332177, 4367872, 972755, -3253406, -7997485, -10456006, -10156549, -9664018, -8360738, -2843649, 4380333, 5558157, 135766, -3325682, -1696811, -2787415, -10549329, -16111004, -11490675, -1930078, 4105872, 7209283, 9969653, 8068261, -290762, -5616563, -439994, 7113059, 6430099, 2698067, 6609266, 13078349, 8463573, -4961891, -11017428, -5679925, -2289500, -7976612]
41022g976612m679502N346848R523844N042192K088882L491165K363574j963086
41014A3237305k735331r1898j469576p328307j0054774p718168o044202n702855
41006b7907806o23777Q395602J0851451K385017o560773m452712N767156J1315054
40998h30788O014078l356777o214331l55839O143999N156559j106820l572869
40990A877212R9149J982865l113980q517757n955643J153324L300995j62627j309926
40981a0646388K661171N507799K611419k388490l820881j011978K969190N284304
40973A166146M649144J917206k90629j027572k645329n815191n853508O33101
40965g266632P867919O733107k152407q481742o238961n10142J902167J735303
$$ y = [-7976612, -12656114, -7309266, 2214578, 7256770, 9345652, 12836817, 15200391, 13237305, 10501974, 10410076, 8940500, 1612193, -8442581, -16160749, -22204951, -27907806, -28531583, -20135981, -9284530, -6899513, -13460286, -17912998, -12145842, -830788, 5183290, 1826513, -4387818, -4743657, 1400342, 6556901, 5450081, 1877212, 1976361, 3959226, 845246, -7672511, -13628154, -12474830, -9173835, -9336462, -10646388, -7985217, -2477418, 134001, -2254489, -6075370, -7087348, -4118158, 1166146, 5815290, 7732496, 7441867, 6414295, 3768966, -2046225, -7899733, -7266632, 601287, 7334394, 5181987, -3299755, -9538716, -10048858, -8146691, -6411388]
40957f411388K718899L210661j015480p601393q105589L97511R152882P836012
40949A82115j152781m720280L129632J2121637R557367j986470r139402o922283
40941A069535k964546k501956p54792N815385J0951698P752476j118094q341771
40933I907935j0641451p837456o48190N732879M356976j921382j644523O232289
40925C537077P158585n387210j4941539n768490J0467676J1133367k547446r181376
40917e529356j896956L984524q58223o438593l933590N10526N73229J166972N836816
40908f584651P780726L124230k84839K837301M707780j422269q437326p738200
40900f017248l804471m619840o917335l292811L602814N956268L553944Q69894
$$ y = [-6411388, -3692489, -481828, -1497308, -9098701, -17204290, -16806779, -7653897, 182115, -970666, -5690946, -2561314, 9560323, 19117690, 17131220, 7991818, 1069535, -1895011, -4396967, -5151759, 663626, 11615324, 19367800, 18249706, 9907935, -733516, -8570972, -9219162, -3486283, 870693, -1050689, -2695212, 3537077, 10695662, 5308452, -9633087, -15401577, -4933901, 6199466, 3652020, -5529356, -7426312, -3441788, -4300011, -10738604, -14672194, -14161668, -13588439, -12421467, -6584651, 1196075, 4320305, 4035466, 6872767, 11580547, 10158278, 1720952, -6017248, -9821719, -14441559, -21358894, -24651705, -21048891, -15092623, -11538679, -10668785]
40892a0668785k037234n155827k425778Q080810J4913917P606376n425970p681323
40884b793814R97560N946345J232251m043033l207059o55049l65260P65047L897779
40875A774767M007192m84722l316543m19702L567350L082650q45148m381567o043677
40866c059400n243256j426863L035981M287267K522123J060614K24486j786008
40858c85056l180464j350614J90346l149054o574698j831889O943788O823435
40850b514206k808905p573547q05012O423743M969329J722416L831678L877712
40842G123208n096017j2490457n401297Q073149R616716o31460n756631m29253
40834d992042K651661k917004o143948P13352P262862K199696o984282n301421
$$ y = [-10668785, -12706019, -17861846, -20287624, -12206814, 2707103, 10313479, 4887509, -2793814, -1796254, 4150091, 5382342, 1339309, -1867750, -2522799, -2888059, -2123012, 1774767, 5781959, 5297237, 1980694, 1560992, 5128342, 8210992, 7365844, 2984277, -3059400, -8302656, -9729519, -6693538, -2406271, 115852, 1176466, 1400952, -385056, -3565520, -4916134, -4725788, -7874842, -14449540, -16281429, -9337641, -2514206, -5323111, -12896658, -13701670, -7277927, -2308598, -586182, 3245496, 7123208, 2027191, -10463266, -15864563, -7791414, 1825302, 1193842, -4562789, -4992042, -2340381, -5257385, -11401333, -10687981, -3425119, -1225423, -8209705, -13511126]
40826a3511126N860752J0395667J378239r164097p604704K805141P234957l35971
40818b941142r259443p059098L091592O707767j032364p939524l034773O627512
40810a4839473O866709j680163n121132J838553R027430P907811K786746L9521
40802F826002k148033o041982o707350j285028K634230j524495o406117j304149
40794a5956922R236940J0883760J715163m946529j308552M567110L669521n59152
40786G301339j001073K70736k812676q103672p885565j317091M026376K635613
40778f886013l197771p971103p959233j905355P857359J4607081J2711404M873630
40770A2129999p48355j470469k628971p255881r543879l650333N476954P152541
$$ y = [-13511126, -7650374, 2745293, 4123532, -5040565, -12645269, -9840128, -2605171, -2941142, -12200585, -19259683, -16168091, -9460324, -10492688, -18432212, -21466985, -14839473, -7972764, -9652927, -14774059, -12935506, -3908076, 3999735, 6786481, 6826002, 4677969, -1364013, -8071363, -9356391, -6722161, -8246656, -14652773, -15956922, -6719982, 4163778, 5878941, 932412, -376140, 4190970, 7860491, 7301339, 6300266, 6571002, 3758326, -4345346, -12230911, -13548002, -9521626, -6886013, -10083784, -18054887, -26014120, -27919475, -20062116, -5455035, 7256369, 12129999, 11381644, 9911175, 7282204, 26323, -9517556, -13167889, -7690935, -538394]
40762e38394k86232o564892k974208O467125J0705099N191069m412250j0588384
40754c001067j1363422q486897k677108N344303J0932021Q097794k127116j0016050
40746a3297542p599914J570622P376972O121428L091895K670350K722473Q20810
40738C477094o25564N00906J396148k58391j434290J0704l45460n478948q449692
40729a1207493j979436P181890N881457m388655p948778J144193R937270P346851
40721E967299L12219n07233R56934m374668j1606875q128022M587163J0963950
40713a829233L746049o701713q149896q17003P265436J0070931N578435l861607
40705E301399j0162704o265508L043059N218834k308127p804053l028725M648862
$$ y = [-538394, -824626, -7389518, -10363726, -3896601, 6808498, 11999567, 7587317, -3001067, -14364489, -22851386, -25528494, -20184191, -9252170, -1154376, -3281492, -13297542, -20897456, -19326834, -11949862, -5828434, -2736539, -66189, 2656284, 3477094, 2851530, 3352436, 4748584, 4490193, 3055903, 3066607, 2721147, -2757801, -11207493, -13186929, -6005039, -123582, -4512237, -12461015, -11316822, -1379552, 5967299, 6279518, 5772285, 6729219, 2354551, -9252324, -17380346, -12793183, -1829233, 1916816, -4784897, -12934793, -13751796, -6486360, 3584571, 9163006, 5301399, -4861305, -11126813, -8083754, -2864920, -5173047, -12977100, -16005825, -11356963]
40697a1356963N129364J389490K233923N937517L531269m324599o613443L49222
40689c724220N878273P41699q462805q407583K086547J0754989Q890795J860261
40681I617956l31685K945661M188269Q3899m611758n815762n544091n781324l611632
40672h860467K536308P425569O253835K740338K608684L328846n99837n804410
40664I628866m700767k7645j692753q729238q828094P60891O962318K199547k974131
40655g401006J188678O122441O12090p623226l819212P739076R177744k052924
40647C943661r495764m558828J857168K68106k041113L789268J1320275R266386
40639A4349159l13408o395307n766043m142829m091184k500829J024190K439152
$$ y = [-11356963, -6227599, -4838109, -2604186, 3333331, 6864600, 2540001, -4073442, -3724220, 2154053, 2895752, -5567053, -13974636, -11888089, -1133100, 7757695, 9617956, 9286271, 12231932, 16420201, 16504100, 11892342, 6076580, 532489, -5248835, -8860467, -6324159, 1101410, 7355245, 10095583, 12704267, 16033113, 15433276, 9628866, 4928099, 4900454, 3207701, -5521537, -14349631, -13588740, -6626422, -4426875, -7401006, -6212328, -89887, 522203, -7101023, -10920235, -3181159, 5996585, 3943661, -5552103, -10110931, -8253763, -7985657, -10026770, -6237502, 5082773, 14349159, 14035751, 7640444, 1874401, -2268428, -6359612, -8860441, -7836251, -5397099]
40631e397099M44314j674473k093572k461037l177981k009190J390542L816147
40623a1162349K600008j594262o097824p449721k505760P345290J4129157J1082265
40615F346804K477023p50067L690302N904326j032868r906626r750454j723861
40607d745421L716963K340816k74095L7005M13332j535887k658347k85964K822402
40598a69196L236673J402042j587488o132408r864621p757902p50286K751394
40590a8871792n80109k674002K349308O650972J432241o159590l063284P325686
40582a3590570R360503P84662l660143K476971O379631j729360j1223445p951981
40574a9153732L592356Q636975M395883J62215K51328J35661k457608l977923
$$ y = [-5397099, -4952785, -6627258, -8720830, -11181867, -14359848, -16369038, -14978496, -11162349, -8562341, -10156603, -16254427, -23704148, -26209908, -18864618, -4735461, 6346804, 8823827, 8073760, 11764062, 17668388, 16635520, 6728894, -3021560, -4745421, -1028458, 1312358, 1038263, 1075268, 1488600, -47287, -2705634, -2991598, -169196, 3067477, 4469519, 2882031, -3250377, -13114998, -20872900, -21623186, -18871792, -19451901, -22125903, -19776595, -13125623, -11693382, -17852972, -20916256, -13590570, -4230067, -3445405, -7105548, -4628577, 1751054, 21694, -11201751, -19153732, -15561376, -6924401, -2528518, -2366303, -2114975, -1979314, -4436922, -8414845]
40566h414845k380831N20930L484991N820654M843724N0098k831118Q88629O363598
40557H345830N568411o64072m975496n144931m754434m419630j637445J808993
40549e872774J504748r83251L5697M098041M895410R67770k553299l181390l328559
40540d417607k864844J366409P299627Q092205K937855j287140j557927k984267
40532F584311q272978j1650349q124883j632401J319192O51635N87488K705385
40524a7832600N044859N198949K179235k027471k635228K312700P450353O442493
40516F133290J273333j413436j197874k479436l933031l40590N045213K426205
40508E513674p753296j2414374m738105O235598J0241450Q390812M859600j778137
$$ y = [-8414845, -10795676, -10274746, -6789755, -969101, 3874623, 3924721, 1093603, 1982232, 8345830, 13914241, 13250169, 8274673, 3129742, -1624692, -6044322, -7681767, -5872774, -4368026, -5351277, -5315580, -1217539, 3677871, 4645641, 2092342, -1089048, -4417607, -7282451, -5916042, 1383585, 9475790, 12413645, 11126505, 9568578, 6584311, -1688667, -13339016, -21463899, -23096300, -21777108, -21125473, -20537985, -17832600, -12787741, -7588792, -5409557, -7437028, -10072256, -7759556, -309203, 6133290, 7406623, 5993187, 4795313, 2315877, -1617154, -1957744, 3087469, 5513674, -2239622, -14653996, -19392101, -13156503, -2915053, 5475759, 10335359, 8557222]
40500H557222j0213910j0907267j04513R830110O272073m498994o546478K347917
40492e263840R402783O570354m07014l026544q00633O72481l117553j0678470
40484f648436j4079660o581153O644523J1647584M005008m056699j743826M176300
40476f636359J793254n505362m941985L992730Q817466L933976k764211m290249
40468e600740l018733k325273q89265J486448J872899Q49844K372548M889805
40460c62467J979611n539447q067223j820031M516367K953757k661029m834857
40452a3835319l849953l614600k664670K059346O688379M631435k240575m654601
40444a7480558J166358Q093311P800108J372352l132684j503472K228497K802541
$$ y = [8557222, -1656688, -12563955, -12668468, -2838358, 3433715, -1065279, -7611757, -5263840, 4138943, 10709297, 10302283, 7275739, 6475106, 7147587, 4030034, -6648436, -20728096, -27309249, -20664726, -9017142, -5012134, -9068833, -10812659, -6636359, -4843105, -10348467, -15290452, -11297722, -2480256, 1453720, -1310491, -5600740, -8619473, -10944746, -11834011, -10347563, -8474664, -7624820, -5252272, -362467, 1617144, -3922303, -11989526, -13809557, -9293190, -6339433, -9000462, -13835319, -17685272, -21299872, -23964542, -21905196, -15216817, -10585382, -12825957, -17480558, -16314200, -8220889, -420781, 951571, -2181113, -3684585, -1456088, 1346453]
40436A346453J460284K830780N737883L419411n191177j1090871p251818O69582
40428h069473L141468J657186M717376J1157479R775838k386727j3135499j1853507
40420d995859l409391J685906K617335M656596O464196K102309o533921r928817
40412g341646m551776K415005M246630L038802L262340L533503M34180l828731
40404A208307m234427j516840j205012m002057l901259J655344N986463K542113
40396c467368m410442n215320J172255O027470L867341o88078j308969J238102
40388b785009K457605J308287l16391j669642k605640j720667J344797L932877
40380e3783L390911o6939m793503q544944p316491R40055R938905R707098N94031
$$ y = [1346453, 2806737, 5637517, 11375400, 14794811, 9603634, -1487237, -8739055, -8069473, -4928005, -3270819, 1446557, 12604036, 22379874, 19993147, 6857648, -4995859, -8405250, -6719344, -4102009, 554587, 7018783, 9121092, 2587171, -7341646, -11893422, -9478417, -5231787, -2192985, 1069355, 4602858, 5037038, 1208307, -3026120, -4542960, -5747972, -9750029, -13651288, -11995944, -6009481, -3467368, -7877810, -13093130, -11920875, -5893405, -2026064, -2714142, -4023111, -2785009, -327404, 980883, 664492, -1005150, -3610790, -5331457, -3986660, -53783, 3337128, 3270189, -1523314, -10068258, -17384749, -16444694, -6505789, 3201309, 3795340]
40371C795340n578278k594128J538684n31014k787742J914654O979490K923768
40363E660774m684993l742661L257118L530799l411431n356428N92290L656893
40355d97639n67739l367189n71433K80840l458334k825325M782353P591494k28127
40346A138901o095278M94949R686561Q357030K281073L697166P596280P54630
40338B7911312j2221075j3493481j103402P023369R48112p436330m476933N831900
40330B983472J0395464M718112n285759j1954958j0652247j751672P608089Q629354
40322D689855R34769o867164q323718n499924k854775j077586N66856J513263
40314a6918424K223782M338146O493637N047434P06152j071291J624523L999494
$$ y = [3795340, -1782938, -4377066, -2838382, -3369396, -6157138, -4242484, 2737006, 5660774, 975781, -2766880, 490238, 4021037, 609606, -4746822, -4154532, -497639, -1065378, -4432567, -5004000, -4723160, -8181494, -11006819, -6224466, 1367028, 1138901, -4956377, -4461428, 5225133, 13582163, 15863236, 19560402, 27156682, 27911312, 15690237, 2196756, 1093354, 8116723, 9064835, 1628505, -2848428, 2983472, 13378936, 18097048, 12811289, 856331, -9795916, -11547588, -3939499, 4689855, 5624624, -1242540, -9566258, -15066182, -17920957, -18998543, -18431687, -16918424, -14694642, -10356496, -3862859, 1184575, 1890727, 819436, 2443959, 6443453]
40306F443453K115815j813047m290289n324417n502423l645553o42840m03633
40298a3062934l331252l891599J188622P102733Q023689N540782M557916M414825
40290A0542782N89000o390382r955279n959636K007529O675662M228484k619195
40282h81035p144512m850167J782372O015679M742256J070406j549078l625269
40274d439348n930579o042991k515466J044189P26485j336552q7951M776048Q717489
40265e088676Q492312M290405k319659p963042p173290J513219J0417817J0254305
40257A2423391K559744k379398o01855N57628m641676j0497378q518545m06O772885
40248d325610P909677N582308J285597m670719p983323l206904O405031R451868
$$ y = [6443453, 8559268, 6746221, 2455932, -2868485, -8370908, -12016461, -12659301, -13062934, -16394186, -20285785, -19097163, -11994430, -3970741, 1570041, 6127957, 10542782, 11131782, 4741400, -5213879, -11173515, -9165986, -2490324, 1738160, -881035, -8025547, -12875714, -11093342, -5077663, -335407, 734999, -814079, -4439348, -10369927, -16412918, -18928384, -17884195, -17157710, -18494262, -18582213, -13806165, -5088676, 3403636, 7694041, 5374382, -2588660, -9761950, -8248731, 2169086, 12423391, 14983135, 12603737, 12001882, 12559510, 7917834, -2579544, -11098089, -11098495, -4325610, 3584067, 9166375, 10451972, 5781253, -2202070, -5408974, 996057, 10447925]
40240A0447925Q05115j0218914j1255113k415583N522746N973227K672983J061250
40232B593636O81629q05783j638543Q14874L920617K836109j080291r88776M821271
40223A1154743Q637552L555511n876167q871900l059658K109175j641228r810043
40215c802015j0734806q95621J0140052J1289497L179123l420607j447490M235005
40207H543138M485314j565908o328978n195473k122730j673255j310077L251238
40199a916731Q870581P904841p67339r721743j2168317q042321r93609N148596
40191a1686042O541719J912720l930355m803197j963329j617496l304827P5859
40183a8774948Q346280J0988438L476125m115532k964934M81420k599165o076697
$$ y = [10447925, 11253040, 1034126, -10220987, -12636570, -7113824, -1140597, 1532386, 2593636, 3275265, 2469482, 830939, 1645813, 5566430, 8402539, 7322248, 6333472, 11154743, 19792295, 23347806, 17471639, 8599739, 5540081, 7649256, 6008028, -3802015, -14536821, -15432442, -5292390, 5997107, 9176230, 5755623, 4308133, 8543138, 13028452, 11462544, 5133566, -61907, -2184637, -3857892, -5167969, -1916731, 6953850, 14858691, 14091352, 4369609, -7798708, -15841029, -16834638, -11686042, -5144323, -3231603, -7161958, -11965155, -13928484, -15545980, -18850807, -18774948, -10428668, 559770, 4035895, -79637, -3044571, -2563151, -5162316, -11239013]
40175a1239013Q04409J2288082J2496150P43621o871820k486931L550267J970636
40167A1255401j599093O37734M835956L307539k891374o957529n197299K154978
40159E546313J1623680J4604049M291354j1654746j6384228o613718K240980j88384
40151C465300m620841o56204M820907J391327n249522l669033K725147K705791
40143I12872k135179j449146L775355K872216m885843q912888n026552K86020
40135a4563145K870915M433675M188983N33505r98826M346497P914700o62164
40127H064140j2493688r735047M672302R740843L46146n596418Q82293N496645
40119A377216j604936p633405j177792O373294J022802r079533p801387L101068
$$ y = [-11239013, -10434604, 1853478, 14349628, 15093249, 8221429, 5734498, 9284765, 11255401, 9656308, 10294042, 15129998, 18437537, 15546163, 8588634, 3391335, 5546313, 17169993, 31774042, 36065396, 24410650, 8026422, 1412704, 3653684, 3465300, -1155541, -1811745, 3009162, 4400489, -849033, -4518066, -1792919, 912872, -1222307, -2671453, 1103902, 3976118, -909725, -9822613, -14849165, -14563145, -11692230, -7258555, -3069572, -2536067, -3534893, 811604, 8726304, 8064140, -4429548, -14164595, -9492293, 248550, 594696, -5001722, -4119429, 1377216, -227720, -7861125, -9038917, -2665623, -1642821, -10722354, -18523741, -15422673]
40111a5422673J0266376J0179004P755752L612032j420233L59639R454574J0157827
40103C4942298n838474j8770577o515730J8283215K3125271L349044j2820086
40096C5754961q104098K375305O12372p947783r781261n623287l159761j502583
40088B623865K994568N659225J324527m113123j827641N343467P093304J298486
40080B0396678l936383k843594R50325Q17074m057728p984789n793160K70722
40072b180855K495785j974201o157755k738712M984608Q109131N176422J948163
40064I662586K2876m341527r872433r411746k052136L521628J809744j857810
40056a2518818j024940K150161K192369p19032k402335j026511K146961M845638
$$ y = [-15422673, -5156297, 5022707, 12778459, 16390491, 14970258, 15329897, 24784471, 34942298, 29103824, 10333247, 3817517, 22100732, 45226003, 48575047, 35754961, 27650863, 30026168, 30638540, 22690757, 12909496, 7286209, 4126448, 2623865, 5618433, 11277658, 12602185, 8489062, 6661421, 12004888, 19098192, 20396678, 16460295, 13616701, 14567026, 15384100, 11326372, 3341583, -2451577, -2180855, 314930, -1659271, -7817026, -10555738, -5571130, 2538001, 7714423, 9662586, 9685462, 5343935, -4528498, -13940244, -15992380, -12470752, -10661008, -12518818, -13543758, -11393597, -9201228, -9920260, -12322595, -13349106, -11202145, -6356507]
40048f356507M422553M20957k623678j23428M630528M211353r79953k789791J507300
40039B319334N511290N415666N079442N726897J788856p015461j0479763l107089
40031E239172N240331L755764k621145k255967L944479M940570k332162r477539
40023F433503j0246395o894451k675243K433810P014033P273198L163922m94678
40015F007699q15344l9198q20998k494176k998316j434642J396358K675648p38779
40006G38252p423290j0454953n040754N075222J2328897J3508731R449301J044425
39998A9225831q423247j1147715l139130P510209R018419J316433n443330o680921
39990B236549p351558r191328n865907M040120R838197L355009o619350n257544
$$ y = [-6356507, -1933954, -1512997, -4136675, -4260103, 370425, 4581778, 3601825, 812034, 2319334, 7830624, 13246290, 18325732, 24052629, 25841485, 18826024, 8346261, 5239172, 10479503, 14235267, 11614122, 9358155, 13302634, 18243204, 15911042, 6433503, -3812892, -10707343, -13382586, -10948776, -3934743, 3338455, 6502377, 6007699, 5192355, 5153157, 4332159, 1837983, -1160333, -2594975, -1198617, 1477031, 738252, -6685038, -17139991, -22180745, -17105523, -4776626, 8732105, 18181406, 19225831, 10802584, -345131, -3484261, 4025948, 13044367, 14360800, 8917470, 2236549, -5115009, -14306337, -20172244, -16132124, -6293927, -2938918, -9558268, -14815812]
39982a4815812O524069J2694822N030453n567030n608421J691333K461497o575829
39974d164918j3533779r336620m48556K274049J36412K624655J0327647J2967956
39966H46846N635453l381849n439658l519893m721037p523557m956512L333793
39958a9726414J0403481J1710122Q591600L476002j649582l040348J435650O606189
39950A7806700M367459n173550j2665954j0833851j799129P568015J2152220R626059
39942B1047969J162951o786360p106683j093568K266211j171537m637663j071713
39934B609607N665180O404685L8853n689770n589317k553475j003849p91673k01612
39925a111371m18070k930633m960522k036713N054749R805938P834270K324667
$$ y = [-14815812, -8291743, 4403079, 9433532, 3866502, -1741919, -50586, 2410911, -4164918, -17698697, -27035317, -27483873, -25209824, -25073412, -22448757, -12121110, 846846, 6482299, 3100450, -2339208, -5859101, -10580138, -18103695, -23060207, -19726414, -9322933, 2387189, 10978789, 14454791, 12805209, 9764861, 11200511, 17806700, 22174159, 17000609, 4334655, -6499196, -8298325, -730310, 11421910, 21047969, 22210920, 15424560, 8317877, 7224309, 9490520, 8318983, 3681320, 2609607, 8274787, 14679472, 14718325, 9028555, 3439238, 885763, -118086, -909759, -1111371, -1529441, -4460074, -9420596, -11457309, -6402560, 3403378, 11237648, 13562315]
39917A3562315n71001K77961O02116k523124o833467q243549n509424p11126L031778
39908f917521L843861K766371K887520M708832L739342l167726j0122102p442827
39900i704250L979381J0959254M933762n956684q038525k46161O638731N581784
39892H147292l39672n829250r075024q840730l605115L898489P086072L250000
39884e307938l055611n920629l734081J596989O692357P376371K167089l931343
39876d116796m012216J345566M581569K301888k55372J505136M014709J638592
39868G003076m468800q463922p578336l592895Q10541L463903K806824j71608
39860a0191217k092582j544627o11880m07509Q16014K949851K712486K13130M53087
$$ y = [13562315, 12991314, 13269275, 13871391, 11348267, 4514800, -3728749, -9238173, -9949299, -6917521, -3073660, -307289, 2580231, 7289063, 11028405, 7860679, -2261423, -9704250, -5724869, 5234385, 10168147, 4211463, -3827062, -4073223, 2565508, 8147292, 7807620, 1978370, -7096654, -15937384, -19542499, -15644010, -8557938, -5307938, -8363549, -14284178, -18018259, -16421270, -9728913, -2352542, -185453, -4116796, -8129012, -6783446, -2201877, 100011, -155361, 1349775, 5364484, 7003076, 2534276, -5929646, -13507982, -17100877, -16290336, -12826433, -10019609, -10191217, -12283799, -13828426, -14440306, -14847815, -14031801, -11081950, -8369464, -8156334, -7703247]
39851g703247L526899R72117j0120174j6915678p084185R525440J1161420l949829
39843b0587237j3219449k658461J2601584J2161773O84791k399010N293974P743286
39835c78749j016487p645080l195674K527552k16371l707526K257794J0191800
39827a182741O576270l997391n138090L872721O562001k927145j0020991m586635
39819a0842001K440543r98803o757789j170900R633986Q154023n512888j2545432
39811a7599261m213801N872813L858857m711534o304419O7168M402744K077227
39803a6550206j503302j033082J623042J536701k226954n083848j859829O199004
39795a8898474J0474350M562981n656536p206949L108552J3193555J0977817j8072
$$ y = [-7703247, -4176348, -3204231, -13324405, -30240083, -37324268, -27798828, -16637408, -20587237, -33806686, -36465147, -23863563, -11701790, -11016999, -13416009, -8122035, -378749, -1395236, -9040316, -12235990, -9708438, -9924809, -13632335, -11374541, -1182741, 5393529, 1396138, -3741952, 130769, 6692770, 3765625, -6255366, -10842001, -8401458, -9400261, -16158050, -17328950, -7694964, 459059, -5053829, -17599261, -21813062, -15940249, -12081392, -16792926, -23097345, -23030177, -18627433, -16550206, -18053508, -19086590, -17463548, -15926847, -18153801, -23237649, -25097478, -18898474, -8424124, -3861143, -9517679, -16724628, -13616076, -422521, 10555296, 10537224]
39787A0537224o233131j978736M818653M508349k219954o489605l008970L137175
39779C071005K734456n071038r865039k787535J0295569J4566403N144736o823438
39771A1265119r252247l376563J365454N58735l082111o256693p057831l530962
39763a9367099L143268O400139J844997m981341n449001n81538J468451k34021
39755a7756145J893193Q748868R444678j865060j3479607j0868994J752929O794287
39747a5335851j178750p976947j248892J1625581J4618739M830928n907774p688725
39739h261691j879039N158077R297266Q473037K506021m370250o320486l435599
39731A167336j407645k287287j949681J080940K059542n77761n16345N105837
$$ y = [10537224, 4304093, 2325357, 7144010, 11652359, 9432405, 2942800, -66170, 3071005, 5805461, 734423, -9130616, -11918151, -1622582, 12943821, 18088557, 11265119, 2012872, -1363691, 1763, 560498, -2521613, -8778306, -15836137, -19367099, -16223831, -9823692, -7978695, -12960036, -18409037, -18990575, -17522124, -17756145, -15862952, -7114084, 2330594, 465534, -13014073, -23883067, -22130138, -15335851, -16514601, -24491548, -25740440, -14114859, 503880, 5334808, -572966, -8261691, -10140730, -4982653, 4314613, 12787650, 15293671, 10923421, 4602935, 1167336, -240309, -2527596, -4477277, -3396337, -1336795, -1914556, -2430901, 2674936]
39723B674936P608732n07849j0939600r435186K920183J0674702N877734k938458
39715E935194n404554k008944J240338J501858j408656o230738p799808j413139
39707a5588449P635566Q075228m02007m735794J688163Q163839L979624m047454
39699D768716l161744M138402M650360l596462q415898k896547N021667N962035
39691F470529K044634R17867L661082M865173J615686k786559l728383r82330
39683A2077699J446950M96994k186603k868338j113644J48853m33086j418198
39675F150627k527495n038835p121439m360770K697907P252020N758371K963839
39667E774225L345999L573493q87061o894576q047755m311934q58516j11667q07365
$$ y = [2674936, 10283668, 9775819, -1163781, -10598967, -7678784, 2995918, 8873652, 5935194, 530640, -1478304, -237966, 1263892, -144764, -6375502, -14175310, -15588449, -7952883, 122345, -279662, -5015456, -3327293, 4836546, 8816170, 4768716, 1606972, 5745374, 10395734, 6799272, -1616626, -4513173, 508494, 6470529, 8515163, 9433030, 13094112, 17959285, 19574971, 16788412, 13060029, 12077699, 13524649, 14021643, 11835040, 8966702, 7853058, 8001911, 7568825, 6150627, 3623132, -1415703, -8537142, -12897912, -10200005, -2947985, 2810386, 5774225, 9120224, 12693717, 11806656, 4912080, -3135675, -7447609, -8306125, -8417792, -9225157]
39658i225157k456307n039538o072853k943048K989895P787676Q581697M446124
39650a931511k397811n465795n97868N187235O62386j1192530j3810040j797888
39642c1343822Q683834M270549m596621j435795R204016J0540916J445472m209163
39634g440614j908749m64120k707868j198860N303338Q310262N236910L068394
39626H198693L868419J636111l788463m703562m32411N94815l221701l634720
39618a482819J203699L018673j89841j45166M636586M504794k765755o166365
39610B613806j298441J262468m168218p582612k158059L443384K781970M021445
39602a084257J1630695J3460389J778744r484724o515991O12375l879179j2936044
$$ y = [-9225157, -11681464, -16721002, -22793855, -25736903, -22747008, -14959332, -6377635, -1931511, -4329322, -9795117, -10392985, -5205750, -4543364, -15735894, -29545934, -31343822, -22659988, -18389439, -22986060, -24421855, -15217839, -4676923, -3231451, -7440614, -9349363, -9813483, -12521351, -13720211, -8416873, -106611, 5130299, 8198693, 12067112, 13703223, 9914760, 5211198, 4778787, 5373602, 2151901, -1482819, -279120, 2739553, 2549712, 2404546, 7041132, 11545926, 8780171, 2613806, 1315365, 2577833, -1590385, -9172997, -11331056, -7887672, -5105702, -1084257, 10546438, 24006827, 25785571, 16300847, 9784856, 10397231, 6518052, -6417992]
39594f417992r002011N016883J0781570M450820j139951n80574m63917j829820
39586H15008J010816M551086o90456j0054880p870343O214796J3170339K601133
39578I747499j1897195j2952258j685792Q088899Q181011J715982l156973j219063
39570c177890M307936M825321j122321l989184J076730L723341m226723j0714070
39562i296860p92739J5364279J4272004l949795j4724688o589180M857956N825331
39554D966308K964922L956951K154158o521041j0901445l500193M273654Q68735
39546a737951n726912k488581O774662R731430N644495K240210J047697l34062
39538A5150988M96488M113860K427760q187045j5775104r283528K413725L958936
$$ y = [-6417992, -15420003, -10403120, 378450, 4829270, 3689319, 3108745, 2644828, 815008, 1825824, 6376910, 5686454, -4368426, -12238769, -6023973, 7146366, 9747499, -2149696, -15101954, -16787746, -8698847, -517836, 1198146, -1958827, -3177890, 1130046, 5955367, 4833046, 843862, 1920592, 5643933, 1417210, -9296860, -10089599, 5274680, 19546684, 15596889, 872201, -5716979, -859023, 4966308, 7931230, 11888181, 14042339, 7521298, -3380147, -6880340, -2606686, -1737951, -7464863, -9953444, -3178782, 6552648, 12197143, 14437353, 15485050, 15150988, 15647476, 19761336, 22189096, 14002051, -1773053, -11056581, -8642856, -4683920]
39530d683920j773941m80683P596224Q341307j188990p891841m880694j041719
39522f004257l661747o736348l347490K347457L037092l82544j964243P00010
39514a6012070N593307R081850P115737r90313q363772o344446L754419J1027673
39506D862385R066789K867330j009763l774392q777132j2380515p901904K920571
39498a4126631R130453L579437o843554q420270J848684J1052620O984630m504143
39490a298774p470742M68252M964081j181639n188204M551322J6665652J1964222
39482B3474170o501146j6661020r293341J392590K221156j008390J857424O724271
39474B205714L367190o070956r290057j793097P377140Q060614K93619p839860
$$ y = [-4683920, -6457861, -6938544, 657680, 8998987, 7809997, -81844, -4962538, -6004257, -9666004, -16402352, -19749842, -17402385, -14365293, -14747837, -16712080, -16012070, -10418763, -1336913, 5778824, 4788511, -3575261, -9919707, -6165288, 4862385, 13929174, 16796504, 15786741, 12012349, 3235217, -9145298, -17047202, -14126631, -4996178, -1416741, -8260295, -16680565, -14831881, -3779261, 3205369, -1298774, -8769516, -8301264, -3337183, -4518822, -9707026, -5155704, 11509948, 23474170, 16973024, 312004, -8981337, -7588747, -5367591, -6375981, -4518557, 2205714, 5572904, -498052, -9788109, -11581206, -4204066, 3856548, 4150167, -3689693]
39466c689693r163529l071140M960040Q412513N421244j26958l109758k018886
39458b386167O32707J541859L783j450992m25461J353404n7173m006057m451593
39449i245690J112084O416089M961049l37068k488753j729808l137918n449467
39441i899482k506146M215849N571331k16302l427871J186155M734751j450837
39433a792552j0233543q076552M807901J4744553J3303035N426734j392607n988308
39425A0798661q714400o843368m11067L851899J257511k518811O60996P942439
39417F023860Q759258J353282l775239j97150M215143L69659o699856n969108
39409D079849J101477K927750k693263n155977L91237M630499L81862m934172
$$ y = [-3689693, -12853222, -15924362, -10964322, -2551809, 2869435, 2742477, -367281, -2386167, -1753460, -211601, -207818, -1658810, -2084271, -730867, -788040, -4794097, -9245690, -8133606, -1717517, 3243532, 2906464, 417711, -1312097, -4450015, -9899482, -12405628, -8189779, -2618448, -2834750, -6262621, -5076466, -341715, -1792552, -12026095, -20102647, -15294746, -550193, 12752842, 18179576, 16786969, 10798661, 2084261, -4759107, -5170174, -1318275, -60764, -2579575, -1918579, 6023860, 14783118, 16136400, 12361161, 12164011, 16379154, 16748813, 10048957, 4079849, 5181326, 8109076, 5415813, 259836, 651073, 5281572, 5663434, 729262]
39401G29262k357760L128502J464988n472590p772327l383408J767914N718444
39393f176975J0274299J1578949L967257p323194j0098444k943534L022095J911993
39385D212446M21750M099117Q053087O588439K129484j065773l512420n730433
39377A5195697n128357k492210l174495o889940n394307L702237J0068248N090092
39369A0976965n222211j0017247q414646n417460o45019P708702J3338076Q543047
39361A0850207k309211p479548m677552k407328m864264o326167k345120L090532
39353a6468451M960932M334741M364260M678704L190073j93825l726221m927600
39345c787387j540548M925558P625558J767199o954220p890549O2259O852577
$$ y = [729262, -1628498, 1500004, 2964992, -2507598, -10279925, -13663333, -11895419, -6176975, 4097324, 15676273, 19643530, 12320336, 2221892, -721642, 2300453, 4212446, 4634196, 8733313, 16786400, 23374839, 25504323, 24438550, 20926130, 15195697, 10067340, 7575130, 4400635, -2489305, -7883612, -4181375, 5886873, 10976965, 5754754, -4262493, -12677139, -18094599, -18739618, -11030916, 2307160, 10850207, 8540996, 1061448, -3616104, -6023432, -10887696, -17213863, -19558983, -16468451, -11507519, -7172778, -2808518, 1870186, 5060259, 4866434, 1140213, -3787387, -5327935, -402377, 7223181, 8990380, 2036160, -5854389, -5792130, 1060447]
39337A060447O048749L118888M586363O689145K419350n323338p058552j606213
39329I934839J882710j508700m581333K52026P968476P554456j348615p370607
39321A2783252l840275K228986J856691k242232j100896N421447Q082955K706184
39313B5896112l153859q50528Q225765J6129230J8762205J8723736K0362352K5444260
39305A29539273L2214129L6487253L5191507L0203494K6434498K4714587J9324533
39298C34109274M736669j7140004l8052745n0004638n0084054m1404842l0563641
39291A11596019k2236169j5917198r795813o009428p557475j1437736j1265506
39284B7376694o613302k731917p89701K959491O929037L669572o285105j0908877
$$ y = [1060447, 7109196, 10228084, 14814447, 21503592, 23922942, 18599604, 11541052, 9934839, 11817549, 10308849, 5727516, 5979542, 13948018, 21502474, 20153859, 12783252, 8942977, 11171963, 13028654, 10786422, 9685526, 15106973, 23189928, 25896112, 22742253, 21891725, 30117490, 46246720, 65008925, 83732661, 104095013, 129539273, 161753402, 198240655, 233432162, 263635656, 290070154, 314784741, 334109274, 338845943, 321705939, 283653194, 233648556, 183564502, 142159660, 111596019, 89359850, 73442652, 63646839, 57637411, 50079936, 38642200, 27376694, 20763392, 18031475, 17241774, 20201265, 27130302, 30799874, 24514769, 13605892]
39276A3605892l911333M624701L768240j481456l01349M893413L368777m480351
39268B0086534p242635j098949N098015M631702J142769k95118k15360o7769R66088
39259B3005277K056558J087129P7946K453289M663749j68750r524184j2866234
39251A0784780p540992k114420j002546J818359Q691275J0895321L753351k581509
39243B2703619J684758R772397J0079359O520225J2234242K7008318L6680839
39236A26683757L5285566L3151685L9158381M7435818M8250916M2402254L6239245
39229D08607622K8488039J1483138j5974593m4164749o1544014o3961005n4746257
39222B08188181m0258268k7029455j9608444j7676964j6211940j1179347m897807
$$ y = [13605892, 9694559, 14319260, 18087500, 16606044, 16304695, 21198108, 24566885, 20086534, 12843899, 11744950, 16842965, 21474667, 22617436, 22322318, 22106958, 22039189, 23005277, 25061835, 26148964, 26226910, 28680199, 33343948, 33175198, 23651014, 10784780, 3243788, 1129368, 126822, 1945181, 10636456, 21531777, 25285128, 22703619, 24388377, 34160774, 44240133, 50760358, 62994600, 90002918, 126683757, 161969323, 195121008, 234279389, 281715207, 329966123, 372368377, 408607622, 437095661, 448578799, 432604206, 388439457, 326895443, 262934438, 208188181, 167929913, 140900458, 121292014, 103615050, 87403110, 76223763, 71325956]
39215G1325956l268493p449471j1430453r652108m226416j510356l417079n958446
39207B4413134n526365k564700Q96115L295487K774122j435041n931880n740455
39199A0180417j390800R81589j404275l599820o73364M489686N568305J971658
39191A6123396j216467q24306J391848K663125K173683k543l738710p906183j0519529
39182a855686j0407362p958553m487882j320074J249217M079560O961399P075944
39174f663437K586347k803430l241867J009945M022222L914314N230782Q682924
39166A2737800O691120m269862j3830063r720730M288509J2563337Q228558k60710
39158A6427959l297540j052230J793474L201942K221605j898568n134285o56146
$$ y = [71325956, 68057463, 60607992, 49177539, 39525431, 35299015, 33788659, 30371580, 24413134, 18886769, 16322069, 17218184, 20513671, 23287793, 21852752, 15920872, 10180417, 8789617, 9771206, 8366931, 4767111, 4093747, 8583433, 14151738, 16123396, 14906929, 14082623, 15474471, 18137596, 20311279, 20308736, 16570026, 8663843, -1855686, -12263048, -20221601, -24709483, -26029557, -24780340, -20700780, -13739381, -6663437, -4077090, -6880520, -10122387, -9112442, -5090220, -1175906, 4054876, 12737800, 19428920, 15159058, 1328995, -8391735, -4103226, 8460111, 16688669, 16427959, 13130419, 12078189, 13871663, 17073605, 19295210, 17396642, 12262357, 11606211]
39150A1606211R923272J4454666N560593q009921j2411074o207061Q96936K842404
39142A8656026J640144r24327n862702j0202085p133498L154644J0250049O457539
39134A6035790k562442o167018l553091k727733o443908p644095j092447P360993
39126f793951Q158431Q86883n777345n476506k37692M776909P223390O648510
39118I408629K538213l317964o030342l185492J141700J818606k10791o81955
39110A480604L95220k59903j988178j037066J318350n57378n957991o327757J133753
39101a1800346O560412J278242p955314p828642K248005R684121O410569k218687
39093c621640o920013m814018J242601O699258P119893K120491j790513J078470
$$ y = [11606211, 21529483, 35984149, 41544742, 33534821, 21123747, 14916686, 15813622, 18656026, 20296170, 19371843, 13509141, 3307056, -3826442, -671798, 9578251, 16035790, 13473348, 7306330, 3753239, 1025506, -5418402, -13062497, -14154944, -6793951, 1364480, 2251363, -3525982, -9002488, -9240180, -4463271, 2760119, 9408629, 11946842, 8628878, 2598536, -586956, 554744, 2373350, 2162559, 1480604, 1875824, 1615921, -372257, -1409323, -90973, -648351, -6606342, -12934099, -11800346, -5239934, -3961692, -11917006, -19745648, -17497643, -7813522, -1402953, -3621640, -10541653, -15355671, -14113070, -7413812, -293919, 1826572, 36059, 1114529]
39085A114529N357880J073826r110036j0908162m95630P401358J653428p110042
39077a1022849k879752J0321593J4779342O020717k793476k692068M03296n85306
39069A1551497l302456m021926m602676n541393k255283N355499Q897223L952867
39061A0033352j947502j245500J972237O74107k566179j769582L82498j888262
39053C645169n072600k209637K583154l98700p800504n736798O805612J3132789
39045D948485L892187p851217p007250O45231K33941o488450n025956N279582
39037a1373447P711937m558577j4733616o450074J0567123J3457152r87340j2264180
39029a8631022n598239Q898547J2798012M438422k601976o43258L620480J747591
$$ y = [1114529, 6472409, 7546235, -1563801, -12471963, -12967593, -5566235, -3912807, -11022849, -13902601, -3581008, 11198334, 17219051, 14425575, 11733507, 12136803, 11551497, 8249041, 4227115, -375561, -5916954, -8172237, -2816738, 6080485, 10033352, 8085850, 6840350, 8812587, 9486694, 6920515, 5150933, 5533431, 3645169, -1427431, -3637068, -1053914, -1452614, -9253118, -14989916, -8184304, 4948485, 8840672, 989455, -6017795, -5372564, -5138623, -11627073, -16653029, -11373447, -3661510, -8220087, -22953703, -29403777, -18836654, -5379502, -6366842, -18631022, -24229261, -15330714, -2532702, 1905720, -696256, -1339514, 2280966, 4028557]
39021D028557m473125p180258l216434L170512N892191K713509l068869n302695
39013g436612r69779N766035P489451K142464m484091n546836k66985O323245
39005C016892Q549522M567590k178808n870756m687514l166561n237300p161601
38997a2168536k870149N271101Q542709M765238N45860p78739l450164p849842
38989g992522n865860M977731J3039387Q673109M15886K114071R916501P654147
38981C2932450o622411j5809061q799957L702465N372435m108805j2030902j0633245
38973a5997031l654465J965057L729173L043292J633698L11334K80849L652877
38965e035216R905781J2298468L767999j0761852j5467402l765592R870798Q399061
$$ y = [4028557, -444568, -7624826, -10841260, -7670748, -1778557, 934952, -2133917, -7436612, -8406391, -2640356, 4849095, 6991559, 2507468, -3039368, -3306353, 3016892, 11566414, 16134004, 13955196, 8084440, 3396926, 230365, -5006935, -12168536, -15038685, -9767584, -1224875, 3540363, 4086223, 3307484, -142680, -7992522, -13858382, -8880651, 4158736, 12831845, 13247731, 15361802, 25278303, 32932450, 26310039, 10500978, 1701021, 5403486, 10775921, 6667116, -5363786, -15997031, -19651496, -17686439, -13957266, -10913974, -9280276, -8968942, -8688093, -5035216, 4870565, 17169033, 20937032, 10175180, -5292222, -9057814, 812984, 9212045]
38957I212045l646810p959758l74443N581755K726378m05121J695844J532495
38949H362385m418839n572362M071629J1464225L331689j1573812j4847407n159717
38941a4342209L331215L811481K060877J829310K64495k702569l717913m333970
38933a3799283p701272q220968J899908J6131841J8586760P395549j921783m36504
38925A1934248K026020m315241j2389032j0673190j627915L963248L701334L188576
38917d191952L904552K444512p64321j672575l04324j9081j9244L509155Q818812
38908A1705534Q742109R27892q118626j1359136r009981n874245m440588l075298
38900b0502339N91847N841323Q050919K887649p001812j1713927m418612R078735
$$ y = [9212045, 5565235, -2394523, -2768966, 2812789, 5539167, 5134046, 6829890, 8362385, 3943546, -1628816, 2442813, 13907038, 17238727, 5664915, -9182492, -14342209, -11010994, -7199513, -5138636, -3309326, -3044831, -5747400, -9465313, -13799283, -21500555, -29721523, -27821615, -11689774, 6896986, 14292535, 12370752, 11934248, 13960268, 9645027, -2744005, -13417195, -15045110, -11081862, -7380528, -4191952, -287400, 2157112, 1392791, -279784, -584108, -603189, -622433, 2886722, 11705534, 20447643, 21375535, 13256909, 1897773, -7112208, -12986453, -17427041, -20502339, -19910492, -14069169, -6018250, -3130601, -10132413, -21846340, -26264952, -17186217]
38892a7186217J5811918J0829566J875677k228175j996545k462421l319993n71681
38884G52129M374395N036439J58941l495152j728957L28162k598171n812939k018244
38875e003397M774110L498814n660761r092432l41978Q328537L622790q381497
38867h255814j1297723k489221N479887N661971M570334O904160O416083j329589
38859E660088q413610n954142K030340N824211M818071M611753M082107k319195
38851A0339623j0876998j0248282O74578Q236180L096308n727210m223873N897539
38843b832135J0203494K605949p124284q326824k833458J123073J507294K078697
38835c598194L157458R85879l686954m044010K635747R170618P945813K132922
$$ y = [-17186217, -1374299, 9455267, 11330944, 9102769, 7106224, 4643803, 1323810, 752129, 5126524, 10162963, 10321904, 6826752, 5097795, 5425957, 2827786, -2985153, -5003397, -229287, 3269527, -2391234, -11483666, -11825644, -3497107, 125683, -8255814, -19553537, -22042758, -16562871, -10900900, -6330566, 573594, 6989677, 5660088, -2753522, -8707664, -6677324, -853113, 3964958, 8576711, 12658818, 10339623, -537375, -10785657, -10111079, -1874899, 1221409, -4505801, -8729674, -2832135, 7371359, 9977308, 2853024, -5473800, -8307258, -7184185, -5676891, -3598194, -440736, 545143, -3141811, -7185821, -4550074, 4620544, 12566357, 14699279]
38827A4699279P56940M331584L476840o185248j5135242j1589166K123867J1749178
38819D228032Q876752J4581l889936j446693J55029k835443n750957l561348R88305
38810c221678J319981k875243m520543O50452P054005O216573j351289o375432
38802c103174l545593J147051m63577n709296l718608Q224579J7586478J1361653
38794B1779513n339633j3565588m830767P015915M523199q772783j3182208j185102
38786a3557454J1681990R289490k957604q546015m444539j352627k602485Q91402
38778a1597842J1432748J5841308N155668q758487r058145J139827M436372l372206
38770E219243p543795J377210J2335321J0455222j827554j0409223r401045m509826
$$ y = [14699279, 15456219, 19787803, 23264643, 17079395, 1944153, -9645013, -7521146, 4228032, 13104784, 13119365, 9229429, 7782736, 7937765, 5102322, -648635, -4209983, -3221678, -1901697, -4776940, -9297483, -8647031, -1593026, 4623547, 3272258, -3103174, -6648767, -5501716, -5965293, -11674589, -15393197, -7168618, 10417860, 21779513, 16439880, 2874292, -1956475, 5059440, 9582639, 809856, -12372352, -13557454, -1875464, 7414026, 4456422, -4089593, -8534132, -9886759, -12489244, -11597842, -165094, 15676214, 20831882, 12073395, 3015250, 4155077, 8591449, 5219243, -2324552, -947342, 11387979, 21843201, 20015647, 9606424, 205379, -4304447]
38762d304447l39491M144282P487380L942570o386039j3492231r077526K413600
38754a5611902R399095O884927J62728l268737j310888K579849L843697J470007
38746D148776o12990J888926P010045P676702J473674m741595l922296R88184
38738A3909426J533066l776939p983858o312477j800972Q67949J391243J537660
38730f34902J548489J284888J239720N46686k383046n899870o023906k701353
38722a3023294k79670q9013J526628N035568M435460k795319q609006m278458
38714a8077104O697276J2776395Q778608n11556q426912j0895840n321071O306269
38706h673935J3810781P567531p454290j4721072o471055O279299Q670861Q51612
$$ y = [-4304447, -4643938, -499656, 6987724, 10930294, 4544255, -8947976, -18025502, -15611902, -6212807, 672120, 834848, -2433889, -3744777, -1164928, 2678769, 4148776, 3535786, 5424712, 12434757, 20111459, 21585133, 16843538, 12921242, 13909426, 15442492, 11665553, 3681695, -2630782, -4431754, -3563805, -2172562, -634902, 913587, 2198475, 3438195, 3984881, 1601835, -4298035, -10321941, -13023294, -13302964, -13391977, -11865349, -6829781, -2394321, -5189640, -13798646, -18077104, -11379828, 1396567, 10175175, 9663619, 1236707, -9659133, -14980204, -8673935, 5136846, 12704377, 5250087, -9470985, -15942040, -9662741, -991880, -140268]
38698a40268m461782O0991P710189P505000j945927j0923968r825832L40641R921918
38689a759038J1699373O909922M24557m969926p176422l526132L871740O460689
38681A1934763p352o928912l587750O418516R669319K666871m462127n121409
38673A0581919m605858p098815o618277J217839Q322978N000774m890891r354661
38665g444992m471702L320822P349838N234033k508354j0003303o782923Q729332
38657f577249K0277285J1032322j1204548k0231590n873783J1896223J0829286
38650A0147946l796050r674439l93138P857672K613074o749590m830597N730593
38642I05471Q219905k700669j2186016o141796Q741394J4574734O442004l639558
$$ y = [-140268, -4602050, -4541059, 3169130, 10674130, 8728203, -2195765, -12021597, -11680956, -1759038, 9940335, 16850257, 17274814, 12304888, 5128466, 1602334, 5474074, 11934763, 11927411, 4998499, 1410749, 7829265, 17498584, 20165455, 15703328, 10581919, 5976061, -1122754, -7741031, -6523192, 1799786, 6800560, 1909669, -7444992, -11916694, -8595872, -1246034, 3987999, 1479645, -8523658, -15306581, -6577249, 13700036, 24732358, 13527810, -6703780, -12577563, -681340, 10147946, 6351896, -3322543, -3715681, 4141991, 6755065, 5475, -4825122, 905471, 9125376, 6424707, -5761309, -11903105, -3161711, 11413023, 17855027, 14215469]
38634A4215469n482910k279995j068083k043292k768659m481748p175250n353531
38626a6437999L227116J0245866P177343j450443m699740j555806P5351j601919
38618e020231n36096L443865J909359p319795j3819817r124393J290065P293528
38610b1883515P803670P695892P279282L598816j387127k423456M74380K041660
38602C199602K38246j029823J471142N116215M496486j842472q442302p518526
38594d311432J523156Q591564M057488o853403q681852K627442J1958360N500001
38586A4411324r317745j4354266n536693M672582O816812L959958J397181j082583
38578I66570l599954l095466l7577L74883k262229j404574M464990O761463K65558
$$ y = [14215469, 8732559, 6452564, 5384481, 3341189, 572530, -3909218, -11084468, -16437999, -13210883, -2965017, 4212326, 2761883, -1937857, -3493663, -3418312, -5020231, -5556327, -2112462, -203103, -7522898, -21342715, -30467108, -29177043, -21883515, -14079845, -6383953, 895329, 4494145, 3107018, 683562, 1157942, 3199602, 3437848, 2408025, 3879167, 8995382, 13491868, 11649396, 3207094, -4311432, -2788276, 5803288, 9860776, 3007373, -5674479, -3047037, 8911323, 14411324, 5093579, -9260687, -14797380, -10124798, -3307986, 651972, 2049153, 966570, -2633384, -5728850, -5766427, -5391544, -7653773, -9058347, -4593357, 2168106, 2433664]
38569B433664o700420m157756M038768O424739J256004k651384k91420M121710
38561D473905N769227M473487P85671n055181q951474n373677L708708Q866577
38553H697243M891750l069948p461484o990986m671042k373097p80349p15883
38545a2473796j270583J93170L756982N904058M634889J999643q7430k201964
38537D54969l680306j665845L143754M884704O14256m500611m507627j128326
38529f385032M2140j555630j644801J870632O660921R260366P386130J249646
38521A6884372m737038m982971l84733J513624k413455n451661j988981K542924
38513I82081M90490m815956m570414N55224K024135j719891l444584l11677K396674
$$ y = [2433664, -4266756, -8424512, -4385744, 2038995, 3294999, 643615, 352195, 4473905, 10243132, 14716619, 15502290, 10447109, 1495635, -3878042, -169334, 8697243, 13588993, 10519045, 3057561, -3933425, -8604467, -10977564, -11757913, -12473796, -13744379, -13551209, -9794227, -3890169, 744720, 2744363, 2656933, 454969, -3225337, -4891182, -1747428, 3137276, 3751532, -749079, -5256706, -6385032, -6342892, -7898522, -9543323, -7672691, -1011770, 8248596, 15634726, 16884372, 12147334, 7164363, 6779630, 8293254, 5879799, 428138, -1560843, 982081, 1472571, -3343385, -7913799, -7358575, -5334440, -7054331, -10498915, -10810592, -8413918]
38504h413918K298570L467362N941473K923413o285301j0815349l092061Q831894
38496e143917J1933250N254574j816900l716362k657151r91445K073947O022513
38488A0958509P505063M624681p30063n335299p121426n656722k417522l23608
38480A503613j259060l929345m814929j400379M802344Q224154M581638k548085
38472E159951m450830O66907L952691m27526m775063l47310O080813J998257q184858
38463c26968p567994N473629J2721221M552966n620278m520214J085750M84128
38455F282240j042128N115596J1183806M778157q600360j3647255r171835n360693
38447a0462472k936032M894527J3362868J0405631n37535l295146L608467L776456
$$ y = [-8413918, -6115348, -2647986, 3293487, 6216900, -68401, -10883750, -13975811, -5143917, 6789333, 12043907, 10227007, 6510645, 3853494, 2862049, 4935996, 10958509, 18463572, 23088253, 22358190, 17022891, 9901465, 4244743, 1827221, 1503613, 244553, -3684792, -8499721, -9900100, -5097756, 3126398, 7708036, 5159951, 709121, 1376028, 5328719, 4901193, 126130, -221180, 5859633, 7857890, -326968, -7894962, -2421333, 10299888, 14852854, 9232576, 4712362, 5798112, 6282240, 5240112, 10355708, 21539514, 26317671, 17717311, 4070056, -5101779, -10462472, -13398504, -8503977, 4858891, 15264522, 14726987, 11431841, 15040308, 18816764]
38439A8816764q166275j6018301q797435J709964J714731l500767k857200P71500
38431a6327019o51215l171898J533895R385876J0056895M329296J075247J210152
38423G441229j292753m994997j639977Q606582J4771803R957183p97898r193437
38415B2857735j2001974r342777k590188L632350L875642j196459n185611m707876
38407d659158k869043k700905k308451Q91709M920769N308144Q79011m337861
38399d875785m830906M92174N923907M546640k584618o032275L12495J0145135
38391C096767J1881123L220428o283419p061647K13242O913914N922027k193859
38383A5708576j0481987j2071022n997281K840551Q545037P964001J538246n973779
$$ y = [18816764, 10650489, -5367812, -14165247, -12455283, -10740552, -14241319, -17098519, -16327019, -16978234, -20150132, -18616237, -9230361, 826534, 5155830, 6231077, 7441229, 6148476, 1153479, -486498, 8120084, 22891887, 32849070, 32051172, 22857735, 10855761, 1512984, -1077204, 2555146, 6430788, 5234329, 48718, -4659158, -7528201, -10229106, -12537557, -11645848, -6725079, -1416935, -537924, -4875785, -9706691, -9214517, -3290610, 1256030, -1328588, -7360863, -7048368, 3096767, 14977890, 18198318, 11914899, 4853252, 5066494, 11980408, 17902435, 15708576, 5226589, -6844433, -12841714, -10001163, -1456126, 6507875, 8046121, 2072342]
38375B072342o913031J629487J1508122J1344417J685805n365053l905992k000622
38367A0055475o458389j0193385m295656N516455O851990J39422k969528J396583
38359D2967N015193K632227j072787j915456k310373l371245j242989M028755
38351A806292N319086k89435n195248k417348L922482N635041K006868k026054
38343H761684l900771l335308O18805N701959M631140m998407j3139855q687271
38335a4348024L982100R642413L179827m059273j507827O053334O915314o20003
38327I237861p148394n985824j227238m99161m203860n619817n37729O762436
38319i221726Q657184L299223l852494o734424l985712K245962Q931465J2064575
$$ y = [2072342, -4840689, -3211202, 8296920, 19641337, 21327142, 15962089, 12056097, 10055475, 3597086, -6596299, -10891955, -5375500, 1476490, 1615912, -1353616, 42967, 5058160, 7690387, 6617600, 4702144, 2391771, -979474, -2222463, 1806292, 7125378, 6835943, 1640695, -776653, 3145829, 8780870, 10787738, 8761684, 4860913, 1525605, 2144410, 7846369, 12477509, 7479102, -5660753, -14348024, -10365924, -723511, 2456316, -1602957, -3110784, 2942550, 9857864, 9237861, 2089467, -3896357, -5123595, -5622756, -9826616, -15446433, -15984162, -9221726, -564542, 2734681, -1117813, -7852237, -11837949, -9591987, -660522, 11404053]
38311A1404053P710062l291306j3340582j4232954n283082O330293J2612522J0848360
38303A2757366M140760k021474m273328l662974k942243k125746L88660K504901
38295D765922l55331o487220o674182K897084J1832648P534836p006760j6219843
38287i712846j1806276p23466P103941R634274Q712840M352708j963115n163009
38279D35051l043588M04240J933793L045734L306375k027198j1570985j3869159
38271b1385737l086497R091225Q738961M99319p47842N440311N467637l675765
38263C41612q253474q96431O954496M461466j120548J840236R239594Q582566
38255B1149517o16521p517603p313727n268976m812458k943323J715867N186056
$$ y = [11404053, 19114115, 15822809, 2482227, -11750727, -17033809, -10703516, 1909006, 12757366, 16898126, 14876652, 10603324, 6940350, 3998107, 1872361, 2261021, 4765922, 4410591, -2076629, -8750811, -5853727, 5978921, 13513757, 6506997, -9712846, -21519122, -22242588, -15138647, -5504373, 3208467, 7561175, 5598060, 435051, -2608537, -2204297, -270504, 2775230, 6081605, 4054407, -7516578, -21385737, -24472234, -15381009, -6642048, -6142729, -6890571, -1450260, 4017377, 341612, -7911862, -8808293, -1853797, 2607669, 1487121, 3327357, 12566951, 21149517, 20532996, 13015393, 5701666, 432690, -4379768, -7323091, -5607224, -421168]
38247d21168M078614m97786n040386n518094L02457P769796P156984l239268j1526348
38238f935199p886475P16870K390863J58419M918143J2900699Q863943p310464
38230G816799j6285767p327842O192005P928632N76635l656501k171124K77543
38222f649620L203972P496671Q018253O31846q617301j1299356q613486o588097
38214b2417118m811633M64541O916552R441453Q601695P056150K678386n424303
38206B505723r564014k973203P713535J0409164M280512k065341m814837n905766
38198d14227m081891K214734O515187K296047l937776j865758L792111M35530
38190D953957q710338p903714L180776O634556l196480q571985J937262J3244270
$$ y = [-421168, 3657446, 3159660, -1880726, -7398820, -7096363, 673433, 7830417, 4591149, -6935199, -14821674, -14104804, -11713941, -11555522, -6637379, 6263320, 15127263, 7816799, -8468968, -15796810, -9604805, -1676173, -1099538, -4756039, -6927163, -6649620, -3445648, 4051023, 12069276, 12701122, 4083821, -7215535, -15829021, -22417118, -27228751, -26764210, -19847658, -10406205, -1804510, 5251640, 7930026, 2505723, -7058291, -10031494, -2317959, 8091205, 12371717, 10306376, 5491539, -414227, -4496118, -2281384, 4233803, 6529850, 2592074, 726316, 4518427, 4953957, -3756381, -11660095, -8479319, -1844763, -5041243, -13613228, -11675966, 1568304]
38182A568304Q328096m105395m928709M871843Q683390J698869n251703n682540
38174E182155m020920l210307p45652K455257J899618j172909j369925K65948
38166g16735j664233m868790j590933O497102Q304883P31810o116216n094673
38158d517785j754405k276113k563587K679973Q589833P126681o9815m590878
38150B623904l642988j649663j506681j486366l23001P61206J582415L607691
38142c3483N986419M949149r77898p641712r223037m623415J713969N351772O546991
38133B048755P813164Q102336L557377m550805p716810r54709P945409P089408
38125B3334125k921022r242007m571575L813821O006457K292211j377401l613836
$$ y = [1568304, 9896400, 5791005, 862296, 5734139, 14417529, 16116398, 10864695, 5182155, 1161235, -2049072, -2794724, -339467, 1560151, 387242, -982683, -716735, -2380968, -7249758, -8840691, -2343589, 5961294, 6693104, 576888, -4517785, -6272190, -8548303, -11111890, -8431917, 157916, 7284597, 7214782, 2623904, -1019084, -2668747, -4175428, -5661794, -5984795, -5223589, -3641174, -33483, 5952936, 10902085, 9924187, 2282475, -6940562, -11563977, -9850008, -4498236, 2048755, 9861919, 17964255, 21521632, 16970827, 9254017, 8299308, 16244717, 23334125, 20413103, 11171096, 6599521, 10413342, 16419799, 18712010, 17334609, 13720773]
38117A3720773n936722o200523k177923J553801r08552o176101n521083Q46239
38109a0800091L218362j822078m908303J432165R714414P443268m267924j1232039
38101a1222226n074816O281359R840941L875268j772751J88920N276599M143537
38093A1536831m411659j1754554j0748868m010742J663240M496582O378579O055299
38085g95292J165557m479429m392043o41536j937038q105419p591134L696585
38077b3079749J2352812O344476n525116o340872L367193Q473346M266848J093732
38069I52670L310801J863211o697541j0907154l543708M655086K582299k433189
38061a0217525J805105R727887O469208o158994j0548519k19325J0802082R340943
$$ y = [13720773, 7784051, 1583528, -594395, 959406, 50854, -6125247, -11646330, -10800091, -7581729, -9403807, -14312110, -12879945, -3165531, 4277737, 9813, -11222226, -16297042, -10015683, -174742, 3700526, 1927775, 2116695, 7393294, 11536831, 7125172, -4629382, -15378250, -19388992, -17725752, -13229170, -6850591, -795292, 370265, -4109164, -8501207, -9142743, -11079781, -19185200, -26776334, -23079749, -10726937, -4382461, -9907577, -16248449, -12881256, -4407910, -141062, 952670, 4263471, 6126682, -570859, -11478013, -15021721, -10366635, -7784336, -10217525, -8412420, 1315467, 7784675, 1625681, -8922838, -9142163, 1659919, 11000862]
38053A1000862p5966n772153n312011l837570l598137k725890n39468J284737
38045i575596P58760l218899q551328q655575Q25599J3111298J5301679N084216
38037E080154m893042l762962L449288M892669o31038l967600j124415P08650
38029b48296n091119j3346871j2883375j681678R084802Q473927j97974m041153
38021a9931737J416462O532851L225032j867630J801818J0594067J1107568P26077
38013A3604508q856791r943190q021297q439474o233129K809821J0805215P945104
38005f329233j857227n753497L97309P956424Q138116J746721l911636l298246
37997b911269K150299M883974p77382j0268633j2745793n394647K431405K964768
$$ y = [11000862, 10924896, 5152743, -159268, -3996838, -7594975, -10320865, -10860333, -9575596, -8816836, -12035735, -20587063, -29242638, -28417039, -15305741, -4062, 5080154, 187112, -3575850, -126562, 4766107, 4135069, 167469, -956946, -248296, -5339415, -18686286, -31569661, -33251339, -24166537, -15692610, -15890584, -19931737, -18515275, -11982424, -8757392, -10625022, -8823204, 1770863, 12878431, 13604508, 4747717, -5195473, -13216770, -21656244, -27889373, -25079552, -14274337, -6329233, -8186460, -13939957, -13542648, -5586224, 2551892, 4298613, 386977, -2911269, -760970, 4123004, 3345622, -6923011, -19668804, -25063451, -22632046, -19667278]
37989a9667278N27714K218594N379945L234159k151807k624773K888219P299036
37981b896191O200309J677752l289753o349374l629484N089616J0703895M326151
37973A1832921q085587j1689563m203689R02802l809821p711777K18586J2362434
37965a0183694J2663622n6532j1029479j0054990k267136K842457L847463M709010
37957i529279O117794N256947J559041k111666l497839k877627j086967J431566
37949d738030L115599J698545k317977m836413k947879J035520K638816R00079
37941e451740j675908l361586l848155j782609L643118Q594305P279472K62707
37933C659604m663283k303442L431304N697449L568116J129553O17820L80714
$$ y = [-19667278, -19139564, -16920970, -11541025, -8306866, -10458673, -13083446, -10195227, -2896191, 3304118, 4981870, 1692117, -4657257, -8286741, -3197125, 7506770, 11832921, 3747334, -7942229, -12145918, -11243116, -15052937, -22764714, -22546128, -10183694, 2479928, 2423396, -8606083, -18661073, -20928209, -18085752, -14238289, -9529279, -3411485, 1845462, 3404503, 1292837, -2205002, -5082629, -6169596, -4738030, -1622431, 76114, -2241863, -7078276, -10026155, -8990635, -6351819, -5451740, -7127648, -10489234, -14337389, -16119998, -12476880, -3882575, 3396897, 3659604, -1003679, -3307121, 124183, 5821632, 9389748, 10519301, 11137121, 11517835]
37925A1517835j614759n101567p746829o822836j837079M010679O669044N388987
37917D463475K112923j739280m542014l003097L070560O832337K524589m283375
37909E436118l677785K595567L503338k457200m346617J892586N562163n32837
37901G975333p436307m926499K722342O158768N555886M969251K037084n119024
37893A1936834r688548o426247j551966j473279j419088L028015M390939k828388
37885d031728q402034k585942N457589L556738q59663M841350J2550449O548468
37877A7075227o262335o664855K573199K384287o134600l292163J0483929J1553533
37869B1716222n270406j5464459n785969N364815K541467k217966L120237O847659
$$ y = [11517835, 9903076, 4801509, -2945320, -9768156, -11605235, -7594556, -925512, 4463475, 6576398, 4837118, 295104, -2707993, 362567, 7194904, 9719493, 5436118, 1758333, 4353900, 7857238, 5400038, 1053421, 2946007, 8508170, 7975333, 539026, -4387473, -1665131, 4493637, 10049523, 15018774, 17055858, 11936834, 2248286, -4177961, -5729927, -7203206, -8622294, -5594279, -1203340, -4031728, -12433762, -15019704, -9562115, -6005377, -6865040, -2023690, 10526759, 17075227, 10812892, 4148037, 6721236, 9105523, 2970923, -321240, 10162689, 21716222, 16445816, 981357, -4804612, 560203, 3101670, 883704, 4003941, 10851600]
37861A0851600k120256j1082549o828383N0021l371778p280500P13876R569421
37853i498548M461203m554998l74069R209537N432384p034320q087192L406722
37845g039281J0492755P662032L862624R92305n600815r483763j004718J0541642
37837A0422781P409110o549657j1294364m041947j141994o669895o373709L693159
37829a4546516Q828912K402376k870996J742342P541890O312166K621914Q69946
37821A2902034k088732n198813j982564L729587m4928j0322457r345094M948109
37813g402858J1279180j264858j3883894p228139R072141J3248055L047828o712138
37805A55317p377470j725715N499813R207212L664891q560937j5002457r335050
$$ y = [10851600, 8731344, -2351205, -9179588, -9129567, -12501345, -19781845, -19067969, -9498548, -5037345, -9592343, -9966412, -756875, 4675509, -2358811, -10446003, -7039281, 3453474, 11115506, 14978130, 15970435, 10369620, 885857, -118861, 10422781, 17831891, 11282234, -12130, -4054077, -5196071, -11865966, -18239675, -14546516, -5717604, -3315228, -6186224, -4443882, 3098008, 9410174, 12032088, 12902034, 10813302, 5614489, 3631925, 7361512, 7316584, -3005873, -12350967, -7402858, 3876322, 2611464, -11272430, -18500569, -9428428, 3819627, 6867455, 155317, -7222153, -8947868, -3448055, 5759157, 9424048, 863111, -14139346, -23474396]
37797b3474396o2225M177850O275892R260061P011414k422501p717209j780790
37789h731904M163987j180616q667620l560748Q698251J0566998L60952o685925
37781e036625k908101L413398M245834J564425o91869k382136k908228n22030
37773e225332K976117M112939L672594M180992L805623j59440m681614n277115
37765C404764l628189l404716k444931K478330O994162M644822j849186m324236
37757A870820k057819j479506m149277m212317J546667Q266794Q821868J095649
37749I702879r688302j3642421n268243P514233J0052646O67877n309961K208108
37741c763184J2185529R299622k826162r007135o152808l836544n043625k844867
$$ y = [-23474396, -23536621, -19358771, -13082879, -3822818, 3188596, 766095, -6951114, -8731904, -4567917, -5748533, -14416153, -17976901, -9278650, 1288348, 1649300, -5036625, -7944726, -4531328, -285494, 1278931, 587062, -1795074, -4703302, -5225332, -2249215, 1863724, 5536318, 9717310, 13522933, 13363493, 8681879, 3404764, -223425, -3628141, -6073072, -3594742, 3399420, 8044242, 6195056, 1870820, -186999, -1666505, -5815782, -10028099, -8481432, -214638, 8607230, 9702879, 14577, -13627844, -18896087, -11381854, -1329208, -661331, -5971292, -3763184, 8422345, 17721967, 14895805, 5888670, -264138, -4100682, -9144307, -11989174]
37733a1989174L715999N672361q10493p572421o634640p4970N399824O289111
37725f004403K709348k533530m424143j102804J990518n52196m746158k673807
37717a7337175M699392Q462338M416526k723722o440193l248329O339400J4806441
37709H974678J0997234m578243j4500222o321857P410899O639881m790129n531055
37701a698814P389167J2744690J80015j1945249n555075R116487J0485531k476248
37693A8240504j2609460j1160308n176815j267587K750126Q268322R666540K659667
37685A1370989p384916j0378554k947014P670650J1136112M499498n522158j0313947
37677a869340p295105K42117P312912R073245L183461n584465p677502o89992
$$ y = [-11989174, -8273175, -2600814, -3411307, -10983728, -17618368, -17693338, -12293514, -6004403, -3295055, -5828585, -10252728, -11355532, -9365014, -9917210, -14663368, -17337175, -12637783, -4175445, 241081, -2482641, -8922834, -12171163, -5831763, 8974678, 19971912, 15393669, 893447, -5428410, 1982489, 8622370, 3832241, -1698814, 5690353, 18435043, 18615058, 6669809, 1114734, 10231221, 20716752, 18240504, 5631044, -5529264, -10706079, -11973666, -9223540, -955218, 8711322, 11370989, 3986073, -6392481, -9339495, -1668845, 9467267, 13966765, 8444607, -1869340, -9164445, -8922328, -1609416, 7463829, 10647290, 5062825, -2614677, -3304669]
37669c304669N960808M101689j451824j972499Q64622J55310k452934p58368K415074
37660C557209l05837n446857l010039M775623N339713k318729m389415N006148
37652C207816J3618097R884544j576801r866424j1447282q178364k762767o97840
37644g819021n523761r145500j59871J5503488J8519869N222199n616417k301918
37636H679068L034661j998775r239914p302043k058774k794715l564485L014506
37628a2230471P615610L29841p708223j395324J0132635P130772o393737q631255
37620a1150152L057577Q632221K71375o118882n29911M836079n55990o653673
37612h211356j507440P784623P890015Q82648j831251J070308J534931k597614
$$ y = [-3304669, 2656139, 6757828, 5306004, 3333505, 4198127, 4353437, 1900503, 1142135, 3557209, 3251372, -2195485, -5205524, -429901, 4909812, 2591083, -1798332, 3207816, 16825913, 26710457, 25133656, 15267232, 3819950, -4358414, -7121181, -7819021, -13342782, -22488282, -22648153, -7144665, 11375204, 16597403, 10980986, 8679068, 11713729, 9714954, 475040, -6827003, -8885777, -11680492, -15244977, -12230471, -4614861, -4285020, -11993243, -13388567, -3255932, 3874840, -2518897, -11150152, -8092575, 539646, 811021, -5307861, -5837772, -1001693, -1557683, -8211356, -9718796, -1934173, 5955842, 6838490, 5007239, 6077547, 7612478, 5014864]
37604E014864n410217l938310j533480p54656l79538L68596J50544j442814k814265
37595a0739276k586621p14453K220382N099564O054883L566595j684713n971777
37587d755416m527704L236963J0593466R487562R29409n337909l712381O24204
37579F538194J463111Q18795K365923K683644k379649q121071p375604k291393
37571f298050K8788k85863J555317M097064K895943J268943M836611Q180438J819982
37562A8099173r023309r640492o08740J590526o935314q684888N879058J9372295
37554A0048309J3028616m072602r818294k429956J485995l395946m930833K483539
37546B398828P567680J843051o232117n928778j274963k491605q126268p804249
$$ y = [5014864, -395353, -4333663, -5867143, -6621799, -7001337, -6632741, -6482197, -7925011, -10739276, -13325897, -14040350, -11819968, -6720404, -665521, 2901074, 1216361, -4755416, -9283120, -6046157, 4547309, 14034871, 14964280, 9626371, 5913990, 6538194, 8001305, 8820100, 11186023, 13869667, 11490018, 3368947, -4006657, -6298050, -6269262, -6555125, -4999808, -902744, 1993199, 3262142, 8098753, 16279191, 18099173, 9075864, -564628, -1173368, 417158, -6518156, -15203044, -9323986, 10048309, 23076925, 19004323, 9186029, 6756073, 8242068, 4846122, -84711, 2398828, 9966508, 11809559, 5577442, -351336, -1626299, -4117904, -12244172, -20048421]
37538b0048421J37249N194908M30709p110383o150813L784264J2173140J0333047
37530a256300M37448p784120o746842K124623R470877P135513k261866p591939
37522f472606l482704K317676J320808j288015N040457J6131078J5431262q51691
37514B8146265j5393861j3740652l548325M51902j224388O05289M181030M99185
37506b3555q230591j0487415m205112J520193K905016M865125P637490N085278
37498i33571j718074l718583M84498K279342o33279k92478M967844N511222j754150
37489D192771n792309n6102N763176K667917k471422n55738K992753j193904q721144
37480c174002q742751k008963K330103K622654L853954M902132K77211p216059
$$ y = [-20048421, -19911172, -14716264, -14285555, -21395938, -27546751, -23762487, -11589347, -1256300, -818852, -8602972, -15349814, -13225191, -3754314, 3381199, 1119333, -6472606, -9955310, -7637634, -6316826, -7604841, -2564384, 13566694, 28997956, 28146265, 12752404, -988248, -4536573, -4084671, -5309059, -4703770, -522740, -23555, -8254146, -18741561, -22946673, -21426480, -18521464, -13656339, -6018849, -933571, -2651645, -6370228, -5885730, -3606388, -4239667, -4532145, 435699, 5946921, 4192771, -1599538, -1655640, 4107536, 6775453, 4304031, 3748293, 6741046, 5547142, -3174002, -11916753, -13925716, -11595613, -8972959, -5119005, -216873, 60338, -7155721]
37472g155721q166795j112249N004466L778037j625625n074643m325884q65385
37464a9543799K150459K470124K390587O456626J2484416J1258482M08764q928756
37456I146903o895509R58655L459852N71472n79258P522k200151m020608J013283
37447A462161Q301595O426521m351214j1115221p156798K22886K808180J331429
37439b070461l61438j300009j018390N72577j31186n709545j0164408n701188
37431b5884048L662202O422381J407175j112452K965166O207799M255497J997995
37423g8285J499343k009217p047532l836377P317516J0788164q33361j2097413
37415f297162o966028O130164P454530l945293j0379220k327700J0313407J3852779
$$ y = [-7155721, -15322516, -16434765, -11430299, -7652262, -9277887, -14352530, -18678414, -19543799, -17393340, -14923216, -12532629, -6076003, 6408413, 17666895, 18075659, 9146903, 2251394, 3210049, 6669901, 7241373, 6662115, 6669637, 4469486, 448878, 1462161, 9763756, 16190277, 11839063, 723842, -6432956, -6210070, -3401890, -2070461, -2431899, -3731908, -4750298, -4177721, -4308907, -10018452, -20182860, -25884048, -22221846, -15799465, -14392290, -15504742, -12539576, -6331777, -2076280, -78285, 1421058, -588159, -7635691, -11472068, -4154552, 6633612, 5800251, -6297162, -13263190, -7133026, 321504, -3623789, -14003009, -16330709, -6017302, 7835477]
37407G835477N849313o035335j1394541m220950R518373J4176538K585585j2142746
37399F171714j2847931j664255N340122K958733P26330K933923K184475l625911
37391B177200m862822K065939N781186j149670p793824k070175Q582463Q801953
37383A1532250j90591m297327n48832K23652n339658o810686N31209N812296O08038
37374A520351o235694l075086N141990N347129j918053l856342L308138Q742957
37366H975390M946497j440687k129035K3578j534790m625830k831493K093883
37358C477513K141987l911005q309080o082095j265319J083104K204963M700640
37350e959292N688758J092651n896573p374687j976798K449037q7733m867820
$$ y = [7835477, 13684790, 7649455, -3745086, -7966036, 1552337, 15728875, 18314460, 6171714, -6676217, -8340472, -3000350, -41617, 684713, 3618636, 5803111, 2177200, -2685622, -619683, 5161503, 4011833, -3781991, -5852166, 2730297, 11532250, 11341659, 7044332, 6495500, 6719152, 1379494, -5431192, -4899983, 912313, 1520351, -4715343, -7790429, -2648439, 2698690, 780637, -3075705, 232433, 8975390, 13921887, 12481200, 10352165, 10375743, 8840953, 4215123, 1383630, 3477513, 5619500, 1708495, -6600585, -12682680, -13947999, -12864895, -10659932, -5959292, -270534, 822117, -5074456, -12449143, -14425941, -11976904, -12064637, -16932457]
37342a6932457l213518M935395J1078564R947931M796791j12996n048709r146696
37334c695695o695768L545957J0904964M765452q556215j2141620j912072Q019589
37326e765408O446455l46942j349761K469639L304752L07863j890325k669650
37318E06623l404589q45821O907970J1834865N058893p751660j2077405n041005
37310d812129J856217J300350r19052J423818N114126N406904L983255L218643
37302A6572132Q99122l426857m373998P59293N872463M536893j085748n219742
37294A4533558o558899o106022l239147K92261q95517o502405p029408K347931
37286a3157648J1435512Q705298q20339l767140r3199j575961r291278r104453
$$ y = [-16932457, -20145975, -15210580, -4132016, 5815915, 10612706, 10499710, 5451001, -3695695, -10391463, -6845506, 4059458, 8824910, 268695, -11872925, -13784997, -5765408, 681047, 334105, -1015656, 1453983, 4758735, 5066598, 3176273, 506623, -2897966, -3743787, 3164183, 14999048, 20057941, 12306281, 228876, -4812129, -2955912, -1655562, -2574614, -1150796, 3963330, 9370234, 13353489, 16572132, 17471254, 14044397, 9670399, 10429692, 16302155, 20839048, 19753300, 14533558, 7974659, 1868637, -1370510, -1078249, -1973766, -8476171, -15505579, -13157648, -1722136, 6983162, 6162823, 2395683, 2302484, 726523, -8564755, -17669208]
37278a7669208N199296J8605569J4336031l084899j5145415j3647786o320284
37271a7726696j146111K748462O879060O761614l30133p274322m480889O542369
37263h026646J3845723J0096745J327612k195994O07055K223143j680339p085344
37255I111955q863903p552453n807840k429141M850100J2178323J1097504o72041
37247A1912504j3582543j5111843l671043R380988J2566933O596000J360717K417677
37239A1869390N055376K702006l675846q059870p564914l470128K961450R650345
37231I467809J0667929J828324j0232301j2667016k917144O734331N367125k664939
37223E584118o050704k835014j95699j315465j749846J143616L485623K014727
$$ y = [-17669208, -12469912, 6135657, 20471688, 17386789, 2241374, -11406412, -17726696, -18872807, -16124345, -9245285, -2483671, -2813804, -10088126, -14569015, -8026646, 5819077, 15915822, 17243434, 15047440, 15654495, 17877638, 16197299, 9111955, 248052, -7304401, -13112241, -15541382, -10691282, 1487041, 12584545, 11912504, -1670039, -16781882, -20452925, -11071937, 1494996, 8090996, 9451713, 11869390, 16924766, 19626772, 15950926, 7891056, 326142, -3143986, -182536, 9467809, 20135738, 21964062, 11731761, -935255, -3852399, 2881932, 8249057, 5584118, -466586, -3301600, -3497299, -4812764, -6562610, -5418994, -1933371, 81356]
37215H1356m40501k75772O23470j695500n987202o363051j9182Q572768J2230173
37206F726559Q526804J827695j656782j64753K308928O54163n549888j0907312
37198A765414r438069j541360N206308M058833k666751o391868l406595J340320
37190a1073768L292169N199706J0079316J2631290N763483o964572j4322687j2263939
37182g659002o943253k665209K942096R100842Q126627k149889j0931669p708021
37174a7887478K997156Q522739N440299J362504J747527L587984K702163M23031
37166H895925N30773L051492L563467j400225q536609r410358r81499P784883
37158C497849O105957l016066o275356J93442N720699L296422K77949L527816
$$ y = [81356, -359145, -634917, -11447, -1706947, -7694149, -14057200, -14076382, -5503614, 6726559, 15253363, 17081058, 15424276, 15259523, 17568451, 18222614, 12672726, 1765414, -7672655, -9214015, -4007707, 51126, -2615625, -9007493, -12414088, -11073768, -7781599, -2581893, 7497423, 20128713, 25892196, 18927624, 4604937, -7659002, -14602255, -17267464, -14325368, -5224526, 2902101, 752212, -10179457, -17887478, -14890322, -6367583, -927284, 435220, 2182747, 5770731, 8472894, 8895925, 9426698, 12478190, 16041657, 14641432, 6104823, -3305535, -4287034, 3497849, 9603806, 6587740, 312384, 505826, 6226525, 9522947, 9800896, 13328712]
37150A3328712O155020K53397p401737n926518J242487L118396L02882J587783
37142A2660422N622639K965538n121408p117833j239912J817436j509040k219334
37134E858508K762976L747933l061535o414143P00117P335710K348093o651067
37126F626592o288463L07433k3301p690831j0085410k297387O297514P410183
37118e743670L859661J329070p5204j657565r47757L718255P580963M045389n772176
37109F336966j2175371p604867L351843Q202200J887183o420660n825488J320867
37101a0927327M220086M54397k151816l38036k64520m217848m276456M008482
37093a3493038J1712895R014745l27920n991018n829202m301690k260423J563516
$$ y = [13328712, 19483732, 19737129, 12335392, 6408874, 7651361, 10769757, 11072639, 12660422, 18283061, 21248599, 16127191, 9009358, 7769446, 9586882, 8077842, 5858508, 8621484, 12369417, 9307882, 2893739, 3593856, 10929566, 13277659, 6626592, 338129, 645562, 622261, -7068570, -17153980, -19451367, -13153853, -5743670, -1884009, -554939, -630143, -2287708, -3235465, 482790, 8063753, 12109142, 6336966, -5838405, -13443272, -10091429, -1889229, -2046, -6422706, -12248194, -10927327, -6707241, -6252844, -8404660, -8742696, -9007216, -13225064, -17501520, -13493038, -1780143, 7234602, 6906682, 915664, -4913538, -9215228, -11475651, -9912135]
37085i912135L695351Q02547k381520O3296M269486K870032j609320j317711K214277
37076a305697J208958k411538P19209Q500130O991906o442368j5346294p969250
37068a6054944M741717O359484o77681k005141M324809O317717n55389n484591
37060c034019K39514R508647J0230803K596712k789012q24081K274298l05083
37052A7897779o196293q453200n661256k268642o56789J146654L376524K460714
37044A645491j954227l556019J833977Q145866O369071k351138q201976o648742
37036d717697l222050l046783l165858Q38024O392819P457994L330159j019630
37028B846978k006783q34264k55585j014607j858470j298275J021485L922821
$$ y = [-9912135, -6216784, -5414237, -7795757, -7732461, -3462975, -592943, -2202263, -3519974, -1305697, -96739, -2508277, -1789068, 6711062, 13702968, 7260600, -8085694, -16054944, -11313227, -4953743, -5631424, -7636565, -3311756, 3005961, 2450572, -3034019, -2794505, 6714142, 16944945, 19541657, 16752645, 15928564, 18202862, 17897779, 11701486, 3248286, -2412970, -4681612, -5338401, -4191747, -815223, 1645491, -308736, -3864755, -2030778, 6115088, 12484159, 10133021, 1931045, -4717697, -7939747, -10986530, -14152388, -13314364, -6921545, 536449, 3866608, 2846978, 840195, 5931, -249654, -1264261, -3122731, -4421006, -3399521, 523300]
37020E23300N664033N515819L951821J422536k060520n969059q746982q527952
37012h227004m331652K546006P964692P603773J718554m232596n316246j980362
37004d254835K140903M803009N412823L540943J65984k118318l000429n265908
36996A424172q558989p280878O3827N062658R34103n234125k546801N167346M698310
36987f270377l561413m360125O807769J3752036M566956q275145o591860N701365
36979A769206R896714J277429o648379m947288k9325L33600k238139m005721n561360
36970a0153263o300444k405937M829878P879026N055266M247412Q668661Q945832
36962B0766431j786668j3712714j2829843j837671M233645N36729k781053J041075
$$ y = [523300, 6187333, 11703152, 15654973, 17077509, 15016989, 9047930, 300948, -8227004, -12558656, -10012650, -2047958, 5555815, 7274369, 3041773, -2274473, -4254835, -2113932, 2689077, 8101900, 11642843, 11808827, 9690509, 6690080, 1424172, -7134817, -14415695, -14351868, -9289210, -8355107, -13589232, -16136033, -10968687, -6270377, -9831790, -14191915, -7384146, 6367890, 10934846, 2659701, -3932159, 1769206, 11665920, 12943349, 6294970, 1347682, 1318357, 1651957, -586182, -4591903, -10153263, -16453707, -18859644, -14029766, -6150740, -1095474, 3151938, 11820599, 20766431, 18979763, 5267049, -7562794, -9400465, -5166820, -4630091, -7411144, -6370069]
36954f370069N145152J837194m743372n723159m74424M534780N562101M013504
36946C781707J939521N36944J097871K947398K434366j946743n717784m004334
36938A068946J246106M066766K215988k494710q690725j4297870j3728412m009194
36930c4623105P559620J0397136N246220K694958O291181P851589K861092j183812
36922G094879J244568K336701n788440j4778794j0336452N501709J6067362J3034864
36914A4376397M662708j09088k867558o804863q248572m458905j434082n407723
36906a0291686j1726180j0366231J6558J0344051J2348473O422981j052252m172041
36898h476327j841209J269097r82115q311594j2028778m461138J0396393J9340995
$$ y = [-6370069, -1224917, 612277, -4131095, -9854254, -10328678, -5793898, -231797, 3781707, 5721228, 6258172, 7356043, 10303441, 12737807, 10791064, 5073280, 1068946, 2315052, 6381818, 8597806, 6103096, -2587629, -16885499, -30613911, -34623105, -27063485, -16666349, -11420129, -8725171, -2433990, 5417599, 8278691, 7094879, 8339447, 10676148, 4887708, -9891086, -20227538, -14725829, 1341533, 14376397, 19039105, 18930017, 16062459, 9257596, 1009024, -3449881, -4883963, -10291686, -22017866, -32384097, -32367539, -22023488, -9675015, -3252034, -4304286, -8476327, -10317536, -9048439, -10030554, -18342148, -30370926, -34832064, -24435671, -5094676]
36890e094676J3928725j62741q951663m789491N690626R281869J872377o565600
36882E209426n407163J735186K316094n967053j0687947k944590Q778451J0525925
36874C558329K349863l873411k764477n36323j628639j484410L176768O312071
36866E109771J918687n048821n637621r74375o3587m626022o019248L58489O620772
36857h361955L915301m250066p499542l300275J685055K873073K369942K579341
36849i989126K726534K559274K735776J055241m226321p171837j35601J1308528
36841a137532J1625987j443748j0275944l195743O399828J066927j1580797j0110654
36833a8651676O102722J5109775N891526o942692p526774P8737L820953K203118
$$ y = [-5094676, 8834049, 8671308, -280355, -5069846, 620780, 9902649, 11775026, 5209426, -197737, 1537449, 3853543, -2113510, -12801457, -15746047, -6967596, 3558329, 5908192, 2034781, -729696, -1266019, -2894658, -4379068, -1202300, 5109771, 7028458, 1979637, -3657984, -4632359, -4695946, -9321968, -15341216, -14982727, -8361955, -4446654, -8696720, -16196262, -19496537, -17811482, -14938409, -12568467, -9989126, -7262592, -4703318, -1967542, -912301, -5138622, -12310459, -12446060, -1137532, 10488455, 9044707, -1231237, -4426980, 1972848, 3039775, -8541022, -18651676, -12548954, 2560821, 8452347, 1509655, -6017119, -5938382, -2117429, 85689]
36825H5689N25057m06069j689366q60070K399052K674737j732146l832154M75761
36816b359509M468558J820789l086737m155242l617649m260453j565799N790624
36808f965418P736191j830208j0546912l914351J0693895J3302362Q04498r971600
36800f91543p718763R82412N912505N279015J165603m459077o821051k458206
36792h809105K723616M84652n240674l806078K892789K490959n025738m571556
$$ y = [85689, 610746, 204677, -1484689, -2344759, 54293, 2729030, 996884, -2835270, -2359509, 2109049, 3929838, 843101, -3312141, -6929790, -11190243, -12756042, -6965418, 770773, -1059435, -11606347, -15520698, -4826803, 8475559, 9280057, -691543, -8410306, -7427894, -1515389, 3763626, 4929229, 470152, -6350899, -8809105, -6085489, -5600837, -10841511, -14647589, -11754800, -9263841, -14289579, -18861135]
$$ [...]
##END NTUPLES=NMR SPECTRUM
##END=
