##TITLE=31Pdec_SR157TFAA2eq
 CDCl3, 24 sc
 5.7.2023
##JCAMPDX= 6.0         $$ Bruker NMR JCAMP-DX V2.0
##DATA TYPE= NMR SPECTRUM
##DATA CLASS= NTUPLES
##ORIGIN= UXNMR, Bruker Analytische Messtechnik GmbH
##OWNER= root
$$ XWIN-NMR		Version 3.5
$$ Wed Jul  5 16:29:53 2023 Russian Standard Time (UT+4h)  she@DPX200
##.OBSERVE FREQUENCY= 81.013821
##.OBSERVE NUCLEUS= ^31P
##.ACQUISITION MODE= SIMULTANEOUS
##.ACQUISITION SCHEME= undefined
##.AVERAGES= 24
##.DIGITISER RES= 16
##SPECTROMETER/DATA SYSTEM= spect
##.PULSE SEQUENCE= zgpg30
##.SOLVENT NAME= CDCl3
##.SHIFT REFERENCE= (INTERNAL, CDCl3, 0, 248.564)
##AUDIT TRAIL= $$ (NUMBER, WHEN, WHO, WHERE, WHAT)
$$ ##TITLE= Audit trail, XWIN-NMR		Version 3.5
$$ ##JCAMPDX= 5.01
$$ ##ORIGIN= Bruker BioSpin GmbH
$$ ##OWNER= she
$$ F:/spectra/data/she/nmr/P31/1/pdata/1/auditp.txt
$$ ##AUDIT TRAIL=  $$ (NUMBER, WHEN, WHO, WHERE, WHAT)
(   1,<2023-07-05 16:28:33.50 +0400>,<she>,<DPX200>,
      <created by zg, POWCHK disabled, PULCHK disabled
       configuration hash MD5:
       00 E9 B6 7A A2 85 ED C7 34 08 36 98 17 FE 4E 26
       data hash MD5: 32K
       10 55 73 97 B9 B4 88 CC 95 B7 3E B4 CB 2A 9E A2>)
(   2,<2023-07-05 16:28:36.01 +0400>,<she>,<DPX200>,
      <Start of raw data processing
       efp BC_mod = 2 LB = 1 FT_mod = 6 PKNL = 1 PHC0 = -10840.95 PHC1 = 439.4848 SI = 64K 
       data hash MD5: 64K
       13 05 71 55 D6 71 D4 5B 26 4E EC 58 8B 84 1C 67>)
(   3,<2023-07-05 16:28:55.20 +0400>,<she>,<DPX200>,
      <pk PHC0 = 75.71965 PHC1 = -145 
       data hash MD5: 64K
       5D F1 64 A3 C9 F2 CE 62 C3 AC 8C 67 A8 4A F9 16>)
(   4,<2023-07-05 16:29:15.68 +0400>,<she>,<DPX200>,
      <abs ABSG = 5 
       data hash MD5: 64K
       BA 5C 7D F9 84 FD E2 AA 54 52 CF E5 D7 68 99 E3>)
$$ ##END=
$$ 
$$ hash MD5
$$ AE 92 D2 C2 79 D3 69 AB 55 75 E5 30 07 CF F1 E0
##$RELAX= 
##$RELAX= 
##$RELAX= 
##$RELAX= 
##$RELAX= 
##$RELAX= 
##$RELAX= 
##$RELAX= 
##$RELAX= 
$$ Bruker specific parameters
$$ --------------------------
##$DU= <F:/spectra>
##$EXPNO= 1
##$NAME= <P31>
##$PROCNO= 1
##$TYPE= <nmr>
##$USER= <she>
##$AMP= (0..31)
100 100 100 100 100 100 100 100 100 100 100 100 100 100 100 100 100 100 
100 100 100 100 100 100 100 100 100 100 100 100 100 100 
##$AQSEQ= 0
##$AQ_mod= 1
##$AUNM= <au_zg>
##$AUTOPOS= <>
##$BF1= 81.014009
##$BF2= 200.13
##$BF3= 200.13
##$BF4= 200.13
##$BF5= 200.13
##$BF6= 200.13
##$BF7= 200.13
##$BF8= 200.13
##$BYTORDA= 1
##$CFDGTYP= 0
##$CFRGTYP= 5
##$CHEMSTR= <none>
##$CNST= (0..31)
1 1 145 1 1 1 1 1 1 1 1 1 1 1 1 1 1 1 1 1 1 1 1 1 1 1 1 1 1 1 1 1 
##$CPDPRG= <waltz16>
##$CPDPRG1= <>
##$CPDPRG2= <waltz16>
##$CPDPRG3= <>
##$CPDPRG4= <mlev>
##$CPDPRG5= <mlev>
##$CPDPRG6= <mlev>
##$CPDPRG7= <mlev>
##$CPDPRG8= <mlev>
##$CPDPRGB= <>
##$CPDPRGT= <>
##$D= (0..31)
0 1 0 0 0 0 0 0 0 0 0 0.03 2e-05 3e-06 0 0 0 0 0 0 0 0 0 0 0 0 0 0 0 0 
0 0 
##$DATE= 1688560112
##$DBL= (0..7)
120 120 120 11 120 120 24 19 
##$DBP= (0..7)
150 150 150 150 150 150 150 150 
##$DBP07= 0
##$DBPNAM0= <>
##$DBPNAM1= <>
$$ [...]
##$SUBNAM3= <"">
##$SUBNAM4= <"">
##$SUBNAM5= <"">
##$SUBNAM6= <"">
##$SUBNAM7= <"">
##$SUBNAM8= <"">
##$SUBNAM9= <"">
##$SW= 501.771253377433
##$SWIBOX= (0..15)
0 1 3 0 0 0 0 0 0 0 0 0 0 0 0 0 
##$SW_h= 40650.406504065
##$TD= 32768
##$TD0= 1
##$TE= 0
##$TE2= 300
##$TE3= 300
##$TEG= 300
##$TL= (0..7)
0 120 53 12 22 120 120 120 
##$TP= (0..7)
150 150 150 150 150 150 150 150 
##$TP07= 0
##$TPNAME0= <>
##$TPNAME1= <>
##$TPNAME2= <>
##$TPNAME3= <>
##$TPNAME4= <>
##$TPNAME5= <>
##$TPNAME6= <>
##$TPNAME7= <>
##$TPOAL= (0..7)
0.5 0.5 0.5 0.5 0.5 0.5 0.5 0.5 
##$TPOFFS= (0..7)
0 0 0 0 0 0 0 0 
##$TUNHIN= 0
##$TUNHOUT= 0
##$TUNXOUT= 0
##$USERA1= <user>
##$USERA2= <user>
##$USERA3= <user>
##$USERA4= <user>
##$USERA5= <user>
##$V9= 5
##$VALIST= <valist>
##$VCLIST= <CCCCCCCCCCCCCCC>
##$VD= 0
##$VDLIST= <DDDDDDDDDDDDDDD>
##$VPLIST= <PPPPPPPPPPPPPPP>
##$VTLIST= <TTTTTTTTTTTTTTT>
##$WBST= 1024
##$WBSW= 4
##$XGAIN= (0..3)
0 0 0 0 
##$XL= 0
##$YL= 0
##$YMAX_a= 4907
##$YMIN_a= -4929
##$ZGOPTNS= <>
##$ZL1= 120
##$ZL2= 120
##$ZL3= 120
##$ZL4= 120
##$ABSF1= 248.5645
##$ABSF2= -253.2056
##$ABSG= 5
##$ABSL= 3
##$ALPHA= 0
##$AQORDER= 0
##$ASSFAC= 0
##$ASSFACI= 0
##$ASSFACX= 0
##$ASSWID= 0
##$AUNMP= <proc_1d>
##$AZFE= 0.1
##$AZFW= 0.5
##$BCFW= 0
##$BC_mod= 2
##$BYTORDP= 0
##$COROFFS= 0
##$CY= -3
##$DATMOD= 1
##$DC= 0
##$DFILT= <>
##$DTYPP= 0
##$F1P= 0
##$F2P= 0
##$FCOR= 1
##$FTSIZE= 65536
##$FT_mod= 6
##$GAMMA= 0
##$GB= 0
##$INTBC= 1
##$INTSCL= 6.047779e-11
##$ISEN= 30
##$LB= 1
##$LEV0= 0
##$LPBIN= 0
##$MAXI= 10000
##$MC2= 0
##$MEAN= 0
##$ME_mod= 0
##$MI= 50
##$NCOEF= 0
##$NC_proc= -6
##$NLEV= 6
##$NOISF1= 182.463
##$NOISF2= 159.3651
##$NSP= 0
##$NTH_PI= 0
##$NZP= 0
##$OFFSET= 248.5645
##$PC= 4
##$PHC0= -10765.23
##$PHC1= 294.4848
##$PH_mod= 1
##$PKNL= yes
##$PPARMOD= 0
##$PSCAL= 0
##$PSIGN= 0
##$REVERSE= no
##$SF= 81.0140089999694
##$SI= 65536
##$SIGF1= 159.3651
##$SIGF2= -187.1042
##$SINO= 113.3802
##$SIOLD= 16384
##$SREGLST= <1H.CDCl3>
##$SSB= 0
##$STSI= 65536
##$STSR= 0
##$SW_p= 40650.406504065
##$SYMM= 0
##$S_DEV= 0
##$TDeff= 32768
##$TDoff= 0
##$TI= <>
##$TILT= no
##$TM1= 0
##$TM2= 0
##$TOPLEV= 0
##$USERP1= <user>
##$USERP2= <user>
##$USERP3= <user>
##$USERP4= <user>
##$USERP5= <user>
##$WDW= 1
##$XDIM= 65536
##$YMAX_p= 204230658
##$YMIN_p= -361015567
$$ End of Bruker specific parameters
$$ ---------------------------------
##NTUPLES= NMR SPECTRUM
##VAR_NAME=  FREQUENCY,     SPECTRUM/REAL,   SPECTRUM/IMAG
##SYMBOL=    X,             R,               I
##VAR_TYPE=  INDEPENDENT,   DEPENDENT,       DEPENDENT
##VAR_FORM=  AFFN,          ASDF,            ASDF
##VAR_DIM=   65536,         65536,           65536
##UNITS=     HZ,            ARBITRARY UNITS, ARBITRARY UNITS
##FACTOR=    0.620285442955139, 1,           1
##FIRST=     20137.2065510682, 0,            0
##LAST=      -20513.1999529968, 0,           0
##MIN=       -20513.1999529968, -361015567,  0
##MAX=       20137.2065510682, 204230658,    0
$$ Real data points
##PAGE= N=1
##DATA TABLE= (X++(R..R)), XYDATA
$$ [...]
15471 1019080 655145 928915 1327455 909449 -127813 -628927 -18409 1201343 2290808
15462 2290808 2811384 2538056 1659742 946783 993878 1418855 1437844 991162 619373 511070
15452 511070 437794 374490 382026 120159 -658296 -1327538 -1016417 89205 936945 989395
15442 989395 567705 27954 -397814 -148925 1024739 1996980 1251154 -822220 -2077223
15433 -2077223 -1555485 -734752 -980054 -1336612 -348737 1157437 1129031 -399108 -1197431
15424 -1197431 -237242 825041 355826 -800604 -917931 -161759 -14440 -602053 -568487
15415 -568487 372496 714967 -334232 -1325412 -750812 537007 689857 -160637 -149984
15406 -149984 1287892 2484893 2032153 652393 -163570 -174177 -120246 -325118 -535092
15397 -535092 -605949 -511112 -63821 678367 1120771 885348 463655 459051 564102 61979
15387 61979 -878320 -1202784 -306037 1216495 2271248 2347573 1767727 1060638 293826 -750146
15377 -750146 -1689655 -1436314 340526 2114357 2056978 599747 6529 1116971 2149290
15368 2149290 1520511 192775 -158090 93731 -529129 -1757005 -1782948 -153907 1450405
15359 1450405 1587434 651415 -271225 -780720 -891493 -557464 -101362 -218008 -964390
15350 -964390 -1484567 -1234747 -755308 -697001 -799686 -530397 -157243 -316317 -786444 -645274
15340 -645274 230016 702404 -10474 -898459 -368273 1250174 1765616 278498 -1123108
15331 -1123108 -223046 1839259 2069073 165911 -1030033 -34278 1112023 454318 -704144
15322 -704144 -345396 709319 504467 -341992 239246 1775225 1684212 -364958 -1714231
15313 -1714231 -911999 237616 -141686 -1291874 -1686198 -1505945 -1647492 -1854213 -1443736
15304 -1443736 -729162 -312209 62790 724661 1092502 665545 114999 211196 477766 114209
15294 114209 -480024 -377469 240109 394764 -65989 -334207 -2592 406860 268129 -473106
15284 -473106 -1378984 -1820870 -1455562 -765939 -674500 -1250985 -1477869 -804822 -73212 -76076
15274 -76076 -63327 1109883 2905274 3563914 2506383 979608 187164 -40136 -333164
15265 -333164 -574616 -288102 361344 670835 311044 -373719 -951337 -1408445 -1927785 -2372026
15255 -2372026 -2287747 -1504298 -504513 16901 -165158 -760658 -1380086 -1689346 -1425881 -744888
15245 -744888 -320506 -515034 -684029 -61617 885466 1002075 276925 -133077 43810 -439043
15235 -439043 -2157708 -3515790 -2725225 -474487 831982 194434 -971912 -1012670 -33760
15226 -33760 716793 636023 234279 84082 -64094 -825317 -2036212 -2595656 -1795546 -426691
15216 -426691 92654 -492118 -1146834 -1159537 -902950 -814957 -680383 -374977 -329022 -636619
15206 -636619 -599497 166535 1021849 1379694 1558497 1786699 1452992 438481 95088 1392150
15196 1392150 2928725 2551926 444154 -1263448 -1672724 -1852430 -2303187 -1930016 -296409
15187 -296409 1097320 1024845 456941 843668 1724728 1685644 806360 363689 541807 258978
15177 258978 -728412 -1273417 -785795 -217456 -403583 -701748 -233736 551884 733406 588841
15167 588841 1048302 1852505 1748200 587845 -223737 144412 702339 352865 -298347
15158 -298347 -85139 557357 134612 -1415487 -2345248 -1541100 -13554 726743 735681 1160882
15148 1160882 2377773 3601003 4061630 3693933 2747471 1508108 486079 202251 546166
15139 546166 825480 677981 481951 555256 408567 -614730 -2131575 -2847939 -2085245
15130 -2085245 -621998 350656 612597 675332 594057 -32625 -918346 -1006187 63753 1266876
15120 1266876 1546591 1114205 732442 439637 -95348 -510619 -145336 756365 1270871
15111 1270871 1131686 903756 873683 681179 75343 -804010 -1886715 -3063792 -3676959
15102 -3676959 -3086638 -1803899 -1091930 -1324199 -1658446 -1409273 -746480 41173 849474
15093 849474 1160730 365638 -973160 -1359332 -294800 1131681 1929248 2193846 1996100
15084 1996100 849608 -857158 -1415867 -56233 1527323 1302595 -345425 -1408831
15076 -1408831 -1108482 -466177 -424366 -817277 -1151712 -1282643 -1242647 -1157679 -1251792 -1369910
15066 -1369910 -823371 674567 2320411 3081906 2796226 1878705 621363 -558299 -995778
15057 -995778 -773257 -998895 -2104595 -2788071 -1900460 -475916 -291698 -1104583 -1156207
15048 -1156207 -54520 803989 679629 428673 665729 774924 368165 159473 575666
15039 575666 808655 169848 -662814 -702764 -159479 44834 -285435 -509008 -190124 369058
15029 369058 512116 -137809 -1218544 -1742457 -1073278 185618 792182 346686 -454063
15020 -454063 -995515 -1326941 -1469825 -1157347 -651786 -850813 -1918862 -2580206 -1596394
15011 -1596394 528514 2136445 2481297 2436301 3051975 3968020 3670833 1340574 -1829153
15002 -1829153 -3587823 -3029589 -1502015 -701172 -540557 148993 1321328 1608910 642944
14993 642944 -58453 716032 1980517 1964752 682826 -131639 596828 2057766 2798232
14984 2798232 2360766 1365305 488429 -180126 -859123 -1492828 -1720015 -1468936 -1254886
14975 -1254886 -1519078 -1882950 -1615448 -782106 -259070 -489715 -948420 -1132285 -1336728
14966 -1336728 -1892562 -2250865 -1611158 -182342 907721 915898 180937 -432578 -347552 402550
14956 402550 1227318 1365539 579566 -547312 -1264012 -1418670 -1209429 -491355 935213
14947 935213 2426491 2825168 2028509 1380658 1865929 2629660 2244506 969769 483994
14938 483994 1371143 2228964 1808500 832921 695160 1218030 1032213 -181072 -1187090
14929 -1187090 -1041650 -306500 -78975 -651425 -1483056 -1840840 -1243853 61038 931966
14920 931966 427580 -794121 -1111053 -178197 602975 275556 -309574 -128320 263955
14911 263955 -176925 -1089463 -1322496 -862249 -719227 -1194024 -1599692 -1594456 -1535501 -1489157
14901 -1489157 -1063518 -368905 -79082 -301304 -328836 188805 655308 459201 -144171 -404036
14891 -404036 120048 1275523 2429234 2828612 2265716 1364964 882284 916309 1138783
14882 1138783 1339485 1215502 256955 -1299141 -2013610 -916285 782971 1014274 -297867
14873 -297867 -1170933 -465934 640481 565018 -574440 -1479739 -1415167 -750249 -318434 -657047
14863 -657047 -1470042 -1777150 -1124296 -415762 -663855 -1207935 -496784 1394285 2592393
14854 2592393 2106543 1089708 768066 660087 -102269 -988301 -945815 -222259 -366
14845 -366 -673607 -1551904 -1967961 -1796121 -1112576 -65143 1054234 2019893 2707257 2788412
14835 2788412 2009784 941984 578248 884866 806256 156325 202289 1543617 2749424
14826 2749424 2363484 1138219 730946 1041227 639790 -611539 -1272894 -717917 -105978
14817 -105978 -525437 -1512039 -2001776 -1735917 -1120244 -472262 -1335 11844 -445513 -893705
14807 -893705 -822357 -232970 384082 490255 11117 -444599 -170257 611460 820346 47739
14797 47739 -653387 -256134 646510 858516 662564 1376828 2939025 3623989 2629390 1395843
14787 1395843 1445875 2147901 1856076 465801 -549032 -360250 227183 165724 -419074
14778 -419074 -620557 -18308 865065 1188601 659491 -172782 -461947 58421 844352 1235935
14768 1235935 1146159 908921 751348 718027 838408 965166 697755 -8130 -361449 413616
14758 413616 1766574 2230227 1431301 790485 1548850 2871297 2972566 1691793 620628
14749 620628 621739 614151 -558866 -2218049 -2843064 -2239465 -1501246 -1145082 -550484 635824
14739 635824 1672668 1786219 1286075 1030731 1229214 1312175 776078 -245589 -1160011
14730 -1160011 -1434188 -1020521 -377860 19063 167824 357212 604473 617043 282225 -188821
14720 -188821 -599682 -837257 -631921 202046 1209031 1584321 1226721 886103 976297 936994
14710 936994 295131 -303803 35526 923098 992847 -225618 -1623915 -2017593 -1617175
14701 -1617175 -1432648 -1667483 -1490906 -419467 770867 911210 -135546 -1372039 -1835664
14692 -1835664 -1414890 -554963 303829 825991 792271 319153 -225597 -711757 -1277121 -1717205
14682 -1717205 -1446847 -477164 180445 -265261 -1226452 -1523658 -929734 -103695 641667
14673 641667 1448990 1943683 1350528 -187895 -1452845 -1725420 -1654288 -2074115 -2759535
14664 -2759535 -2995598 -2771763 -2646865 -2735985 -2539720 -1769582 -867839 -557368 -1034429 -1724636
14654 -1724636 -1916146 -1611504 -1471548 -1779394 -1921533 -1330203 -483696 -263306 -613022
14645 -613022 -675493 -134745 445073 623338 574832 497373 355394 350436 839503 1594848
14635 1594848 1890139 1487572 817411 107283 -808598 -1694624 -1889318 -1333120 -712149
14626 -712149 -327979 194996 772952 554852 -665877 -1701498 -1347936 190417 1807220
14617 1807220 2725851 2752643 2076226 1342471 1204912 1342136 719343 -720380 -1557005
14608 -1557005 -707697 1107111 2355507 2359127 1398565 75192 -753122 -341161 843122
14599 843122 1273851 430050 -255444 529991 1919262 2103057 904518 -189337 -126331
14590 -126331 798026 1852450 2568034 2600132 1810984 578436 -471213 -951470 -737672
14581 -737672 37797 803322 1037300 1126201 1798914 2529497 1887715 -17730 -1096748
14572 -1096748 -236348 957064 692943 -345857 -564555 -172992 -273168 -455886 332517
14563 332517 1345814 912115 -695942 -1636924 -1489383 -1515179 -2056794 -2113974 -1664379 -1947927
14553 -1947927 -2983768 -3164017 -2006697 -1052377 -1121810 -878475 643014 2030374 1547286
14544 1547286 -277865 -1616330 -1775077 -1335387 -802397 -352112 -187529 -145514 351653
14535 351653 1194026 1325310 353979 -591545 -501660 53185 97846 -130117 95484 517842
14525 517842 384318 -281636 -1041660 -1977945 -3082531 -3437507 -2404072 -1104270 -1226547
14516 -1226547 -2632786 -3601952 -3306711 -2554294 -2015473 -1290593 -187779 478798 177855
14507 177855 -282152 67376 783218 596170 -742951 -2123143 -2609068 -2558838 -2864994
14498 -2864994 -3544206 -3648653 -2575262 -970992 5473 61137 -91508 88497 287249
14489 287249 72400 -290351 -283355 17544 209648 426294 1122333 1979896 1909025 550227
14479 550227 -906475 -1044127 61250 1158145 1584008 1811494 2194936 2185912 1335726
14470 1335726 311062 86858 549388 769255 454372 222932 428287 622555 436217
14461 436217 220837 434578 957845 1380449 1549054 1596516 1781219 2295406 2753657 2112841
14451 2112841 -9002 -2112139 -2197297 -498150 643405 52082 -805266 -465454 196061
14442 196061 -218849 -960409 -297983 1481023 2333796 1468262 250585 55222 720240
14433 720240 1296760 1123983 77648 -1256559 -1785718 -1217417 -770513 -1514083 -2586262
14424 -2586262 -2425535 -1179562 -251864 54528 555598 1154153 865314 -122950 -484423
14415 -484423 -37782 57734 -341833 -16746 1073825 1167681 -458874 -2101234 -2218048
14406 -2218048 -1560048 -1478235 -1788940 -1630840 -984190 -138977 914366 1490041 284889
14397 284889 -2251536 -3398888 -1686563 674863 804426 -801569 -1396300 -101224 1414011
14388 1414011 1796891 1383063 913908 746373 1253631 2433472 3254857 2805234 1798340
14379 1798340 1510196 1632463 846056 -746233 -1579093 -1060643 -340108 -376243 -755876
14370 -755876 -828554 -723392 -792861 -1043908 -1398065 -1676404 -1343033 -223131 677286 220418
14360 220418 -1113768 -1759422 -1208128 -246142 789469 2278314 3704050 3655746 2032717
14351 2032717 547589 256244 213315 -456471 -813735 147322 1342487 928805 -985682
14342 -985682 -2622165 -3061417 -2926220 -2782711 -2436015 -1915427 -1743253 -1869573 -1515103
14333 -1515103 -498443 359505 666129 1179150 2280077 2735067 1248957 -1280960 -2496410
14324 -2496410 -1529180 124550 929563 1102705 1380670 1373614 493709 -384806 82276 1352374
14314 1352374 1400837 -301945 -1890040 -1809002 -926241 -942337 -1901815 -2528794 -2203489 -1307518
14304 -1307518 -158802 1083365 1723588 993019 -738091 -2118808 -2244230 -1292751 48735
14295 48735 1064363 1184151 536363 162842 889399 2175012 2836020 2548046 1714812
14286 1714812 340259 -1653371 -3257290 -3099237 -1486172 -254715 -255814 -428385 154493
14277 154493 844236 830510 595231 851926 1172303 910544 583114 997467 1717057 1787212
14267 1787212 1439568 1566635 1854614 1132589 -393591 -1015853 -145766 541511 -448636
14258 -448636 -2114479 -2396607 -1130263 -87308 -351902 -1097693 -1192404 -785528 -680013
14249 -680013 -962324 -1043350 -637785 6475 663252 1301655 1749619 1701329 1154171 509152
14239 509152 166471 229740 561171 879042 864562 441471 -98050 -451146 -635142 -746914
14229 -746914 -713470 -652279 -1035569 -1845517 -2013432 -716424 996641 1168325 -351403
14220 -351403 -1572136 -1245484 -566675 -957826 -1542458 -523533 1706013 2804286 1791864
14211 1791864 320566 154761 895842 1103131 595209 472172 1309031 2374374 2671665
14202 2671665 2086271 1308031 959157 1002518 946553 549846 211833 515399 1423731 2178786
14192 2178786 2105158 1352693 676559 500948 350771 -586085 -2256445 -3407732 -2908557
14183 -2908557 -1290824 -289960 -654733 -1179551 -464682 1034324 1604840 574061 -989058
14174 -989058 -1842155 -1877681 -1611393 -1208337 -560042 170735 655538 849877 926001 865847
14164 865847 467290 -236236 -811349 -791862 -130373 794033 1557082 1915038 1657786 617726
14154 617726 -841841 -1699791 -1306734 -410578 -308049 -914889 -768791 608101 1561329
14145 1561329 522902 -1568769 -2449990 -1603290 -617958 -615305 -900897 -517818 270933
14136 270933 746092 906959 1071841 1091520 788786 597316 919066 1236199 717939 -433445
14126 -433445 -1020386 -343019 892134 1381553 645315 -580296 -1252257 -1109604 -753504
14117 -753504 -762784 -1056321 -1264426 -1332885 -1343345 -1039374 -145204 959566 1541336 1494385
14107 1494385 1345473 1203190 492292 -953791 -2273816 -2578776 -2055962 -1555448 -1487900
14098 -1487900 -1632290 -1660118 -1324715 -472124 561018 856507 -114641 -1593244 -2284026
14089 -2284026 -1953696 -1574433 -1800524 -2071791 -1595297 -583083 85568 79196 -158538 -263837
14079 -263837 -362837 -512873 -359607 266606 845848 780228 285959 122736 511587 899640
14069 899640 856013 602749 455353 322090 92387 -32616 -44953 -423837 -1315338 -1885710
14059 -1885710 -1280431 56116 863183 717755 323165 193857 57496 -235326 -215363
14050 -215363 321087 772224 652294 334987 244020 -12682 -909210 -1957488 -2301508 -1972643
14040 -1972643 -1626471 -1349813 -801825 -364245 -864257 -1958586 -2087107 -606253 1145522
14031 1145522 1674781 1199791 700937 92922 -1195121 -2419655 -2090716 -350555 931268
14022 931268 838441 534741 993649 1293647 465784 -416130 168124 1423575 1199002 -624399
14012 -624399 -1893086 -1539707 -1029688 -1674024 -2425707 -1672906 190914 1518501 1799772
14003 1799772 1794494 1875243 1704193 1283892 1044988 1012688 971989 1263235 2254068 3155408
13993 3155408 2663535 923679 -379105 -235762 490963 571962 87349 -118497 116207
13984 116207 221757 -83156 -427217 -323973 318978 1089053 1281218 520328 -653240
13975 -653240 -1198138 -753393 44890 607568 1120746 1842909 2355347 2199552 1760508 1680281
13965 1680281 1711665 1112597 88375 -215565 597916 1487914 1503055 1127268 1269684 1564070
13955 1564070 835840 -886808 -2000121 -1294976 558016 1949852 2074608 1213640 -72010
13946 -72010 -1270564 -1796908 -1340103 -315446 524882 840766 687943 65004 -922064
13937 -922064 -1659903 -1497964 -604121 203992 426591 192211 -196222 -422250 -110119 643999
13927 643999 934069 112502 -997990 -978305 197129 1160615 1129019 636306 173805 -501176
13917 -501176 -1315644 -1543304 -1139388 -1115232 -1833301 -2166672 -1245321 90558 546267 60528
13907 60528 -718363 -1621545 -2588489 -3073708 -2893857 -2745751 -2872201 -2323357 -750463 297043
13897 297043 -536890 -2081918 -2254268 -1199644 -796875 -1538383 -2070259 -1726187 -1382798
13888 -1382798 -1507118 -1299633 -403389 133037 -588969 -1910177 -2440926 -1547352 318329
13879 318329 2052420 2541866 1629124 469124 252675 817052 1295822 1597959 2064562
13870 2064562 2181677 1163657 -429764 -1215872 -983017 -600264 -150898 990611 2248382
13861 2248382 2119152 733184 58263 861745 1487105 652636 -426483 -75449 1211014
13852 1211014 1725774 1075188 269639 -18883 3251 49497 94933 144769 230219 327737
13842 327737 81278 -765429 -1575750 -1424891 -661541 -661410 -1688485 -2356437 -1785521 -910612
13832 -910612 -861569 -1371529 -1738651 -2115400 -2729126 -2911744 -2116056 -1040925 -607393 -551535
13822 -551535 -77364 791484 1498789 1922688 2139892 1901299 1205631 695210 680941 563394
13812 563394 -6291 -364264 -132849 -180860 -1134697 -2002158 -1671455 -834555 -822047 -1279639
13802 -1279639 -793910 592675 1323908 729623 -196991 -607300 -853766 -1298895 -1345533
13793 -1345533 -340371 1329450 2595207 2741833 1889277 877437 714651 1637176 2671409
13784 2671409 2595728 1351669 63824 -320267 59424 491561 711099 1135493 2117199
13775 2117199 3142740 3163531 1986155 863720 1022998 1958099 2161663 1349061 718270
13766 718270 948413 1332965 1257373 1151423 1390510 1545210 1400728 1484903 1887341 1827425
13756 1827425 1131233 778111 1168413 1343172 899104 1033601 2381458 3427067 2693298
13747 2693298 1094993 354464 378419 129425 -85794 644331 1687101 1621660 549444
13738 549444 -303982 -656651 -920815 -671086 476834 1165671 -125438 -2274089 -2772654
13729 -2772654 -1526208 -854023 -1779994 -2931343 -3291041 -3410725 -3454462 -2608839 -1117866
13720 -1117866 -501678 -982078 -997778 -60252 315639 -500959 -914078 58586 976214 595573
13710 595573 83422 721791 1392130 568869 -745556 -490562 1071866 1791005 893126
13701 893126 -292971 -646961 -464359 -351488 -413032 -666547 -1141834 -1499291 -1376233 -1003913
13691 -1003913 -829011 -862643 -1006863 -1428128 -1873712 -1375362 371555 2009322 2024295
13682 2024295 713796 -472393 -1007082 -1428503 -1831438 -1651347 -884639 -241860 18227
13673 18227 333171 829719 1095214 1101962 1402912 2160109 2776891 2743799 2195966 1477822
13663 1477822 795296 428072 637075 1171471 1421424 1230166 1067773 1272416 1590094
13654 1590094 1617077 1322856 1011484 992748 1234768 1157405 99989 -1634191 -2672651
13645 -2672651 -2165038 -1042739 -811728 -1454240 -1683822 -1127131 -824488 -1287713 -1540970
13636 -1540970 -851944 -116363 -366745 -893497 -315459 1009812 1245600 -229752 -1800889
13627 -1800889 -1685918 49965 2007147 3019896 2674830 1197490 -391153 -709317 522358
13618 522358 1941127 2251463 1909035 2120765 2724511 2466451 1258559 601018 1331858
13609 1331858 2307585 2100506 979173 275007 502096 1029170 1118815 463503 -873668
13600 -873668 -2236047 -2491144 -1250389 303830 690122 44748 -145823 808301 1866541
13591 1866541 1731216 526455 -435855 -209107 822794 1440551 890716 -371461 -1295105
13582 -1295105 -1398011 -948189 -187155 847894 1664291 1483285 488944 -87981 252469
13573 252469 460963 -267844 -993276 -523214 555154 819591 245380 -154338 -362228
13564 -362228 -1156057 -2088102 -1643273 321425 2028589 2137849 1198496 325916 -175875
13555 -175875 -415179 -471473 -823823 -1956927 -3152671 -3022675 -1628408 -582955 -593454
13546 -593454 -594707 14388 179762 -649012 -1021888 262452 1946512 2215425 1607550 1939068
13536 1939068 3095058 3123042 1361615 -543519 -1033033 -443044 14106 -180081 -780699
13527 -780699 -1327239 -1335207 -649172 113810 57786 -916319 -2056701 -2760242 -3016602 -2911727
13517 -2911727 -2393168 -1588140 -758810 53593 771726 836640 -162514 -1432345 -1505895 -126309
13507 -126309 1222522 1139153 1475 -748710 -528785 -64916 -57285 -169933 318164 1308941
13497 1308941 1911480 1654800 1116335 1028009 1208920 979800 376935 134755 408185 392861
13487 392861 -393219 -1203217 -1052060 -92686 665528 665040 155445 -537285 -1377366 -2208717
13477 -2208717 -2545592 -2040823 -967415 -54829 202631 76897 272822 913762 1226621
13468 1226621 723256 266592 997212 2375638 2607635 1286797 176352 612237 1504952
13459 1504952 1151089 -72849 -414753 517808 1427821 1493014 1214118 1038555 697120
13450 697120 227982 213976 492280 2140 -1351498 -1984561 -835353 791682 917115
13441 917115 -310633 -1051669 -706339 -679431 -1844702 -2815540 -1812909 669518 2339610
13432 2339610 1907279 246257 -1202692 -1997883 -2288225 -1917350 -793625 434794 975075
13423 975075 907951 860482 875106 418996 -543663 -1320661 -1454245 -1209132 -968586 -841964
13413 -841964 -1025765 -1772428 -2670546 -2682783 -1382848 388150 1541530 1925659 2070302
13404 2070302 2248962 2313004 2102017 1551808 664041 -285003 -812458 -797088 -622305 -506955
13394 -506955 -181403 432823 762985 291536 -715787 -1662934 -2352303 -2733955 -2423296
13385 -2423296 -1232248 74120 365249 -447077 -1189160 -815755 332876 893384 4769
13376 4769 -1666420 -2538868 -1780616 -127848 1108366 1410725 991022 -45583 -1492362
13367 -1492362 -2338018 -1592114 79226 832674 71718 -905299 -1099991 -1162324 -1738313
13358 -1738313 -1955619 -839946 861210 1655846 1299019 527979 -370421 -1315042 -1505784
13349 -1505784 -377280 993213 1083880 255553 210120 1235733 1765676 934700 -96504
13340 -96504 26768 1029027 1716433 1491480 507118 -836682 -1903145 -1971250 -960053
13331 -960053 380520 1264126 1435405 924384 -77538 -949334 -958945 -126134 756852 1097131
13321 1097131 970541 633349 245285 116798 500981 1031851 1050784 555059 136022 9557
13311 9557 -66958 41431 734838 1611106 1633844 710874 33092 350526 923540 807655
13301 807655 232862 -74890 -141403 -404749 -703291 -545149 -80780 35723 -343716 -646015
13291 -646015 -376499 317588 905245 1016815 734852 471526 526922 822938 1187228 1609585
13281 1609585 1849117 1234581 -344051 -1574224 -1038285 575172 934387 -806390 -2665290
13272 -2665290 -2456018 -607761 763414 715293 58674 -402364 -752079 -1127904 -1266874
13263 -1266874 -1159375 -1230581 -1553992 -1612432 -1167570 -756806 -933153 -1440717 -1552890 -1013837
13253 -1013837 -326677 -166850 -684481 -1401216 -1740479 -1578609 -1187930 -786903 -486983
13244 -486983 -614118 -1471495 -2538988 -2563417 -1034827 868611 1518946 762907 -137380
13235 -137380 -336460 -303051 -755398 -1525951 -1894029 -1477447 -376248 1092289 2349051
13226 2349051 2679451 1978508 1088078 809838 827557 319629 -522163 -573285 396522 1021707
13216 1021707 185089 -1256035 -1652406 -961641 -632330 -1196572 -1493823 -739664 89738
13207 89738 -97607 -675055 -450879 195675 -20740 -891716 -811294 554803 1453991 605581
13197 605581 -873207 -1142472 -188171 487985 46865 -999421 -1882902 -2241649 -1851632
13188 -1851632 -734499 412226 734206 289504 -68378 106069 497781 926712 1703715
13179 1703715 2754997 3206028 2455052 1127492 283323 4588 -495493 -1453640 -2011923
13170 -2011923 -1366846 46932 979624 793657 48404 -367501 -309977 -320289 -689935 -1011384
13160 -1011384 -781787 -116432 443395 633294 584503 343508 -205117 -844005 -1036382 -771833
13150 -771833 -830828 -1586242 -2000838 -788596 1515319 2775037 1931383 442527 307606
13141 307606 1475768 2264119 1808848 821282 52863 -622968 -1273941 -1274688 -336138 643815
13131 643815 569753 -457706 -1374830 -1434051 -737716 130294 479825 -128463 -1347530 -2131960
13121 -2131960 -1849936 -1030553 -552062 -467848 -235157 227423 461044 321836 209359 393351
13111 393351 654844 673955 372213 -153811 -706841 -1020464 -980125 -716625 -289393 457866
13101 457866 1460133 2185798 2169800 1474458 366792 -937248 -1863425 -1572287 -148559
13092 -148559 980879 687838 -371517 -846781 -653617 -668047 -979494 -890192 -436518 -401462
13082 -401462 -758878 -562493 387977 1167548 1356613 1680052 2525372 3141501 2982261 2682211
13072 2682211 2941824 3419280 3425229 2830719 1719644 131775 -1266146 -1363473 -192125
13063 -192125 742928 483672 -158697 -224279 -141466 -508796 -628139 255089 1288121 1250756
13053 1250756 666842 940375 1968401 2390569 1802895 929909 -71225 -1527222 -2626126
13044 -2626126 -2026259 -317698 270519 -814106 -1532406 -543789 676980 404459 -486371
13035 -486371 -110065 1276938 1811521 1024370 244908 205161 174068 -264281 -270029 759878
13025 759878 2043866 2584059 2567305 2715409 2861583 2173188 626714 -622538 -602819
13016 -602819 250375 622611 -127220 -1348571 -2051207 -2024444 -1687688 -1209087 -432146 408260
13006 408260 697813 406247 282584 671657 909945 544656 350575 1093935 1891905 1226093
12996 1226093 -552873 -1292127 655 1675040 1717230 359116 -671864 -648033 -253121
12987 -253121 62473 689848 1703957 2308562 1924645 1031996 398006 21506 -620616
12978 -620616 -1620354 -2447554 -2604931 -2132364 -1467735 -970891 -582585 40267 943061 1523169
12968 1523169 1074088 -267550 -1437005 -1482990 -521416 460893 604455 -75380 -772033
12959 -772033 -687332 97898 609433 72395 -1076070 -1635760 -1078311 -91710 376210 154917
12949 154917 -222083 -177324 538571 1699151 2559317 2389667 1399067 742347 1206220 2204831
12939 2204831 2513641 1739755 601194 -64964 -92440 126363 106610 -371437 -1042438 -1295293
12929 -1295293 -777230 175060 872243 907086 313404 -608252 -1326951 -1263391 -404449 445964
12919 445964 503014 -39567 -359820 -184871 -37316 -325864 -830876 -1253063 -1667854 -2101298
12909 -2101298 -2129755 -1348073 22373 1357023 2250390 2602851 2366232 1678657 1088581
12900 1088581 1051554 1160094 482611 -1083191 -2371409 -2329210 -1382137 -793825 -1005214
12891 -1005214 -1418309 -1638087 -1873821 -1958113 -1138059 549384 1698207 1231161 -70825
12882 -70825 -731973 -634347 -735051 -1203096 -1217058 -523085 101578 68576 -420830 -1059271
12872 -1059271 -1643079 -1607302 -578528 547023 429890 -652060 -1060730 -408208 -226640
12863 -226640 -1421923 -2777677 -2941754 -2303927 -1746223 -1046962 77336 706181 97126
12854 97126 -751934 -515748 452549 1098863 1599781 2494130 2857566 1532577 -403890
12845 -403890 -728921 517742 978446 -455547 -2147888 -2338911 -1408673 -737857 -797307
12836 -797307 -1212106 -1601793 -1637033 -1128006 -526567 -528797 -935000 -839613 -136838 252755
12826 252755 -35477 -106397 813632 2174782 2810542 2261624 1098919 374335 729656
12817 729656 1572345 1477562 71891 -1113264 -703685 350863 181278 -1040799 -1460248
12808 -1460248 -571631 235176 239709 291070 725786 594344 -274797 -532941 352325 962198
12798 962198 336698 -296333 355284 1397109 1286273 385862 253385 1182792 2005997
12789 2005997 1853660 922966 -60732 -271404 726321 2182875 2627927 1776519 981673
12780 981673 1119407 1323206 797215 473695 1432106 2802587 2875437 1542176 115847
12771 115847 -662138 -987269 -902882 -299968 317312 324324 -21016 -66675 171725 372535
12761 372535 705296 1230365 1229164 336399 -381032 158241 1184868 1108097 -90123 -1027738
12751 -1027738 -1128445 -1084997 -1304634 -1416726 -1305030 -1249516 -1042092 -253631 654403 781381
12741 781381 314782 271773 708345 606253 -277474 -872537 -526956 -35202 -360079 -1275075
12731 -1275075 -1838542 -1553336 -683794 50693 -46907 -954655 -1748368 -1674183 -1169941 -1112646
12721 -1112646 -1437125 -1491497 -1410596 -1873704 -2636108 -2679638 -1930502 -1463669 -1697677 -1701906
12711 -1701906 -812252 223307 373771 -294571 -985309 -1202883 -901206 -234260 394013
12702 394013 540702 247802 -141032 -686207 -1610214 -2363984 -1994411 -704196 30524
12693 30524 -624213 -1786401 -2237609 -1943141 -1526847 -1093100 -436697 168969 268224 -6136
12683 -6136 -126447 101500 483162 813090 903020 594344 139732 155537 748597 1126192
12673 1126192 613221 -326570 -715574 -451576 -382421 -1027428 -1850221 -2009982 -1442204 -874565
12663 -874565 -862892 -1086690 -792229 136246 880427 635899 -450227 -1567127 -2120553
12654 -2120553 -1936652 -1044984 69026 416125 -315984 -778054 608839 3184191 4413779
12645 4413779 3162348 1174760 479530 731954 452872 -289908 -287033 347371 180081
12636 180081 -1012052 -1625973 -682926 718873 1175238 799708 341946 -229715 -1074702
12627 -1074702 -1480455 -892887 -125507 -103453 -145598 832716 2002216 1539541 -299363
12618 -299363 -1224880 -357647 561088 143757 -601202 -390715 132822 -97321 -539668 -323937
12608 -323937 -146355 -899137 -1614393 -948387 275264 347827 -311031 -10653 886731 398602
12598 398602 -1365496 -1943052 -516208 699448 65107 -1103095 -1112659 -537659 -681263
12589 -681263 -1311306 -1580007 -1615661 -1660238 -1105427 85044 411070 -1094235 -3057308
12580 -3057308 -3597473 -2871691 -2289604 -2223553 -1984603 -1196048 92046 1740320 2920493
12571 2920493 2408277 586551 -319669 711682 1901981 1630063 1037153 1623856 2198739
12562 2198739 957176 -899920 -758592 1076483 1802410 487096 -1003977 -1382193 -1329822
12553 -1329822 -1299183 -671639 387132 687509 170195 39540 312451 -390203 -2023936
12544 -2023936 -2551237 -1101839 606166 1129422 1394124 2509244 3443804 2679466 808275
12535 808275 -318338 -199427 114269 -81738 -396699 -342259 -88290 -87045 -373155 -369654
12525 -369654 501616 1881408 2583907 2110847 1443440 1565848 1965404 1741892 1397907
12516 1397907 1915338 2643368 2044895 316168 -755058 -576748 -358348 -691537 -609565
12507 -609565 383333 1277745 1298711 984833 829589 504755 150478 711125 2064619 2443837
12497 2443837 841909 -1358130 -2263858 -1832218 -1316902 -1388199 -1821151 -2255515 -2401824
12488 -2401824 -2079153 -1558011 -1261045 -978139 -253220 460531 225540 -754302 -1287061
12479 -1287061 -1064043 -907552 -1055095 -844159 -283209 -158479 -327914 179241 1053486
12470 1053486 813581 -499961 -1023627 -184833 254885 -738637 -1756817 -1554431 -1037479
12461 -1037479 -1165145 -1144075 -439604 -403797 -1893307 -3209845 -2579555 -1015675 -542677
12452 -542677 -1084503 -1307560 -1146853 -1220306 -973219 280629 1506667 1356865 462338
12443 462338 188132 156686 -687665 -1538920 -797421 978695 1695801 907624 58949 -106602
12433 -106602 -131211 -137311 248377 525924 41069 -258825 918419 2514497 2232971 279431
12423 279431 -712886 221096 1094677 453507 -542055 -667581 -832978 -2095657 -3345766
12414 -3345766 -2832353 -845902 756775 983903 347514 -385764 -912714 -1110117 -913591
12405 -913591 -482674 -108246 -33915 -372381 -860223 -842265 -76471 618193 272689 -808235
12395 -808235 -1402922 -1073916 -562256 -495356 -711019 -950750 -1204998 -1202151 -560274 310912
12385 310912 429283 -330830 -931605 -639658 43654 324350 242035 379013 961038 1637073
12375 1637073 1871172 1457333 893041 1005644 1781152 2032805 987652 -301250 -213252
12366 -213252 1129858 2128087 2121127 2036151 2460512 2657371 2097435 1569311 1858292 2379117
12356 2379117 2114584 1146700 290681 -214989 -689221 -1062810 -921043 -398623 -201447
12347 -201447 -594993 -987405 -799008 -323118 -294517 -775976 -1041293 -765746 -740197 -1722740
12337 -1722740 -2946927 -2847064 -1339086 -167641 -512926 -1489727 -1850178 -1917480 -2513199
12328 -2513199 -3008502 -2201599 -589151 87201 -569465 -1220527 -1051536 -687779 -606236
12319 -606236 -422458 -281472 -1138644 -2738254 -3008941 -817918 1996085 2876924 1845327
12310 1845327 888979 809738 629087 -51860 -152781 850107 1654933 966501 -515131
12301 -515131 -1162042 -770892 -502459 -785663 -774550 -135927 59427 -929038 -1958276 -1411250
12291 -1411250 395564 1528911 1029692 -60427 -419679 -37130 331769 330879 53310
12282 53310 -368725 -702594 -677747 -444720 -408901 -429129 54659 901483 1232431 839019
12272 839019 572228 868005 1031084 607859 251241 384177 234484 -737594 -1624475 -1539596
12262 -1539596 -1214567 -1693791 -2410358 -2193183 -1393697 -1219210 -1510386 -1074156 36250
12253 36250 439978 -362389 -1369290 -1752353 -1606358 -982908 206230 1157210 699901
12244 699901 -765681 -1377520 -320726 1161748 1710253 1393994 804863 54522 -602214
12235 -602214 -465336 423090 891424 263371 -647238 -949849 -1016072 -1484806 -1955700 -1803346
12225 -1803346 -1478446 -1769282 -2340407 -2243452 -1517115 -1058208 -1076961 -894705 -328793 -98220
12215 -98220 -516463 -823655 -414117 107302 -88144 -585816 -269053 871388 1574845 1170849
12205 1170849 550999 697443 1157575 926103 189138 -6905 486773 758318 389480
12196 389480 -62168 -236526 -366769 -288374 588843 1894221 2258641 1291021 277531
12187 277531 186044 315646 -201662 -929616 -1215824 -1419925 -1854998 -1804341 -934496 -394010
12177 -394010 -983784 -1505714 -675742 521350 371146 -740652 -1232687 -1161716 -1704773
12168 -1704773 -2434886 -1794885 -122894 473882 -504829 -1251252 -819895 -528831 -1346781
12159 -1346781 -2150693 -1799563 -1099985 -1348847 -2283316 -2727609 -2259761 -1225780 26387
12150 26387 1079998 1377719 900474 293249 -65104 -392243 -699562 -583864 -102045 41424
12140 41424 -536396 -1490250 -2348554 -2720574 -2131031 -736552 69356 -869091 -2571097
12131 -2571097 -3017278 -2032862 -1347510 -1728448 -1988503 -1271892 -453447 -513561 -1077834 -1345253
12121 -1345253 -1185334 -756223 -285438 -560003 -2178497 -4015694 -4106287 -2477060 -1296975
12112 -1296975 -1654420 -2136951 -1445943 -442275 -386331 -859234 -798834 -225708 317024 811611
12102 811611 1137590 629862 -649211 -1397233 -878094 -60849 28049 -152461 218986 894008
12092 894008 1278101 1405179 1258675 404115 -772624 -876049 414086 1514932 1291861
12083 1291861 723444 1024048 1698390 1858844 1920686 2429002 2661030 2025270 1438993 1651204
12073 1651204 1685532 788168 352886 1672931 3155631 2365324 -99016 -1437785 -809065
12064 -809065 -8877 -185980 -449114 -8541 530692 533583 231983 -188474 -925337 -1681264
12054 -1681264 -1771077 -1282357 -916941 -686742 -36767 829956 1140603 1028966 1395586 2219291
12044 2219291 2392398 1434977 163936 -528172 -537862 -191846 -10073 -644756 -1992455
12035 -1992455 -2687689 -1701830 -62255 431920 -191202 -428583 42564 36545 -738597 -1010616
12025 -1010616 -194702 538523 216034 -504426 -695058 -536068 -440141 -95815 614605 860936
12015 860936 123341 -655510 -260901 1048205 1943930 1757350 984452 372683 206628
12006 206628 358874 565559 692845 869826 1172403 1264669 813809 162216 -56556 89134
11996 89134 -4057 -341863 -312684 103857 186506 -193376 -245100 245061 308839 -509736 -1010826
11985 -1010826 -66785 1382506 1503093 273186 -500131 189102 1379563 1919744 2012926
11976 2012926 2243368 2225171 1401214 507761 848342 2210770 2825996 1738238 79372
11967 79372 -657657 -633954 -984385 -1835678 -2264743 -1974829 -1710658 -1853000 -1768278 -992842
11957 -992842 -114501 107672 -202547 -418231 -262637 205627 879486 1352390 942849 -405811
11947 -405811 -1656133 -1694183 -538489 883862 1782624 1873918 1140214 -138435 -1270055
11938 -1270055 -1577662 -997356 -140121 127354 -720298 -2252340 -3133545 -2394524 -650498
11929 -650498 601080 802425 571498 239714 -551828 -1575506 -1772245 -877003 34589
11920 34589 346293 892062 2216715 3215803 2768282 1573222 966641 881765 447125 -247227
11910 -247227 -556784 -766779 -1543083 -2403582 -2347942 -1644067 -1411784 -1716996 -1653751 -1098256
11900 -1098256 -772297 -697840 -244559 309682 -13307 -981031 -1197320 -415300 -58687 -806586
11890 -806586 -1320897 -359897 1181864 1515420 349829 -1010942 -1354664 -496041 940801
11881 940801 1914184 1600254 344872 -393635 301598 1537223 1655576 343839 -997354
11872 -997354 -1068128 -290647 -217128 -1459752 -2705886 -2201533 -21445 1823055 1733288
11863 1733288 272245 -882780 -1013120 -646461 -401226 -547346 -1324228 -2579445 -3268865
11854 -3268865 -2470792 -904614 -279774 -969738 -1531925 -943832 -132060 -506143 -1859922
11845 -1859922 -2700077 -2202972 -981808 -116996 -130884 -835727 -1589226 -1670566 -890844 71828
11835 71828 321878 -166914 -480435 46052 959824 1385280 1265441 1278435 1594512 1530380
11825 1530380 731128 -114399 -351174 -435569 -1053606 -1740805 -1534465 -682716 -401799 -963879
11815 -963879 -1346300 -976473 -546340 -725435 -1239602 -1647123 -1920194 -1874934 -1189000 -357331
11805 -357331 -344730 -878523 -541942 907301 1945045 1721880 1300254 1456263 1177321
11796 1177321 -219055 -1340618 -929020 -151670 -572469 -1298789 -575640 948684 1254574
11787 1254574 495339 652504 1899008 2152306 541584 -1262235 -1803453 -1665839 -1734344
11778 -1734344 -1624140 -846967 25468 326672 225997 27714 -307267 -469576 88558
11769 88558 877514 603503 -686130 -1115056 438735 2488347 2808316 1316788 -81073
11760 -81073 -67193 770277 1167597 891830 768337 1219168 1375610 232885 -1537199 -2007551
11750 -2007551 -584943 998680 1061278 137528 -376372 -528232 -1115540 -1652447 -1050302
11741 -1050302 190630 544167 -12288 -103548 436446 216982 -1146369 -2198209 -1987896
11732 -1987896 -1406240 -1415485 -1564999 -1139527 -445754 -113078 -169541 -433698 -870761 -1175600
11722 -1175600 -981721 -652737 -764811 -848785 -68525 910740 526126 -1024267 -1707961
11713 -1707961 -751982 183462 -299353 -1396623 -1853139 -1824432 -1805161 -1365182 -279817
11704 -279817 519909 421733 219497 511215 455245 -496331 -1088042 -162656 1170564 1111424
11694 1111424 -65636 -734689 -655447 -952642 -1739732 -1807413 -799508 50015 -210726
11685 -210726 -959827 -1090236 -445059 293334 506477 110248 -451847 -550842 -13994 633589
11675 633589 832486 637029 365701 -5267 -586297 -1033739 -843415 -17862 980088 1704968
11665 1704968 1805979 1027155 -346246 -1369110 -1354737 -713135 -340178 -355459 -38806
11656 -38806 1004087 2153128 2419477 1497150 36162 -988949 -1091315 -524387 133323
11647 133323 492950 472788 189618 -73445 -169 440261 966015 1363910 1583230 1394183
11637 1394183 529307 -605423 -1056463 -565633 26415 76827 -13942 162950 180881 -176214
11627 -176214 -130880 678038 1100750 227980 -782860 -336920 1023071 1581200 1228246
11618 1228246 1133110 1234576 488489 -657431 -621740 392735 443411 -810120 -1424079
11609 -1424079 -528007 204331 -512993 -1564437 -1670000 -1505547 -2092643 -2879045 -2930242
11600 -2930242 -2496865 -2037512 -1160842 176721 921305 661628 599025 1441384 1897699
11591 1897699 781755 -885806 -1535260 -1427091 -1608332 -1746982 -935601 320783 845011
11582 845011 782569 1046097 1389759 822097 -499721 -1454961 -1722845 -1864574 -1960367 -1609588
11572 -1609588 -1037126 -844952 -887669 -657660 -495357 -1062880 -1804126 -1360759 363883
11563 363883 1786276 1580568 134601 -1176403 -1461538 -850471 -110249 41245 -504784
11554 -504784 -1276646 -1781707 -1809304 -1281612 -348255 373303 336524 -96461 -95441 372446
11544 372446 625874 550126 612532 597759 -202022 -1323158 -1321153 -107203 647558 164868
11534 164868 -192904 648733 1580955 1215085 139885 -270940 -51243 -92499 -447146 -649065
11524 -649065 -814613 -1104205 -1009713 -381691 -103124 -523621 -470383 765084 1770611 1046231
11514 1046231 -494943 -954037 -359165 -103114 -279124 192027 1174532 1245526 48581
11505 48581 -1124913 -1323724 -1026929 -1039557 -1491844 -2071801 -2336383 -1877644 -952474 -569545
11495 -569545 -1121412 -1500253 -553220 1183381 2252766 2170929 1487229 620097 -210371
11486 -210371 -502155 -84000 335014 214389 58377 286784 221364 -611261 -1203841 -484897
11476 -484897 936522 1830302 2119741 2132900 1289474 -652522 -2137279 -1648453 -138935
11467 -138935 426361 95513 286112 931289 781086 56041 176930 1003144 923143 -196253
11457 -196253 -656000 164868 955901 1032363 1390194 2415857 2718992 1372345 -409561
11448 -409561 -1003644 -509490 -155816 -590839 -1564314 -2509822 -2874442 -2497775 -1891508 -1555038
11438 -1555038 -1218023 -607799 -505114 -1740763 -3459037 -3865453 -2592403 -906817 263832
11429 263832 992280 1224151 696580 -7849 11760 349934 -160078 -1310265 -1734556 -1276251
11419 -1276251 -1132323 -1439284 -891857 705004 1687738 1222558 742561 1542768 2642742
11410 2642742 2351226 640435 -1246303 -2459055 -2755378 -2060533 -826197 -14409 57946
11401 57946 62444 330708 258215 -356331 -591977 135869 1025802 1248578 1296739 1867107
11391 1867107 2298190 1446814 -350098 -1436114 -899205 412880 1031553 460905 -502594
11382 -502594 -788994 -263662 196430 -98266 -760362 -1031961 -919015 -907676 -942353 -649992
11372 -649992 -366326 -835609 -1861350 -2324470 -1743107 -873867 -510136 -522448 -380854 81659
11362 81659 719124 1358360 1842708 2116675 2206152 1892312 850014 -531256 -1206723 -963570
11352 -963570 -926430 -1707846 -2147491 -1162016 244786 479531 -93018 -75896 262419 -469015
11342 -469015 -1948611 -2337392 -1351582 -736564 -1349900 -2063238 -2067922 -2032628 -2269660 -1913137
11332 -1913137 -829077 -335388 -975128 -1415552 -693657 142215 -162459 -1157071 -1804513
11323 -1804513 -2111221 -2395328 -2210324 -1310828 -628332 -1011953 -1837330 -1965186 -1323580
11314 -1323580 -592587 -77246 222899 124176 -378898 -877264 -1211272 -1656405 -2088185 -1909121
11304 -1909121 -1186722 -780014 -913360 -818560 -264354 -110681 -721555 -1189447 -888968 -464760
11294 -464760 -466120 -383199 21135 -166336 -1390002 -2391090 -1883037 -426418 588944
11285 588944 849675 802677 450644 -175554 -228606 783956 1682392 948717 -1023837 -2382403
11275 -2382403 -2266785 -1545726 -1209039 -1214067 -1099631 -850547 -811501 -1152102 -1587099 -1546091
11265 -1546091 -769871 265521 871718 996353 967904 593398 -492781 -1575310 -1225277
11256 -1225277 661963 2338989 2265286 683462 -1317537 -3113754 -4247700 -4038148 -2488154
11247 -2488154 -740985 221312 593497 827712 667327 -95937 -832151 -954314 -806081
11238 -806081 -846832 -779430 -344230 -114221 -513478 -823846 -243592 684689 784228 -41272
11228 -41272 -750742 -527605 519579 1681760 2128871 1525408 620912 619302 1557438 2134928
11218 2134928 1632366 944134 952368 987766 35986 -1385873 -1870641 -1174479 -448768 -620427
11208 -620427 -1443533 -2037757 -1758223 -738684 76616 -107364 -743687 -554828 361401
11199 361401 278440 -1572470 -3478267 -3495662 -2125411 -1310378 -1663088 -2335832 -3002879
11190 -3002879 -4064181 -5010700 -4499252 -2528829 -1034113 -1517919 -3084978 -3635356 -2380205
11181 -2380205 -403146 940533 1408998 1559915 1616979 1200573 197909 -680799 -726056
11172 -726056 -292405 -333336 -981444 -1399871 -1119638 -662777 -583555 -714654 -713860 -577495
11162 -577495 -236824 542708 1416336 1451872 413535 -747198 -1267619 -1588034 -2267740
11153 -2267740 -2755624 -2234139 -1059397 -303797 -289157 -596529 -1162048 -2167798 -2929548
11144 -2929548 -2184000 72876 1993750 1858481 143134 -1132128 -907867 -119716 -64523
11135 -64523 -567495 -502569 332922 904440 515371 -320028 -871735 -1116410 -1256593 -1287627
11125 -1287627 -1536232 -2536944 -3743478 -3655749 -2127985 -1083862 -1651487 -2173462 -897617
11116 -897617 865806 726713 -775201 -1053266 198060 701160 -326001 -957825 -105993
11107 -105993 653978 -52444 -1225072 -1514570 -1265361 -1185261 -908027 -231384 -30475 -632597
11097 -632597 -930484 -336049 61721 -467240 -835448 -113252 686479 307222 -763974
11088 -763974 -1486565 -1959097 -2400964 -1964546 -294908 1091956 825261 -125072 -130201 357850
11078 357850 -194610 -1544287 -2008654 -1231481 -557655 -718995 -914991 -367196 599348
11069 599348 1261007 1290145 744610 -3087 -388792 -246001 -2969 91917 344117 762279
11059 762279 679327 -100537 -650569 -256261 402280 309221 -375981 -805996 -807757 -829767
11049 -829767 -1053169 -1392560 -1912191 -2490372 -2490772 -1439842 237969 1531959 1616465 358522
11039 358522 -1336412 -1909084 -828763 388348 84855 -1009661 -890413 388826 802377
11030 802377 -94196 -367023 788829 1461256 281614 -1227948 -1321275 -850200 -1392776
11021 -1392776 -2380412 -2253075 -1092486 -78753 519379 972248 824290 -227224 -1215784
11012 -1215784 -1294108 -1171166 -1634887 -1899392 -1131881 -360567 -913622 -1992788 -1813971
11003 -1813971 -415157 547270 234718 -758204 -1622940 -1715507 -423782 1891173 3493555
10994 3493555 3161710 1820855 1154461 1439195 1848288 1870002 1290202 -97706 -1634160
10985 -1634160 -1921327 -931628 -498644 -1516545 -2434943 -1995419 -1456697 -2183110 -2986894
10976 -2986894 -2215177 -785010 -574477 -1214526 -1160607 -767924 -1499059 -2916971 -3226542
10967 -3226542 -2294711 -1615217 -1674444 -1677968 -1511530 -1759755 -2101231 -1718389 -958025 -774756
10957 -774756 -1067402 -1278764 -1803550 -2952982 -3551128 -2636813 -1486902 -1691194 -2348236
10948 -2348236 -1697783 -425716 -457090 -1337451 -981652 445596 639129 -903492 -2148271
10939 -2148271 -1992462 -1572898 -1657435 -1438054 -582307 -73809 -285479 -331429 32756 -154067
10929 -154067 -1127738 -1743880 -1324038 -514491 101229 627324 771825 -192605 -1924639
10920 -1924639 -2926300 -2419759 -1191149 -408661 -644483 -1930805 -3625793 -4438955 -3723291
10911 -3723291 -2405002 -1622003 -1172196 -504133 -198225 -846779 -1488767 -1058274 -476933
10902 -476933 -1233424 -2662486 -2820394 -1474675 -111456 471023 541525 87506 -824004
10893 -824004 -1088519 -112857 566018 -491849 -1856101 -1372140 -36359 -550853 -2688158
10884 -2688158 -3546791 -2248284 -949371 -975086 -1247784 -1028898 -1050025 -1225999 -275516
10875 -275516 1459681 1639020 -509594 -2718736 -2928867 -1843392 -1166039 -1240471 -1489088
10866 -1489088 -1561809 -1210456 -394020 87896 -510417 -1313959 -846524 472719 819892
10857 819892 -99867 -785089 -687713 -932733 -1976631 -2771331 -2725741 -2468429 -2251409 -1559617
10847 -1559617 -661343 -610479 -1374850 -1808379 -1669822 -1783708 -2122827 -1748686 -759549 -257830
10837 -257830 -305730 11218 482354 -34484 -1235874 -1484750 -504330 275739 276783 425613
10827 425613 989710 999318 211412 -418859 -565243 -916119 -1564181 -1867315 -1908536 -2260138
10817 -2260138 -2554834 -2223502 -2110808 -3134471 -4031332 -3050457 -1258165 -1230049 -2904023
10808 -2904023 -3844989 -3350152 -3028811 -3379819 -3128999 -2108281 -1542358 -1321338 -251281
10799 -251281 916340 206718 -1680227 -1930443 -424900 -49272 -1559065 -2266686 -975233
10790 -975233 -115887 -1312923 -2603389 -2061773 -854594 -620484 -765459 -363827 -83389
10781 -83389 -382619 -295699 355182 55216 -1548305 -2440361 -1460303 -229777 -299792 -847174
10771 -847174 -815102 -926940 -1859646 -2592504 -2208673 -1422312 -1012369 -673850 -441052 -1103470
10761 -1103470 -2281016 -2427424 -1662457 -2058724 -4091201 -5479253 -4778511 -3458473 -3038643
10752 -3038643 -2778375 -1773032 -916909 -1092875 -1465406 -1104435 -548829 -588865 -1150724
10743 -1150724 -2100554 -3338941 -3771417 -2394685 -603782 -835270 -2694170 -3310963 -1848125
10734 -1848125 -503444 -598839 -1050080 -1347324 -2479066 -3978791 -3687461 -1663771 -808422
10725 -808422 -2236277 -3421927 -2371955 -378143 741672 910226 62312 -2468151 -5514979
10716 -5514979 -6391390 -4906276 -3726071 -3749547 -2959607 -1034829 -793972 -3223122 -5194518
10707 -5194518 -4337772 -2448053 -1895244 -2229186 -2438377 -3050928 -3968832 -3691622 -2510022
10698 -2510022 -2831216 -4674203 -4876423 -2546244 -897779 -1594358 -1963199 -375311 426801
10689 426801 -1502614 -3451007 -2906298 -1959280 -3023558 -4178953 -2890958 -797424 -596966
10680 -596966 -1316189 -789254 4385 -864594 -2272557 -2125965 -1240463 -1574395 -2648099
10671 -2648099 -2965123 -2969306 -3620672 -4076175 -3467894 -2853705 -3037883 -2847508 -1733836 -1328888
10661 -1328888 -2270035 -2550019 -1267840 -711018 -2300559 -3883662 -3568446 -2756612 -2851753
10652 -2851753 -2655607 -1644530 -1895275 -3922968 -4678286 -2719097 -1156901 -2173346 -3004168
10643 -3004168 -1139632 808133 -325042 -2758136 -3246262 -2509291 -2804148 -3356830 -2532700
10634 -2532700 -1563046 -2040647 -2597755 -1821133 -1402888 -2776141 -3916090 -3148429 -2692718
10625 -2692718 -4638345 -6854788 -6714155 -5423010 -4930770 -4177609 -2223880 -1342363 -3031401
10616 -3031401 -4649974 -3901048 -2846892 -3645703 -4402775 -3276620 -2474053 -3931377 -5235115
10607 -5235115 -4123503 -2798896 -3494694 -4160211 -2868815 -1907810 -3064655 -3675771 -1942630
10598 -1942630 -1104667 -3476642 -5571518 -4297016 -2674941 -3985512 -5633001 -4532678
10590 -4532678 -3167237 -4365755 -5533312 -4160648 -3426061 -5940858 -7754337 -5394942
10582 -5394942 -2976737 -4997264 -7911392 -6680701 -4054141 -5042500 -7428074 -6381252
10574 -6381252 -3773158 -4279710 -6516246 -6356025 -4885863 -5116197 -5221206 -2875053 -1494379
10565 -1494379 -4243174 -6974358 -5209286 -2575175 -3911676 -6026282 -4341782 -2470342
10557 -2470342 -5361123 -9052592 -7619810 -4421396 -5708779 -8832726 -7905260 -5528217
10549 -5528217 -7416855 -10794004 -9771222 -6928993 -7855462 -9734137 -7338900 -4552663
10541 -4552663 -7441172 -11773795 -10344104 -6686205 -8183198 -11799551 -10613823 -8109129
10533 -8109129 -11287257 -15972030 -14228351 -10002703 -11677416 -15733856 -14129057 -10822120
10525 -10822120 -13737634 -17736677 -13920328 -8247527 -11437289 -18129503 -16676372 -11576350
10517 -11576350 -14202825 -19615619 -16240677 -10101542 -14049212 -21556593 -18473329 -11820100
10509 -11820100 -17248305 -27176758 -23992852 -15577493 -21659005 -34006497 -30307938 -19063514
10501 -19063514 -25865436 -42597025 -40597530 -28220611 -38155796 -61402019 -59801048 -44202757
10493 -44202757 -62587053 -103541987 -105811529 -87267073 -150649977 -299409215 -361015567
10486 -361015567 -201255197 65063767 204230658 157317460 71911187 63288710 87595685
10479 87595685 72391336 39968435 40176150 56128805 47993957 28146323 28838790 39792698
10471 39792698 33788997 19920086 21999117 31652922 27102822 15700798 17687722 26925454
10463 26925454 24493235 14975086 15451753 22397350 20689249 13480895 14315364 20028600
10455 20028600 18092756 11555333 12052913 16623350 14475508 8757717 9839524 14500432
10447 14500432 12512983 6856179 7575123 12171641 11170958 6993298 8783627 14072284
10439 14072284 13460277 8584501 8321304 11644571 10651174 6447750 6260638 8668150 6959096
10430 6959096 3477953 5701810 11325005 11733106 7474734 6389215 8981838 9118650
10422 9118650 6846099 7417715 9693388 8159991 4555660 5235872 8817700 8448792 4692114
10413 4692114 4309754 7596217 8546032 6617906 6978647 9623990 9237789 5770815 4783980
10404 4783980 7058517 7517209 4753806 2666247 2502426 1762037 882990 2804194 6082382
10395 6082382 6316739 4059227 3771474 5629771 5891850 4524047 4857476 6491595 6058787
10386 6058787 4224754 4539664 6237152 5533755 3098246 2803874 4062103 2991556 376596
10377 376596 760304 4101928 5860539 5068530 4981332 5967118 5096453 2769292 2541689
10368 2541689 4180796 3863008 1532881 1202947 3492220 4547912 3079078 2154477 3217381
10359 3217381 4195927 4276414 5031864 6264673 5950027 4586638 4606917 5594726 5088486
10350 5088486 3603730 3610389 4289466 2949807 898939 1857500 4996719 5773999 3571898
10341 3571898 2286568 3186078 3417280 2098051 1792070 3079258 3398982 2272279 2293253
10332 2293253 3963399 4628762 3424236 2440089 2332914 1558896 439043 1138281 3141294
10323 3141294 3557952 2323885 2292592 3841541 4283605 3009912 2335632 2852905 2771308
10314 2771308 2150267 2877969 4240302 3589077 1645734 1877582 4256326 5067254 3453856
10305 3453856 2585213 3535857 3671087 2248263 1990388 3583628 4031354 2232925 1042082
10296 1042082 1923692 2547062 1651927 1458517 3096371 4236172 3518148 3028089 4119869
10287 4119869 4847158 3788155 2610562 2684783 2730410 1797392 1129603 1303623 965915
10278 965915 17480 510675 2779815 4213307 3441122 2261486 2011467 1675588 976270
10269 976270 1470410 3022551 3128516 1443170 971929 2877276 4201549 2994239 1683718
10260 1683718 2690246 4351146 4115567 2614635 1665141 1008777 -180104 -963526 -372512
10251 -372512 629311 1013161 1417922 2283154 2565474 1952825 1901381 2860335 3040214 1592248
10241 1592248 394205 983907 2301848 3072655 3711082 4282473 3522822 1687032 1344975
10232 1344975 3289648 4629933 3218277 1066752 834744 1663615 1330675 187289 -21412
10223 -21412 565476 630811 260668 388044 841322 957469 987711 1296242 1484409 1595593
10213 1595593 2513540 3943293 4014519 2258603 789086 1007031 1466024 743422 9325
10204 9325 660816 1667195 1572239 1134107 1618981 2272273 1860258 1116250 1301804 1761691
10194 1761691 1199035 121299 -175515 60158 -216856 -765950 -638422 22975 415889
10185 415889 489307 598163 716293 1070217 2314573 4076582 4803588 4015818 2986377
10176 2986377 2295177 919701 -1072866 -1531078 317585 1937796 1193485 -362825 -337382
10167 -337382 599462 448465 -389093 -170029 814950 916588 129573 -342987 -561695 -1209840
10157 -1209840 -1418576 13552 1976326 2344692 1320120 824737 1133080 896326 160461
10148 160461 430343 1639496 1853017 504611 -493231 392587 2316659 3627678 3804033
10139 3804033 3199915 2273922 1636010 1720572 2024175 1616360 520145 -362093 -606006
10130 -606006 -500116 -93236 820813 1836028 2164138 1714229 1028272 350921 -319044
10121 -319044 -626157 -341812 -40504 -227261 -311947 352145 1026585 645838 -217387 -138765
10111 -138765 719847 781458 -365452 -1368333 -1311798 -790899 -380661 300793 1341546
10102 1341546 1824030 1222670 360944 147407 353062 462308 800689 1828466 2972474
10093 2972474 3169094 2233595 896401 -229168 -959086 -1069133 -401042 488077 576131
10084 576131 -345144 -1171067 -775014 509811 1315836 1054556 554463 645751 895147 441987
10074 441987 -456450 -719342 -134316 298782 -70500 -574759 -300928 567515 1075159 753928
10064 753928 45755 -322988 -59693 466482 593642 134498 -300359 -67528 601145 972323
10054 972323 908849 893585 1057981 1012085 682861 499356 649298 946083 1447758 2265038
10044 2265038 2726473 1905565 234444 -627413 -6242 855604 666977 -224331 -722109
10035 -722109 -540019 -78359 356804 440709 -200402 -1173634 -1393802 -718047 -435200 -1196388
10025 -1196388 -1639919 -385008 1633975 2439724 1899783 1572891 2054839 2352508 1958393
10016 1958393 1732618 2188890 2407536 1509284 180787 -170522 805016 2158422 2781615
10007 2781615 2281791 1059674 -49065 -428722 -245492 -146484 -315455 -227892 493073
9998 493073 1439480 1934283 1801825 1284272 530619 -387095 -1132019 -1243185 -662421 140638
9988 140638 607067 504591 -37659 -696899 -1133083 -1156590 -808574 -279648 205367 435961
9978 435961 323235 49541 -71791 -22398 -142772 -564331 -864430 -665805 -320745 -423730
9968 -423730 -760281 -461352 679834 1783777 2108916 2028739 2270542 2715281 2630001 1851028
9958 1851028 1137794 1335765 2440505 3443783 3148070 1469745 -185328 -438228 339519
9949 339519 733923 536800 840919 1740047 1793367 525323 -469594 -152138 116490 -984942
9939 -984942 -2237739 -1919157 -800787 -721802 -1437552 -1463330 -988490 -1195090 -1547030 -688780
9929 -688780 589710 320120 -1106446 -1382695 -26271 1224670 1450095 1098315 46092
9920 46092 -1765140 -2472834 -573618 1707914 1162572 -1204238 -2020926 -1477196 -2294851
9911 -2294851 -3829724 -3177017 -1387366 -1860770 -3216830 -1526087 977593 -1167561 -5301382
9902 -5301382 -4203453 -2085354 -11403600 -28137843 -27914872 546256 33147920 39159637
9894 39159637 21632549 8938494 12717626 17394638 11097320 3371976 5111583 10275498
9886 10275498 8727853 3270151 2048252 3994844 3160086 412493 519522 2678366
9878 2678366 2942437 2099479 3266290 5022019 4028192 1575426 1128025 2005652 1373806
9869 1373806 -5691 424234 1781823 1551037 527285 1100178 2571454 2681478 1830116
9860 1830116 1604483 1253225 -302019 -1244644 239124 2173269 1996826 1107798 1969362
9851 1969362 3209819 2219610 352299 686925 2482729 2699253 1466874 1291183 2176246
9842 2176246 2224560 1891122 2980333 4414781 3631264 1415906 829856 1927710 1984151
9833 1984151 542866 -149517 421688 365226 -790345 -1431895 -1109832 -942039 -860934 144855
9823 144855 1282308 862374 -348365 -101978 1398011 2037730 1788626 2414690 3544031
9814 3544031 3015291 1122182 519753 1636449 2099434 1211314 1114267 2678387 3888158
9805 3888158 3398708 2429236 2046975 1582961 771084 631062 1255141 1352348 771944 849832
9795 849832 1607950 1397239 50694 -464627 569904 1394174 937086 474198 925190
9786 925190 1096761 31049 -1166013 -1275419 -804935 -604117 -397335 161967 573944
9777 573944 591163 738073 1014243 646754 -248244 -399726 614541 1711018 2163739 2457561
9767 2457561 2797587 2530655 1655315 1219053 1559099 1694908 1054077 335126 151607 217887
9757 217887 278852 510264 764773 756189 1006245 2132862 3315164 3129258 1766450 642866
9747 642866 63153 -664651 -1040070 208009 2330470 2736071 596184 -1924919 -2688557
9738 -2688557 -1803634 -302111 1262651 2172040 1543937 -100914 -939887 -233924 882031
9729 882031 1354025 1269957 734620 -363592 -1116566 -201040 1771276 2563012 1553431
9720 1553431 620022 1135140 2162114 2429910 2085150 1577083 685969 -397792 -742022
9711 -742022 -250157 67018 19993 626134 1927816 2403240 1408864 323240 343496 937591
9701 937591 1352519 1816930 2324075 2073826 1126733 816805 1526207 1883467 1221593 919466
9691 919466 2032677 3400730 3544717 2855155 2442803 2255956 1808076 1504330 1778577
9682 1778577 1942631 1204538 -32951 -925503 -1328327 -1332752 -715906 289403 741810 334167
9672 334167 -59524 120581 266834 -25053 -26682 777957 1583949 1437924 548130 -338100
9662 -338100 -918740 -1079952 -626214 212011 919075 1577365 2533440 3216720 2769016 1817885
9652 1817885 1793586 2408867 1991558 623492 436534 2015288 3095294 2107363 607639
9643 607639 587068 1524376 1903109 1723820 1560231 814961 -969417 -2374187 -1765880 226277
9633 226277 1679074 1968962 1771442 1346350 534662 -139245 65552 867987 1361961 1295770
9623 1295770 1092028 1064632 1252998 1450200 1078071 -36162 -641575 684952 2960807
9614 2960807 3366811 1089067 -1435296 -2105116 -1826336 -2192947 -2652110 -1924744 -535573
9605 -535573 155631 132634 30649 -446492 -1487711 -1803041 -373936 1453668 1711683
9596 1711683 782225 569937 1451446 2140921 2050833 1735695 1316369 384544 -674685 -953789
9586 -953789 -502891 -86430 293431 1194819 2319252 2734886 2356735 1917532 1650428 1201236
9576 1201236 632052 363760 326835 197403 205106 743883 1489271 1765436 1429729 726095
9566 726095 -118871 -527353 244355 1726829 2163179 858575 -583189 -602133 22585
9557 22585 -245059 -1074101 -1121642 -510044 -334744 -374749 486163 1852244 2018811 711977
9547 711977 -258519 540414 2492814 4024366 4210798 3149730 1722869 1015360 1197142
9538 1197142 1270204 634619 134357 483233 647557 -584580 -2203993 -2122446 -352412
9529 -352412 971760 731901 29122 -26079 125677 -200926 -546383 -101900 987532 1801545
9519 1801545 1685473 860801 273268 633563 1324737 959449 -421482 -816281 951661
9510 951661 3073277 3060791 1291819 174087 369516 276702 -772043 -1341616 -539073
9501 -539073 418436 315726 -219587 -221028 -237549 -1261580 -2794381 -3368033 -2516611 -1196982
9491 -1196982 -549457 -958565 -2019031 -2817825 -2501284 -1042450 715556 1985134 2671797
9482 2671797 2940216 2675150 1775921 645240 -69447 -159101 -17771 -92407 -291012 -99151
9472 -99151 629218 1263553 1182155 741726 761297 1137215 966478 198065 -52231 667669
9462 667669 1270571 900822 343185 569724 1052678 901604 639475 1192430 1920130 1513108
9452 1513108 354651 60840 897183 1591932 1687881 2039932 2679459 2279918 560896
9443 560896 -607732 280364 2087254 2588523 1413700 121504 -152739 118147 -34564
9434 -34564 -719482 -1210993 -881772 143266 1146625 1503568 1184355 686612 671142 1552262
9424 1552262 2971715 3661599 2567401 406303 -725265 140435 1571280 1751730 896989
9415 896989 531659 1067297 1524180 1349626 1059337 1012947 793761 49233 -968408 -1822658
9405 -1822658 -2091009 -1285462 487588 1957726 1902531 897987 686064 1724028 2620490
9396 2620490 2288707 1395663 1095443 1383838 1482123 1132144 742778 643010 765050 868659
9386 868659 773488 544414 514672 834153 1032246 465433 -779348 -1850801 -2036776 -1368590
9376 -1368590 -395948 310910 583256 866718 1700120 2691908 2626638 1162038 -297232
9367 -297232 -323507 584757 944050 633282 793849 1571456 1646623 370838 -1109830 -1542295
9357 -1542295 -1229354 -1236233 -1817306 -2418713 -2603735 -2261302 -1389948 -313627 285488 132747
9347 132747 -144344 210432 1080225 1711728 1703288 1246999 559681 -299209 -945363 -621080
9337 -621080 880802 2529067 2937156 1987572 917077 523584 117680 -1018178 -1939791
9328 -1939791 -1151999 912362 2095051 1369408 -28653 -762808 -1096342 -1597374 -1652491
9319 -1652491 -546845 1052932 1996657 2214402 2213140 1845185 838406 -169845 -403267
9310 -403267 -126189 113425 645445 1758812 2439731 1634561 161720 -344640 56941
9301 56941 -17946 -683193 -556733 704684 1560844 905021 -266974 -313102 914323 2073280
9291 2073280 1893768 376792 -1152737 -1187624 340997 1869111 2132914 1700212 1772691
9282 1772691 2199148 1908610 820417 -45619 -154534 46872 47759 -326383 -1111417 -1861380
9272 -1861380 -1669855 -553275 -6727 -946312 -2088373 -1912629 -1101151 -1038961 -1029455 421297
9262 421297 2346846 2348228 616603 -197479 674640 1095752 -16502 -886276 -212759 637259
9252 637259 337783 -108845 410101 923891 364149 -262984 266168 1111130 1022159 712258
9242 712258 1395345 2296956 1929585 835175 712103 1463317 1396708 86569 -1029445
9233 -1029445 -894007 73785 1148453 1991587 2119279 1178901 -30284 -139324 872883
9224 872883 1464539 589119 -971197 -1717906 -1130649 144529 1231112 1728780 1779715
9215 1779715 1741638 1768395 1694827 1336545 731978 43478 -531115 -711962 -341147 304047
9205 304047 752448 907952 998120 1058434 997557 1038726 1402470 1650883 1167264 255374
9195 255374 -123475 296518 932904 1487959 2087532 2290568 1369484 -124278 -520583 673615
9185 673615 1950602 1935192 1094391 594197 710795 1268686 2459694 4103809 5005940
9176 5005940 4192954 2219517 400578 -673367 -1183369 -1334205 -1240188 -979009 -345083
9167 -345083 722148 1298770 266537 -1717264 -2534449 -1534552 -536817 -981376 -1796857
9158 -1796857 -1451995 -511030 -391227 -870104 -778270 -212552 -56952 -8446 858715 1982877
9148 1982877 1838189 484586 -330942 205585 988623 976435 595319 582697 683515 231314
9138 231314 -751451 -1606699 -1756688 -1131347 -237667 210898 82665 23282 484835 997574
9128 997574 924927 382091 -251886 -1064147 -1991431 -2190112 -1161298 52239 68757 -815715
9118 -815715 -1128589 -468321 151444 135611 66534 428497 817972 781519 469471 166026
9108 166026 -20379 127289 703219 1141647 831432 267170 521952 1468240 1711321 655415
9098 655415 -489172 -360078 792543 1676901 1638558 1107017 808750 1099273 1803827 2329629
9088 2329629 2143017 1341463 510979 -27457 -413867 -638429 -324556 569380 1293450 1019674
9078 1019674 -105714 -908395 -249157 1798332 3758030 3959116 2231529 250131 -158506
9069 -158506 1056904 2275511 2075177 561169 -1069932 -1763991 -1325535 -338295 404187
9060 404187 542076 307130 45314 -191394 -426056 -465889 -194349 78820 -21491 -355847
9050 -355847 -432081 -47905 570306 1153266 1533137 1461878 700020 -566012 -1596343 -1599064
9040 -1599064 -501645 741554 870769 -340537 -1654457 -1689693 -483444 791520 1404556
9031 1404556 1559671 1479942 1063557 569050 563300 917207 913754 622668 923550 1758111
9021 1758111 1830491 795427 220173 1240012 2671216 2885681 2296789 2253039 2493535
9012 2493535 1741425 249746 -346059 385958 1106984 847835 86529 -481506 -739047
9003 -739047 -521610 340546 1112677 709470 -551048 -1133446 -520279 186077 258972 346407
8993 346407 832373 812687 -256451 -1248414 -981375 -112023 -38758 -647528 -624454 313915
8983 313915 927895 308526 -887812 -1411594 -879560 108688 783988 741624 6578 -985133
8973 -985133 -1548492 -1267320 -477243 -19455 -353575 -1092358 -1600785 -1759405 -1712592 -1185062
8963 -1185062 136675 1597909 1992550 1304963 979027 1847873 2840667 2634553 1609581
8954 1609581 984656 845101 470283 27000 303149 1034794 1178941 834734 1200637 2388848
8944 2388848 2970956 2220116 1221994 988665 917434 159675 -678718 -464525 604342 1283632
8934 1283632 1025900 454246 330323 818826 1606993 2156318 1972543 1041318 -157734
8925 -157734 -1245086 -2160961 -2652965 -2194417 -794360 694701 1517719 1764686 1835451
8916 1835451 1789922 1670331 1801255 2203474 2313599 1873616 1481105 1595430 1631121 852702
8906 852702 -358447 -1019119 -904790 -488108 97064 998689 1793244 1811285 1317518 1302287
8896 1302287 1934131 2215032 1465732 217123 -794090 -1618383 -2457930 -2798807 -2040480
8887 -2040480 -592771 496668 883037 1172187 1805157 2344753 2111168 1098030 -45583
8878 -45583 -720583 -806179 -500807 -1963 568281 1021316 1068033 590957 -61900 -273820
8868 -273820 209198 979178 1419831 1273522 606340 -450562 -1501133 -1716858 -618331
8859 -618331 911184 1190831 -259309 -1899222 -1914999 -304947 1446697 2374176 2808232
8850 2808232 3255471 3475204 3015598 2036204 1166350 837553 971722 1098555 741631 -27268
8840 -27268 -517766 -328760 -124347 -784649 -1865715 -1885308 -390941 1275770 1852169 1873057
8830 1873057 2636693 4107619 4946222 4425182 3325171 2798226 3060255 3455182 3340608
8821 3340608 2637029 1736147 1079237 817717 864073 1162483 1663800 2068922 2000918 1548239
8811 1548239 1232300 1267995 1272619 895173 273827 -348447 -934284 -1289618 -980978 -44361
8801 -44361 767321 945307 917607 1213773 1451970 900894 -275365 -1102771 -1005004 -304367
8791 -304367 376212 629155 251115 -695235 -1702058 -2078267 -1527611 -375976 671906
8782 671906 962141 412286 -229525 -16226 1096134 2165542 2457165 2194280 1872107
8773 1872107 1487741 928914 527324 591600 808889 716424 441357 422838 681092 859708
8763 859708 763641 470938 152658 37521 231964 438598 327154 225392 705593 1404906
8753 1404906 1266748 220739 -558804 -531508 -576980 -1153175 -1158749 117482 1232568 460106
8743 460106 -1431492 -2051956 -613028 1355328 2298876 2123648 1412967 572205 -5072
8734 -5072 28086 483079 793239 648931 63847 -787869 -1336972 -930887 6826 93661
8724 93661 -874656 -1070464 821799 3351352 4196593 3311169 2318308 1643099 472780
8715 472780 -900008 -1083773 -18985 700091 236517 -538283 -746648 -484063 93556
8706 93556 1010367 1615970 1119009 138326 103779 1007108 1439201 937791 464449 408043
8696 408043 70747 -584724 -672423 -239791 -378747 -1073287 -1049227 -276490 -354634 -1668510
8686 -1668510 -2485562 -1875481 -1205025 -1476641 -1474425 -157465 1185174 1032825 147441 63299
8676 63299 503724 217014 -768548 -1494142 -1684609 -1480224 -605601 748470 1376097 867497
8666 867497 701976 1922553 3073552 2369752 696854 268074 1213182 1787035 1355598
8657 1355598 885318 790682 521574 227414 722044 1615597 1422745 -59174 -1145197
8648 -1145197 -577242 868225 1593380 985055 -355392 -1379007 -1403107 -792529 -707189
8639 -707189 -1557073 -2207910 -1624607 -646676 -828343 -2029063 -2708065 -2336958 -1844795 -1681836
8629 -1681836 -1173635 -118526 586926 502367 452978 1091069 1814418 1878138 1580183 1469723
8619 1469723 1149224 -143514 -2094604 -3280626 -2619782 -486797 1643903 2550582 2310750
8610 2310750 2002040 2362725 3016777 3155401 2530871 1433219 187212 -815017 -1084329
8601 -1084329 -679042 -403238 -661672 -674866 263331 1317100 1110776 -153845 -969621
8592 -969621 -811527 -634592 -871201 -564273 734450 1622443 691397 -1126685 -1512970
8583 -1512970 157125 1993064 2086099 766112 -225594 -47304 688775 1353191 2131575
8574 2131575 3068342 3267869 1964352 -77766 -1231840 -961943 -201264 189421 333395
8565 333395 515575 459479 -95290 -827732 -1276253 -1260666 -668780 426974 1294477 1150841
8555 1150841 481508 622293 1667860 2112357 1176906 78288 67141 595788 632250 471124
8545 471124 721236 630166 -738202 -2377592 -2333793 -578332 866799 717486 -165852
8536 -165852 -365936 328882 1054978 935828 -115201 -1127309 -890845 427241 1166837
8527 1166837 453291 -342475 375133 1877901 2209633 1150915 232799 164631 216206 117776
8517 117776 594828 1671873 2197251 1613468 782130 535414 635809 586208 333190 -144872
8507 -144872 -851851 -1204698 -604032 355253 514654 2396 -10619 556544 520575 -347377
8497 -347377 -754307 -59155 771015 1019253 1181847 1262160 121855 -2185654 -3344788
8488 -3344788 -1805718 604943 1071067 -313294 -1126257 -396471 423167 158748 -454809
8479 -454809 -315083 417337 935447 1019492 970974 930648 818459 622645 377839 35769
8469 35769 -397721 -647102 -254997 926922 2249994 2585908 1543152 118473 -454235
8460 -454235 -247002 -200027 -411420 -138056 461981 201808 -941378 -1160183 532354 2446431
8450 2446431 2559967 1544660 1521738 2565240 2716210 1371894 349188 984082 2171512
8441 2171512 2325393 1666342 1263987 1119864 763113 783066 1932080 3168199 2559748
8432 2559748 271264 -1195600 -325377 1502039 2340235 2332562 2590336 2713808 1502624
8423 1502624 -403690 -831168 760981 2391594 2444451 1636983 1156795 537228 -1117233
8414 -1117233 -2998035 -3418709 -2175366 -573922 494466 1090328 1150280 387260 -680006
8405 -680006 -908849 -24867 1019481 1370998 1166454 989981 1131209 1428683 1345681 431149
8395 431149 -792724 -979401 232146 1296248 773172 -474140 -562772 553024 1322486
8386 1322486 1352137 1823066 3017982 3537941 2612095 1379770 1048835 1296891 1330294 1154781
8376 1154781 946555 398059 -495333 -1107010 -1286673 -1614741 -1995515 -1415103 153737
8367 153737 1093869 371104 -950745 -1467118 -1355049 -1387217 -1365928 -893367 -528240 -749387
8357 -749387 -799916 16501 886463 810434 398149 739031 1386988 1248916 735579 1076660
8347 1076660 1956389 1851301 597358 -326109 -233461 -140456 -798175 -1403651 -983431 82354
8337 82354 655411 265894 -553323 -928901 -449736 393126 710477 425645 414159 962572
8327 962572 1041945 92211 -506952 708917 2726101 3223835 1906690 634799 335429
8318 335429 20797 -756732 -770627 574065 1751450 1287922 -39607 -583064 -246988
8309 -246988 -107404 -495216 -880230 -1047542 -1079143 -659038 333292 946861 216091 -1106492
8299 -1106492 -1232100 164229 1375773 934094 -609435 -1678582 -1592757 -840606 -44507
8290 -44507 579565 963682 1032419 825526 424316 -186999 -883745 -1169407 -645953 282285
8280 282285 694222 329477 -15671 382589 1129891 1375384 1158218 1273008 1870309 2107171
8270 2107171 1440477 441788 -128167 -343222 -621505 -825884 -597619 -174047 -99270 -354893
8260 -354893 -479036 -372038 -318616 -367338 -363009 -466750 -937831 -1472935 -1494588 -1089749 -910156
8249 -910156 -1080043 -1014596 -540673 -372944 -999578 -1740868 -1581244 -619129 -29545 -576744
8239 -576744 -1645957 -1989722 -1228804 -270747 -129781 -651496 -850849 -397137 -94320 -669133
8229 -669133 -1729148 -2360692 -2219683 -1531589 -557681 326430 557787 126097 -100386 416274
8219 416274 887208 396782 -428318 -248032 777198 1093512 168273 -659167 -161417 1178579
8209 1178579 2091610 2012774 1150216 43296 -466774 182159 1219005 1118346 -175828
8200 -175828 -746298 735328 2988944 3723510 2445064 590214 -476893 -497412 115520
8191 115520 627192 268072 -823129 -1296287 -203055 1467871 1929048 965838 48153
8182 48153 238157 1105758 1717849 1693099 1214430 839189 1223135 2201366 2441038 1124847
8172 1124847 -322339 306213 2786154 4386767 3446523 1371066 277571 257325 224222
8163 224222 122497 593655 1233260 964696 -87123 -680491 -457391 -416030 -1100344 -1644791
8153 -1644791 -1212559 -315333 86583 24681 170571 519785 377561 -441931 -1225163 -1331063
8143 -1331063 -927417 -462275 83060 904271 1623945 1506564 515879 -436639 -637345 -480400
8133 -480400 -704141 -1097401 -753939 461157 1547056 1668976 1066424 359812 -245885
8124 -245885 -565073 -80707 1149231 1845562 854556 -1117749 -2190450 -1686295 -767605
8115 -767605 -548912 -675782 -303086 400496 537311 -160518 -994786 -1217674 -787865 -217387
8105 -217387 19615 -115864 -279236 -153038 242982 716945 1191334 1583460 1627409 1241774
8095 1241774 909509 1142281 1634068 1553841 697862 -270421 -777746 -867309 -688920 -242927
8085 -242927 138474 -159674 -1128322 -1946448 -2055950 -1768487 -1486503 -1081784 -449747 111165
8075 111165 523493 1085042 1529359 987007 -400791 -989236 167663 1680562 1778652
8066 1778652 1000766 1188660 2325550 2417097 673431 -1066283 -812030 1012010 2362737
8057 2362737 2110056 988810 463937 1195113 2468024 2986816 2325817 1341324 901626
8048 901626 831444 721642 960989 1836885 2332133 1394001 4542 144359 1700544 2383467
8038 2383467 1157936 -215159 17673 1003324 835664 -530034 -1395032 -696381 927916
8029 927916 2101954 1956646 771579 -166697 113975 861630 432336 -1175309 -1908390
8020 -1908390 -464176 1803005 2776109 2219901 1393023 1068154 1227941 1858775 2683705
8011 2683705 2770849 1682800 402386 -65700 -247767 -1004748 -1597534 -661331 1362612
8002 1362612 2546060 2067273 861991 -214083 -1192489 -1865601 -1537836 -324625 692339
7993 692339 1056304 1463460 2318445 2998041 3050163 2976466 3219640 3357908 2922028 2165815
7983 2165815 1448140 632517 -312292 -830111 -553441 -41376 -116298 -763283 -1167647 -719034
7973 -719034 267825 798336 226171 -881779 -1271638 -633822 -72313 -423777 -959581 -730116
7963 -730116 -338022 -910938 -1926202 -1871352 -826007 -409871 -1057106 -1415870 -928935 -893887
7953 -893887 -2024233 -2891689 -2092098 -391945 629863 694501 244651 -805151 -2138322
7944 -2138322 -2194898 -221507 1808276 1457561 -548211 -1127677 879900 3344652 3981076
7935 3981076 2923694 1602820 722732 246179 167658 333434 239385 -254710 -573133 -320589
7925 -320589 15942 -245169 -1052101 -1813068 -2135545 -2007777 -1570145 -1036497 -640721 -469293
7915 -469293 -479769 -659005 -934027 -1073458 -1035915 -1209408 -1793980 -2149248 -1453460 18272
7905 18272 982834 630829 -551585 -1488104 -1465211 -421262 989871 1587265 731050 -632681
7895 -632681 -818860 456873 1650425 1485167 585916 393122 1181061 1958006 1904229 1160071
7885 1160071 391661 138747 466205 895034 837746 282464 -278011 -673241 -1190819 -1664993
7875 -1664993 -1254312 309550 1957338 2467020 1852418 912880 50781 -631949 -691899
7866 -691899 123031 1057375 1083576 201279 -875334 -1867084 -2674305 -2518059 -884235 889470
7856 889470 756865 -1049783 -1926897 -431255 1704097 2036540 514560 -1063838 -1581490
7847 -1581490 -1264062 -600331 30675 66606 -724078 -1626506 -1739829 -1105132 -410835 -21423
7837 -21423 23945 -362916 -919958 -915421 -264571 1026 -663285 -1177961 -546254 329649
7827 329649 206107 -92611 977804 2533980 2121069 -241963 -1650248 -630850 805202
7818 805202 665364 29633 764608 2234549 2557946 1727472 1133838 924236 193072 -718258
7808 -718258 -455202 861087 1487344 669917 -420485 -754154 -744260 -901855 -747881 73302
7798 73302 816083 715651 147192 -180344 -439791 -1168794 -2080671 -2365357 -1946267 -1559215
7788 -1559215 -1543496 -1282972 -171230 1281224 1788074 774567 -813567 -1498699 -941169
7779 -941169 -179566 -165343 -646710 -836363 -604185 -373037 -193685 303459 1091697 1554954
7769 1554954 1265551 553946 175332 597583 1583443 2366508 2424618 2119294 2161696 2414585
7759 2414585 1970761 677763 -390264 -576753 -700187 -1505996 -2100526 -1327380 80790
7750 80790 413001 -407797 -925188 -669763 -632787 -1072515 -877885 272529 992009 353503
7740 353503 -658650 -944901 -1027421 -1678861 -2132070 -1238912 490459 1575847 1668539 1489185
7730 1489185 1189875 355055 -596438 -574085 481336 1331308 1138181 426883 132646 562870
7720 562870 1470460 2332643 2424697 1447307 215197 -135436 226947 -34857 -1355406 -2369052
7710 -2369052 -1731107 -16778 1029618 625195 -496066 -1333996 -1578786 -1368659 -841810
7701 -841810 -159584 427951 722782 604308 -25642 -1016027 -1746549 -1565068 -561574 427769
7691 427769 726445 432393 11016 -336951 -619150 -705594 -489284 -249279 -409029 -926802
7681 -926802 -1266312 -997827 -168026 870726 1697232 1983228 1786551 1575402 1561135 1253138
7671 1253138 314806 -436255 48152 1148419 997389 -723082 -1873441 -768802 1297234
7662 1297234 1926839 1043121 594904 1342362 1978442 1527876 672451 169233 -323964 -1032739
7652 -1032739 -1157944 -217758 844584 935582 265812 -417916 -1090436 -1842323 -1916702 -699353
7642 -699353 909860 1467927 976633 617955 784679 754946 261911 -49926 30300 -164980
7632 -164980 -798653 -950900 -178572 411164 -328344 -1739629 -2203574 -1444698 -768577 -1002814
7622 -1002814 -1389606 -931433 138615 927179 1236239 1502872 1801631 1839254 1769941 2029723
7612 2029723 2304497 1691398 198368 -921716 -864706 -336367 -189783 19915 1041712
7603 1041712 2292616 2578151 1955494 1424280 1059829 68850 -1314908 -1719047 -773803
7594 -773803 264197 593896 953980 1797887 2013200 748688 -794846 -947566 -28413
7585 -28413 374743 -44270 -140027 546493 1046951 512511 -690603 -1655249 -1835365 -1205857
7575 -1205857 -299301 -44888 -816021 -1764077 -1856139 -1296762 -991605 -942842 -418148 440947
7565 440947 636357 104331 -17025 597730 669998 -569105 -1778103 -1305209 282484
7556 282484 921576 -93918 -1387200 -1605593 -957969 -322891 62781 341439 211788
7547 211788 -732318 -2068348 -2724277 -2218110 -1231601 -737469 -879684 -998196 -608833 -65198
7537 -65198 -183178 -1290004 -2686393 -3141575 -2107131 -442123 349709 -272202 -1342211
7528 -1342211 -1645525 -1117940 -577128 -422095 -276014 169398 657389 873268 925603 1117233
7518 1117233 1578757 2188693 2527565 2031525 701243 -493834 -617944 -77786 -62227
7509 -62227 -694974 -861566 -139946 329061 -440994 -1762532 -2350303 -2059474 -1583641 -1129591
7499 -1129591 -459834 231662 520082 510635 527038 403332 -44221 -246848 426137 1499051
7489 1499051 1897810 1407099 677525 24289 -753062 -1512590 -1787592 -1612019 -1362775 -893312
7479 -893312 130078 1138384 1107051 155346 -502714 -367261 -185977 -418490 -474801 12811
7469 12811 404356 248630 165346 693999 1228224 1067814 733898 1127701 1910633 1888684
7459 1888684 842532 -40670 310957 1574550 2456591 2043230 670351 -393946 -262269
7450 -262269 516407 586987 -417020 -1321811 -1000523 170672 1055718 1344880 1539726 1774556
7440 1774556 1702584 1464170 1700673 2371834 2511471 1658603 771423 1000567 2033790 2495109
7430 2495109 1819795 872216 558711 658124 546097 436324 1011372 2005979 2145098 819451
7420 819451 -903967 -1489330 -701204 380933 776258 414853 -275668 -949545 -1465407
7411 -1465407 -1878232 -2360896 -2865614 -3010777 -2632928 -2171285 -2005974 -1730755 -814367 229777
7401 229777 300680 -571536 -959511 75165 1616548 2008231 808264 -925832 -1907609
7392 -1907609 -1644278 -497011 722273 1303883 1160162 765437 469866 136820 -375535
7383 -375535 -758880 -635284 -145826 197568 135489 -79249 72410 938605 2243320 3032272
7373 3032272 2522054 1175242 411387 931872 1851244 1927602 1126062 337036 -9942 -218346
7363 -218346 -429516 -385030 -184467 -439583 -1311506 -2011111 -1724600 -649509 320678 662101
7353 662101 544990 293053 -5184 -346329 -637797 -754566 -541301 248109 1703278 3325514
7343 3325514 4134007 3500318 1820469 170429 -667023 -697223 -367534 -48007 65671
7334 65671 -179223 -826088 -1617814 -2071445 -1876981 -1201452 -503768 -30918 360112 768605
7324 768605 864601 323176 -441432 -572433 12262 359257 -115019 -637401 -262103 553922
7314 553922 671194 200828 305739 1053460 1076754 -80107 -856894 -6863 1256611 936767
7304 936767 -744277 -1692943 -975452 132778 242183 -461594 -1075973 -1358511 -1555913
7295 -1555913 -1621724 -1312050 -684374 -12461 568836 1035469 1286897 1205203 817703 357765
7285 357765 197081 517061 905500 639080 -316617 -997086 -593883 474840 1195201 1224087
7275 1224087 847320 148478 -849765 -1537106 -1278483 -509168 -212250 -360407 -39430 800926
7265 800926 1044451 280101 -292902 377465 1514049 1580453 442800 -522309 -241960 934323
7255 934323 1883913 1855655 886505 -443796 -1400709 -1417959 -392154 1089540 1942349 1478879
7245 1478879 273601 -341231 100301 668774 533809 201725 479308 947768 634956
7236 634956 -255647 -609652 -194280 172308 233713 659750 1542073 1892476 1190830 324137
7226 324137 344161 1134905 1879193 2145121 2004449 1613313 1063349 344780 -530422 -1060508
7216 -1060508 -446337 1025554 1602213 347582 -1024134 -443775 1083193 841878 -1038325
7207 -1038325 -1459278 617530 2214297 885431 -1695781 -2792698 -2661436 -2889188 -2810183
7198 -2810183 -849595 1795450 2213889 189614 -1461034 -1099275 -106372 2462 -116348
7189 -116348 763740 2280772 3061259 2446769 904360 -569320 -1070762 -455503 457182
7180 457182 857240 915324 1174095 1491482 1514411 1633199 2286327 2820976 2378974 1478672
7170 1478672 1251308 1477491 1018393 -14840 -280785 575801 1436259 1602183 1522512 1398253
7160 1398253 749452 -241741 -598702 -257738 -335286 -1147713 -1560615 -990351 -467384 -832222
7150 -832222 -1343475 -1113221 -649985 -880689 -1704062 -2527258 -3236351 -3670226 -3170958 -1734465
7140 -1734465 -665018 -939511 -1710270 -1534281 -346292 893606 1776847 2453191 2677830
7131 2677830 2155698 1458803 1387644 1685038 1514832 975272 959883 1621814 2150801 2134931
7121 2134931 2020223 1996523 1508077 366692 -501056 -116177 1206896 2227255 2287184
7112 2287184 1856491 1521702 1002749 -324838 -2101820 -2905095 -1916394 -182218 512873
7103 512873 -163214 -850738 -482748 407207 740765 477222 479660 1190584 2038009 2093424
7093 2093424 1075550 -215693 -507900 595266 2004928 2385369 1812614 1437891 1644474
7084 1644474 1632966 999320 500903 716221 1043955 792321 337712 330594 499143 154444
7074 154444 -668859 -1389831 -1726414 -1700653 -1341888 -980345 -1158305 -1624348 -1259649 211881
7064 211881 1384418 1048473 -47594 -562364 -743323 -1618332 -2694051 -2404439 -705140
7055 -705140 638278 568130 -84977 -287165 -162193 -155651 -158977 -75995 -177536 -363048 -74381
7044 -74381 606122 811427 295833 -104750 65944 115008 -432645 -839088 -413543 226600
7034 226600 186829 -191500 75648 1054169 1905414 2045972 1458059 290759 -1008717 -1595271
7024 -1595271 -1124619 -402117 -328727 -588571 -250292 704628 1441559 1621445 1666656 1731319
7014 1731319 1364678 342018 -879794 -1649539 -1576519 -642214 583193 1095495 503319
7005 503319 -350554 -503237 -171753 -58065 66278 751163 1235086 143486 -2087181
6996 -2087181 -3267281 -2463455 -1286481 -1346985 -1972878 -1615792 -248384 987009 1547887
6987 1547887 1555392 898638 -319952 -1069606 -522252 582386 1019914 968114 1316723 1638069
6977 1638069 718609 -1036444 -1725683 -780085 189726 -59792 -765831 -871514 -707818
6968 -707818 -846007 -723906 195930 1016319 651711 -309632 -471574 218402 663448 564571
6958 564571 627344 933596 639431 -453650 -1342125 -1288908 -787999 -544811 -406898 57159
6948 57159 643191 917376 1054806 1480008 1868046 1311286 -306533 -1691333 -1444890 160396
6938 160396 1334231 919085 -225550 -588734 -197833 -309001 -1061416 -951961 789280
6929 789280 2698005 3024346 2097357 1413995 1228953 670415 -262876 -650286 -545087 -1119344
6919 -1119344 -2549761 -3384492 -2687414 -1457257 -1096838 -1561364 -1848361 -1407225 -296173
6910 -296173 1184783 2245816 1871289 201330 -1137803 -981998 -156898 -117781 -850623
6901 -850623 -1274435 -1057835 -701046 -282276 427203 852808 175974 -959509 -884303 571820
6891 571820 1487862 496815 -1278731 -1923004 -1317433 -817319 -1030417 -1291122 -1146754 -1093195
6881 -1093195 -1613456 -2423724 -3003954 -3168324 -2792256 -1649489 7879 1229192 1310012
6872 1310012 684722 357290 605158 741740 115698 -1081819 -2023221 -1944826 -722873
6863 -722873 859696 1495889 513226 -1265666 -2260902 -1816462 -694887 127199 482471
6854 482471 610258 511946 263380 342815 911497 1198619 405819 -1040899 -1954376 -1947546
6844 -1947546 -1695002 -1663481 -1460762 -666423 405938 1100278 1091323 471250 -388097 -938893
6834 -938893 -888310 -609405 -650005 -848692 -565820 195293 699927 703169 904669 1775967
6824 1775967 2710434 2911942 2506261 2131391 1899854 1430438 609559 -259962 -883681 -1129197
6814 -1129197 -968465 -604987 -412973 -485858 -551527 -503965 -512218 -370847 544788 2174817
6804 2174817 3310491 2950285 1615076 583210 289133 291728 381229 704661 1017458 870698
6794 870698 548390 822385 1609387 1799091 755206 -785642 -1720666 -1829797 -1548310
6785 -1548310 -1062397 -274859 602244 1062517 972352 816440 1070608 1502785 1385461 504920
6775 504920 -310133 -76695 988885 1588462 1007352 16558 -331151 -135233 -109765 -162241
6765 -162241 375484 1268977 1368402 344003 -639405 -510474 322069 836329 903714 1048273
6755 1048273 1181648 616539 -690863 -1792020 -1892215 -1249135 -616496 -225932 289351
6746 289351 1178930 2149579 2631616 2277425 1237898 108747 -432542 -116818 721954
6737 721954 1459679 1624414 1043781 -98216 -1034685 -627826 1399125 3444561 3279721
6728 3279721 871751 -1002868 -21877 2487728 3092627 785377 -1752618 -1850982 -125292
6719 -125292 1016967 783920 319370 355100 329743 -152858 -510398 -298234 -76824 -536983
6709 -536983 -1384505 -1672371 -979230 91692 524843 -34522 -768959 -504848 777795
6700 777795 1730718 1372009 461092 380484 1141515 1547915 1074322 396698 84328 -5779
6690 -5779 142626 924147 2040313 2371851 1509749 400788 -128215 -445724 -1018462 -1360385
6680 -1360385 -1056983 -822996 -1322825 -1777221 -1142675 -18693 220235 -210365 199313
6671 199313 1618537 2417138 1779008 982000 1213459 1731619 1466409 1094606 1835010 3039412
6661 3039412 2897822 1274379 -30245 -32542 196919 -331887 -794255 -89340 1093401
6652 1093401 1186791 70757 -922105 -1018868 -700175 -475708 -274423 -210799 -725310 -1598089
6642 -1598089 -1931448 -1568893 -1441748 -1924969 -1991490 -867042 527460 926948 659864
6633 659864 894447 1577483 1650192 1006333 638936 840471 839351 475531 648528 1531783
6623 1531783 1844837 807729 -440775 -489813 264218 402655 -380135 -1204242 -1599072
6614 -1599072 -1888307 -2168205 -2070328 -1565807 -1039708 -508146 365942 1388731 1794540 1274173
6604 1274173 375774 -269481 -542980 -600114 -625959 -857964 -1272585 -1312013 -594990 218494
6594 218494 124178 -717981 -1171892 -875476 -645809 -900943 -982764 -588108 -530706 -1205108
6584 -1205108 -1554227 -743874 254499 217666 -121274 791202 2528488 2985785 1409727
6575 1409727 -754958 -2219442 -3154433 -3712114 -3250939 -1971831 -1508277 -2555212 -3412788
6566 -3412788 -2416333 -519670 304511 165098 667884 1868546 2093610 790159 -564047
6557 -564047 -814527 -575399 -705474 -927609 -727167 -281720 264103 1210396 2236243 2196102
6547 2196102 903187 -69942 554828 1937743 2476079 2039060 1639074 1707385 1982421
6538 1982421 2407468 2848454 2591834 1458564 705995 1316082 2112046 1394725 -151491
6529 -151491 -395460 658334 773137 -696966 -1550963 -367132 1064675 627947 -791249
6520 -791249 -967676 101189 623000 146383 -104011 270053 260930 -439365 -766152 -247819
6510 -247819 74777 -526450 -1138252 -669757 407928 817829 302286 -233372 -24222 797206
6500 797206 1485593 1284828 72290 -1290787 -1694316 -1113241 -600670 -675023 -577829 278351
6490 278351 1027671 484740 -1071779 -2323850 -2679280 -2492788 -1895826 -745680 348887
6481 348887 394433 -333526 -373819 677061 1325652 385704 -1166682 -1645134 -1038714 -639177
6471 -639177 -887627 -1033202 -738970 -609854 -898284 -858313 106260 1427155 2009706 1431445
6461 1431445 194548 -851378 -1139827 -729939 -105838 504893 1316925 2170149 2149522
6452 2149522 873357 -355204 43253 1548173 2052089 925788 -37143 604347 1725816
6443 1725816 1334846 -601002 -2306616 -2505444 -1395303 191194 1468185 1822410 1251935
6434 1251935 552645 384790 469173 326361 235928 604037 958217 649207 125241 326015
6424 326015 1048421 1110275 107911 -1039729 -1331461 -603686 679146 1697450 1589769
6415 1589769 463195 -228869 564964 1761511 1558844 248772 -168494 809108 1371635
6406 1371635 319610 -1120548 -1360134 -672830 -165292 73108 423710 467396 -249588
6397 -249588 -951999 -582280 474238 894272 309036 -440740 -673172 -472913 -154597 1336
6387 1336 -256680 -637320 -210267 1296351 2597218 2326484 1008604 326708 685888 904313
6377 904313 366651 10349 663142 1607138 1611744 645166 -257999 -450937 -319772 -585056
6367 -585056 -1392935 -2148871 -2147730 -1401044 -746517 -917373 -1597472 -1731076 -767787 705802
6357 705802 1612572 1433749 597183 -23836 -12391 180482 -84966 -639866 -750673 -452662
6347 -452662 -762756 -2006697 -2820527 -1860699 71870 906139 73358 -974409 -1112203
6338 -1112203 -938471 -1246278 -1422597 -462566 1218415 2202687 1988704 1393116 1059177
6329 1059177 600786 -424623 -1506177 -1784219 -1244713 -633086 -329341 -9991 472071
6320 472071 604037 57608 -566247 -545549 -220999 -489250 -1272337 -1552824 -1077222 -855765
6310 -855765 -1434283 -1803500 -989046 159226 50052 -1243763 -2032056 -1399097 -255447
6301 -255447 269964 342540 729848 1413691 1676070 1229169 606099 427602 647752 668592
6291 668592 116799 -669424 -1108729 -1193747 -1375420 -1611213 -1251698 -216620 524647 320668
6281 320668 -75411 252428 716298 88728 -1340085 -1956155 -1181664 -157592 241694
6272 241694 617527 1592562 2400740 1943003 488110 -628533 -592379 258150 998798 832373
6262 832373 -314197 -1476177 -1427501 -146488 1075977 1344450 1206644 1476750 1876272
6253 1876272 1672192 982045 496994 403420 505630 948734 1768623 2076111 904187 -1161239
6243 -1161239 -2332441 -1802812 -622882 -123557 -368294 -632304 -676692 -883134 -1462291
6234 -1462291 -2069482 -2159995 -1516657 -484488 319046 677608 1021721 1722219 2390229 2407978
6224 2407978 1957481 1772659 1900306 1623584 862288 677009 1765531 3228845 3637125
6215 3637125 2783541 1547584 503183 -310437 -554996 185902 1242970 1177412 -246760
6206 -246760 -1470969 -1211710 -168389 260038 128191 529658 1490165 1778456 927014
6197 927014 80768 310320 1108620 1248830 429862 -584424 -965284 -435625 659280
6188 659280 1466216 1276808 420944 -42469 180457 217964 -437593 -972011 -578461 197096
6178 197096 442659 357068 543563 609049 -89724 -909697 -757429 -52412 -93345 -694278
6168 -694278 -393911 949233 1848975 1788667 1921105 2521657 2097820 242662 -917593
6159 -917593 75768 1351066 519306 -1405113 -1579267 136608 1161318 484221 49771
6150 49771 1302784 2924903 3152722 2335540 1772142 1501584 791187 -182581 -667535 -784381
6140 -784381 -1262530 -1979629 -2004313 -1136669 -341596 -316674 -426289 355421 1830995 2589100
6130 2589100 1736239 127791 -588654 16986 727790 396895 -609063 -1199253 -1198336 -1340149
6120 -1340149 -1873530 -2116794 -1516615 -406268 510906 859879 602356 -83329 -687160
6111 -687160 -620184 117606 829485 868943 265942 -418060 -588155 -41646 772091 1067852
6101 1067852 688136 464346 1053956 1793065 1572375 576514 17346 189202 110506 -634233
6091 -634233 -1084814 -558526 190228 383792 630131 1689225 2732885 2333644 745310
6082 745310 -306527 -61871 403564 -21480 -982140 -1433214 -1053989 -332058 200581 319422
6072 319422 50554 -363148 -643997 -784876 -922493 -882546 -277717 820208 1761850 2093100
6062 2093100 2039682 1970773 1803506 1316435 696685 259024 -193457 -1138784 -2416968 -3105111
6052 -3105111 -2634574 -1662983 -1343253 -1840154 -2131406 -1463135 -498551 -517021 -1687341 -2750946
6042 -2750946 -2533510 -1270600 -145941 109178 -270994 -768663 -1224613 -1633325 -1677743
6033 -1677743 -918907 484858 1584100 1504709 428270 -665950 -1240344 -1657477 -2219624
6024 -2219624 -2450834 -1926030 -1212550 -1066636 -1074719 -251340 1112481 1540416 606959 -256754
6014 -256754 134613 1024185 1101194 564924 519381 976473 893237 -31072 -911713 -1093481
6004 -1093481 -924713 -948853 -1199546 -1445267 -1385275 -582097 986574 2318503 2275123 1174391
5994 1174391 489694 761994 936036 223902 -525801 -167024 897765 1259265 433069
5985 433069 -737559 -1417043 -1603454 -1544475 -1092509 -44046 1193969 1693873 918085
5976 918085 -521076 -1268782 -613343 714494 1402100 955331 -161625 -1365237 -2148614
5967 -2148614 -1773215 38592 2024043 2289879 766566 -446763 138515 1453434 1625695
5958 1625695 557049 -506110 -1069065 -1519924 -1698943 -975760 338187 1102930 967084
5949 967084 621516 390017 -109488 -739219 -698042 -29044 74403 -895399 -1832928 -1705255
5939 -1705255 -1064437 -943835 -1192533 -994095 -337053 161916 427679 836637 1256896 1171652
5929 1171652 581947 -67806 -646806 -1162531 -1093352 57455 1587783 2047037 1080365
5920 1080365 -64134 -174147 528377 966223 558569 -367184 -1066195 -1049439 -644086 -868924
5910 -868924 -2169388 -3362877 -2767439 -541478 1177761 947329 -254335 -753114 -570524
5901 -570524 -843943 -1573585 -1523452 -271926 1080069 1518958 1231612 716943 -59716 -984795
5891 -984795 -1277933 -528748 480425 889321 1062899 1745219 2440557 1964083 466243
5882 466243 -504009 -243776 117487 -473017 -1257560 -890851 374912 982661 267952 -808648
5872 -808648 -1187675 -965123 -818430 -947629 -1028662 -770080 -178767 454775 714035 507600
5862 507600 335036 650247 1047556 753886 -73477 -412214 67014 489463 266287 74233
5852 74233 605823 1277674 1192429 640388 483042 623550 375134 -80503 -27577 239077
5842 239077 -245804 -1244518 -1409312 -480583 275608 284130 558058 1597043 2189590 1549577
5832 1549577 986001 1768690 2705983 1896678 -68096 -959145 -486594 -567805 -1908453
5823 -1908453 -2740382 -1746253 -190818 84867 -716586 -1084161 -512131 240642 571349
5814 571349 573372 495138 489964 655394 806850 585209 112216 -73520 -22561 -421411 -1187574
5803 -1187574 -1130373 207113 1482097 1391762 552759 251789 281300 -334082 -1140109 -709883
5793 -709883 909603 2106500 2190968 2166088 2644714 2770656 1912586 829610 211485 -539237
5783 -539237 -1936794 -3008510 -2585998 -1179075 -255083 -214042 -322677 -260797 -479147 -1127659
5773 -1127659 -1678024 -1651537 -983971 193714 1414490 1783088 905174 -273011 -477152
5764 -477152 167246 405112 -207398 -753468 -513890 66036 399617 729092 1443921 2242195
5754 2242195 2657091 2755108 2642404 1963768 741577 112239 1099426 2884460 3450788
5745 3450788 2064887 101639 -893278 -986610 -1125545 -1452677 -1291671 -468182 284007
5736 284007 280879 -411593 -1313004 -1957618 -1879170 -862377 451431 838087 -96377 -1258124
5726 -1258124 -1441675 -930729 -902612 -1527911 -1752031 -1058751 -302335 -271426 -432529 41673
5716 41673 749301 686586 12689 -62272 783237 1329218 579780 -723493 -1106764 -355619
5706 -355619 341994 114455 -486624 -319538 871495 2164637 2478347 1597130 220631
5697 220631 -741070 -821007 -171293 655333 1141751 1221000 1226501 1293126 1028786 165506 -691445
5686 -691445 -698815 -207537 -627494 -2395057 -3976291 -3760533 -2263639 -1311541 -1440099 -1451189
5676 -1451189 -526197 632076 1173338 1357756 1709430 1887883 1302936 202792 -714795
5667 -714795 -1310575 -1841503 -2200371 -2097863 -1681033 -1245762 -677821 67255 348022 -320986
5657 -320986 -1101595 -666960 817687 1736549 1259988 383773 313464 930780 1528666 2039905
5647 2039905 2592243 2642308 1693066 409640 -116535 26360 -186651 -961543 -1346184 -831583
5637 -831583 -192320 -297884 -999258 -1710568 -2257802 -2517142 -1998815 -640491 563997
5628 563997 665281 105564 25915 528215 695230 233877 -76571 231476 606953 590389
5618 590389 601962 974647 1107771 455951 -324067 -234219 464350 562906 -317823 -1239962
5608 -1239962 -1302651 -622791 220774 927782 1296748 942278 -243089 -1565913 -1887486
5599 -1887486 -611269 1625930 3223505 2926068 1212212 19002 528537 1619908 1399188
5590 1399188 -10225 -498355 993620 2846766 2972317 1548915 409625 419595 807223
5581 807223 823360 686431 676538 444993 -254872 -956670 -1198204 -1290696 -1736990 -2220263
5571 -2220263 -1843514 -352269 1388265 2294087 2159951 1668751 1440628 1325303 765997
5562 765997 -266435 -1033037 -894444 -164507 275172 136730 45358 540442 1150468 845925
5552 845925 -695729 -2596017 -3596442 -3233126 -2189881 -1577682 -1834249 -2272826 -1816622
5543 -1816622 -267791 1326238 1759645 931991 -268525 -1120621 -1563188 -1601924 -1001593
5534 -1001593 90690 886299 896208 646557 838256 1275331 1396325 1383719 1693440 1827923
5524 1827923 918264 -523292 -946502 -138058 354046 -211972 -485535 598171 1790493
5515 1790493 1506571 517793 673278 1825730 2244742 1645997 1501278 2315578 2826097
5506 2826097 2306654 1639690 1502050 1358509 971253 1115251 1939760 2307880 1698983 1145026
5496 1145026 1310784 1320092 571889 -41990 -23416 -532873 -2155813 -3218502 -2334245 -985877
5486 -985877 -1220389 -2174600 -1589791 266950 1169969 815981 991873 1963273 1924772 558097
5476 558097 33279 1387012 2669016 2145081 939391 778955 1181212 847260 197394
5467 197394 392443 979147 602661 -624656 -1348974 -1160095 -887676 -941641 -848939 -408720
5457 -408720 -52347 36092 207091 710070 1465208 2315120 2879470 2524032 1238289 160240
5447 160240 336918 1238455 1410800 420252 -741693 -1083283 -578079 275430 1045073 1399455
5437 1399455 1195621 701077 343140 240480 273709 403098 540950 403733 -59633 -401099
5427 -401099 -287462 -1662 150878 430907 1022165 1346720 869568 127486 -36465 81808
5417 81808 -501200 -1720424 -2391787 -1969748 -1199152 -716940 -139889 875426 1610493 1169687
5407 1169687 -123393 -1018359 -868052 -261745 -86439 -372348 -343151 439221 1314842 1319741
$$ [...]
##END NTUPLES=NMR SPECTRUM
##END=
