##TITLE=31Pdec_SR157TFAA2eq'
 CDCl3, 24 sc
 6.7.2023
##JCAMPDX= 6.0         $$ Bruker NMR JCAMP-DX V2.0
##DATA TYPE= NMR SPECTRUM
##DATA CLASS= NTUPLES
##ORIGIN= UXNMR, Bruker Analytische Messtechnik GmbH
##OWNER= root
$$ XWIN-NMR		Version 3.5
$$ Thu Jul  6 13:45:01 2023 Russian Standard Time (UT+4h)  she@DPX200
##.OBSERVE FREQUENCY= 81.013821
##.OBSERVE NUCLEUS= ^31P
##.ACQUISITION MODE= SIMULTANEOUS
##.ACQUISITION SCHEME= undefined
##.AVERAGES= 24
##.DIGITISER RES= 16
##SPECTROMETER/DATA SYSTEM= spect
##.PULSE SEQUENCE= zgpg30
##.SOLVENT NAME= CDCl3
##.SHIFT REFERENCE= (INTERNAL, CDCl3, 0, 248.564)
##AUDIT TRAIL= $$ (NUMBER, WHEN, WHO, WHERE, WHAT)
$$ ##TITLE= Audit trail, XWIN-NMR		Version 3.5
$$ ##JCAMPDX= 5.01
$$ ##ORIGIN= Bruker BioSpin GmbH
$$ ##OWNER= she
$$ F:/spectra/data/she/nmr/P31/1/pdata/1/auditp.txt
$$ ##AUDIT TRAIL=  $$ (NUMBER, WHEN, WHO, WHERE, WHAT)
(   1,<2023-07-06 13:43:14.78 +0400>,<she>,<DPX200>,
      <created by zg, POWCHK disabled, PULCHK disabled
       configuration hash MD5:
       00 E9 B6 7A A2 85 ED C7 34 08 36 98 17 FE 4E 26
       data hash MD5: 32K
       90 17 4E 52 8D 6D 1A 05 79 EC 7D 26 5F E6 69 85>)
(   2,<2023-07-06 13:43:52.53 +0400>,<she>,<DPX200>,
      <Start of raw data processing
       efp BC_mod = 2 LB = 1 FT_mod = 6 PKNL = 1 PHC0 = -10765.23 PHC1 = 294.4848 SI = 64K 
       data hash MD5: 64K
       51 8F E5 51 BD 6A 3D 0B 57 6F F2 1A 86 15 8D 93>)
(   3,<2023-07-06 13:44:16.35 +0400>,<she>,<DPX200>,
      <pk PHC0 = 21.43055 PHC1 = -47.99999 
       data hash MD5: 64K
       07 91 22 75 17 F8 82 BA 93 9F 6A 01 5B 1B D1 7F>)
$$ ##END=
$$ 
$$ hash MD5
$$ 57 69 EE 0A 25 BE CC E0 AE B8 F8 85 61 05 A0 B0
##$RELAX= 
##$RELAX= 
##$RELAX= 
##$RELAX= 
##$RELAX= 
##$RELAX= 
##$RELAX= 
##$RELAX= 
##$RELAX= 
$$ Bruker specific parameters
$$ --------------------------
##$DU= <F:/spectra>
##$EXPNO= 1
##$NAME= <P31>
##$PROCNO= 1
##$TYPE= <nmr>
##$USER= <she>
##$AMP= (0..31)
100 100 100 100 100 100 100 100 100 100 100 100 100 100 100 100 100 100 
100 100 100 100 100 100 100 100 100 100 100 100 100 100 
##$AQSEQ= 0
##$AQ_mod= 1
##$AUNM= <au_zg>
##$AUTOPOS= <>
##$BF1= 81.014009
##$BF2= 200.13
##$BF3= 200.13
##$BF4= 200.13
##$BF5= 200.13
##$BF6= 200.13
##$BF7= 200.13
##$BF8= 200.13
##$BYTORDA= 1
##$CFDGTYP= 0
##$CFRGTYP= 5
##$CHEMSTR= <none>
##$CNST= (0..31)
1 1 145 1 1 1 1 1 1 1 1 1 1 1 1 1 1 1 1 1 1 1 1 1 1 1 1 1 1 1 1 1 
##$CPDPRG= <waltz16>
##$CPDPRG1= <>
##$CPDPRG2= <waltz16>
##$CPDPRG3= <>
##$CPDPRG4= <mlev>
##$CPDPRG5= <mlev>
##$CPDPRG6= <mlev>
##$CPDPRG7= <mlev>
##$CPDPRG8= <mlev>
##$CPDPRGB= <>
##$CPDPRGT= <>
##$D= (0..31)
0 1 0 0 0 0 0 0 0 0 0 0.03 2e-05 3e-06 0 0 0 0 0 0 0 0 0 0 0 0 0 0 0 0 
0 0 
##$DATE= 1688636594
##$DBL= (0..7)
120 120 120 11 120 120 24 19 
##$DBP= (0..7)
150 150 150 150 150 150 150 150 
##$DBP07= 0
##$DBPNAM0= <>
##$DBPNAM1= <>
##$DBPNAM2= <>
##$DBPNAM3= <>
##$DBPNAM4= <>
##$DBPNAM5= <>
##$DBPNAM6= <>
##$DBPNAM7= <>
##$DBPOAL= (0..7)
0.5 0.5 0.5 0.5 0.5 0.5 0.5 0.5 
$$ [...]
##$SUBNAM2= <"">
##$SUBNAM3= <"">
##$SUBNAM4= <"">
##$SUBNAM5= <"">
##$SUBNAM6= <"">
##$SUBNAM7= <"">
##$SUBNAM8= <"">
##$SUBNAM9= <"">
##$SW= 501.771253377433
##$SWIBOX= (0..15)
0 1 3 0 0 0 0 0 0 0 0 0 0 0 0 0 
##$SW_h= 40650.406504065
##$TD= 32768
##$TD0= 1
##$TE= 0
##$TE2= 300
##$TE3= 300
##$TEG= 300
##$TL= (0..7)
0 120 53 12 22 120 120 120 
##$TP= (0..7)
150 150 150 150 150 150 150 150 
##$TP07= 0
##$TPNAME0= <>
##$TPNAME1= <>
##$TPNAME2= <>
##$TPNAME3= <>
##$TPNAME4= <>
##$TPNAME5= <>
##$TPNAME6= <>
##$TPNAME7= <>
##$TPOAL= (0..7)
0.5 0.5 0.5 0.5 0.5 0.5 0.5 0.5 
##$TPOFFS= (0..7)
0 0 0 0 0 0 0 0 
##$TUNHIN= 0
##$TUNHOUT= 0
##$TUNXOUT= 0
##$USERA1= <user>
##$USERA2= <user>
##$USERA3= <user>
##$USERA4= <user>
##$USERA5= <user>
##$V9= 5
##$VALIST= <valist>
##$VCLIST= <CCCCCCCCCCCCCCC>
##$VD= 0
##$VDLIST= <DDDDDDDDDDDDDDD>
##$VPLIST= <PPPPPPPPPPPPPPP>
##$VTLIST= <TTTTTTTTTTTTTTT>
##$WBST= 1024
##$WBSW= 4
##$XGAIN= (0..3)
0 0 0 0 
##$XL= 0
##$YL= 0
##$YMAX_a= 4354
##$YMIN_a= -4639
##$ZGOPTNS= <>
##$ZL1= 120
##$ZL2= 120
##$ZL3= 120
##$ZL4= 120
##$ABSF1= 0
##$ABSF2= 0
##$ABSG= 0
##$ABSL= 0
##$ALPHA= 0
##$AQORDER= 0
##$ASSFAC= 0
##$ASSFACI= 0
##$ASSFACX= 0
##$ASSWID= 0
##$AUNMP= <proc_1d>
##$AZFE= 0.1
##$AZFW= 0.5
##$BCFW= 0
##$BC_mod= 2
##$BYTORDP= 0
##$COROFFS= 0
##$CY= -3
##$DATMOD= 1
##$DC= 0
##$DFILT= <>
##$DTYPP= 0
##$F1P= 0
##$F2P= 0
##$FCOR= 1
##$FTSIZE= 65536
##$FT_mod= 6
##$GAMMA= 0
##$GB= 0
##$INTBC= 1
##$INTSCL= 6.047779e-11
##$ISEN= 30
##$LB= 1
##$LEV0= 0
##$LPBIN= 0
##$MAXI= 10000
##$MC2= 0
##$MEAN= 0
##$ME_mod= 0
##$MI= 50
##$NCOEF= 0
##$NC_proc= -6
##$NLEV= 6
##$NOISF1= 182.463
##$NOISF2= 159.3651
##$NSP= 0
##$NTH_PI= 0
##$NZP= 0
##$OFFSET= 248.5645
##$PC= 4
##$PHC0= -10743.8
##$PHC1= 246.4848
##$PH_mod= 1
##$PKNL= yes
##$PPARMOD= 0
##$PSCAL= 0
##$PSIGN= 0
##$REVERSE= no
##$SF= 81.0140089999694
##$SI= 65536
##$SIGF1= 159.3651
##$SIGF2= -187.1042
##$SINO= 113.3802
##$SIOLD= 16384
##$SREGLST= <1H.CDCl3>
##$SSB= 0
##$STSI= 65536
##$STSR= 0
##$SW_p= 40650.406504065
##$SYMM= 0
##$S_DEV= 0
##$TDeff= 32768
##$TDoff= 0
##$TI= <>
##$TILT= no
##$TM1= 0
##$TM2= 0
##$TOPLEV= 0
##$USERP1= <user>
##$USERP2= <user>
##$USERP3= <user>
##$USERP4= <user>
##$USERP5= <user>
##$WDW= 1
##$XDIM= 65536
##$YMAX_p= 170632774
##$YMIN_p= -399028862
$$ End of Bruker specific parameters
$$ ---------------------------------
##NTUPLES= NMR SPECTRUM
##VAR_NAME=  FREQUENCY,     SPECTRUM/REAL,   SPECTRUM/IMAG
##SYMBOL=    X,             R,               I
##VAR_TYPE=  INDEPENDENT,   DEPENDENT,       DEPENDENT
##VAR_FORM=  AFFN,          ASDF,            ASDF
##VAR_DIM=   65536,         65536,           65536
##UNITS=     HZ,            ARBITRARY UNITS, ARBITRARY UNITS
##FACTOR=    0.620285442955139, 1,           1
##FIRST=     20137.2065510682, 0,            0
##LAST=      -20513.1999529968, 0,           0
##MIN=       -20513.1999529968, -399028862,  0
##MAX=       20137.2065510682, 170632774,    0
$$ Real data points
##PAGE= N=1
##DATA TABLE= (X++(R..R)), XYDATA
$$ [...]
##PAGE= N=2
##DATA TABLE= (X++(I..I)), XYDATA
15386 647346 1489440 1303985 759400 785356 1202720 1281592 1032595 902044 701097 26438
15376 26438 -632423 -519791 -157436 -857236 -2594832 -3720558 -3164354 -1795939 -1112410
15367 -1112410 -1517637 -2411188 -3149182 -3294687 -2510733 -877476 869909 1796621 1484471
15358 1484471 369487 -509505 -387297 349901 605476 200379 279301 1425588 2322157
15349 2322157 1488011 -394229 -1362401 -866286 35222 729860 1392670 1455732 -58980
15340 -58980 -2355597 -3163822 -1885567 -449145 -270402 -475466 -182146 -281770 -1349848
15331 -1349848 -1894552 -816753 127564 -1146915 -3330620 -3349624 -1083033 470613 -230829
15322 -230829 -1336602 -912530 276401 510128 -220482 -730943 -586489 -175043 339954
15313 339954 935928 1115190 392499 -861234 -1787188 -2045112 -1958817 -1934238 -2160308 -2618572
15303 -2618572 -3029001 -3006031 -2459787 -1565299 -350629 1114889 2121195 1812086 605184
15294 605184 140817 1151982 2264097 1843854 327542 -476763 11380 585730 273278
15285 273278 -413183 -637417 -539705 -669216 -884836 -658158 -77196 240871 137098 159524
15275 159524 686038 1203960 756810 -888703 -2646624 -2956366 -1473236 318974 689243
15266 689243 -277937 -941452 -471801 72805 -427765 -1271299 -948620 556352 1751525
15257 1751525 1763833 1272183 1167643 1352742 1265692 810450 354983 328916 983429 1973464
15247 1973464 2191377 855244 -1147529 -1975541 -1118002 67085 395176 212800 152000
15238 152000 -137997 -990679 -1548462 -897082 313495 663695 -36156 -688570 -572849
15229 -572849 -64423 103685 -481935 -1641432 -2363963 -1508008 443319 1224456 -397756
15220 -397756 -2501381 -2289531 117113 2009732 1942138 1259467 1560654 2481885 2655269
15211 2655269 1511920 -478217 -2309355 -2816741 -1595784 197042 981281 760118 833664
15202 833664 1579579 2027409 1760474 1560265 1772406 1685306 1067967 727318 957797 1039211
15192 1039211 832672 1099598 1578213 779268 -1291462 -2308800 -926579 1078034 1611207
15183 1611207 1283570 1620890 2058334 1208921 -205177 -401376 301511 62066 -1167131
15174 -1167131 -1535837 -475785 469019 262935 -345851 -574643 -682139 -831758 -639585
15165 -639585 -312608 -598715 -1204734 -923782 218919 633160 -456698 -1904741 -2508280
15156 -2508280 -2357004 -1673321 -87723 1924781 2568807 1072213 -769765 -827900 557206
15147 557206 1397388 894802 28110 -206347 189327 735116 939578 393411 -756164
15138 -756164 -1619455 -1565743 -1096348 -1001068 -1071980 -566019 371089 793212 414330 -4760
15128 -4760 114946 408262 341960 69840 72570 370914 531404 238403 -497213 -1592672
15118 -1592672 -2983828 -4328990 -4869266 -3965119 -1906302 80796 946053 846757 780414
15109 780414 1265088 1749557 1384526 71112 -1377301 -1973698 -1474202 -668433 -581911
15100 -581911 -1255902 -1718519 -1466995 -1330391 -2098560 -2883412 -2107894 17577 1437709
15091 1437709 997920 -104077 -291306 187829 80719 -730294 -1201041 -862520 -405954
15082 -405954 -546577 -1196818 -1874485 -2274560 -2317162 -2090563 -1801773 -1497907 -1008098 -483146
15072 -483146 -605461 -1657332 -2698173 -2496711 -1206099 -245786 -389074 -841204 -591255
15063 -591255 128539 400371 64845 -262781 -379440 -728267 -1286917 -1155641 127786
15054 127786 1513150 1602486 630902 223039 1042887 1812543 1270093 102092 -117165
15045 -117165 744368 1384880 1125558 604242 370936 170691 -8831 475336 1577790
15036 1577790 1996757 942378 -445061 -575513 357604 808882 80955 -1139468 -2184582
15027 -2184582 -3062291 -3673514 -3541603 -2608337 -1437707 -419167 476358 1099191 1194500
15018 1194500 1167979 1720282 2480859 2203785 822303 32657 936874 2249082 2103488
15009 2103488 778650 97428 615034 1087962 675186 -14060 -378133 -717200 -1037527
15000 -1037527 -510087 845698 1315360 -218171 -2152443 -2075129 -181541 1158435 1046752
14991 1046752 1074870 2219557 2919242 1573545 -701580 -1606940 -931332 -381162 -661284
14982 -661284 -721797 35692 682694 451447 -49236 -121444 -216180 -883082 -1491947 -1185098
14972 -1185098 -427912 -356056 -935623 -1038037 -322190 149122 -501613 -1694742 -2240091
14963 -2240091 -1842481 -1209494 -1034431 -1394246 -1959831 -2316302 -2092496 -1184688 -29529
14954 -29529 562853 127677 -848098 -1234442 -405992 958995 1529052 861824 -61152 -113547
14944 -113547 527501 752074 158108 -415286 -193305 359025 195777 -832353 -1772310
14935 -1772310 -1777645 -1001354 -183395 219327 252168 114911 -47344 -72140 174258 520242
14925 520242 404688 -651895 -2339643 -3481288 -3024061 -1253165 269790 264809 -954624
14916 -954624 -2041192 -2254113 -2001322 -1843796 -1741094 -1596945 -1856583 -2910062 -4252910
14907 -4252910 -4891253 -4454383 -3404542 -2296348 -1355761 -676157 -271783 37280 326367
14898 326367 274692 -301046 -830376 -637857 -77447 -126421 -842376 -1260432 -1036616 -1049098
14888 -1049098 -1844838 -2589494 -2378338 -1681200 -1512979 -1895086 -2190442 -2352107 -2642351
14879 -2642351 -2527367 -1182402 953059 2314378 2077461 968464 99490 -142676 44641
14870 44641 261519 7981 -783489 -1240284 -469343 912618 1205377 -115042 -1584944
14861 -1584944 -1679621 -629551 255617 230872 -563233 -1652753 -2380043 -2164879 -1345471
14852 -1345471 -1119854 -1873098 -2250364 -910158 1346768 2432221 1708217 579946 314551
14843 314551 604916 744836 987868 1793824 2513281 2009252 404891 -825274 -712152
14834 -712152 48703 218190 -277069 -397589 466211 1671536 2162400 1640278 645695
14825 645695 -170768 -518187 -409017 3915 522054 974417 1176005 885192 116431 -495649
14815 -495649 -175019 911039 1609415 1230851 451568 185761 197093 -275327 -1017695 -1137057
14805 -1137057 -637812 -439566 -772518 -840589 -375523 -254623 -1010091 -1850976 -1871371 -1228549
14795 -1228549 -360169 935881 2622688 3523139 2585503 544507 -906540 -1286399 -1504633
14786 -1504633 -2118395 -2693396 -2943379 -3262597 -3760552 -3760839 -2790020 -1409714 -610335 -813806
14776 -813806 -1722512 -2678498 -2960618 -2233978 -980602 -99031 75776 -71751 -308114
14767 -308114 -915924 -1918730 -2595493 -2275311 -1217423 -269228 19550 -392094 -1256457
14758 -1256457 -2009412 -1977223 -1221485 -806931 -1501579 -2512924 -2447297 -1417614 -1044094
14749 -1044094 -2054929 -3077589 -2627722 -1328283 -896905 -1464679 -1437816 -91178 1213537
14740 1213537 1020492 -230878 -1150177 -1410954 -1660605 -2012279 -1933558 -1439899 -1151868
14731 -1151868 -1103705 -654940 180861 450305 -236704 -926756 -699295 -4370 128343 -429309
14721 -429309 -1033004 -1398341 -1729363 -1969975 -1774809 -1217566 -865631 -1061408 -1603574 -2203764
14711 -2203764 -2844392 -3543883 -4023386 -3804596 -2721569 -1392429 -930233 -1726625 -2655100
14702 -2655100 -2227290 -642324 243805 -604221 -1973644 -2237559 -1658008 -1647547 -2387563
14693 -2387563 -2689175 -2049191 -1308818 -1006119 -470377 813391 2030385 2047592 886389
14684 886389 -552590 -1666150 -2334725 -2425455 -1929430 -1354803 -1238793 -1347015 -988809
14675 -988809 -105937 565040 515781 97819 -98901 -43481 -78770 -240839 -229251 14209
14665 14209 146677 -42601 -326917 -508749 -824236 -1448143 -1867749 -1396777 -273035 479826
14655 479826 448718 326312 666349 988822 778798 564916 996123 1466051 967113 -746
14645 -746 85517 1271908 1739003 515774 -943940 -967568 -173455 -279669 -1234866 -1336254
14635 -1336254 -41564 1079013 627646 -767573 -1631818 -1682068 -1758443 -2262061 -2573933
14626 -2573933 -1967482 -565370 672318 785353 -187829 -1040575 -660954 478242 776419
14617 776419 -271591 -1178749 -505158 970736 1259319 -29840 -1214559 -1004116 -172595
14608 -172595 -179987 -1073897 -1642790 -1182266 -265616 143881 -249583 -946165 -1220945 -770450
14598 -770450 48375 635483 784712 701946 469935 -36299 -625523 -774004 -421542 -224212
14588 -224212 -587690 -941366 -494405 672185 1775708 2224700 1845270 668799 -836828
14579 -836828 -1683235 -1279591 -253763 321896 315044 410677 796665 843478 131880 -970085
14569 -970085 -1894703 -2431795 -2616925 -2603552 -2658908 -2788636 -2494713 -1491984 -437131 -179732
14559 -179732 -505709 -577902 -499652 -1271625 -3016351 -4397285 -4262803 -2957977 -1546098
14550 -1546098 -564614 -60170 -104342 -663894 -1418300 -2097877 -2632240 -2868545 -2680959 -2336691
14540 -2336691 -2070946 -1465397 -207628 755213 199993 -1229916 -1518577 -238304 799370
14531 799370 514772 207651 1054750 1881600 1203968 -35121 91853 1322627 1720885
14522 1720885 846648 207164 619588 1138041 866878 119035 -654906 -1624200 -2732999
14513 -2732999 -3271062 -2812299 -1713327 -400082 952457 1827536 1441452 -191361 -1994644
14504 -1994644 -2923888 -2758689 -1782496 -410675 793203 1459907 1854150 2345024 2556822
14495 2556822 1849343 541376 -278633 -200327 129325 110131 -214242 -692246 -1253326 -1482696
14485 -1482696 -997320 -412843 -923010 -2599478 -4026057 -4020053 -2941402 -1918394 -1488562
14476 -1488562 -1420069 -1317456 -1020672 -722292 -774068 -1068550 -862150 211060 1278925
14467 1278925 1186504 24050 -1191381 -1983590 -2429637 -2096280 -509526 1359559 1771427
14458 1771427 722439 164224 1140943 2249774 1823365 313940 -588820 -269531 420398
14449 420398 446324 -512043 -1903469 -2551196 -1731146 -360592 -229284 -1675412 -3086942
14440 -3086942 -3176711 -2517481 -2129808 -1857786 -1175480 -489997 -442782 -734828 -753898 -671099
14430 -671099 -931879 -1367152 -1705484 -2139171 -2466540 -1689145 375671 2097287 2046303
14421 2046303 1106156 1007203 1564759 1219733 -191265 -1218796 -1249545 -1246306 -1837540 -2422413
14411 -2422413 -2565317 -2675389 -2785047 -2150206 -722057 341416 389417 270832 775561
14402 775561 1251092 818477 511 -87583 472587 679270 328214 212456 628598 819440
14392 819440 225859 -562743 -619713 87320 808428 1046610 918196 564061 -188828 -1293347
14382 -1293347 -2022609 -1598619 -283678 605592 3917 -1779074 -3377034 -3644852 -2558563
14373 -2558563 -1089238 -323863 -541469 -1073284 -1191591 -995926 -1058886 -1354260 -1209866
14364 -1209866 -429964 271564 294454 -62206 -296043 -555292 -1200487 -2027226 -2577719 -2804280
14354 -2804280 -2761011 -2055108 -416664 1410743 2162020 1450710 143789 -586247 -173766
14345 -173766 1086056 2153759 1927812 439473 -921917 -1007646 -327706 -74606 -224535
14336 -224535 186837 1118558 1326628 395758 -426397 -137487 418637 -99681 -1316662
14327 -1316662 -1498280 33262 1899160 2352133 1291002 138268 17935 571594 679439
14318 679439 -36230 -856043 -1018535 -584239 -57804 306430 405309 -12251 -916692 -1608629
14308 -1608629 -1474127 -910361 -741335 -894191 -575439 257087 658122 209256 -252991
14299 -252991 22019 507769 324200 -307503 -469673 -49561 141925 -274634 -646005 -287041
14289 -287041 566648 1185722 1281612 1059260 601933 -235059 -1265554 -1786487 -1273633 -58039
14279 -58039 1004474 1432217 1385730 1165410 902178 777103 1033794 1557478 1857057 1681301
14269 1681301 1229551 575665 -494673 -1714909 -2149603 -1459216 -718236 -1064713 -2009596
14260 -2009596 -2155006 -1276304 -452612 -217682 17153 423361 80575 -1397872 -2728334
14251 -2728334 -2524877 -1272741 -611517 -1048265 -1498300 -1043060 -146795 168945 -291245
14242 -291245 -768610 -559069 166069 589139 224303 -489084 -749398 -395557 51975 275733
14232 275733 465406 588781 80469 -1256648 -2566378 -2752495 -1692255 -202463 871491
14223 871491 1134493 677382 174631 479639 1475684 1808675 570264 -1205919 -1748150
14214 -1748150 -918802 -160399 -194650 -221976 299451 563454 -114633 -940839 -813413 -26509
14204 -26509 279087 -201444 -824269 -1115330 -1012947 -393865 617874 1208967 821523 241447
14194 241447 560338 1313336 1082803 -87915 -553837 282039 893093 72236 -1087915
14185 -1087915 -967370 -737 127468 -771866 -1120735 24041 1687577 2375971 1802726
14176 1802726 876188 528127 768077 679065 -469016 -1935714 -1982944 -130875 1870040
14167 1870040 2181410 1187100 499399 431326 62913 -618282 -528774 485781 1220733 1083453
14157 1083453 880894 1160427 1356433 1215771 1458611 2141965 1912586 54542 -2030784
14148 -2030784 -2673187 -2146692 -1703012 -1418256 -540245 735028 1404830 1206597 699957
14139 699957 134748 -554667 -988423 -793815 -485369 -687667 -861414 -145210 868483
14130 868483 765654 -337419 -703323 464844 1843545 1914575 846921 -180464 -515567
14121 -515567 -213095 482143 1113338 1081360 385307 -127775 244533 1161473 1719456 1530180
14111 1530180 1017815 872703 1364127 1971258 1726312 298481 -1322921 -1718213 -619894
14102 -619894 853176 1489455 1002097 -118739 -1081135 -1129841 -143880 990360 1246478
14093 1246478 751796 520355 882326 1063037 513874 -274540 -677585 -781391 -800233 -470568
14083 -470568 260587 595026 -211158 -1657665 -2510379 -2338964 -1863632 -1833289 -2184137 -2389695
14073 -2389695 -2135216 -1454519 -542554 331192 879308 939610 526462 -268505 -1256404 -1949158
14063 -1949158 -1670687 -296717 1182886 1471058 618272 191632 1133276 2117565 1230928
14054 1230928 -1053945 -2192755 -1098295 367472 261099 -706510 -712829 149442 202464
14045 202464 -1111156 -2645090 -3440003 -3603028 -3347554 -2598300 -1629921 -882955 -180174
14036 -180174 728417 1139880 373940 -502070 251745 2189024 2858326 1279284 -705037
14027 -705037 -1311176 -1161606 -1588790 -2255011 -2034040 -1157864 -856328 -1410320 -1914869 -1718818
14017 -1718818 -1073348 -495983 -227725 -210381 -169001 83520 259742 -61999 -678235 -995461
14007 -995461 -1003517 -1131495 -1165017 -469762 615956 983133 600792 644768 1369080 1551494
13997 1551494 733374 181003 598811 729976 -379286 -1457372 -1079414 -165497 -418722
13988 -418722 -1429026 -1445667 -227248 960485 1629511 2316146 2866409 2417243 1050752
13979 1050752 -144942 -633532 -730210 -613006 -316634 -265477 -509849 -107942 1263680
13970 1263680 1997034 721920 -1125486 -1202381 5475 33110 -1399312 -2104184 -1387657
13961 -1387657 -1077862 -1903610 -2003105 -333186 1278948 1149643 313770 247799 285501 -609617
13951 -609617 -1465184 -971295 79450 311143 282309 1057103 1529481 -62221 -2701411
13942 -2701411 -3523675 -2002523 -539717 -666544 -1175385 -688509 165983 254023 -110348
13933 -110348 -33921 249343 -146155 -1077764 -1216868 373905 2905229 4276125 3096561
13924 3096561 445462 -999073 -95455 1307036 999274 -401857 -508107 1103270 2248603
13915 2248603 1450701 -46826 -336577 639623 1605228 1780786 1233849 371152 -14323
13906 -14323 927156 2820323 3901219 3014551 1044676 -450732 -1164362 -1625774 -1793843
13897 -1793843 -1397059 -1042259 -1516453 -2307230 -2253159 -1515593 -1416118 -2212627 -2544317 -1541388
13887 -1541388 -135693 463683 482218 804006 1285246 989736 -176008 -1073146 -722796
13878 -722796 497389 1272964 745936 -593708 -1359394 -697151 737068 1453784 792010
13869 792010 -433412 -1002803 -562815 357763 1121108 1406463 1218473 872591 755227
13860 755227 826704 669119 285936 339922 1050601 1345057 25049 -2332054 -3651869
13851 -3651869 -2868799 -1314411 -971863 -1929103 -2465721 -1522638 -115492 103725 -991417
13842 -991417 -2000610 -1901640 -1168720 -872384 -1372654 -2294836 -3212977 -3736644 -3334856 -1889349
13832 -1889349 -290557 338509 53501 -83694 297754 321096 -572449 -1465660 -1193722
13823 -1193722 -77860 522222 29908 -913030 -1662352 -2271014 -2874500 -3183976 -2901459
13814 -2901459 -2156899 -1317772 -698634 -514957 -756787 -1073418 -1117857 -968023 -878711 -794616
13804 -794616 -590679 -594794 -1191692 -1962728 -1973311 -1024550 97321 775147 1183104 1465226
13794 1465226 1153783 47641 -953141 -718164 640145 1844716 1932580 1114103 195350
13785 195350 -305051 -326080 -9208 387845 495831 92901 -563251 -869270 -539783 -52438
13775 -52438 -176866 -1069456 -2151485 -2915463 -3370578 -3475858 -2740873 -976069 958713
13766 958713 1878572 1590181 858845 234651 -368517 -1003097 -1390693 -1414654 -1268367 -1018744
13756 -1018744 -609027 -286130 -331314 -384329 129083 847957 749473 -185849 -646043 165720
13746 165720 1315858 1444377 470941 -724155 -1557342 -1838779 -1306238 -95880 774816
13737 774816 493905 -165471 382599 2321626 3935080 3621421 1712682 -92013 -609056
13728 -609056 -45441 724520 1219370 1516984 1623336 1130074 -213469 -1793371 -2461820
13719 -2461820 -1679520 -57160 1276404 1587405 894811 -168025 -805059 -709451 -275253
13710 -275253 44242 270038 388056 -115389 -1346412 -2156635 -1476607 -203374 -193703 -1389616
13700 -1389616 -1778408 -604093 374939 -272617 -1498561 -1803384 -1613257 -1870085 -1829956
13691 -1829956 -476939 1016620 730699 -739233 -1022798 229000 921354 174972 -237230
13682 -237230 942782 2197350 1665518 94704 -438232 333269 820420 190163 -609956
13673 -609956 -487883 349598 940532 823874 336055 -50852 -350651 -918345 -1727445 -2098116
13663 -2098116 -1489901 -355309 333833 330606 260659 512567 710914 520684 280414 396072
13653 396072 595910 291691 -558118 -1336359 -1434323 -829928 -51957 377965 499997 782737
13643 782737 1349999 1678218 1357005 749831 399560 153063 -437005 -1100954 -1050694 -129600
13633 -129600 965053 1593560 1644920 1185828 394076 -197307 -179503 11234 -338620 -952897
13623 -952897 -816784 196564 973375 752437 130932 28036 454803 828657 844964 529205
13613 529205 -44149 -651077 -964730 -969296 -883934 -590027 213667 1165504 1344886 491076
13603 491076 -623941 -1298470 -1598387 -1703912 -1463372 -990740 -822780 -1011153 -900903
13594 -900903 -278873 141195 -126917 -651466 -1080140 -1742584 -2564058 -2588908 -1594092 -998733
13584 -998733 -1820348 -2724105 -1770213 532694 1737180 826323 -665580 -1048349 -407223
13575 -407223 273586 531053 322104 -414963 -1365227 -1767425 -1388379 -983362 -1225998 -1668060
13565 -1668060 -1310548 89735 1684700 2328298 1562422 74693 -826927 -586948 -149624
13556 -149624 -740363 -2030887 -2448191 -1429677 -247652 -92571 -461837 -334843 47873
13547 47873 -146859 -573163 -155669 899173 1169303 331669 -175230 538872 1303469 755130
13537 755130 -506022 -1062956 -1071913 -1713582 -2694990 -2357754 -537762 644723 -289088
13528 -289088 -2061060 -2612637 -1890390 -1229667 -961121 -349064 567542 808140 145380
13519 145380 -482100 -471833 -263002 -278567 -276132 -114961 -186440 -641925 -983297 -807564
13509 -807564 -302898 230460 686486 866965 649255 495567 913084 1388466 947535 -138501
13499 -138501 -524577 41332 210707 -692762 -1411368 -742096 577834 1204167 1239262 1535409
13489 1535409 1873236 1400300 314884 -366188 -373176 -233085 -105737 191463 340470 -62446
13479 -62446 -575374 -597577 -574116 -1199920 -1882467 -1544021 -598251 -381181 -803813 -510465
13469 -510465 564677 898563 50779 -493320 68085 463193 -303159 -1129688 -800073
13460 -800073 -74373 -98911 -244582 473917 1083978 92748 -1577287 -1631872 -119334 468049
13450 468049 -911462 -2328960 -2101607 -1311026 -1715766 -2858624 -3008202 -1954454 -1088569
13441 -1088569 -1116525 -1264546 -813540 -209352 -276573 -1027162 -1613191 -1198260 221738 1737953
13431 1737953 2352649 1928873 1085631 262819 -498385 -878791 -408009 374472 68676
13422 68676 -1464057 -2288730 -977584 969437 1003703 -747973 -1678962 -617079 593608
13413 593608 67537 -1487078 -2263511 -1981967 -1584503 -1365529 -954407 -544037 -646399
13404 -646399 -888119 -362952 868901 1743567 1670869 1073904 432514 -233265 -770012 -696981
13394 -696981 43410 772848 805267 45913 -1206602 -2507441 -3241827 -2981580 -2085845
13385 -2085845 -1451114 -1458984 -1596353 -1274475 -590246 -73058 -18667 -252273 -323171 103042
13375 103042 813780 1108636 622727 -67266 -131443 346044 480947 -131893 -872238 -970435
13365 -970435 -409762 224911 373022 -165619 -1107109 -1753051 -1564576 -819627 -396537 -816147
13355 -816147 -1767192 -2570981 -2787626 -2388473 -1707164 -1256288 -1291095 -1544645 -1588816 -1311851
13345 -1311851 -851495 -385551 -266353 -865383 -1821577 -2029038 -1056564 80 -60436
13336 -60436 -861265 -1261268 -1275422 -1762508 -2544584 -2523745 -1718547 -1459506 -2172776 -2633822
13326 -2633822 -2086459 -1521512 -1883266 -2383878 -1823793 -565781 72540 -305315 -1045696
13317 -1045696 -1648459 -2056321 -2152440 -1887869 -1591504 -1439090 -1045642 -259746 213018 -197358
13307 -197358 -859001 -820267 -332877 -449287 -1320355 -1935541 -1589683 -737676 -218172 -284114
13297 -284114 -632495 -966802 -1293238 -1769272 -2277710 -2250163 -1297839 -44562 288371 -604472
13287 -604472 -1648979 -1825105 -1384017 -1085900 -911209 -344726 504593 954434 766029
13278 766029 398237 290897 417369 489496 218959 -482359 -1222915 -1277985 -400614 694658
13268 694658 1011306 328534 -616236 -857025 -65925 1043669 1236178 100032 -1231426
13259 -1231426 -1290972 -69811 1169817 1690875 1803782 1645399 840464 -303170 -716849
13250 -716849 -290275 -265398 -1153596 -1708557 -1004003 -132570 -501758 -1618021 -2053666 -1679268
13240 -1679268 -1427441 -1616196 -1984352 -2660273 -3578442 -3649627 -2178536 -522046 -551454
13231 -551454 -1855020 -2301956 -1179798 103931 453429 338162 337872 194796 -156763 -126357
13221 -126357 363740 543350 198446 187076 942056 1618748 1462677 1021372 1183235 1792861
13211 1792861 2025934 1579742 791645 7809 -544890 -582246 -42942 568173 529541 -352181
13201 -352181 -1466235 -1899758 -1314110 -375567 -92730 -619328 -1070621 -728717 16315
13192 16315 242092 -418343 -1551617 -2335951 -1932588 -243314 1412708 1316059 -446185
13183 -446185 -1798385 -1332295 3896 680909 707879 776637 614297 -206651 -881365 -552177
13173 -552177 2943 -340819 -950324 -626339 -86672 -897757 -2419610 -2399663 -582541
13164 -582541 815979 543437 -226907 -435446 -766096 -1796432 -2588810 -2309467 -1647746
13155 -1647746 -1535706 -1782980 -1893107 -2018092 -2311449 -2445508 -2387516 -2570929 -2889267 -2715994
13145 -2715994 -2198825 -2154972 -2432223 -1939293 -606565 400467 795423 1603402 2935952
13136 2935952 3359850 2325036 1271439 1308136 1636494 1343678 906952 723752 -7906
13127 -7906 -1573413 -2634140 -2295687 -1691342 -2035293 -2635393 -2346346 -1523035 -1030761 -764710
13117 -764710 -572111 -1026350 -1801833 -1163690 1109110 2297542 528190 -1906478 -1772061
13108 -1772061 162711 597029 -975680 -1881149 -823749 527282 705161 196428 -405401
13099 -405401 -1231633 -1566443 -145180 2161645 2558447 346688 -1653216 -1105810 593192
13090 593192 829717 -306677 -767733 -24999 507178 144023 -68440 631468 1255505
13081 1255505 432759 -1555768 -2979768 -2730874 -1522356 -808657 -1016052 -1423385 -1531669
13072 -1531669 -1636684 -1887946 -1790628 -1182928 -775082 -945891 -882544 87663 1089775 818228
13062 818228 -533775 -1707231 -2218356 -2417683 -2173018 -1082670 143585 116503 -1256107
13053 -1256107 -2584680 -2942514 -2680748 -2163283 -1124897 332111 1415723 1797704 1934696
13044 1934696 1846883 854392 -891478 -1892854 -1211971 65662 215178 -942762 -2073612
13035 -2073612 -2063180 -1022393 75798 226903 -797029 -2047891 -2154929 -829854 707440
13026 707440 1068307 120261 -1107857 -1552211 -961326 33851 567215 497392 584933 1339505
13016 1339505 2058461 1761937 803072 515292 1268679 1974804 1762477 1110448 882975
13007 882975 1114080 1276045 1110379 746621 469531 573665 945144 831649 -206178
12998 -206178 -1220363 -856380 517635 996934 -159442 -1416741 -1263575 -269962 178010
12989 178010 -3378 -70549 -128570 -779637 -1577539 -1392227 -273482 382042 -274043 -1545985
12979 -1545985 -2376925 -2627518 -2757390 -2881067 -2638593 -1762195 -536879 225764 -186047
12970 -186047 -1504452 -2450772 -2036708 -726462 216939 359596 362361 647367 674832 -66591
12960 -66591 -1026616 -1185548 -378610 540432 761184 281833 -362980 -691794 -487053 182705
12950 182705 890686 1060929 560954 -57832 -202988 29961 157228 190923 606320 1334146
12940 1334146 1516587 714361 -258784 -403109 -3302 -143948 -930195 -1220616 -355053
12931 -355053 795015 1067615 624836 577949 1357637 2256111 2558538 2403560 2247818 1991733
12921 1991733 1136695 -331600 -1669863 -2111229 -1626522 -826143 -330751 -422579 -1054749
12912 -1054749 -1815181 -1985369 -1092613 506993 1913087 2571700 2559646 2085555 1276450
12903 1276450 489266 145462 58375 -377347 -1085231 -1247348 -766008 -786340 -1971899 -3185130
12893 -3185130 -2999798 -1808306 -1093149 -1104854 -819301 -39052 156281 -641031 -1338895
12884 -1338895 -1128937 -761761 -1136632 -1706743 -1410917 -461109 -3790 -348760 -638120
12875 -638120 -233092 479713 796245 494928 -291382 -1426414 -2635222 -3363321 -3180783
12866 -3180783 -2260279 -1183805 -282950 550025 1291875 1391827 398535 -1136916 -1986108
12857 -1986108 -1637358 -827223 -439659 -498106 -659886 -992268 -1523924 -1633408 -869905 5883
12847 5883 -98408 -893167 -1082714 -470184 -378321 -1583975 -3005600 -3121460 -1845256 -323603
12837 -323603 449970 194141 -853698 -1999609 -2410126 -1964671 -1429645 -1345414 -1242555
12828 -1242555 -498116 537486 937009 368295 -751640 -1955218 -2932897 -3306412 -2899341
12819 -2899341 -2153917 -1694362 -1532925 -1245153 -864080 -971805 -1759263 -2506315 -2311559
12810 -2311559 -1130167 127001 476966 -194363 -1013219 -958502 120410 1367403 1808917
12801 1808917 1262303 356851 -142639 43080 564203 808262 537428 170983 250920 689388
12791 689388 875987 524361 -6593 -307927 -356907 -181847 376327 1195004 1612524 1181336
12781 1181336 439632 357196 1032471 1450955 728788 -726581 -1598862 -1130113 78731
12772 78731 861739 836644 583846 573983 546536 206641 -148117 -301297 -810471 -2100773
12762 -2100773 -3276281 -3031921 -1662766 -847936 -1210737 -1487144 -711187 161918 -134180
12753 -134180 -1074725 -1236958 -575348 -306109 -866636 -1480595 -1707371 -1967040 -2285555 -1899884
12743 -1899884 -651093 414329 555206 452574 975515 1699737 1705633 1219806 1236707 1783244
12733 1783244 1804706 850726 -241519 -645370 -555336 -458446 -271221 169471 460268 218233
12723 218233 -197383 -277456 -201997 -278100 -14603 1160778 2490009 2433479 775442 -965448
12713 -965448 -1564246 -1422211 -1356464 -1188874 -450217 354234 317080 -434423 -886006 -554130
12703 -554130 89179 539475 867164 1338768 1946434 2385235 2274957 1590477 1002505 1263428
12693 1263428 1974331 1741954 145906 -1315917 -1166536 -28367 467919 191149 349935
12684 349935 1125844 1253410 222243 -727085 -462108 465100 886691 665638 427211
12675 427211 366468 165686 -285632 -710760 -790539 -404336 238657 690516 870793 1378814
12665 1378814 2514805 3265789 2369764 350355 -836983 -450135 161272 -138400 -593649
12656 -593649 -196289 327537 -365798 -1936113 -2718300 -2073288 -1026953 -593287 -624446
12647 -624446 -528659 -217080 36246 134157 217499 386129 470511 71780 -961037 -2044928
12637 -2044928 -2300192 -1697552 -1247116 -1652474 -2285030 -2050421 -906043 81705 1881
12628 1881 -1050021 -2224116 -2644342 -2047377 -988862 -273020 -87773 -28060 36313 -234295
12618 -234295 -798424 -964118 -394358 308706 500640 294488 -28263 -623013 -1461078 -1929482
12608 -1929482 -1874783 -2229083 -3546889 -4664756 -4153486 -2602700 -1921398 -2525305 -2875368
12599 -2875368 -2106702 -1488717 -2373136 -3871035 -3847221 -1772125 560178 1214576 202377
12590 202377 -923917 -1035931 -439609 -29325 -63561 -200946 -380705 -909453 -1599720 -1591273
12580 -1591273 -476962 927438 1482814 1046111 385516 96763 165539 384716 611373
12571 611373 663434 427363 57284 -251981 -589847 -1138000 -1810617 -2371051 -2715293 -2774624
12561 -2774624 -2409077 -1720149 -1180255 -1081531 -1121238 -894091 -506515 -322183 -396932 -562418
12551 -562418 -765656 -925629 -790330 -380452 -247485 -817157 -1746965 -2331149 -2235463 -1539259
12541 -1539259 -557453 31454 -412956 -1428748 -1598927 -498634 430180 24629 -528869
12532 -528869 628421 2887778 3696773 2224186 490760 284384 789837 344902 -926358
12523 -926358 -1651068 -1438932 -1108065 -1141420 -1255867 -1383205 -1914333 -2826334 -3470120 -3463887
12513 -3463887 -3095628 -2595259 -1662224 -114364 1473421 2272287 2110207 1469034 739445
12504 739445 -56840 -829595 -1231079 -1142157 -961219 -1056461 -1220107 -1112521 -1008152 -1457756
12494 -1457756 -2246045 -2438912 -1713626 -930399 -903069 -1208554 -911406 -67166 341553 -112425
12484 -112425 -673781 -461844 401376 1014608 733174 -244611 -1135786 -1280005 -721318 -136866
12474 -136866 -75461 -322171 -223273 400681 951535 746937 -200579 -1236764 -1748261 -1596283
12464 -1596283 -929728 117850 1302364 2039297 1805224 899953 308952 475873 704383
12455 704383 289930 -282905 -101986 588445 653466 -168874 -958785 -1240210 -1646919 -2462960
12445 -2462960 -2730978 -1705708 -255981 242637 -200821 -447522 15287 551125 432957
12436 432957 -365951 -1341838 -1833824 -1401855 -337877 431453 375850 -48135 -200763 -70949
12426 -70949 232485 1053210 2390900 3162734 2373225 689939 -262777 -37833 304479
12417 304479 13892 -330519 25310 730186 813190 20131 -884196 -1110883 -820917 -834229
12407 -834229 -1321053 -1270053 98949 1727684 1684583 -131603 -1606030 -1307360 -387532
12398 -387532 -573734 -1569092 -1924085 -1510281 -1365503 -1615026 -1343495 -406005 235424 41285
12388 41285 -596650 -1351754 -2101957 -2129430 -738818 1120703 1392292 -450581 -2611221
12379 -2611221 -3314835 -2706485 -1826049 -917189 337704 1706366 2441778 2129383 1075428
12370 1075428 118814 78259 877688 1348557 634309 -418963 -295980 912668 1589340
12361 1589340 1056463 485314 858391 1460144 1231848 431071 -86636 -322349 -768660
12352 -768660 -1228076 -1092550 -474188 -123033 -355434 -797109 -1131466 -1496739 -2069000 -2641935
12342 -2641935 -2766673 -2218758 -1293462 -563012 -277575 -208700 -196480 -422836 -852074 -1009759
12332 -1009759 -872001 -1261897 -2482955 -3277230 -2406180 -738703 -222116 -1028782 -1450160
12323 -1450160 -701285 -13507 -447622 -1289524 -1412670 -870523 -294747 139120 367565
12314 367565 113509 -402868 -460133 -126662 -376530 -1284622 -1471602 -260232 940587
12305 940587 565895 -911079 -1927674 -1972273 -1521498 -787138 77287 298209 -509179
12296 -509179 -1213385 -499895 1078946 1817470 1327063 816370 969795 1025597 274357 -743676
12286 -743676 -1093687 -708755 -260167 -199672 -325827 -151751 445684 960381 818802 232609
12276 232609 77564 731612 1481649 1365786 230148 -1222937 -2015074 -1524860 -212945
12267 -212945 332315 -949745 -2840282 -3011986 -1214397 236544 -244917 -1425217 -1537197
12258 -1537197 -988138 -1177967 -1941159 -2084279 -1600432 -1404441 -1415974 -794015 264100
12249 264100 782935 848103 1366693 2081212 1716339 303772 -468425 267210 1299344
12240 1299344 1189192 79113 -989335 -1476810 -1465919 -1248434 -1210706 -1375320 -967365
12231 -967365 564983 2105654 1829489 -109688 -1366545 -550203 830941 581048 -1157844
12222 -1157844 -2340369 -1812888 -462648 224164 -139376 -650994 -233472 1058245 1893579
12213 1893579 1223837 -185717 -591781 380701 1315925 1159160 524078 267314 57164
12204 57164 -625693 -1145958 -693177 115195 28507 -816300 -1071390 -290458 474530 395904
12194 395904 9236 174493 813343 1253747 1194107 770553 122727 -585648 -1034914 -1127641
12184 -1127641 -1303080 -2041774 -3160351 -3969032 -4065180 -3601820 -2776310 -1502274 152517
12175 152517 1492984 1615641 396770 -1187480 -1915275 -1429930 -421099 174580 -7952
12166 -7952 -652536 -1203910 -1308931 -963620 -407715 78150 324895 305099 94013 -156364
12156 -156364 -260688 -143153 -5692 -260952 -1100598 -2086109 -2450806 -2089453 -1974590 -2960556
12146 -2960556 -4197386 -3670589 -859787 2002943 2391953 726017 -173351 1202531 3329371
12137 3329371 4062153 3355540 2627300 2466632 2263236 1620528 907852 471151 214895
12128 214895 34453 11788 132463 250029 258336 -7280 -737786 -1664273 -2068555 -1752389
12118 -1752389 -1433398 -1580607 -1551555 -740209 139277 98287 -357510 65158 1272517 1888741
12108 1888741 1526970 1325932 1915851 2434696 2158357 1653112 1519010 1325781 775524
12099 775524 703963 1690981 2614330 1973214 94651 -1295294 -1404851 -1079986 -1256152
12090 -1256152 -1741624 -1681106 -585214 1114666 2152150 1423685 -577362 -1851573 -1149695
12081 -1149695 419038 932440 183631 -564665 -826637 -1244255 -1781643 -1410441 -103834
12072 -103834 527074 -475214 -1837717 -1926842 -1109778 -880077 -1385584 -1388529 -437394 405192
12062 405192 206730 -627125 -1201456 -1335897 -1407307 -1517434 -1323576 -564225 442197 848840
12052 848840 80379 -1233695 -1621121 -589851 441694 -91899 -1639612 -2253463 -1413923
12043 -1413923 -624651 -864327 -1052963 -893 1445202 1596574 436899 -565675 -755260
12034 -755260 -886588 -1456250 -1865802 -1601729 -1088933 -837269 -663307 -386563 -531986 -1529522
12024 -1529522 -2657543 -2641777 -1271257 217204 530327 -300653 -1154772 -1179808 -549946
12015 -549946 127880 705135 1374687 1900011 1632824 454333 -882496 -1664056 -1986902
12006 -1986902 -2286948 -2603027 -2715121 -2529544 -1928062 -816653 233681 174535 -1005475
11997 -1005475 -1788581 -1087934 134071 402990 51568 405345 1280650 1261514 248058
11988 248058 -406823 -457206 -1192688 -2717760 -3152819 -1749691 -639504 -1703321 -3439607
11979 -3439607 -3129117 -950823 443178 -82684 -956476 -783623 -272474 -588608 -1408483
11970 -1408483 -1638479 -1125427 -673981 -780389 -1079066 -965198 -346056 329710 684788
11961 684788 865265 1143870 1216776 485220 -830791 -1579251 -1108244 -185955 67694 -383062
11951 -383062 -768112 -758761 -699766 -843272 -969010 -682916 162203 1056227 833033 -1135968
11941 -1135968 -3566188 -4202320 -2681847 -1208200 -1477402 -2280421 -1572485 242657 995314
11932 995314 47121 -1145062 -1598679 -1966610 -2878618 -3838746 -4260735 -4215262 -3697493 -2416497
11922 -2416497 -757026 241772 321735 314460 641614 691636 132810 -388655 -439082 -482685
11912 -482685 -714651 -430992 592122 1246925 658973 -387739 -723474 -612214 -1015772
11903 -1015772 -1751258 -1862832 -1455479 -1606024 -2410185 -2568283 -1349112 198582 685819
11894 685819 236549 100277 820943 1576422 1346680 198456 -827526 -878522 -68498
11885 -68498 892846 1550443 1895542 1857351 1150349 -116067 -1116760 -1107385 -354140 248750
11875 248750 394884 579423 1022487 1123064 438498 -403064 -521475 -172375 -386861 -1259345
11865 -1259345 -1631527 -840054 191334 301449 -249431 -392447 58161 431315 578826
11856 578826 994629 1588809 1570891 798992 161957 267161 722178 1067175 1390541 1553840
11846 1553840 876521 -697463 -1997775 -1956651 -863924 315448 1146217 1640961 1747555
11837 1747555 1582434 1486673 1331632 590890 -463186 -758661 -192627 -36396 -762274
11828 -762274 -1051800 -172647 361541 -766176 -2165746 -1888466 -759917 -918815 -1980870
11819 -1980870 -1742316 -370541 -553915 -2985193 -4876396 -4157160 -2378340 -1813578 -2060930
11810 -2060930 -1578309 -744570 -1011708 -2088647 -2278628 -1219507 -334228 -550638 -1154211
11801 -1154211 -1191632 -837042 -886062 -1552768 -2190397 -2009787 -957644 114604 314178
11792 314178 -305718 -958976 -1213263 -1268926 -1196933 -730899 -35299 149073 -446608 -1074667
11782 -1074667 -899517 43050 1109472 1729179 1588531 743044 -190730 -525877 -371757
11773 -371757 -403914 -702912 -649728 -154235 -35728 -775693 -1736860 -2096668 -1825195 -1304715
11763 -1304715 -710411 -233383 -244193 -763799 -1321452 -1643157 -1884027 -2002435 -1670504 -1008395
11753 -1008395 -549454 -254435 472758 1506508 1812349 968330 -156011 -675021 -587772
11744 -587772 -55528 882359 1328837 -140321 -3127269 -4855112 -3379495 -249514 1520999
11735 1520999 1178042 280305 -175140 -694726 -1553241 -2030033 -1769451 -1467426 -1639625
11726 -1639625 -1759835 -1211908 -315793 211102 316576 528937 973347 975254 -114186 -1799219
11716 -1799219 -2531101 -1297636 1039746 2536909 2308954 1325704 1015658 1716689 2666667
11707 2666667 2893605 1925431 228942 -923332 -676488 264361 462542 -349397 -1194045
11698 -1194045 -1575867 -1908185 -2085095 -1288254 229472 842938 -71084 -1015005 -705220
11689 -705220 -12876 -241129 -861107 -587116 355146 703954 139091 -719319 -1583474 -2353669
11679 -2353669 -2413877 -1460537 -337712 212957 700110 1443006 1266490 -517582 -2061764
11670 -2061764 -1264176 786075 1220531 -339374 -1695363 -1953872 -2429228 -3405522 -3131516
11661 -3131516 -1004545 1011114 1426258 1238603 1485406 1145481 -688707 -2519639 -2394716
11652 -2394716 -721141 740624 1387440 1428099 371870 -1934047 -3732344 -3177843 -1217469
11643 -1217469 -407161 -1162377 -1509538 -602417 -57892 -1133198 -2694237 -3082227 -2353205
11634 -2353205 -1446874 -493081 644847 1151062 167680 -1544089 -2277958 -1576042 -543740
11625 -543740 -28835 274278 693287 789871 347185 202533 1158868 2562329 2933631 1895117
11615 1895117 602895 120199 112460 -419043 -1595383 -2448283 -2177131 -1163632 -544801
11606 -544801 -955381 -1914367 -2457636 -2151504 -1313316 -456688 64257 -56547 -906170 -1850461
11596 -1850461 -1865883 -868925 -143773 -776309 -2152932 -2835046 -2490231 -1929292 -1539915
11587 -1539915 -954290 -250148 -123526 -586322 -784328 -541571 -767042 -1690785 -2054916
11578 -2054916 -1044394 164507 25911 -1104702 -1651566 -1133169 -468629 -390921 -802889
11569 -802889 -1426728 -1933146 -1652101 -262540 1399885 2207369 2126055 1749025 965190
11560 965190 -520943 -1720776 -1172351 652314 1464715 206415 -1504496 -1688836 -495154
11551 -495154 466755 218385 -1056356 -2685648 -3783916 -3559922 -2280529 -1405353 -1933546
11542 -1933546 -3076280 -3334508 -2412747 -1235543 -504363 -193079 -221280 -629000 -1066077
11533 -1066077 -945427 -245806 458860 815227 916494 719642 10381 -869098 -1052572
11524 -1052572 -339672 291634 -72899 -1020895 -1451110 -1127097 -819220 -1008405 -1253346
11515 -1253346 -1010056 -401628 136356 431529 437031 8464 -734704 -1220574 -1081544 -676529
11505 -676529 -485915 -354881 61088 429516 82055 -923002 -1817411 -2123569 -1919360
11496 -1919360 -1222613 11964 1271196 1804104 1709729 1754234 1916740 1236317 -455100
11487 -455100 -1809460 -1740447 -954020 -777804 -1262395 -1492820 -1167914 -713793 -195467 709145
11477 709145 1731889 2060798 1520990 939085 1122335 1974853 2720941 2649794 1697024 589467
11467 589467 211921 553815 688988 167939 -197141 386795 1256099 1149014 120460
11458 120460 -569187 -373174 -51403 -172282 -232665 176254 315696 -716768 -2465272
11449 -2465272 -3428025 -2762699 -1066293 505847 1317179 1306471 547489 -685404 -1586938
11440 -1586938 -1261822 183295 1461664 1497202 645644 -30220 -320981 -855033 -1733369
11431 -1733369 -2264481 -2179583 -2021443 -1991022 -1491832 -357036 497943 345370 -351373 -937306
11421 -937306 -1617189 -2625887 -3307106 -3144342 -2886127 -3337518 -3686913 -2532467 -225662
11412 -225662 1335603 1197395 204338 -738263 -1805106 -3197779 -4201500 -4070268 -3078754
11403 -3078754 -1988113 -1004108 66255 976636 1097872 373172 -316105 -131041 557348
11394 557348 550130 -435505 -1115284 -460118 461120 -223433 -2263830 -3330719 -2325048
11385 -2325048 -891892 -778398 -1362204 -1133633 -205751 303454 307334 416804 411433 -161378
11375 -161378 -545715 182609 1155867 767297 -643789 -1200782 -455592 159883 -52721
11366 -52721 -175485 149317 -203049 -1722086 -3050691 -2976964 -2192787 -1986961 -2364014 -2471478
11356 -2471478 -1912283 -762807 779349 1977368 1738173 39295 -1671410 -2227518 -2018096
11347 -2018096 -1849898 -1619027 -1038020 -643053 -878136 -973436 -56127 1153656 1134415 -159975
11337 -159975 -1124523 -712376 286839 515864 -234572 -1044920 -1092175 -412688 318813 455934
11327 455934 -92369 -840129 -1250998 -1294024 -1373387 -1713218 -2016256 -1890412 -1479091 -1353070
11317 -1353070 -1703906 -1997030 -1717893 -1156482 -963033 -1125006 -1022200 -435420 215134
11308 215134 664695 1033663 1161509 655409 -142543 -283041 268650 356963 -509411 -1225882
11298 -1225882 -890376 -352017 -798576 -1815353 -2183401 -1766948 -1205112 -488973 613071
11289 613071 1330204 757233 -417516 -666270 119382 666215 446876 212975 424249
11280 424249 608003 370830 -195832 -1079788 -2155074 -2670798 -2188201 -1654759 -2150836
11271 -2150836 -3058733 -3098607 -2599211 -2734053 -3007885 -1976055 -333188 -497056 -2669545
11262 -2669545 -4094240 -3165529 -1617814 -1290967 -1249862 6787 1570980 1596697 318514
11253 318514 -563211 -549754 -449868 -564744 -597857 -832817 -1675411 -2381928 -1860472 -535379
11243 -535379 101088 -281734 -542020 -86864 250448 -198897 -753629 -625596 -459040 -1481434
11233 -1481434 -3393042 -4298614 -3142997 -1294813 -821039 -1735464 -2212214 -1419390 -592116
11224 -592116 -804719 -1280930 -1025708 -759259 -1656556 -3118494 -3523866 -2617129 -1518476
11215 -1518476 -839872 -391059 -277826 -620177 -627345 332466 1253806 930312 239707 804241
11205 804241 1929187 1461433 -560599 -1921024 -1915064 -2045480 -2712452 -2399728 -954655
11196 -954655 -443528 -1449503 -1628637 339680 2269515 1985995 690362 483918 875844
11187 875844 353516 -517837 -325226 332351 -94796 -1279861 -1762290 -1619897 -1997772
11178 -1997772 -2681420 -2453104 -1384232 -664325 -529223 -280891 18365 -259086 -729872
11169 -729872 -402433 551515 1048526 907774 879695 1046036 672148 -398852 -1460970
11160 -1460970 -1983032 -1917104 -1239993 -171790 511295 344724 -42522 146737 739854
11151 739854 1188867 1512371 1718032 1217830 -41914 -775503 32248 1493404 2045789
11142 2045789 1525575 773449 65667 -654451 -804243 69889 1204035 1659386 1704933
11133 1704933 1813494 1258987 -588131 -2418254 -2386444 -860502 104592 -302003 -1051225
11124 -1051225 -1375776 -1643292 -2081447 -2214526 -1775008 -1020144 -165534 533900 501138 -322730
11114 -322730 -909864 -562436 -159614 -635063 -1086363 -157504 1407441 1642273 431566
11105 431566 -381403 89402 744706 570774 -96658 -715265 -1310879 -1722582 -1530811 -1127319
11095 -1127319 -1538898 -2802591 -3685058 -3353195 -2306999 -1446445 -1154247 -1380624 -1735797
11086 -1735797 -1558251 -747731 -216140 -531382 -678673 485055 2099273 2324065 1174514
11077 1174514 429803 737067 820720 -52350 -771511 -332299 519781 568273 -159467 -889196
11067 -889196 -1376473 -1826926 -2225732 -2464689 -2667358 -2916152 -3057435 -3015108 -2845727 -2395949
11057 -2395949 -1468383 -401071 112428 -121867 -637618 -1027320 -1347314 -1830395 -2567204
11048 -2567204 -3314603 -3374484 -2168754 -331784 514200 -249163 -1253935 -1030485 -56763
11039 -56763 199099 -462423 -1031718 -1083072 -1074752 -1160834 -1068577 -975503 -1250885 -1501505 -1075677
11028 -1075677 -311026 -99101 -468713 -813972 -1188899 -1993516 -2648171 -2131180 -811821
11019 -811821 -253631 -1038482 -2109833 -2449529 -2174248 -1784961 -1483210 -1433968 -1686270 -1723108
11009 -1723108 -1060122 -285584 -472902 -1569776 -2434818 -2504193 -2365370 -2560160 -2766228
11000 -2766228 -2363593 -1174155 360550 1331935 1117652 417282 696439 1952454 2266025
10991 2266025 677394 -919775 -435866 1196285 1626486 812172 540621 951652 491143
10982 491143 -821618 -1142972 -230106 -155466 -1713663 -2874718 -2100746 -703914 -295180
10973 -295180 -120177 1083057 2366866 1980617 350325 -560037 -252984 -50106 -689405
10964 -689405 -1432025 -1731224 -2180364 -3211991 -4012960 -3561565 -2117261 -874933 -418760
10955 -418760 -327234 -338108 -987503 -2511231 -3841261 -3751992 -2679530 -2140012 -2370183 -2040280
10945 -2040280 -678230 259284 -371450 -1545297 -1661494 -807110 -150742 -135364 -584569
10936 -584569 -1555838 -2665342 -2603320 -901446 777642 773982 -113630 -112407 576076 438726
10926 438726 -537521 -1082641 -1168357 -1823691 -2610991 -1859617 309947 1577436 622569
10917 622569 -1293656 -2538937 -3008292 -3152191 -2908440 -2477698 -2684421 -3651898 -4228008
10908 -4228008 -3464526 -1796271 -290448 452292 391312 -101653 -288230 296915 1228633
10899 1228633 1819303 2001270 1851620 948481 -691829 -1807267 -1436669 -593910 -841803
10890 -841803 -1875741 -2284368 -2058308 -2281198 -2752962 -2181883 -697323 18282 -654784
10881 -654784 -1467949 -1408094 -850588 -357417 11215 -37601 -861774 -1793616 -1706538 -755892
10871 -755892 -134133 -208234 -424415 -814318 -1833092 -2841562 -2596770 -1282839 -360453
10862 -360453 -438334 -923796 -1564622 -2549506 -3284732 -2928544 -1982341 -1574731 -1505620 -902332
10852 -902332 -323176 -983600 -2261780 -2384015 -1419095 -1141672 -1938057 -2285964 -1436518
10843 -1436518 -312457 368798 673495 225296 -1321148 -2745900 -2595555 -1790216 -2312298
10834 -2312298 -3623928 -3354860 -1430445 -273593 -657642 -664757 607807 1479410 724603
10825 724603 -671687 -1700366 -2637525 -3386238 -3080853 -2076023 -1880010 -2574925 -2755476
10816 -2755476 -2278440 -2367027 -2883015 -2558453 -2045120 -3257186 -5345863 -5108434 -2106748
10807 -2106748 474478 995455 1383053 2761441 3203253 1602483 -94416 -506480 -1002994
10798 -1002994 -2288683 -2536106 -1142469 -625174 -2247844 -3369088 -1968335 -375181
10790 -375181 -1359947 -3612710 -4389484 -3862959 -3505716 -2733710 -676777 896726 -48061
10781 -48061 -2247061 -3157481 -2911107 -3173828 -3673211 -3062674 -1962709 -2037821 -2987622 -3238685
10771 -3238685 -2797503 -2888540 -3516033 -3641290 -3044844 -2113887 -740703 842616 1374615
10762 1374615 437384 -427148 -231957 -429499 -2193509 -3655323 -2485827 166986 1134438
10753 1134438 -238936 -1655546 -1477241 -408497 271715 203313 -368079 -991768 -1117768
10744 -1117768 -694760 -376148 -583667 -985370 -1260339 -1476327 -1497421 -1161861 -1048985 -1595338
10734 -1595338 -1678106 -98745 1758210 1348771 -934813 -2098370 -1284616 -814207 -1780434
10725 -1780434 -2241676 -1103137 -221651 -898820 -1603855 -1100271 -674445 -1263727 -1463130
10716 -1463130 -463945 59277 -892426 -1628522 -1056654 -874641 -2180639 -3024479 -1855126
10707 -1855126 -401164 -507751 -1026458 -522496 -194213 -1307770 -2454190 -2125689 -1393956
10698 -1393956 -1409654 -1016193 485828 1121062 -365355 -1796553 -1203191 -283249 -1155884
10689 -1155884 -2546394 -2456498 -1849543 -2296433 -2619933 -1384250 -251487 -1313732 -3292844
10680 -3292844 -3774422 -3116875 -2945449 -2881950 -1855378 -585977 30657 743872 1632738
10671 1632738 760581 -2167513 -3906353 -2411355 -300069 -482524 -1716757 -1839785 -1833934
10662 -1833934 -2958446 -3420762 -1915876 -931762 -2327151 -3273669 -1167783 1120492 -13275
10653 -13275 -2449665 -2204018 -612236 -1681703 -4758167 -5890383 -4644966 -3773325 -3648331
10644 -3648331 -2596852 -1404904 -2114887 -3524407 -2960722 -1310678 -1390996 -2686426 -2624707
10635 -2624707 -1661943 -2099241 -3201467 -2526472 -845311 -748269 -1598851 -879045 655841
10626 655841 240377 -1574448 -1938615 -1144509 -2027606 -4558916 -5787950 -4739770 -3128136
10617 -3128136 -1848047 -681839 -475587 -1765560 -2538000 -1111844 434221 -465483 -2264577
10608 -2264577 -2109630 -967807 -1477675 -2897195 -2852152 -2046530 -2633481 -3964657 -4348062
10599 -4348062 -4646018 -5785497 -5602166 -2820759 -888120 -2692042 -4928769 -3425935
10591 -3425935 -592603 -1242248 -4144309 -4472749 -2079752 -654044 -909007 -1048342 -1739387
10582 -1739387 -4266978 -6032525 -4160678 -1242506 -1439652 -3577034 -4150543 -3994905 -5537985
10573 -5537985 -6841394 -5158518 -2999436 -3804645 -5277484 -4008975 -2541846 -4341837
10565 -4341837 -6276653 -4250821 -1664766 -3468297 -6457761 -4906560 -1283781 -1405465
10557 -1405465 -3393172 -2009979 306858 -2099385 -6528854 -6279524 -3033264 -3311160
10549 -3311160 -6018993 -5354097 -2725172 -3647951 -6109235 -4393724 -1077312 -2531272
10541 -2531272 -6122063 -5061870 -2110337 -4502610 -9191557 -7961568 -3475211 -4666376
10533 -4666376 -9679397 -9593445 -5757586 -6521489 -9952096 -7521319 -2047570 -3534649 -9796911
10524 -9796911 -10189476 -5959599 -7156137 -12057663 -10490337 -4953966 -6597566 -12798966
10516 -12798966 -11673175 -6039893 -8492898 -15678818 -13784415 -6512218 -9109387 -17631220
10508 -17631220 -15247899 -6281929 -9755936 -21382425 -19764977 -8970205 -12946894 -27739563
10500 -27739563 -26207731 -12064527 -16347587 -35651304 -34149226 -15572701 -23180972 -52883129
10492 -52883129 -49549763 -17906867 -36433327 -102688906 -73100750 137710609 379910537
10485 379910537 426266234 265808241 101012075 65718628 91067699 73225938 30747612
10478 30747612 27627386 49278362 44029340 20099497 18501484 33052349 29211714 11938178
10470 11938178 11704853 25062653 24737619 12354784 11565991 21330440 20598912 9865201
10462 9865201 7930868 14870229 14473008 7253641 7826903 14740232 13569438 5553553
10454 5553553 4801744 11001386 11356230 5960008 6179809 11115524 9585240 2818760 2512244
10445 2512244 8516848 9826936 5740351 5663684 9716873 9145976 4533643 4823979 9450280
10436 9450280 9368718 4760120 4390888 8325438 8114168 3550387 2957141 7047781 8064897
10427 8064897 4955900 4540491 7477378 7298701 3616878 2764033 5175055 5073023 2545074
10418 2545074 3255321 6452191 5813878 1954472 1716696 5251283 6028240 3529159 3724338
10409 3724338 6843366 6770699 3083021 1949191 4346558 4727142 2184122 1824946 4102670
10400 4102670 3714493 358475 3889 3890825 6253765 4622514 2988746 3273199 2688150
10391 2688150 918071 1221719 3213365 2863325 457928 349925 2426689 2269823 51360
10382 51360 531905 3754072 4558093 2081681 1040156 2680408 3053723 1301226 1177218
10373 1177218 3141700 3203777 903226 406968 2434615 3018591 1486380 1731260 4242135
10364 4242135 4789034 2541697 1738695 3627800 4290561 2226135 797563 1405520 1352577
10355 1352577 165306 958208 3758350 4433078 2105491 901812 2517862 3669647
10347 3669647 2744108 2437504 3845892 4237658 2676410 1897547 2802093 2823977 1295225
10338 1295225 774415 1791007 1960471 1289553 2438336 4852727 4838542 2400903 1635908
10329 1635908 3307229 3607339 1509264 614977 2138508 2730359 1117272 404101 1783842
10320 1783842 2281331 804682 247425 1489171 1433725 -823929 -1917245 -497043 339864
10311 339864 -850156 -1208473 644955 1937712 1241281 1039626 2435340 2807292 1134667
10302 1134667 237343 1335974 1716724 150639 -660177 644897 1618910 1045437 1176012
10293 1176012 2745451 3082453 1404503 636135 1757540 1813916 -224966 -1267881 -102629
10284 -102629 202668 -1557632 -2089512 69526 1508491 324622 -397578 1101392 1435254
10275 1435254 -1500102 -3969560 -2631408 -119147 108606 -373124 1052112 2624778
10267 2624778 1653772 -364774 -666056 47781 -66220 -165700 875551 1454681 388245
10258 388245 -110941 1754670 3773986 3523269 2525715 3008429 3738664 2855001 1782752
10249 1782752 2464932 3450696 2498600 559257 -342354 -703806 -1680508 -2172121 -1111615
10240 -1111615 -182908 -953878 -1713358 -424661 1524055 1760708 873380 747136 1105186
10231 1105186 806236 573851 1445317 2363544 2062222 1521858 2057340 2864684 2751020
10222 2751020 2258988 1970519 1005541 -705922 -1199155 288826 1498086 796708 -124176
10213 -124176 444864 1149072 409148 -497803 -3187 747608 264531 -410018 86896 806274
10203 806274 666485 710313 1610745 1646491 -99954 -1292579 969 1916201 2064492
10194 2064492 1480998 2078827 2765859 1601466 -366048 -842732 9608 709640 1352938
10185 1352938 2385101 2512378 886773 -577030 -43882 1064230 653993 -394469 -238631
10176 -238631 379915 -163514 -1078008 -802494 -92773 -262298 -244253 1260407 2577264
10167 2577264 1542914 -460992 -577007 854692 1320737 586210 429989 870577 320124
10158 320124 -1028401 -1352788 -450110 155782 59950 183330 459833 -74305 -1116405
10149 -1116405 -1368294 -745026 -305156 -375786 -530353 -792354 -1172557 -870935 404182
10140 404182 1391520 1206835 1001211 1896842 2761743 2123276 863691 724457 1363904
10131 1363904 1230584 348141 20417 604546 1463514 2189898 2276640 924916 -1126536
10122 -1126536 -1260897 1470595 4127853 3542942 701405 -1002933 -520842 494767 981658
10113 981658 1333139 1558289 1116319 394782 340837 786350 722533 -43666 -748417 -722475
10103 -722475 305331 2137810 3632179 3500166 2267976 1897126 2764158 2973977 1587914
10094 1587914 279341 495046 1249292 1265895 1065135 1217368 717011 -1011496 -2450301
10085 -2450301 -2151598 -756503 676174 2315669 3996983 4240573 2576685 791084
10077 791084 270057 204858 -206758 -210404 438044 486600 -266598 -220061 837119 912650
10067 912650 -306286 -305749 1687259 2811377 1493685 318370 1315530 2370473 1414585
10058 1414585 286122 973290 1776672 910141 266359 1648838 2784177 1264299 -902595
10049 -902595 -963912 -294734 -1106163 -1647438 378089 2691904 1938711 -412080 -881298
10040 -881298 -92517 -692517 -1665196 -440619 1464628 816618 -1089421 -495983 1967914
10031 1967914 2514397 1114216 1095547 2606984 2609547 1103265 1370399 3820568 5208159
10022 5208159 4396697 3651877 3750905 2878942 957541 247389 1028183 1183072 476615
10013 476615 758729 1665979 818974 -1282207 -1324228 1177087 2933898 2452255 2030591
10004 2030591 3080895 3736427 2566057 965346 435064 594225 921493 1651557 2325152
9995 2325152 2085589 1552385 1811992 2018480 906626 -182141 798911 2613770 2449703
9986 2449703 735572 201769 932200 667925 -572335 -607970 604213 1127613 997089
9977 997089 1665406 2235710 887128 -758576 256096 2481197 1889355 -996544 -1609194
9968 -1609194 1008919 2959144 2368652 1697038 2316995 2406235 1367110 1085399 1681652
9959 1681652 1025282 -632072 -572903 1128613 1452006 172509 341553 2312579 2891649
9950 2891649 1332822 507313 1145900 735584 -795957 -319113 2296388 3291553 1782032
9941 1782032 1324093 3188254 4289993 3539253 3896940 6110099 6739962 4648775 3229377
9932 3229377 3932020 3813147 1798640 1034773 2602387 3238248 1718711 1116749 2414721
9923 2414721 2523755 932961 1329667 4208155 5143058 2901902 1721701 3068793 3192885
9914 3192885 1365649 1816142 4763891 4949156 2009326 2038804 5647636 5948719 2129779
9905 2129779 2059941 6802282 7305034 2451551 3310010 11202670 11624685 2364432 4086304
9896 4086304 21837396 19382616 -34798048 -109480945 -137528829 -99672793 -45088930
9889 -45088930 -22464341 -26120348 -25289091 -14425263 -8921173 -11563633 -11237247 -5999505
9881 -5999505 -4398865 -7434446 -7368906 -2927407 -876124 -3098582 -4482483 -3444276 -3801687
9872 -3801687 -6003926 -5947097 -3103564 -1691639 -3030477 -3768897 -2407309 -1357432 -1810950
9863 -1810950 -2024706 -1370886 -1327703 -1934553 -1475400 -41312 309031 -910117 -2150662
9854 -2150662 -2672883 -2852828 -2285919 -619906 533397 -376940 -1790757 -1179949 680784
9845 680784 925552 -677241 -1650103 -1016969 -242361 -106196 219760 852691 755249 -128623
9835 -128623 -656617 -561338 -670906 -1084344 -1060696 -590708 -284329 5725 708252 1162789
9825 1162789 533283 -442667 -468134 129947 150482 -164136 350314 1416123 1646553 986698
9815 986698 701325 1019928 845548 -112692 -841698 -866365 -837062 -1006471 -758759 -54996
9805 -54996 117106 -715304 -1652299 -1641743 -770524 28096 5459 -800702 -1577813 -1441940
9795 -1441940 -476407 238667 -53455 -964957 -1770295 -2229016 -2164965 -1256819 58466 552431
9785 552431 -64715 -496095 74155 517370 -331826 -1547154 -1604134 -1027915 -1521383 -2929820
9775 -2929820 -3162895 -1262513 1170111 2025780 950512 -783130 -1740525 -1407880 -476992
9766 -476992 -143325 -735945 -1370639 -1365966 -1240334 -1528464 -1513499 -392764 951066 844975
9756 844975 -755909 -2137863 -2090945 -1095166 -227096 -15820 -516043 -1525986 -2495621
9747 -2495621 -2895742 -2747761 -2315212 -1578676 -645413 -165823 -409656 -384837 969503 2956455
9737 2956455 3674434 2356856 117748 -1597381 -2299405 -2243452 -1957513 -2023675 -2443848
9728 -2443848 -2316214 -1049965 375026 538001 -269325 -463980 291563 639492 -74668
9719 -74668 -699236 -312731 268488 136300 36207 1008564 2327901 2467802 1492639 727784
9709 727784 310113 -1003274 -3222904 -4178201 -2329801 670755 1716181 66674 -1968004
9700 -1968004 -2166761 -876451 153660 291565 325630 772190 1079220 645546 -256845
9691 -256845 -964945 -1248523 -1256196 -1087394 -845320 -784243 -979250 -1103944 -935544 -810256
9681 -810256 -1075186 -1284262 -589930 977458 2187935 1894958 350351 -1080045 -1388221
9672 -1388221 -829902 -374273 -545824 -1037547 -1347329 -1409343 -1409926 -1310097 -992554 -762069
9662 -762069 -1156329 -2126088 -2858833 -2675550 -1782332 -904181 -494031 -553625 -893001 -1224954
9652 -1224954 -1275824 -1141373 -1260476 -1700552 -1851109 -1340346 -863823 -1299332 -2169600 -1986248
9642 -1986248 -342066 1295427 1432416 423735 -263964 -86988 247986 195974 18178
9633 18178 -45319 -205933 -423966 -245718 176311 -115646 -1300771 -1943024 -900005 630911
9623 630911 478270 -1375051 -2712330 -2315361 -1529547 -1868077 -2663058 -2406251 -1276181
9614 -1276181 -717957 -1093768 -1361622 -952384 -503529 -542940 -672317 -417842 79380 566500
9604 566500 1002705 1059998 202773 -1282402 -2182194 -1857986 -1111179 -915945 -1036816 -776106
9594 -776106 -481831 -1129260 -2562840 -3351139 -2694340 -1544019 -1289970 -1990500 -2544613
9585 -2544613 -2191830 -1152093 -13105 793013 949565 433391 -102783 195400 1209096
9576 1209096 1745215 1020205 -322446 -1170284 -1295423 -1042828 -289533 1195241 2635244
9567 2635244 2710447 1260749 -450944 -1311042 -1260183 -580419 540474 1429266 1131450
9558 1131450 -225637 -1313122 -1416819 -1299798 -1619756 -1715830 -922977 55759 298325
9549 298325 225005 677972 1256099 1045085 383407 306098 613686 153589 -1060141 -1605755
9539 -1605755 -740478 617327 1298579 1176796 812596 779409 1468742 2605991 2946783
9530 2946783 1549588 -587870 -1343352 -107543 1535670 1977476 1260064 328716 -136620
9521 -136620 270262 1597639 2895815 2818186 1486526 627350 1169877 1922590 1557697
9512 1557697 695774 689353 1239032 842475 -734289 -2006235 -1914123 -1111644 -696678 -712919
9502 -712919 -598833 -415083 -722547 -1435437 -1648134 -873945 124754 264136 -409130 -840372
9492 -840372 -460633 179531 395536 185974 -238100 -834883 -1107335 -128599 1868947 2900519
9482 2900519 1582020 -630945 -1183513 30777 752292 -58069 -835108 -216757 768074
9473 768074 561148 -392756 -565905 97951 185183 -910335 -2070404 -1955704 -543867
9464 -543867 1046245 1729245 1275766 257754 -644985 -1187641 -1313190 -710707 748078
9455 748078 2242527 2541664 1548092 540313 540457 1164513 1489100 1303880 924422 395641
9445 395641 -403292 -1228950 -1675675 -1717652 -1628621 -1558181 -1503476 -1496153 -1576973 -1753084 -2042635
9434 -2042635 -2311663 -2165789 -1456405 -767240 -759995 -1126898 -1000253 -396832 -268508 -909018
9424 -909018 -1352849 -818227 180238 743673 815674 852794 922133 772554 319820 -429947
9414 -429947 -1441649 -2238694 -2029460 -723783 690121 1193361 690628 -308373 -1302087
9405 -1302087 -1833329 -1669899 -1276651 -1369597 -1783837 -1711506 -1266303 -1557629 -2738080 -3389384
9395 -3389384 -2674352 -1706327 -1660576 -1878058 -1337476 -838094 -1799087 -3557336 -3926753 -2360514
9385 -2360514 -665116 -262674 -415731 163112 1277275 1779634 1332605 665140 383309
9376 383309 313847 92112 -139103 -12092 220122 -310959 -1862087 -3322431 -3441551 -2562459
9366 -2562459 -2138978 -2581718 -2797536 -2078827 -1088531 -462497 141027 814414 692332 -411016
9356 -411016 -1045996 -228292 739493 200709 -1169788 -1483738 -572625 261844 770053 1723394
9346 1723394 2673441 2213962 667055 126928 1254517 2220415 1648370 541409 206815
9337 206815 186214 -374339 -944825 -804114 -713730 -1698879 -3100947 -3528867 -3075697 -2924405
9327 -2924405 -3184333 -2795345 -1487886 -305781 8237 -119437 -124011 -127189 -369602 -697806
9317 -697806 -1003226 -1481521 -2137365 -2625563 -2804749 -2837990 -2587530 -1678794 -468057 -91078
9307 -91078 -951317 -1878696 -1605812 -586517 -392719 -1502511 -2662971 -2567514 -1343964
9298 -1343964 -96468 355843 -76937 -980812 -1623898 -1325086 -133469 1077949 1524907
9289 1524907 1263552 797638 370726 28500 -69656 81871 136235 -11948 139800 850615
9279 850615 1382248 912107 -163409 -756311 -634715 -431754 -325223 121705 825051 1097949
9269 1097949 862957 792721 1015368 833097 22298 -742067 -1085011 -1367293 -1602236 -1264230
9259 -1264230 -596152 -643783 -1414696 -1584177 -776229 -384117 -1084375 -1431835 -416377 473034
9249 473034 -252763 -1214975 -339470 1352024 1078771 -1150027 -2388684 -1257474 310334
9240 310334 440274 -227963 -526248 -868089 -1879954 -2690741 -2240798 -1160008 -881592
9231 -881592 -1618785 -2355405 -2259579 -1249257 243355 1352237 1247062 149739 -728697
9222 -728697 -714594 -350853 -148894 262639 1058924 1413271 797943 177601 687499 1765739
9212 1765739 1917359 998552 388942 826481 1276114 441727 -1364492 -2525394 -2048029
9203 -2048029 -662645 116483 -291081 -1101249 -1337121 -850678 7554 990811 1637538
9194 1637538 1087628 -781203 -2540139 -2723065 -1807781 -1354736 -1480212 -906400 454848
9185 454848 994548 88660 -664077 33019 1115554 1004346 70408 -347201 -233210 -443744
9175 -443744 -790989 -420321 348724 293050 -783093 -1898938 -2517960 -2846672 -2657324 -1421551
9165 -1421551 250954 867758 143388 -513395 -66174 857209 1316313 1489241 1920545
9156 1920545 2299577 1981058 1137603 474221 142159 -234954 -629269 -505698 229213 785371
9146 785371 383250 -643885 -1089961 -370777 559044 265486 -1265704 -2464068 -2171384
9137 -2171384 -1116466 -816160 -1541268 -2154216 -1682097 -298415 1084289 1521234 554243
9128 554243 -1240230 -2425340 -2193460 -1441873 -1507645 -2174115 -2124441 -1186262 -612591 -918192
9118 -918192 -1055953 -417554 -110019 -1099161 -2334253 -2231897 -1244069 -1259002 -2655732 -3559795
9108 -3559795 -2383926 61226 1570294 958492 -1009081 -2635732 -2813302 -1769892 -617981
9099 -617981 -162957 -209485 -141057 106530 67170 -416260 -883134 -816015 -135138 855339
9089 855339 1653807 1756582 1103574 326001 130170 445603 624479 431223 238130 163323
9079 163323 -298038 -1436948 -2638293 -2972050 -2214766 -989024 -123419 -66801 -640750
9070 -640750 -1181163 -1202344 -984727 -1079220 -1251964 -724747 287374 334302 -1183635 -2603725
9060 -2603725 -1924769 358109 1780788 1195231 54151 70839 979621 1418070 1005211
9051 1005211 509865 505204 786021 878573 469289 -450306 -1376373 -1562923 -967723 -491214
9041 -491214 -739525 -1091341 -720827 -8157 52094 -507048 -716237 -320658 -179433 -817935
9031 -817935 -1610383 -1767340 -1285208 -537793 278056 854496 675829 -252534 -1139337 -1324402
9021 -1324402 -954619 -428286 160675 597664 312051 -791784 -1855398 -2074397 -1691676
9012 -1691676 -1400342 -1322839 -1225913 -1129495 -954048 -235978 890109 1147530 -213216 -1783386
9002 -1783386 -1569448 77214 836128 -157112 -1099867 -394538 952310 988213 -321613
8993 -321613 -1277865 -849138 348176 1131624 805447 -602508 -2248665 -2813480 -1756853
8984 -1756853 -110778 641872 237908 -476337 -923389 -1147142 -1072674 -512369 87805 -54202
8974 -54202 -850719 -1360771 -1194699 -968935 -1113924 -1221719 -990715 -837839 -985323 -860549
8964 -860549 -160544 313235 -186866 -1027177 -1082781 -484263 -321101 -843897 -1167050 -794319
8954 -794319 -296011 -213200 -324039 -418242 -856364 -1741151 -2296415 -1829793 -793890 -120589
8944 -120589 130858 637587 1500863 1942180 1466785 634540 291588 442178 316916 -554364
8934 -554364 -1662003 -1999955 -1161622 114898 594206 -192336 -1415064 -1792731 -891531
8925 -891531 555552 1512081 1575796 1083296 582162 354102 306717 159316 -252952 -785206
8915 -785206 -1084714 -891216 -238336 569584 1110023 1064556 457857 -319269 -834479 -938516
8905 -938516 -690742 -142288 517544 741940 84520 -997929 -1365852 -608693 236592 -37890
8895 -37890 -1163076 -1778689 -1283360 -368569 343586 1078632 1868666 1877368 738783 -300700
8885 -300700 99779 1216405 1134980 -360502 -1461973 -1200033 -846174 -1567701 -2338326
8876 -2338326 -1690768 -340294 -157642 -1153201 -1517839 -580021 308043 253022 265089 1271623
8866 1271623 2273765 1826658 275744 -910426 -1318798 -1648572 -2009556 -1671193 -529889
8857 -529889 465003 615010 194749 -382628 -1165210 -2069593 -2563884 -2423192 -2088352 -1821616
8847 -1821616 -1246393 -293962 157161 -551075 -1577711 -1489057 -224057 875128 1032591
8838 1032591 994360 1617945 2388530 2105787 633599 -801747 -1027612 -113756 920090
8829 920090 1196338 636018 -224883 -857405 -1167150 -1356637 -1501869 -1496786 -1413633 -1545338
8819 -1545338 -1880771 -1894614 -1230911 -333117 47042 -227202 -719442 -1178858 -1633973 -1831903
8809 -1831903 -1344281 -361190 325256 361704 203360 195742 15458 -594402 -1276994 -1760221
8799 -1760221 -2346090 -3033124 -2921825 -1455117 321675 863258 169602 -409176 -255759
8790 -255759 -164486 -830114 -1806721 -2339359 -2317273 -1988360 -1482090 -1001032 -819385 -764172
8780 -764172 -349313 311037 476530 -2646 -275935 195327 710332 394862 -455433 -877978
8770 -877978 -616628 -186463 125506 509247 970298 1130033 791631 226840 -241894 -647345
8760 -647345 -1214130 -1887093 -2149512 -1504384 -255391 524473 230979 -378398 -215732 461002
8750 461002 389104 -693717 -1557803 -1296222 -438438 270665 944578 1565729 1169001 -687534
8740 -687534 -2531235 -2551041 -1063425 48439 39760 -76402 429627 900096 601822 -145104
8730 -145104 -718858 -1079258 -1318238 -1179196 -672816 -478770 -998836 -1463241 -726520 1199723
8720 1199723 2979068 3326760 2214743 701467 -165428 -177653 154730 322677 229814
8711 229814 -47615 -545231 -1230645 -1783671 -1846816 -1378339 -588938 263001 850063 876499
8701 876499 477905 208648 318909 365748 -119857 -940030 -1596775 -1959901 -2085682 -1754709
8691 -1754709 -804092 314427 877487 643845 -122166 -1046256 -1625548 -1310930 -272175
8682 -272175 368077 -128442 -909715 -577980 817123 1832687 1578620 575943 -390098
8673 -390098 -1220857 -1983581 -2328371 -1969192 -1259295 -875206 -1168860 -1960911 -2710604 -2878462
8663 -2878462 -2366464 -1499508 -438861 906419 2035690 1694109 -563224 -3178973 -4040671
8654 -4040671 -2853874 -1110089 -58765 147453 -353303 -1344666 -1976160 -1424089 -259588
8645 -259588 159905 -233969 -202230 588968 1025655 665921 623296 1511644 2202289 1764807
8635 1764807 1124789 1412941 1984903 1667454 890358 810837 1104053 527433 -730426 -1188310
8625 -1188310 -525767 -68890 -502621 -758786 138218 1465573 1957354 1625398 1445966
8616 1445966 1778791 2020396 1639335 840248 168012 -105146 -127263 -243358 -632097 -1005151
8606 -1005151 -742806 434874 1924120 2624929 2041864 840634 70223 -52122 -193453
8597 -193453 -743596 -1177498 -903047 -202800 264939 497098 893145 1215559 764783 -363448
8587 -363448 -1166940 -1173115 -1094391 -1569109 -2031013 -1526872 -167826 927278 911307 -61859
8577 -61859 -1205296 -1813599 -1750941 -1480142 -1475883 -1551562 -1073549 113791 1395434 2092939
8567 2092939 2027232 1375973 551197 227457 745991 1377478 1007029 -264880 -1153358 -1101488
8557 -1101488 -1040847 -1703147 -2364582 -2161015 -1584976 -1509840 -1567386 -836545 413965 1055454
8547 1055454 860054 605887 603669 461801 297077 774778 1678747 1775720 666990 -335660
8537 -335660 70592 1423497 2274200 2119626 1691489 1643613 1795596 1666144 1101699 223942
8527 223942 -781554 -1580941 -1696549 -926966 295172 1225670 1540561 1528908 1463131 1099326
8517 1099326 158715 -915603 -1262461 -719760 -70878 49851 -52587 155924 424177
8508 424177 69870 -822103 -1239402 -477650 876811 1535364 973218 -7274 -343742 -117738
8498 -117738 -404687 -1640149 -2819080 -2879759 -2283386 -2231897 -2635726 -2173276 -540982 724827
8488 724827 357642 -812203 -1104702 -284679 459602 345080 -281490 -848615 -1212000 -1362400
8478 -1362400 -1225777 -881706 -518461 -186164 51914 -53723 -492931 -657625 -78054 684535
8468 684535 600120 -375935 -1106289 -724572 257768 616317 -121647 -1191846 -1495349 -777480
8458 -777480 206520 680737 758260 1088724 1787304 2242263 2021860 1399376 788895 222726
8448 222726 -307825 -519756 -267227 73688 38803 -357255 -711418 -612049 124556 1144389
8438 1144389 1486911 511727 -1009946 -1551309 -785683 27438 -99665 -723504 -1168144
8429 -1168144 -1679738 -2522171 -2988651 -2422102 -1425462 -967261 -978886 -897966 -856848 -1128755
8419 -1128755 -1101335 -194685 729517 358807 -998159 -1794933 -1498817 -1001146 -894529 -860041
8409 -860041 -825418 -1191175 -1625091 -1095794 415540 1523780 1301455 379794 -351268 -979349
8399 -979349 -1787599 -2276487 -1891545 -1048518 -595193 -690491 -844881 -668277 -71088 843965
8389 843965 1606266 1523309 508051 -575855 -835231 -326002 221438 287605 -196435 -1100060
8379 -1100060 -2075154 -2520480 -2077808 -1112109 -313220 160585 765857 1696777 2280882 1651442
8369 1651442 -8880 -1379989 -1497389 -953214 -977442 -1545992 -1367391 72996 1527158
8360 1527158 1664525 837939 294769 335178 317026 20039 -152506 -132984 -265781 -471999
8350 -471999 -325913 18843 -73641 -617918 -908550 -659650 -352043 -233684 128117 912696
8340 912696 1453613 1139857 379451 59675 290007 246267 -625851 -1593827 -1275072 531086
8330 531086 2131317 1784139 46594 -803198 172331 1419640 1399474 789331 986134
8321 986134 1634342 1309327 -61378 -1193100 -1495911 -1492864 -1379404 -775033 85583 408350
8311 408350 177982 79823 58018 -632458 -1864015 -2590471 -2514442 -2324422 -2066739 -867966
8301 -867966 1280293 2950566 3087238 2131726 893678 -369011 -1254900 -1029473 143957
8292 143957 997609 868246 478346 428505 185590 -671535 -1412647 -1254823 -495913 251908
8282 251908 1006372 1854260 2403456 2506448 2581276 2586577 1778004 200324 -779198 -343384
8272 -343384 503132 563826 271347 684127 1582726 1903552 1480926 1130882 1353418 1909024
8262 1909024 2342095 2179887 1093480 -428096 -1128257 -439098 667807 951042 378332
8253 378332 -330163 -882219 -1326203 -1476308 -1292843 -1263398 -1629664 -1819505 -1365074 -735791
8243 -735791 -538614 -587614 -498159 -449334 -585494 -458532 123640 539265 486027 712839
8233 712839 1630832 2222944 1586294 635981 822988 1871691 2317382 1770065 1097222 702487
8223 702487 173937 -476159 -661334 -364842 -220329 -391907 -432408 -240921 -125463 67271
8213 67271 854298 2090188 2941723 2942633 2329937 1445521 595284 317158 871599 1524816
8203 1524816 1206654 -72986 -1144036 -1006341 252554 1658681 2018894 816221 -1017356
8194 -1017356 -1754685 -880535 234968 300972 -202461 -205223 165445 270264 402275 917938
8184 917938 809224 -887458 -2835573 -2747365 -809463 480093 38731 -555453 -121899
8175 -121899 125931 -1138229 -2918797 -3342635 -2367725 -1499438 -1497763 -1786828 -1862518 -2059670
8165 -2059670 -2745962 -3492264 -3421029 -2262375 -897460 -599206 -1575504 -2636474 -2664519
8156 -2664519 -1908386 -1216740 -616195 328558 1197214 1064493 71410 -617772 -514580 -291696
8146 -291696 -448262 -672405 -747801 -936470 -1164334 -921489 -280639 48258 -50200 61791
8136 61791 409847 131180 -959105 -1740680 -1364291 -389753 291583 661030 1042263 1337352
8126 1337352 1478591 1741370 1960298 1363424 -131267 -1388990 -1550420 -1133465 -929383
8117 -929383 -816921 -539927 -623687 -1419085 -2112615 -1879104 -1301200 -1445311 -2175479 -2626681
8107 -2626681 -2735363 -2916177 -2739895 -1537423 -82138 48638 -1064410 -1516715 -351506
8098 -351506 1046943 1155615 558659 765876 1707705 1901815 815935 -369647 -582178
8089 -582178 -256390 -337564 -787208 -954669 -888970 -1201795 -1746616 -1570648 -487193 355080
8079 355080 133150 -314569 215773 1331168 1622394 867424 237757 262952 83355 -775666
8069 -775666 -1297874 -612155 340918 49681 -1271033 -1954869 -1254004 -156744 308702
8060 308702 396587 724580 979302 479111 -402409 -431555 738421 1885323 1778004 798696
8050 798696 274864 581531 879425 674765 500442 683117 558315 -298556 -973442 -416864
8040 -416864 857199 1422749 922736 269974 123527 309568 597794 880809 672988 -340581
8030 -340581 -1277230 -891124 480146 1186312 670103 101187 246577 355218 -126588 -349136
8020 -349136 350026 1016796 516291 -655079 -1233761 -968084 -381846 297284 747961 106404
8010 106404 -1609251 -2547310 -1267885 725674 687247 -1453431 -2982782 -2329084 -972328
8001 -972328 -796699 -1453230 -1499253 -741455 -72030 177027 413207 735041 785931 515417
7991 515417 282794 235108 160838 -53054 -249184 -277703 -148418 71581 320878 543714
7981 543714 694724 645713 159053 -770961 -1637590 -1926534 -1866666 -2071326 -2359874 -1760494
7971 -1760494 -101186 1224422 881982 -551191 -1310402 -745229 115441 238901 -275503
7962 -275503 -985659 -1919386 -2957536 -3319812 -2588513 -1621476 -1414238 -1507418 -754487 537932
7952 537932 725019 -625007 -1762645 -1139711 448677 1204445 840071 373618 83516
7943 83516 -669065 -1742625 -2041829 -1373905 -972940 -1524115 -1977142 -1251835 -50203 215976
7933 215976 -402976 -596621 124544 803911 595788 -88393 -359256 -44688 366927 536089
7923 536089 549904 574483 607348 573768 447446 222799 -99264 -411653 -492027 -276761 -111589
7912 -111589 -434870 -1101219 -1371467 -848938 -76224 209434 61370 -14043 -50780 -463688
7902 -463688 -1046431 -1084757 -551233 -214588 -321376 -179824 521460 1006772 671650 94729
7892 94729 -38336 -147433 -847653 -1550173 -1247603 -265429 157964 -50367 458305 2296240
7882 2296240 4087894 4035368 2062491 -171000 -1012513 -233759 950553 1049184 -216925
7873 -216925 -1506247 -1314066 164681 1188367 582088 -955060 -1938835 -1873032 -1455715
7864 -1455715 -1443552 -1838239 -2010992 -1288732 380330 2092437 2634969 1787747 638122
7855 638122 227671 319682 98770 -336401 -148641 636121 833944 -131749 -1122634 -780238
7845 -780238 505649 1179075 782129 443287 959487 1560205 1185764 102490 -617697
7836 -617697 -674290 -677987 -1009446 -1425692 -1682263 -1705787 -1176982 189006 1821777 2590621
7826 2590621 2181208 1435076 1037895 676241 -46347 -645713 -435081 335959 744662 314440
7816 314440 -680541 -1704731 -2212145 -1783516 -663395 153418 76089 -138294 556665 1697005
7806 1697005 1649806 -73440 -1898741 -2123760 -954811 122712 419761 549510 1065750
7797 1065750 1590466 1594463 1348700 1534032 2192017 2611492 2254575 1367976 528537 -86110
7787 -86110 -693291 -1366783 -1872872 -2054445 -2060363 -2057525 -1946117 -1559504 -1001908 -554614 -292864
7776 -292864 -14144 421959 856017 991224 648599 -184347 -1312692 -2145617 -1839245 -153635
7766 -153635 1829395 2463353 1347078 -110777 -400931 291791 692506 415867 297891
7757 297891 798062 1212052 837404 -31923 -777111 -1301312 -1676377 -1729207 -1544566 -1594043
7747 -1594043 -1804333 -1419857 -452060 -132613 -961736 -1545168 -757005 136043 -620682 -2176698
7737 -2176698 -2191739 -601436 246879 -682452 -1780510 -1743393 -1391690 -1524469 -1264229 -46338
7727 -46338 682488 -397304 -2047264 -2060134 -328046 1366312 1863162 1384738 479617
7718 479617 -269004 -51933 1219292 2305758 2296588 2163514 3159939 4432394 4128748 2429568
7708 2429568 1348590 1532623 1435958 156570 -946560 -461515 847840 1281433 607726
7699 607726 -40101 -41858 134201 38242 -56899 237638 652425 483781 -386159 -954516
7689 -954516 -76974 1861933 2921259 1864449 -92487 -713733 390832 1433962 962338
7680 962338 -450063 -1332836 -1140419 -390350 271073 466867 -21251 -1107520 -2201905
7671 -2201905 -2537158 -1848216 -750412 -344808 -1101024 -2055669 -1721246 -135287 799265
7662 799265 -199335 -1751356 -1540439 374443 1564928 622420 -1040610 -1316391 -1644
7653 -1644 1524405 2197648 1939252 1146528 398330 236351 555281 552323 -230050 -1232011
7643 -1232011 -1666681 -1462664 -971482 -349975 180304 73991 -766983 -1421991 -983098 144748
7633 144748 791291 646085 469658 755545 1077230 929538 441897 -65205 -615403 -1258490
7623 -1258490 -1666035 -1497572 -915166 -345408 95057 560044 957920 887905 197883 -662397
7613 -662397 -1028983 -679302 -23548 268506 -203152 -1241774 -2128049 -2168715 -1367247 -475973
7603 -475973 -219586 -571993 -983913 -1135165 -1116168 -1004625 -744046 -438635 -264984 -36708
7593 -36708 563301 1169578 844862 -608508 -2066477 -2345749 -1542129 -549252 202881 752196
7583 752196 815835 55087 -957661 -1071194 -87480 853817 738801 -171543 -1029520 -1560542
7573 -1560542 -1937887 -1969093 -1204431 145967 1027131 587730 -827469 -2035080 -2329710
7564 -2329710 -2173401 -2436949 -3183682 -3548886 -2804246 -1201932 318432 967614 590661
7555 590661 -316206 -923430 -744962 -150050 121576 -24038 -55605 61311 -389437 -1530109
7545 -1530109 -2136811 -1132956 677585 1419317 532036 -658064 -889990 -597382 -1117534
7536 -1117534 -2796011 -4484853 -4916579 -4181017 -3475528 -3391827 -3037166 -1464759 450316
7527 450316 725924 -998673 -2711225 -2633184 -1440208 -904720 -1289973 -1434785 -888900
7518 -888900 -516951 -1015047 -1991830 -2693715 -2815854 -2467708 -1946869 -1569262 -1314779 -895126
7508 -895126 -543806 -1099907 -2623678 -3682746 -3058695 -1551490 -876215 -1266392 -1536786
7499 -1536786 -1171143 -839767 -944208 -1127082 -1300930 -1781978 -2277817 -2088159 -1465209 -1426287
7489 -1426287 -2033494 -2251064 -1748261 -1381498 -1535906 -1508818 -1064643 -1084402 -1939846 -2625867
7479 -2625867 -2365012 -1796489 -1644403 -1400168 -382277 900199 1521198 1473280 1268524
7470 1268524 943117 364521 -132992 -223429 -73468 236450 918050 1517823 926044 -750673
7460 -750673 -1574309 -333893 1376161 1268266 -245990 -674239 855730 2460122 2324087
7451 2324087 987319 146419 418967 1139880 1588858 1581458 1217116 690505 246411 -32520
7441 -32520 -295887 -574661 -536021 102938 954055 1123472 261785 -788040 -909521 -267912
7431 -267912 -193779 -1152937 -1733179 -587953 1305929 1718411 248219 -1193128 -1126531
7422 -1126531 -193216 378324 480772 468826 120600 -645162 -1058984 -671486 -353360 -884076
7412 -884076 -1315644 -210714 1928966 3019766 2170556 721286 229694 602561 793907
7403 793907 478633 210847 283392 237830 -320020 -909394 -666735 421520 1323408 1230035
7393 1230035 472050 -275397 -1059170 -2093313 -2703075 -2064586 -801740 -491770 -1470468
7384 -1470468 -2427461 -2396117 -1792637 -1149799 -296917 606758 671899 -260412 -1030748 -872296
7374 -872296 -464623 -447223 -282354 339970 409438 -705944 -1751080 -1371629 -340291 -275792
7364 -275792 -1028434 -1222088 -792520 -1009472 -2175487 -3130929 -3129199 -2636202 -2085824 -1239217
7354 -1239217 -102192 635642 433485 -540155 -1713171 -2358539 -1821371 -276405 1081586
7345 1081586 1405361 1270194 1481662 1475272 166681 -2080562 -3727750 -4050127 -3562359
7336 -3562359 -2717279 -1546061 -448800 27715 195066 782807 1568199 1669039 1084507
7327 1084507 646403 522211 127343 -480168 -498217 233394 1025609 1549165 1951663 1822652
7317 1822652 542002 -1247596 -2070222 -1741656 -1528607 -1931308 -1968850 -1122880 -286425
7308 -286425 -69958 205895 887832 859870 -742138 -2799895 -3449463 -2333724 -629028
7299 -629028 542952 865789 567060 203402 295487 662143 615031 137380 112563 964700
7289 964700 1910631 2079675 1551650 764170 -176462 -918539 -573374 1014562 2382677
7280 2382677 1894410 -227925 -2119580 -2333913 -1112368 171272 334076 -686010 -1901448
7271 -1901448 -2398487 -2349066 -2472064 -2676512 -2155598 -931697 -217415 -781565 -1919703
7262 -1919703 -2620329 -2846590 -2990987 -2938814 -2519640 -2179671 -2296251 -2346482 -1627831 -411625
7252 -411625 415382 526028 236368 -256057 -931706 -1435931 -1269721 -515038 175421 370088
7242 370088 279560 366208 771678 1142967 964465 159369 -681401 -875279 -349047 478119
7232 478119 1211544 1446133 710390 -685208 -1144269 593064 3346355 4402932 2839559
7223 2839559 592199 -283739 -20657 658 -522197 -899977 -821675 -419745 364359 1335338
7213 1335338 1515027 222267 -1653213 -2497657 -1871717 -692059 186756 655238 852271
7204 852271 940256 1303359 2126488 2787831 2422847 1114546 -156408 -792419 -1184838 -1948511
7194 -1948511 -3100303 -4151290 -4590929 -4119977 -2739241 -847037 841305 1630540 1270643
7185 1270643 210206 -665147 -809355 -489710 -270493 -272581 -380209 -838363 -1852144 -2765058
7175 -2765058 -2635338 -1697225 -1190303 -1492444 -1544748 -599799 580674 1006471 962400 1297638
7165 1297638 1921240 2011985 1357428 628350 439696 665024 600443 -351689 -1872340 -2672113
7155 -2672113 -1880948 -382231 194171 -241290 -256356 637357 1146129 424863 -489576 -476941
7145 -476941 -99188 -347661 -920867 -1103920 -1212727 -1705520 -1863822 -888459 517688 1124049
7135 1124049 942404 634574 69397 -992224 -1717175 -1442069 -1226900 -2286489 -3676163
7126 -3676163 -3611890 -2404997 -1805801 -1939374 -1383844 -80450 437260 -152010 -457420
7117 -457420 -6326 118987 -280481 -25733 856480 774041 -247671 121301 2547870 4193929
7107 4193929 2904235 700336 512023 1561340 1108285 -698570 -1190512 194503 1065399
7098 1065399 112491 -1027951 -798952 -125217 -537484 -1739246 -2400852 -2133495 -1502046
7089 -1502046 -984931 -856576 -1308471 -1907134 -1726588 -746837 -253010 -995257 -1823389 -1252231
7079 -1252231 290512 1065457 504297 -246736 -219133 248432 540418 742538 1042153 1093176
7069 1093176 653150 119155 -251774 -949098 -2216826 -3123071 -2713806 -1663240 -1486758
7060 -1486758 -2210738 -2192397 -546384 1497895 2216856 1336522 -245799 -1668774 -2281138
7051 -2281138 -1604347 -146279 522166 -387317 -1603798 -1551500 -755179 -993575 -2385774
7042 -2385774 -3076970 -2064961 -705438 -679177 -1706345 -2230529 -1556595 -342316 583077
7033 583077 1014352 1096847 883827 315448 -531553 -1263915 -1452126 -1279847 -1516703 -2316074
7023 -2316074 -2489093 -928268 1475071 2572653 1752184 681262 813635 1507131 1496253
7014 1496253 1008541 1075354 1528431 1246292 143771 -586557 -400627 -258260 -1027919 -2074097
7004 -2074097 -2236120 -1559557 -1122007 -1373967 -1570601 -1026387 -179842 110413 -131643 -136960
6994 -136960 288289 435785 -20533 -229832 626022 1873928 2089063 1134039 427700 995905
6984 995905 2178390 2668548 2020468 565881 -1400487 -3470772 -4601768 -3819414 -1596404
6975 -1596404 221647 250739 -1039072 -2075666 -2052214 -1607549 -1666185 -2116242 -2086976 -1327776
6965 -1327776 -611894 -535880 -588135 -16304 859528 1057311 458695 -29847 78131 196531
6955 196531 -195879 -617920 -358178 430710 1016484 1025486 566523 -140884 -679175 -391500
6945 -391500 847819 2048864 2017362 796720 -418548 -777513 -543743 -320735 -203966
6936 -203966 -14286 153817 63227 -272549 -704294 -1230131 -1776710 -1900961 -1246574 -288796
6926 -288796 -18312 -617298 -989874 -138052 1340347 1818676 631121 -1169676 -2103642
6917 -2103642 -1658338 -282321 1227751 1976696 1365224 -182293 -1430940 -1772857 -1820230
6908 -1820230 -2040283 -1706873 -190752 1509891 1906563 1231986 979591 1387898 1080079
6899 1080079 -487983 -1884148 -1803509 -998557 -1042748 -2052057 -2746289 -2299488 -1171638
6890 -1171638 -292730 -111554 -393509 -568540 -336257 13697 139688 313748 879262 1204470
6880 1204470 266528 -1542122 -2428765 -1561783 -246888 12666 -490457 -590071 -124289
6871 -124289 320256 667223 946420 320972 -1822180 -4119151 -4335876 -2419810 -851090
6862 -851090 -1400088 -2892100 -3056104 -1571277 -149206 -65076 -722518 -767103 146998 1132545
6852 1132545 1312031 814236 439041 683828 1434727 2377049 3151379 3178986 2090437 537755
6842 537755 -200148 155386 421470 -271496 -1040553 -542258 870235 1496681 662543 -406573
6832 -406573 -301914 852436 1750337 1387737 -95892 -1656035 -2228425 -1653327 -769546
6823 -769546 -394369 -408006 -190599 342535 722999 759727 720812 694608 376489 -373199
6813 -373199 -1165422 -1395200 -748785 470492 1372408 1188789 194490 -558793 -682769 -854245
6803 -854245 -1315716 -1069832 407044 1684406 1148354 -451279 -1037443 -398079 -275164
6794 -275164 -1240368 -1735849 -847001 131313 41599 -115489 917583 2199709 1906862 220883
6784 220883 -942044 -686099 5091 24569 -633389 -1391064 -1635417 -752900 1245768 3065811
6774 3065811 3175305 1690354 266373 -49918 106799 -266703 -1153331 -1907013 -2200854
6765 -2200854 -1980013 -1074887 476689 2029635 2763153 2382582 1191642 -219711 -1156757
6756 -1156757 -1133824 -401034 138668 -89526 -674292 -860293 -530562 -94776 327875 968971
6746 968971 1678215 1787040 949007 -352313 -1415257 -2011660 -2133723 -1575803 -442096
6737 -442096 273781 -409854 -1908095 -2412001 -1204069 302034 538919 -92959 -187700
6728 -187700 274690 60534 -951608 -1267249 -103197 1335707 1775984 1719832 2147549
6719 2147549 2477778 1445972 -549876 -1702193 -1342588 -669205 -661691 -731336 -80906 800457
6709 800457 933033 369879 -9413 198071 608075 770823 532846 -120979 -957184 -1336066
6699 -1336066 -766192 348270 986756 633570 -215516 -728468 -614910 -233565 -62416
6690 -62416 -211737 -390766 -293219 26753 293885 529793 1122645 2157323 2974964 2828624
6680 2828624 1833430 754082 -131084 -1304805 -2890396 -3937065 -3533733 -2282369 -1708947
6671 -1708947 -2129604 -2132187 -751206 786043 642120 -801912 -1261741 107724 1312420
6662 1312420 411015 -1529587 -1945632 -497951 620879 46084 -1039788 -1171511 -835046
6653 -835046 -1181522 -1771201 -1269767 174720 941188 339788 -464758 -343109 202649 76184
6643 76184 -629043 -856341 -262788 276267 10227 -500130 -72707 1373946 2369538 1529888
6633 1529888 -622747 -2063823 -1572232 -60531 693419 103238 -933826 -1356958 -884038
6624 -884038 114872 968210 987468 47327 -1075074 -1448245 -1047431 -577878 -378618 -160313
6614 -160313 232885 568237 812403 1216211 1636539 1512587 775942 85961 -147429 -302167
6604 -302167 -752308 -1187025 -1153193 -740896 -324935 -94439 -154553 -585313 -1104765 -1201743
6594 -1201743 -856292 -569426 -525114 -434785 -323519 -512863 -623505 191484 1584268 1956491
6584 1956491 797934 -352372 -299962 -41890 -790107 -1608917 -993005 282470 203408
6575 203408 -1156934 -1741119 -830190 54272 -172577 -759259 -941409 -1165339 -1703978 -1788758
6565 -1788758 -1023445 -227512 -89994 -320795 -738167 -1654621 -2482746 -1692793 792821
6556 792821 2791050 2699722 1658693 1479838 1851366 1301488 -181876 -1335765 -1680532
6547 -1680532 -1663139 -1289882 -269261 836959 1116438 715803 448024 344086 -95619
6538 -95619 -610355 -558453 -249181 -403401 -543205 445906 2157371 2726583 1385127 -459454
6528 -459454 -1180246 -822819 -524953 -932411 -1679969 -1902243 -1074630 240594 712980 -111915
6518 -111915 -987597 -669425 183698 91865 -790856 -948690 -19193 757675 719944 606375
6508 606375 805426 553904 -412017 -993058 -431765 408592 383097 -402946 -1193491 -1642357
6498 -1642357 -1530618 -575012 624375 594174 -1030775 -2555505 -2353916 -1042223 -355652
6489 -355652 -656627 -876355 -419179 179820 312969 -14023 -479544 -710931 -431088 123490
6479 123490 294583 -13736 -34304 599231 1041548 518245 -306807 -305785 318088 379827
6469 379827 -456861 -1343600 -1614686 -1438031 -1102059 -606695 -95549 73948 -129645 -337081
6459 -337081 -309542 -134626 41904 133664 157379 441534 1365475 2504233 2631203 1199677
6449 1199677 -717053 -1653727 -1368724 -506656 626619 1870385 2372740 1328792 -565046
6440 -565046 -1603012 -1086197 94957 839206 845381 332092 -237056 -149838 870652 1979630
6430 1979630 2114834 1480811 1155762 1425754 1696118 1876086 2396435 2829178 2132162 610613
6420 610613 -32223 763846 1454380 898145 283365 1237418 3220597 4318466 3851266
6411 3851266 2744369 1837215 1219287 926580 990324 923184 281786 -380658 -192888 532718
6401 532718 621200 -135321 -631451 -118296 889227 1705288 2389581 3007570 2935875 1758934
6391 1758934 275809 -265755 303140 1024331 1177527 1043124 1229050 1741882 1965262
6382 1965262 1358856 57677 -1128254 -1331599 -412017 850450 1458853 1106892 339538
6373 339538 -72390 229880 1034804 1741710 1719954 819403 -361510 -970806 -785757 -350009
6363 -350009 -131934 59434 542479 1065148 1148740 867194 685176 656686 438658 68806
6353 68806 13997 339859 542374 385845 186335 60213 -255215 -507866 123167 1563857
6343 1563857 2341533 1466875 -51613 -649136 -328261 -26769 350471 1509083 2776355
6334 2776355 2566834 1006507 123360 829876 1559457 860408 -347602 -469593 173889
6325 173889 124383 -708694 -1066448 -484578 201088 454383 693884 1110051 1058718 112366
6315 112366 -1166653 -1998645 -2304955 -2433623 -2478610 -2305703 -1921826 -1433470 -803808 88090
6305 88090 1213872 2318782 2993001 2838634 1784454 335484 -646853 -618282 106985
6296 106985 556506 36275 -1062026 -1646278 -1288516 -802799 -1038145 -1574464 -1435192 -766749
6286 -766749 -643900 -1189824 -1216493 -128169 1139481 1747005 2173107 2800583 2585125 628217
6276 628217 -1836619 -2712274 -1769435 -497482 324421 1085330 1567982 788037 -988799
6267 -988799 -1930955 -1119295 162268 437747 -49350 -389897 -660300 -1277910 -1706789 -1191083
6257 -1191083 -201293 99006 -502392 -1183364 -1355845 -1098779 -612549 -121110 -52643 -478151
6247 -478151 -660870 -30449 712698 446514 -679620 -1498676 -1624154 -1757139 -2130451 -1995857
6237 -1995857 -1105106 -458581 -803684 -1359195 -979765 104783 735837 566238 287993
6228 287993 298492 210730 -168404 -335117 2800 240022 -280343 -1164987 -1415192 -852545
6218 -852545 -429878 -934900 -1895471 -2201838 -1586862 -959443 -1160023 -1834858 -1959838 -1286653
6208 -1286653 -667899 -744880 -886246 -87485 1299688 1675697 397620 -957927 -449770
6199 -449770 1506206 2467603 1182049 -735863 -1058927 119910 917414 575451 315162
6190 315162 1146296 2281497 2470696 1852008 1434779 1376776 937357 -53876 -780998 -670558
6180 -670558 -182801 -9594 -82220 176866 948655 1742908 1888202 1115448 -188091 -1210092
6170 -1210092 -1401343 -1005327 -690260 -674726 -585377 -209362 136033 208491 290469 645866
6160 645866 1000542 1092915 1327129 2162314 3101610 3143973 2236827 1393403 1144558 774879
6150 774879 -370422 -1582266 -1612720 -398393 868217 1237802 848439 330046 76368
6141 76368 194077 553082 721047 346022 -283784 -557883 -476307 -645223 -1203384 -1474021
6131 -1474021 -1014659 -319722 1137 123241 495389 950644 984111 505295 -318081 -1515204
6121 -1515204 -2862940 -3420495 -2476160 -746885 344395 506657 701062 1423946 1997763
6112 1997763 1854431 1431447 1235124 942305 192944 -409263 30019 1345065 2375200
6103 2375200 2278869 1285058 229018 -279024 -277170 -270277 -583258 -947477 -1008896 -1051860 -1543046
6092 -1543046 -1996825 -1271578 664928 2234124 2115521 783919 -483417 -1237219 -1607942
6083 -1607942 -1324719 -226952 838777 966546 660194 1019009 1767347 1616696 505216
6074 505216 -179742 161798 565776 472930 740491 1731431 2006647 416744 -1624231 -1697882
6064 -1697882 305667 2054390 1810498 163768 -1340472 -1962303 -1798995 -1183744 -648677
6055 -648677 -749242 -1381824 -1768013 -1473217 -928871 -614624 -308172 349294 1009792 982991
6045 982991 254251 -414655 -379971 283489 1065923 1556194 1639140 1442812 1216374 1130977
6035 1130977 1135556 1070706 889059 641922 281310 -341873 -1210565 -1992265 -2283219 -2001840
6025 -2001840 -1469086 -1062781 -846703 -653247 -536219 -903311 -1929577 -2950511 -2902425
6016 -2902425 -1573576 -35786 554636 290141 79811 64723 -656771 -2424447 -3993136
6007 -3993136 -3908871 -2436827 -1168293 -888620 -912676 -686507 -856664 -2042689 -3448796
5998 -3448796 -3729459 -2774477 -1620558 -863884 -242635 286699 278216 -115025 58356 1048977
5988 1048977 1705564 1138305 273092 597514 1826124 2152028 849039 -635033 -635996 648357
5978 648357 1711200 1683382 936170 156793 -295769 -179235 676371 1928975 2735882 2523736
5968 2523736 1505745 295367 -677003 -1209689 -1213938 -904360 -783377 -1004695 -1021590 -399702
5958 -399702 268578 33207 -859507 -1019477 153170 1497038 1690682 1027190 674401
5949 674401 784652 528225 -293911 -978351 -1264658 -1628898 -1991393 -1517873 -274581 295271
5939 295271 -510775 -1291790 -580103 756894 763147 -566607 -1315516 -606577 290836 208211
5929 208211 -214740 98498 835208 895920 62690 -890626 -1301417 -1097900 -546172 -91952
5919 -91952 -91903 -280530 988 660529 664101 -407388 -1396284 -1068555 54402 457077 -195199
5908 -195199 -844967 -829095 -621063 -662126 -616260 -186570 253528 342292 347357 619383 940541
5897 940541 817082 57579 -1122368 -2147781 -2217305 -1049437 403924 772333 2758
5888 2758 -580343 -241862 182157 -141019 -565924 -64970 1024815 1556341 1350731 1158581
5878 1158581 1136540 687728 -178296 -611345 -323775 -98630 -445657 -735704 -287078 488753
5868 488753 771754 613639 751292 1404000 1944590 1750997 925437 93403 -283499 -329247
5858 -329247 -496243 -849511 -823434 -29083 922690 1052418 438767 201588 823949 1350565
5848 1350565 790729 -436127 -1213313 -1313760 -1374612 -1625452 -1596287 -1014360 -134311 861979
5838 861979 1988590 2858515 2793114 1862599 1107015 1225148 1573919 1063288 -279143 -1280784
5828 -1280784 -1110905 -241578 282769 209518 333746 1325368 2579743 2662253 1031694 -1085253
5818 -1085253 -1976655 -1373351 -508789 -317430 -337994 288932 1432741 2224406 2302527 2075330
5808 2075330 1860489 1489016 895202 476193 525064 712494 515935 -72781 -618042 -866797
5798 -866797 -974375 -1181834 -1560766 -2038465 -2408332 -2344400 -1686356 -728929 6728 265735
5788 265735 67981 -650811 -1905137 -3120664 -3372712 -2544795 -1746698 -2012877 -2887299
5779 -2887299 -2937826 -1577202 237691 1181749 912783 88516 -530219 -704875 -656678 -646007
5769 -646007 -675588 -619993 -551240 -669012 -915593 -1110778 -1538810 -2657128 -3873542 -3617664
5759 -3617664 -1544849 234235 -447964 -2714955 -3638251 -2206149 -475067 -475097 -1814268
5750 -1814268 -3039774 -3608902 -3462482 -2228442 -199699 1132130 855049 -122207 -771627
5741 -771627 -1526274 -2699375 -2869663 -961573 1270196 1350477 -89039 -313826 1085666
5732 1085666 1793856 990391 790734 2445806 3988158 3363878 1630172 1060195 1791506
5723 1791506 2387343 2409204 2375886 2093524 1029958 -187076 -415739 196029 563428 471314
5713 471314 580817 949173 998899 777475 877566 1237480 1333248 1409763 2115394 2954802
5703 2954802 2611137 1043204 -145201 128369 1101899 1523853 1237768 806091 516070
5694 516070 494765 1072590 2229567 3105104 2746379 1193863 -535571 -1372011 -963000
5685 -963000 125299 810591 458019 -409193 -696104 -73809 705890 860548 386593 -296800
5675 -296800 -914913 -1310094 -1376428 -1290035 -1338477 -1310915 -614041 703441 1633231 1397115
5665 1397115 504644 70460 364272 589838 -14627 -1306619 -2436659 -2601928 -1651871
5656 -1651871 -204740 849812 1100253 805675 348372 -182910 -709170 -883138 -531814
5647 -531814 -148010 -428297 -1340119 -2080997 -2032938 -1388125 -721061 -314230 -133890 -162486
5637 -162486 -390223 -590608 -440460 110655 786352 1264785 1327562 857475 32370 -555908
5627 -555908 -465450 -151887 -583713 -1888777 -3012492 -3141067 -2805003 -2894413 -3191108 -2866775
5617 -2866775 -2063678 -1800474 -2352530 -2883930 -2839745 -2576170 -2330966 -1735400 -832128 -456327
5607 -456327 -944875 -1480292 -1438764 -1369529 -1777368 -1968722 -1220796 -212177 -11961 -336816
5597 -336816 -156757 529400 949874 1130755 1632735 1975348 1064068 -694349 -1420022 -394349
5587 -394349 838971 730894 -194921 -435625 304226 1040760 1012943 328518 -546477 -1172234
5577 -1172234 -1162655 -410570 704771 1593597 1878382 1503602 690949 -140581 -683385 -1009545
5567 -1009545 -1297412 -1425010 -1208147 -856217 -683342 -538023 -112583 351278 365953 82199
5557 82199 91097 392315 365916 -230539 -1046809 -1879488 -2695256 -2915514 -1794727 215364
5547 215364 1510560 1161934 -123413 -1143620 -1406021 -936268 69696 980338 1120360
5538 1120360 888138 1447552 2809983 3415557 2379372 960077 717489 1213791 881094
5529 881094 -477280 -1484075 -1287636 -628488 -671783 -1621047 -2700125 -3030437 -2432671
5520 -2432671 -1582659 -1277654 -1531153 -1804621 -2076380 -2832883 -3822141 -3934131 -2881874
5511 -2881874 -1866840 -1721468 -1515066 -208341 1283194 1249520 -151341 -1059625 -598943
5502 -598943 181246 214180 -163540 -158109 253307 641741 881549 1044176 1086520 1031487 1005357
5491 1005357 847890 163649 -996068 -1942924 -2095028 -1592037 -1031675 -903272 -1332514
5482 -1332514 -2015909 -2340563 -1939474 -1209979 -938377 -1336390 -1781666 -1601403 -814925 -3594
5472 -3594 298466 -21041 -676329 -1238507 -1443614 -1350847 -1255666 -1445507 -1883006 -2037852
5462 -2037852 -1356512 -211746 81802 -1087162 -2356940 -1893306 -67219 772816 -457515
$$ [...]
##END NTUPLES=NMR SPECTRUM
##END=
