##TITLE=31Pdec_SR156_k
 DMSO-d6, 24 sc
 20.1.2023
##JCAMPDX= 6.0         $$ Bruker NMR JCAMP-DX V2.0
##DATA TYPE= NMR SPECTRUM
##DATA CLASS= NTUPLES
##ORIGIN= UXNMR, Bruker Analytische Messtechnik GmbH
##OWNER= root
$$ XWIN-NMR		Version 3.5
$$ Fri Jan 20 16:43:03 2023 Russian Standard Time (UT+4h)  she@DPX200
##.OBSERVE FREQUENCY= 81.013821
##.OBSERVE NUCLEUS= ^31P
##.ACQUISITION MODE= SIMULTANEOUS
##.ACQUISITION SCHEME= undefined
##.AVERAGES= 24
##.DIGITISER RES= 16
##SPECTROMETER/DATA SYSTEM= spect
##.PULSE SEQUENCE= zgpg30
##.SOLVENT NAME= DMSO
##.SHIFT REFERENCE= (INTERNAL, DMSO, 0, 248.564)
##AUDIT TRAIL= $$ (NUMBER, WHEN, WHO, WHERE, WHAT)
$$ ##TITLE= Audit trail, XWIN-NMR		Version 3.5
$$ ##JCAMPDX= 5.01
$$ ##ORIGIN= Bruker BioSpin GmbH
$$ ##OWNER= she
$$ F:/spectra/data/she/nmr/P31/1/pdata/1/auditp.txt
$$ ##AUDIT TRAIL=  $$ (NUMBER, WHEN, WHO, WHERE, WHAT)
(   1,<2023-01-20 16:41:27.45 +0400>,<she>,<DPX200>,
      <created by zg, POWCHK disabled, PULCHK disabled
       configuration hash MD5:
       00 E9 B6 7A A2 85 ED C7 34 08 36 98 17 FE 4E 26
       data hash MD5: 32K
       A6 22 0B 1F 7D 08 AB 55 28 74 69 22 90 DC 36 E0>)
(   2,<2023-01-20 16:42:11.70 +0400>,<she>,<DPX200>,
      <Start of raw data processing
       efp BC_mod = 2 LB = 1 FT_mod = 6 PKNL = 1 PHC0 = -11021 PHC1 = 195.6578 SI = 64K 
       data hash MD5: 64K
       D3 E5 C4 58 14 0F B4 A0 52 D9 EE 08 B8 3F 12 01>)
(   3,<2023-01-20 16:42:26.31 +0400>,<she>,<DPX200>,
      <pk PHC0 = -6.09202 PHC1 = 0 
       data hash MD5: 64K
       7F 14 A9 72 B1 7C 6A DD BA 7E 53 C1 7C CD 32 65>)
$$ ##END=
$$ 
$$ hash MD5
$$ 49 E8 01 A3 C6 BC 2B 44 F6 FC E9 83 CF 06 19 68
##$RELAX= 
##$RELAX= 
##$RELAX= 
##$RELAX= 
##$RELAX= 
##$RELAX= 
##$RELAX= 
##$RELAX= 
##$RELAX= 
$$ Bruker specific parameters
$$ --------------------------
##$DU= <F:/spectra>
##$EXPNO= 1
##$NAME= <P31>
##$PROCNO= 1
##$TYPE= <nmr>
##$USER= <she>
##$AMP= (0..31)
100 100 100 100 100 100 100 100 100 100 100 100 100 100 100 100 100 100 
100 100 100 100 100 100 100 100 100 100 100 100 100 100 
##$AQSEQ= 0
##$AQ_mod= 1
##$AUNM= <au_zg>
##$AUTOPOS= <>
##$BF1= 81.014009
##$BF2= 200.13
##$BF3= 200.13
##$BF4= 200.13
##$BF5= 200.13
##$BF6= 200.13
##$BF7= 200.13
##$BF8= 200.13
##$BYTORDA= 1
##$CFDGTYP= 0
##$CFRGTYP= 5
##$CHEMSTR= <none>
##$CNST= (0..31)
1 1 145 1 1 1 1 1 1 1 1 1 1 1 1 1 1 1 1 1 1 1 1 1 1 1 1 1 1 1 1 1 
##$CPDPRG= <waltz16>
##$CPDPRG1= <>
##$CPDPRG2= <waltz16>
##$CPDPRG3= <>
##$CPDPRG4= <mlev>
##$CPDPRG5= <mlev>
##$CPDPRG6= <mlev>
##$CPDPRG7= <mlev>
##$CPDPRG8= <mlev>
##$CPDPRGB= <>
##$CPDPRGT= <>
##$D= (0..31)
0 1 0 0 0 0 0 0 0 0 0 0.03 2e-05 3e-06 0 0 0 0 0 0 0 0 0 0 0 0 0 0 0 0 
0 0 
##$DATE= 1674218486
##$DBL= (0..7)
120 120 120 11 120 120 24 19 
##$DBP= (0..7)
150 150 150 150 150 150 150 150 
##$DBP07= 0
##$DBPNAM0= <>
##$DBPNAM1= <>
##$DBPNAM2= <>
##$DBPNAM3= <>
##$DBPNAM4= <>
##$DBPNAM5= <>
##$DBPNAM6= <>
##$DBPNAM7= <>
##$DBPOAL= (0..7)
0.5 0.5 0.5 0.5 0.5 0.5 0.5 0.5 
##$DBPOFFS= (0..7)
$$ [...]
##$SUBNAM2= <"">
##$SUBNAM3= <"">
##$SUBNAM4= <"">
##$SUBNAM5= <"">
##$SUBNAM6= <"">
##$SUBNAM7= <"">
##$SUBNAM8= <"">
##$SUBNAM9= <"">
##$SW= 501.771253377433
##$SWIBOX= (0..15)
0 1 3 0 0 0 0 0 0 0 0 0 0 0 0 0 
##$SW_h= 40650.406504065
##$TD= 32768
##$TD0= 1
##$TE= 0
##$TE2= 300
##$TE3= 300
##$TEG= 300
##$TL= (0..7)
0 120 53 12 22 120 120 120 
##$TP= (0..7)
150 150 150 150 150 150 150 150 
##$TP07= 0
##$TPNAME0= <>
##$TPNAME1= <>
##$TPNAME2= <>
##$TPNAME3= <>
##$TPNAME4= <>
##$TPNAME5= <>
##$TPNAME6= <>
##$TPNAME7= <>
##$TPOAL= (0..7)
0.5 0.5 0.5 0.5 0.5 0.5 0.5 0.5 
##$TPOFFS= (0..7)
0 0 0 0 0 0 0 0 
##$TUNHIN= 0
##$TUNHOUT= 0
##$TUNXOUT= 0
##$USERA1= <user>
##$USERA2= <user>
##$USERA3= <user>
##$USERA4= <user>
##$USERA5= <user>
##$V9= 5
##$VALIST= <valist>
##$VCLIST= <CCCCCCCCCCCCCCC>
##$VD= 0
##$VDLIST= <DDDDDDDDDDDDDDD>
##$VPLIST= <PPPPPPPPPPPPPPP>
##$VTLIST= <TTTTTTTTTTTTTTT>
##$WBST= 1024
##$WBSW= 4
##$XGAIN= (0..3)
0 0 0 0 
##$XL= 0
##$YL= 0
##$YMAX_a= 3811
##$YMIN_a= -1897
##$ZGOPTNS= <>
##$ZL1= 120
##$ZL2= 120
##$ZL3= 120
##$ZL4= 120
##$ABSF1= 0
##$ABSF2= 0
##$ABSG= 0
##$ABSL= 0
##$ALPHA= 0
##$AQORDER= 0
##$ASSFAC= 0
##$ASSFACI= 0
##$ASSFACX= 0
##$ASSWID= 0
##$AUNMP= <proc_1d>
##$AZFE= 0.1
##$AZFW= 0.5
##$BCFW= 0
##$BC_mod= 2
##$BYTORDP= 0
##$COROFFS= 0
##$CY= -3
##$DATMOD= 1
##$DC= 0
##$DFILT= <>
##$DTYPP= 0
##$F1P= 0
##$F2P= 0
##$FCOR= 1
##$FTSIZE= 65536
##$FT_mod= 6
##$GAMMA= 0
##$GB= 0
##$INTBC= 1
##$INTSCL= 6.047779e-11
##$ISEN= 30
##$LB= 1
##$LEV0= 0
##$LPBIN= 0
##$MAXI= 10000
##$MC2= 0
##$MEAN= 0
##$ME_mod= 0
##$MI= 50
##$NCOEF= 0
##$NC_proc= -9
##$NLEV= 6
##$NOISF1= 182.463
##$NOISF2= 159.3651
##$NSP= 0
##$NTH_PI= 0
##$NZP= 0
##$OFFSET= 248.5645
##$PC= 4
##$PHC0= -11027.09
##$PHC1= 195.6578
##$PH_mod= 1
##$PKNL= yes
##$PPARMOD= 0
##$PSCAL= 0
##$PSIGN= 0
##$REVERSE= no
##$SF= 81.0140089999694
##$SI= 65536
##$SIGF1= 159.3651
##$SIGF2= -187.1042
##$SINO= 113.3802
##$SIOLD= 16384
##$SREGLST= <1H.CDCl3>
##$SSB= 0
##$STSI= 65536
##$STSR= 0
##$SW_p= 40650.406504065
##$SYMM= 0
##$S_DEV= 0
##$TDeff= 32768
##$TDoff= 0
##$TI= <>
##$TILT= no
##$TM1= 0
##$TM2= 0
##$TOPLEV= 0
##$USERP1= <user>
##$USERP2= <user>
##$USERP3= <user>
##$USERP4= <user>
##$USERP5= <user>
##$WDW= 1
##$XDIM= 65536
##$YMAX_p= 279392944
##$YMIN_p= -162626622
$$ End of Bruker specific parameters
$$ ---------------------------------
##NTUPLES= NMR SPECTRUM
##VAR_NAME=  FREQUENCY,     SPECTRUM/REAL,   SPECTRUM/IMAG
##SYMBOL=    X,             R,               I
##VAR_TYPE=  INDEPENDENT,   DEPENDENT,       DEPENDENT
##VAR_FORM=  AFFN,          ASDF,            ASDF
##VAR_DIM=   65536,         65536,           65536
##UNITS=     HZ,            ARBITRARY UNITS, ARBITRARY UNITS
##FACTOR=    0.620285442955139, 1,           1
##FIRST=     20137.2065510682, 0,            0
##LAST=      -20513.1999529968, 0,           0
##MIN=       -20513.1999529968, -162626622,  0
##MAX=       20137.2065510682, 279392944,    0
$$ Real data points
##PAGE= N=1
##DATA TABLE= (X++(R..R)), XYDATA
$$ [...]
41479E092062p081425j1104Q411438R963950O630920L391822J3313n073388q725865
41470A2611723o858453j026684L440499L665846K28734n294185j0123245j0097842
41462a3453607l962918L283738M956611M00574m259350k995188L795226R472810
41454b762104P583022n99439o005600k538475L553141J441807p105764p930753
41446a4364165L845205J2941053M574300j2138740j5491703k235377Q668743M619196
41438i581488m404725m453700J856745L930465J585315J918431M327116K158175
41430b663666l425044l860437K394124O771577L770547j831405l572647j717129
41422d134080j66997o96552k633881l945680j853315L398478O297462K934221
$$ y = [5092062, -1989363, -2000467, 6410971, 16374921, 23005841, 26397663, 26410976, 21337588, 12611723, 5753270, 4726586, 8167085, 11832931, 12061665, 6767480, -3355765, -13453607, -17416525, -14132787, -9176176, -8775602, -13034952, -16030140, -12234914, -2762104, 4820918, 4221479, -1784121, -4322596, -769455, 672352, -6433412, -14364165, -10518960, 2422093, 6996393, -5142347, -20634050, -22869427, -14200684, -9581488, -13986213, -18439913, -16583168, -12652703, -11067388, -9148957, -4821841, -2663666, -6088710, -9949147, -7555023, -783446, 2987101, 1155696, -2416951, -4134080, -4301077, -4997629, -7631510, -11577190, -13430505, -10032027, -3734565, -800344]
41414h00344j881730j518141R75396j954483p350089m525561O019358J0304196
41406g31398J800421q615572r817182m653126M53707O681386J3589271J1987804
41398A0695311q83015j0578416m890320N863405M697486m526583m714755N159044
41390H22157R470206K820951l375697k497450j148197k730587j460057K382624
41382D283950n10084r762497j1217095M34353J1421765J0353261M142747K492774
41374A1639174J968280k655291n544052j559170J869420j700974m206867K350223
41366B160743Q905472K887384j0216790j4895230p927709K257566J0896778J6269793
41358A0338007J1909705l431381j5041553r586561K884177L194352o621751q682082
$$ y = [-800344, -2682074, -4200215, -3224819, -5179302, -12529391, -17054952, -11035594, -731398, 1069023, -7546549, -17363731, -22016857, -21563150, -14881764, -1292493, 10695311, 9812296, -766120, -5656440, 206965, 4904451, 377868, -4336887, 822157, 10292363, 13113314, 9737617, 7240167, 6091970, 3361383, 1901326, 4283950, 3773866, -5988631, -17205726, -16771373, -5349608, 5003653, 9146400, 11639174, 13607454, 10952163, 5408111, 3848941, 5718361, 4017387, -189480, 2160743, 11066215, 13953599, 3736809, -11158421, -19086130, -16828564, -5931786, 10338007, 22247712, 18816331, 3774778, -5811783, -2927606, 266746, -6355005, -15037087]
41350a5037087p49153J919200m086606m600057M132336O602367l820120j0421283
41342b6060403K66569J5803465J6601110L619386p094390p409236j761148L549938
41334b484709M872664R08135m328463m283331l28485q91896o389846o855028K15914
41325a9565045L741189j354330l499551N282450J2947079N997286p403450r632410
41317a3486782k93240O317247M406873P07498p91569k187401j869593L728359
41309c468608R388893N850452m469190q828563k149834O987267R090181L351853
41301A5752451n327340j0593745p286003K067949O161312j076434r616411o759919
41293a6678140L494721P212524K449585m07969K192685L565528K214767M037957
$$ y = [-15037087, -15786240, -13867040, -17953646, -22553703, -18421367, -11819000, -15639120, -26060403, -25793834, -9990369, 6610741, 10230127, 3135737, -4273499, -6034647, -2484709, 2387955, 3296090, -1032373, -5315704, -5644189, -6536085, -12925931, -19780959, -19565045, -15823856, -17178186, -20677737, -15395287, -2448208, 3549078, -3854372, -13486782, -13780022, -7462775, -3055902, -2348404, -3139973, -5327374, -7196967, -3468608, 5920285, 11770737, 7301547, -1527016, -3676850, 3310417, 12400598, 15752451, 10425111, -168634, -7454637, -5386688, 774624, -301810, -9918221, -16678140, -13183419, -5970895, -3521310, -3929279, -1736594, 1828934, 4043701, 8081658]
41285H081658P387629K747740q688379j2432292k782465P515213P011101J038602
41277I878807q58859Q3197q56632j066351K393091M422083P20205l281766j952343
41268I481432L4707l552912q741477q296849l692102m07993K103699N890628O688048
41259d92819J358377l149367K33812N456750K380570n862317p834715k492740
41251a0402449J031098J05291N81338K754056K06725n991414o511046j14381L388984
41242a4951798O99133J091106Q578067J2323046M370203n547877m898122J818174
41234C481932J691698n022893o554848M19178O595369N766290K165459J74234
41226H716419k116089n325640m369039K892033R550089Q028571o6929p402189
$$ y = [8081658, 15469287, 18217027, 9528648, -2903644, -5686109, 1829104, 8840205, 9878807, 9019948, 9103145, 8246513, 7180162, 9573253, 13995336, 14715541, 11433775, 9481432, 9516139, 5963227, -2778250, -11075099, -14767201, -15175194, -13071495, -7180867, -492819, 865558, -2283809, -2049997, 3406753, 5787323, -74994, -7909709, -10402449, -9371351, -9266060, -8684722, -5930666, -5723941, -11715355, -18226401, -18340782, -14951798, -14252665, -13161559, -4583492, 7739554, 12109757, 6561880, 1663758, 3481932, 5173630, 150737, -6404111, -5984933, 610436, 6376726, 8542185, 8716419, 6600330, 1274690, -3094349, -202316, 9347773, 17376344, 17309415, 9907226]
41218I907226j0358866j0085165p067307k67171Q651105J4298129J2103955K908315
41210B0090221p085289j1095181p720841j982640J040049K393122N953367J0210269
41202A1803077Q798522L02481p928900q558690k706934L014499M021986M9913
41194H795954n626562o979291o04883P168056N563741m522153q748226l21618
41186e274982P609572J809472q487283n473935O899946P503150o966377j4161235
41178a6541672o96163J5994629J3702514k852325j2802034r753261l490734J077755
41170a5361291P355765J2612616Q817950j156725m722519P5733P45171q051892
41162C14808j3667682m839234R713435J3119581L574300n510021n108305R7048
$$ y = [9907226, -451640, -10536805, -17604112, -17871283, -9220178, 5077951, 17181906, 20090221, 13004932, 1909751, -5811090, -7793730, -6753681, -4360559, 1592808, 11803077, 20601599, 20904080, 12975180, 4416490, 1709556, 4724055, 8746041, 8795954, 3169392, -3809899, -4414782, 2753274, 8317015, 3794862, -4953364, -5274982, 2334590, 4144062, -4343221, -9817156, -2917210, 4585940, -2380437, -16541672, -17237835, -1243206, 12459308, 9606983, -3195051, -12948312, -16439046, -15361291, -8005526, 4607090, 13425040, 12268315, 7545796, 7621529, 8366700, 314808, -13352874, -18192108, -8478673, 4640908, 8215208, 2705187, -2403118, -2306070]
41154b306070J938258l91749k649655l027390k797258j817622J713918O254040
41146c083528O116403o18502o552342l464442N005251P342423J594491j392630
41138D947124L872803P668831J564039o295721m658197J361105k16515o197708
41130B045761m096203L818412L191118n629034n907571N640825J0228850j903364
41122G388794j3507030q209589K888754J504111o808457m705699M956126M594466
41114a1898524n682851p018353N695385J4338584O851043m735708n252569J547627
41106f155366L651501M07192j289193j099679k870971m183067J1547O661725P643723
41097B777412J924067l520508m045420j767399j82657j24523r89751j687523q46794
$$ y = [-2306070, -367812, -759561, -3409216, -6436606, -9233864, -11051486, -9337568, -3083528, 3032875, 2414373, -4137969, -7602411, -2597160, 4745263, 6339754, 4947124, 8819927, 16488758, 18052797, 11757076, 7098879, 8459984, 8243469, 2045761, -2050442, 1767970, 4959088, -669946, -6577517, -936692, 9292158, 7388794, -6118236, -14327825, -11439071, -9934960, -16743417, -21449116, -16492990, -11898524, -17581375, -24599728, -18904343, -4565759, 2285284, -2450424, -7702993, -6155366, -2503865, -2096673, -3385866, -4485545, -7356516, -11539583, -11528036, -4866311, 2777412, 4701479, 1180971, -2864449, -4631848, -4814505, -4939028, -5928779, -7616302, -8463096]
41088h463096Q39725K93308k886892m150780q48608K393602Q40689j302380L302340
41079i982092J1964926J3382717L312450q949953j2472727o855541M61252L552927
41071e586041J402390l246129n100804o72903N806063N757850j506115o218205
41063i363894k507969J700640l057782j1319712r127395N135288J7201451J5348671
41055D009298L326263p148871q837725j790354Q339374J2050800L901107q169540
41047E680352r507385J574815R922370M792885m872001n063132K121216L722523
41039H371643l025585p895581m482195J977939M711574L599386J117715j948400
41031B426496m177245l143732L39622K358914J433617k60934j259413k150287
$$ y = [-8463096, -7623371, -7330063, -10216955, -14367735, -15216343, -12822741, -11982052, -13284432, -9982092, 1982834, 15365551, 18678001, 9728048, -2744679, -9600220, -9138968, -5586041, -4183651, -7429780, -12530584, -13203487, -7397424, -1639574, -3145689, -9363894, -11871863, -10171223, -13229005, -24548717, -33676112, -28540824, -11339373, 4009298, 7335561, 186690, -8651035, -10441389, -2102015, 9948785, 13849892, 5680352, -3827033, -2252218, 7670152, 12463037, 7591036, 2527904, 4649120, 8371643, 5346058, -2549523, -7031718, -5053779, -342205, 3257181, 4374896, 2426496, -1750749, -4894481, -4554859, -2195945, -762328, -1023262, -2282675, -4432962]
41023d432962l065320l709229m274345k788218M360847J4118860J5096703K613127
41015A7919463j0780816j1201613m179585m787261j1319553p900515O398259J2474425
41007a3377196J662839r017608l537955Q674839R861823J539103k306161L15783
40999f184533J59123l523710j916938N971331J0233845N540115k360260o795085
40991A123888o791840l126018K728315N388092N20698o513543n906434K069733
40983a0507109O728691K443770m402107o346523m508445l482215l069590M6769
40975b3096759N826967R924506Q424514K446676k037963o76079K851630J280520
40967D944012m280587m330114L163363O523478j608244r673113l940541P474652
$$ y = [-4432962, -7498282, -11207511, -15481856, -18270074, -13909227, 209633, 15306336, 17919463, 7138647, -4062966, -8242551, -13029812, -24349365, -32249880, -25851621, -13377196, -11714357, -20731965, -24269920, -15595081, -5733258, -4194155, -6500316, -6184533, -6025410, -9549120, -11466058, -5494727, 4739118, 10279233, 7918973, 1123888, -5667952, -8793970, -6065655, -677563, -156865, -6670408, -12576842, -10507109, -3778418, -1334648, -5736755, -12083278, -16591723, -20073938, -23143528, -23096759, -17269792, -7345286, 1079228, 3525904, 1487941, 811862, 3663492, 4944012, 663425, -3666689, -503326, 6020152, 4411908, -5261205, -9201746, -1727094]
40959a727094N067529j0032112j4624326J647081J8788447J4403887n011421j4698941
40951f186950n384695Q010782R049520j015824q912340o529195J745121O445530
40943b778051M656918K266134M136772N887430N87735q725019j1379223m719896
40935a0067200J293463j188787o447473m405749M502667J0635123Q086560J71878
40927B580482o216635o691920j212187N643444P080827P18087p429744q668789
40919a4196435j372897P191450Q840383K681225m900017p489182m852559j047902
40911a5145934K412698P383143J1874244Q392371m695083j5460141j1553665J446968
40903a5345399O161002j717554p371880l9997J0349853Q770092k163662o916897
$$ y = [-1727094, 3340435, -6691677, -21316003, -19668922, -880475, 13523412, 8511991, -6186950, -11571645, -3560863, 5488657, 4472833, -4439507, -10968702, -9223581, -2778051, 1878867, 4145001, 8281773, 14169203, 14756938, 6031919, -5347304, -10067200, -8773737, -9962524, -16409997, -20815746, -16313079, -5677956, 2408604, 2580482, -3636153, -10328073, -11540260, -5896816, 1184011, 1902098, -5527646, -14196435, -15569332, -8377882, 462501, 3143726, -1756291, -9245473, -14098032, -15145934, -12733236, -5350093, 6524151, 14916522, 10221439, -5238702, -16792367, -15345399, -9184397, -10901951, -18273831, -18313828, -7963975, 806117, -1357545, -8274442]
40895h274442L70479R778139J0944169M514948k753453o399014n516730j308461
40887A355635L010647M022385J309769k623271m940405l545299J793055O781952
40879G164468M824648l771159q819206k781786P148216P796257r61529n926452
40871D673457m51612N837053J943767q497841j3382908q636095o61972M430948
40863a4745203O023828M457522p84560o664449o654906J159269R755785J0784132
40855C331418M695312k61995J245368N222624M015064l708462j1294913j2263995
40847i019579p296321j567704K212024M626570N065024J781182k743621k289253
40839i231678L947776P744069K553264o118855p712508j530883L167532J399476
$$ y = [-8274442, -7903963, 1874176, 12818345, 17333293, 14579840, 8180826, 2664096, 1355635, 4366282, 8388667, 9698436, 7075165, 2134760, -1410539, 382516, 7164468, 11989116, 8217957, -601249, -3383035, 3765181, 11561438, 10599909, 4673457, 4221845, 10058898, 12002665, 3504824, -9878084, -18514179, -19176151, -14745203, -8721375, -4263853, -5048413, -11712862, -18367768, -17208499, -7452714, 3331418, 8026730, 7764735, 9010103, 14232727, 18247791, 14539329, 3244416, -9019579, -16315900, -17883604, -15671580, -11045010, -5979986, -4198804, -6942425, -9231678, -5283902, 2460167, 5013431, -1105424, -8817932, -10348815, -7181283, -5781807]
40831e781807j689594p92052J977876L004589L428323M752677M293827K30647
40823I424486l918041m774466l974490l015120M41036N585309N339027k047280
40815C060461o095374Q87377R295865N987598l486181k986103O791378Q132088
40807B1587109m441905j4072594p803004M145201N901021r92675m429078j422270
40799a528195J786780K350019J950920J41699l704912n771452l094532P18356
40791g151317J656955J825707L506080L293175q60024l741698j521076R19503
40783b072695j060637l534668k809303l480158q090893q515427O29337R416061
40775a9518383O930835n17968k91539N562090O415042K902567K893367L753390
$$ y = [-5781807, -7471401, -8263453, -6285577, -3280988, 147335, 4900012, 9193839, 9424486, 5506445, 731979, -3242511, -6257631, -5816595, -231286, 5107741, 3060461, -3034913, -2147536, 7148329, 13135927, 9649746, 6663643, 13455021, 21587109, 17145204, 3072610, -4730394, -585193, 5315828, 4323153, -105925, -1528195, 258585, 2608604, 4559524, 4701223, 996311, -4775141, -7869673, -7151317, -5494362, -3668655, -162575, 3130600, 2270576, -1471122, -2992198, -2072695, -3133332, -6668000, -9477303, -12957461, -21048354, -29563781, -28934444, -19518383, -12587548, -13105516, -13397055, -7834965, -1419923, 1482644, 4376011, 8129401]
40767H129401k178479r124666n337762M117066L602127n614696o939639K038020
40759a1308628N798109j01690j366076O915675R566209o21538p983538j367873
40751d69350N329229k519716j4074685j1236012J351192N693765N2400j554328
40743a7427505N860420J2281419R645597O87562p900052j0866045n767535K815997
40735a0670142N155231m49268l644413J494737O054137J961803l385972q44901
40727d328788L435324K43057l670638K746894J2133734Q468388m975227r244695
40719D808049m16006N129953j082951p123257k948002L492200K045231l071262
40711H33955l547903j677644l112183m370471K30907N682253K694710o069162
$$ y = [8129401, 5950922, -3173744, -8511506, -4394440, -792313, -6407009, -13346648, -11308628, -5510519, -5612209, -6978285, -62610, 9503599, 8882061, 898523, -469350, 4859879, 2340163, -11734522, -22970534, -21619342, -15925577, -15873177, -17427505, -11567085, 714334, 10359931, 11047493, 3147441, -7718604, -13486139, -10670142, -5514911, -5964179, -9608592, -8113855, -2059718, -97915, -3483887, -4328788, -893464, -650407, -4321045, -1574151, 10559583, 19027971, 14052744, 4808049, 4392043, 9521996, 8439045, 1315788, -1632214, 1859986, 3905217, 833955, -2713948, -4391592, -7503775, -11874246, -11643339, -5961086, -3266376, -9335538]
40703i335538p794823J874330J1423140Q310687m493562j1927829n318362P123982
40695a0137975J0490276J416327q424992p638936J293090P266704N171726l84913
40687i48693l812828m608453m281561k494914J452303N908279P670147N200994
40679D085274P42675j399106N9608J234942r81247k622738J772999P903531M682678
40670A5478616q894286j8891818j3972895j13442Q895809Q772883M927222J480787
40662b317124j081385j711085o75556k038013o839725q327484j950811N147077
40654a9794106M192768o86048O87859P056265Q027974K095108j318834J454655
40646A715641L050220m43722k392071J448088L807147k550108j1986362j3169376
$$ y = [-9335538, -17130361, -15256031, -3832891, 4477796, -15766, -11943595, -17261957, -10137975, 352301, 1768628, -6656364, -14295300, -13002210, -5735506, -563780, -948693, -4761521, -9369974, -13651535, -16146449, -14694146, -8785867, -1115720, 4085274, 4827949, 3428843, 3488451, 4723393, 3742146, 1119408, 2892407, 10795938, 15478616, 6584330, -12307488, -26280383, -26393825, -17498016, -8725133, -3797911, -2317124, -3398509, -5109594, -5785150, -7823163, -14662888, -22990372, -24941183, -19794106, -15601338, -16287386, -15599527, -8543262, -515288, 1579820, 260986, 1715641, 4765861, 4322139, 1930068, 3378156, 7185303, 4635195, -7351167, -20520543]
40638b0520543m644599M388816O933993N377800N372227P165763N927158l24708
40630I675907o499442o715651k644726o09516j227073P30380N070871M300207
40622B080957k759004n857129N20066O057326P30555o974649k489289J0325380
40614A634213J3932728M161910m871230m355936k437255p024650j1771646p777713
40606a8509579J393839N656772K772973q93721j454M644958P877260M772131l357359
40597D355820p861874k933028M469035K883057o109637q973596m74957Q416853
40589f228327P294381M10357k663048j495737j519124k751599q70212L789983
40581d033326O119317L802343o84526m637038p157167p433217m845705o52881
$$ y = [-20520543, -25165142, -20776326, -13842333, -8464533, -3092306, 4073457, 10000615, 9675907, 3176465, -3539186, -6183912, -6793428, -8020501, -7290121, -2219250, 2080957, -678047, -6535176, -6015110, 42216, 772771, -6201878, -8691167, 1634213, 15566941, 19728851, 14857621, 10501685, 8064430, 1039780, -10731866, -18509579, -17115740, -11458968, -8685995, -9579716, -9581170, -4936212, 2941048, 7713179, 4355820, -3506054, -6439082, -1970047, 913010, -5196627, -14170223, -14645180, -6228327, 1066054, 1476411, -1186637, -2682374, -4201498, -6953097, -7823309, -4033326, 2085991, 5888334, 5203808, 566770, -6590397, -14023614, -18869319, -19522200]
40573a9522200L037262N766601Q221201R416001O521399j049031q226266q097019
40565c932052j107171L102613j827052p866415k817984R648935J2659517J394464
40557I254855q711083n926427O21968q83190m089985K119205J1106611Q598242
40549A2090196k704938q391003o085338l841498o68096Q962131J5777719O128530
40541B1267703j0246291j0203421M356551P858566m861883q812093O107932J4357595
40533A9824659j829100j9264427j0382573J1742188J5400544l94522j0320898
40526D775871n444876l23488k515514l676622n93774m77872l803492k688966K425042
40517a2323691L202678N87065K949628P385001K613409q427331r474808K211415
$$ y = [-19522200, -16484938, -10718337, -2497136, 6918865, 13440264, 12391233, 4164967, -3932052, -5039223, -1936610, -3763662, -11630077, -14448061, -4799126, 7860391, 9254855, 543772, -5382655, -4760687, -5643877, -9733862, -7614657, 3491954, 12090196, 9385258, 994255, -5091083, -8932581, -9600677, -638546, 15139173, 21267703, 11021412, 817991, 5174542, 13033108, 8171225, -640868, 5467064, 19824659, 17995559, -1268868, -11651441, 90747, 15491291, 15096769, 4775871, -669005, -992493, -3508007, -7184629, -7778403, -8256275, -12059767, -14748733, -12323691, -9121013, -8533948, -5584320, 1800681, 4414090, -4013241, -13488049, -11276634]
40509a1276634J0268555O181908J856530O636784J0564038K900144q091854q652331
40501A0387140j856696j085182p647646r613765j034774R691464J1858700M770254
40493A5469495l860069o762352k729184L676759O703191M503443k27873m171917
40485A2601493o155648o081164l637529P84161N224405P042502M701895m36917
40477A4043198m201264l873527k585076n519893j0790386r826383J16577J0056635
40469a2580119J0947911N503775J935986J219067j197367m812746m528847k75604
40461c787944K273582N97456j931435k140157p2707L395916O563488N916646N47523
40452A1362368m410902m187455j361541o06634n22593J864435K993538j242593
$$ y = [-11276634, -1008079, 5173829, 7030359, 13667143, 24231181, 27131325, 19039471, 10387140, 8530444, 7445262, -202384, -9816149, -10850923, -1159459, 10699241, 15469495, 11609426, 4847074, 2117890, 5794649, 12497840, 17001283, 16773410, 12601493, 6445845, 364681, -3272848, -2488687, 2735718, 9778220, 14480115, 14043198, 9841934, 5968407, 3383331, -2136562, -12926948, -22753331, -22636754, -12580119, -1632208, 3871567, 5807553, 7026620, 5829253, 1016507, -3512340, -3787944, -1514362, -916906, -2848341, -4988498, -5061205, -1665289, 4898199, 10814845, 11362368, 6951466, 2764011, 1402470, 795836, 273243, 2137678, 5131216, 3888623]
40444C888623n208074p25564P622552P239803k379496p697110k012754M578868
40436E306848J518145o889022r552980l790690M589865J0129897J0264987M162906
40428A5739956m903556r690960o617670p38482M40272m293822r615684r545889
40420b9225835k303249P573483J1511039N360342m331228p440867l517081j512695
40412b3886091n576086q668074l345802P477361J4503061J2379283L234548o206012
40404a0087812r235482m782409Q92108K196847K403220P086358J1562983N929254
40396E965067o611141r945970J072033J0148755K603216j2090098j3934138j462282
40388b4254558P769050L440252n202936n448608K232022Q577845Q384144L376696
$$ y = [3888623, -1319451, -2045015, 5577537, 12817340, 10437844, 2740734, 727980, 5306848, 6824993, -64029, -9617009, -13407699, -8817834, 1312063, 11577050, 15739956, 10836400, 1145440, -5472230, -6210712, -5770440, -10064262, -19679946, -29225835, -31529084, -23955601, -12444562, -7084220, -11415448, -18856315, -22373396, -23886091, -29462177, -38130251, -41476053, -33998692, -19495631, -7116348, -3881800, -10087812, -19323294, -24105703, -23213595, -21016748, -18613528, -11527170, 35813, 5965067, -646074, -10592044, -9520011, 628744, 3231960, -8858138, -22792276, -24254558, -16485508, -13045256, -18248192, -23696800, -21464778, -12886933, -4502789, -1126093]
40380a126093k491156n539487l519879J443153L340563o27634n233316l301394
40372a7055243M302684Q988495N546646j020483k581235J004331K528013j262249
40364D50959m553227j348102M925287N652310r19316p082152n576254J957345
40356f493150P943354P615022K898998j278291k814159l670415n347466n360247
40348f506354j253275L370903K415899k615454l158028K905463O167904j8292
40340A308766p663761n328177M464812R577791O512084K644897J423233k321809
40332A0617836j0210927j4519010r114767J635817R057694R419790M512564j233301
40324A65696k511793K129878O471206L739023k785968m154361k18078L34902m764561
$$ y = [-1126093, -3617249, -9156736, -12676615, -11233462, -7892899, -8520533, -13753849, -17055243, -12752559, -3764064, 1782582, 762099, -1819136, -814805, 1713208, 450959, -4102268, -5450370, -525083, 5127227, 4207911, -2874241, -8450495, -6493150, 1450204, 9065226, 11964224, 10685933, 7871774, 4201359, -1146107, -6506354, -7759629, -4388726, -1972827, -4588281, -7746309, -4840846, 1327058, 1308766, -6354995, -11683172, -7218360, 2359431, 8871515, 11516412, 12939645, 10617836, 406909, -14112101, -23226868, -21591051, -12533357, -3113567, 1398997, 165696, -2346097, -216219, 6254987, 9994010, 7208042, 3053681, 2835603, 3170505, -1594056]
40315a594056p475992l591093Q82941J778481L432205P500105O990397p10525
40307G212463n954079j423493N254162L923057j990665l305898j195110k662077
40299a41640n927942l843584J924008L284014n303j002245J012361L19857k629885
40290g010359j198825L837664L293524m850414j0340192n502337M495793J0670555
40282f604591J0555942N153779m908118j4081239j2034194K106038J2731327N734420
40274a346636j0372874j3144377L839262K1240648J8975673J739317r302047n247900
40266F381066J814185k95279o270321m325802L684198N337902k071835p510722
40258c256608m163800J090045J115237k30117J852917K234381m211470j0063843
$$ y = [-1594056, -9070048, -12661141, -11778200, -9999719, -6567514, 932591, 7922988, 7212463, 1258384, -165109, 5089053, 9012110, 7021445, 3715547, 2520437, -141640, -6069582, -9913166, -7989158, -4705144, -4710447, -5712692, -4700331, -4380474, -7010359, -8209184, -4371520, -1077996, -5928410, -16268602, -21770939, -17275146, -6604591, 3951351, 9105130, 4197012, -9884227, -21918421, -19812383, -7081056, -1346636, -11719510, -24863887, -21024625, 216023, 19191696, 20931013, 11628966, 6381066, 8195251, 7899972, 1629651, -2696151, 988047, 6325949, 4254114, -3256608, -7420408, -6330363, -5215126, -5445243, -3592326, -1357945, -5569415, -15633258]
40250a5633258n676415L502488M207575k807308l594890N490564J0643105K277707
40242a590432r352729q969703K339152J0178842O204372m207934j1191432j0150392
40234b6740256k864018N764403J1018965J1021874P141654J993476k016427l047099
40226B272572j223794P32527P76266L76059J174138J072454j725816l297085O75328
40217H32649N807906L610595m858742r140293m860546M05342K215k683975k964522
40208a3849371l314651o050019n809420J827337J0399558J0538594L550796j744953
40200d452129k100856j000776M1679K010660K413838j624082n486363k085338
40192a2283367N433456O254301j440546o686476k098553N487632O161128Q68312
$$ y = [-15633258, -21309673, -17807185, -13599610, -16406918, -20001808, -14511244, -3868139, -1590432, -10943161, -19912864, -17573712, -7394870, -1190498, -5398432, -16589864, -26740256, -29604274, -23839871, -12820906, -1799032, 5342622, 7336098, 5319671, 2272572, 1048778, 1781305, 2557571, 2933630, 4107768, 5180222, 3454406, 157321, 832649, 6640555, 10251150, 5392408, -3747885, -8608431, -8203089, -8200874, -10884849, -13849371, -17164022, -23214041, -29023461, -27196124, -16796566, -6257972, -2707176, -4452129, -6552985, -7553761, -7512082, -5501422, -3087584, -4711666, -10198029, -12283367, -6849911, -595610, -2036156, -8722632, -10821185, -5333553, 827575, 1695887]
40184A695887k547062j500805M17612J188632K008795K633288J016956k343356
40176B569947m015194k119242J538252L926484L390777K90158k951207l046326
40168d16351O57531M133987K539459l236802o051970o14015Q648938J0965617
40160A6626394K267753q010798p759680J411592N662916j301069q437902l739658
40152c280452P143419R286568J122469m491413j422732J723488j420464l771504
40144D889379J296703O264594J067558r260770j1049257k099835O599823P665723
40136E373918M529830J475249k782158q455874j0305982m913246K883987N479287
40128f714989J868942j667892O34866P011160R305292K331186q129360j0562477
$$ y = [1695887, -851175, -2351980, -1934368, -745736, 1263059, 3896347, 4913303, 2569947, -1445247, -3564489, -2026237, 1900247, 5291024, 5581182, 2629975, -416351, 241180, 4375167, 6914626, 3677824, -2374146, -2988161, 5660777, 16626394, 18894147, 10883349, 3123669, 4535261, 10198177, 8897108, 459206, -3280452, 3862967, 13149535, 14272004, 9780591, 8357859, 10081347, 8660883, 4889379, 6186082, 12450676, 13518234, 4257464, -6791793, -8891628, -2291805, 5373918, 9903748, 11378997, 8596839, 140965, -10165017, -15078263, -12194276, -6714989, -4846047, -6513939, -5879073, 1132087, 10437379, 12768565, 4639205, -5923272]
40120e923272k441568N686556M474692j839636l301765R36583L541363R29502
40112B062455l838980p167121o410863R29851J1385072J3831727L608403p108474
40104G292070n222223K812940K018098m874217k602998P028722N178930j0189700
40096A441622j6230725j844374J2008580N323549q963296p516587N835823J0156441
40088B11033L591093K583689R957578J0070887l049881j5333041j4865459o469285
40080a3303386N40122L955738L928412L7465l526089j706223J311867j813597
40072a0575691o214097j040113R207622Q316244m056608r032015P87574Q409270
40064d197814J143965q091601l848902N051362J790108q247956o274979P711976
$$ y = [-5923272, -8364840, -2678284, 1796408, -43228, -3344993, -2408410, 1132953, 2062455, -1776525, -8943646, -15354509, -14424658, -3039586, 10792141, 14400544, 7292070, 2069847, 4882787, 6900885, 2026668, -576330, 6452392, 11631322, 1441622, -14789103, -16633477, -4624897, 698652, -8264644, -15781231, -9945408, 211033, 3802126, 6385815, 16343393, 26414280, 23364399, 8031358, -6834101, -13303386, -12763264, -8807526, -4879114, -4841649, -8367738, -10073961, -8762094, -10575691, -16789788, -17829901, -8622279, -306035, -4362643, -13394658, -12607084, -4197814, -3053849, -11145450, -14994352, -9942990, -8152882, -16400838, -22675817, -14963841]
40056a4963841J4459511O111860l745935m052359j579936m937701q628078l970685
40048b1307164M391751N253850j020976l052984L543239R291695N374513l194388
40040g20464n615706j504369J35462l098131k982046L783865P084574p58658r644699
40031a3320172n231749P665745J1079763J972371l266484L936879J0283924K985269
40023A6105546q943641r265593K44475M469491j125835o364237m180746Q20730
40015h239810K413953N31949k717607n961415n722543J253689J0419453J1433117
40007C410786J318658r928596j0931377k402056M956163L952125j564390k799437
39999a3988124L120524J0427802J2227366P956047J949766k603695n134949n505238
$$ y = [-14963841, -504330, 5607530, 1861595, -2190764, -3770700, -8708401, -17336479, -21307164, -16915413, -11661563, -12682539, -15735523, -12192284, -2900589, 2473924, -720464, -6336170, -7840539, -7705077, -10803208, -13785254, -10001389, -2916815, -3675473, -13320172, -18551921, -10886176, 193587, 2165958, -1100526, 2836353, 13120277, 16105546, 7161905, -2103688, -1859213, 2610278, 1484443, -4879794, -9060540, -8239810, -5825857, -5293908, -8011515, -13972930, -19695473, -18441784, -8022331, 3410786, 4729444, -5199152, -16130529, -18532585, -13576422, -9624297, -11188687, -13988124, -10867600, -439798, 11787568, 19743615, 21693381, 19089686, 13954737, 8449499]
39991H449499m689115n687219q709703p833601P46829R452801P509040k478248
39983c239717o989440j413002M850534N684352O695478J0672547R281424j102843
39975B4439333q794389m647621J362301l425124j1476488o970565O109660Q599985
39967E197092k649295r270641j025324Q257530L468593q014861q005131N572605
39959f469432J6156054J0674012n166749j5034300j0357147J955425Q999219O495626
39951G252708J089812j083312j843237l938447l670242K343671Q240630N945566
39943A4337149j632608m069009P42353L718174j318516q984072j0347155l671680
39935a1225364N016188Q135222K892319n253342o889663O9059O712373N324377
$$ y = [8449499, 3760384, -1926835, -10636538, -18470139, -17723310, -8270509, -761469, -3239717, -10229157, -11642159, -6791625, -1107273, 5588205, 16260752, 25542176, 24439333, 15644944, 10997323, 12359624, 8934500, -2541988, -9512553, -3402893, 5197092, 2547797, -6722844, -7748168, 509362, 3977955, -4036906, -12042037, -6469432, 9686622, 20360634, 15193885, 159585, -10197562, -8242137, 757082, 7252708, 8342520, 7259208, 5415971, 1477524, -2192718, 150953, 8391583, 14337149, 12704541, 8635532, 9377885, 13096059, 11777543, 2793471, -7553684, -11225364, -6209176, 1926046, 4818365, -434977, -7324640, -7255581, -543208, 4781169]
39927D781169J70521q42954L60011l123878r011203q305170j78968P126514R420078
39918C96120R175823N961846k850159j1172889p803039N776895J3883787P599819
39910B0968203m012840q591082n680940j779745o8896j064511m914450p680962
39902a2825223l408882N724887J0028028O975192N133116Q580114Q775261p35138
39894B8247355j2100780j4660444r771044m924609j192622L535893N940315K664438
39886b261498j025334J442396N983737L526235n104062r972848o627745q85941
39878a4925060J340361J437617L435976O944261P278192J467730o531746q144476
39870g697145m32039P937770O629478j925547o045962k208381J359164k27781
$$ y = [4781169, 4951690, 4108736, 4468747, 1344869, -7666334, -15971504, -16150472, -9023958, 396120, 9571943, 15533789, 12683630, 1510741, -6292298, -515403, 13368384, 20968203, 16955363, 8364281, 2683341, 903596, 834700, -229811, -5144261, -12825223, -16234105, -10509218, -481190, 6494002, 11627118, 20207232, 28982493, 28247355, 16146575, 1486131, -8284913, -13209522, -14402144, -10866251, -4925936, -2261498, -3286832, -1844436, 4139301, 7665536, 2561474, -7411374, -14039119, -14925060, -13584699, -12147082, -8711106, -1766845, 5511347, 6979077, 447331, -7697145, -8129184, -191414, 6438064, 4512517, -1533445, -3741826, -2382662, -2610443]
39862b610443j738760Q3816l501m169818n263712L94252N236034L625479J467367
39853b979286L590827L403093l977699r831596n650977J826681K784300R34716
39845i899941L263289M001841l751519j0072952j962709J2044977J2640943Q20937
39837G084866m216425L138556P991360J947419m605702k529826K471315K734272
39829A4015835n42971m717709r646446j0515462j470404J0644937J1814625K704817
39821A2287222j957756J706173J907520m681145n627591L165512Q006016J904910
39813A6710861l218041m70202j516736j1463697j3396073K632290J6811479R312663
39805A5402544o101624n168479N929561L324422j1594998j4947979j748595P893221
$$ y = [-2610443, -4349203, -4265387, -4268888, -8438706, -13702418, -13308166, -8072132, -4446653, -2979286, 611541, 4014634, 36935, -9794661, -15445638, -13618957, -10834657, -9899941, -6636652, -2634811, -6386330, -16459282, -18421991, -6377014, 6263929, 7084866, 2868441, 6006997, 13998357, 15945776, 11340074, 8810248, 11281563, 14015835, 13472864, 8755155, -891291, -11406753, -12877157, -2232220, 9582405, 12287222, 10329466, 12035639, 13943159, 9262014, 3634423, 6799935, 14805951, 16710861, 13492820, 13022618, 11505882, 42185, -13353888, -10721598, 6089881, 15402544, 9300920, 4132441, 10062002, 13386424, 1791426, -13156553, -14905148, -7011927]
39797g011927N043462L728300J0743396J1820999j879582j6712142j7644937q086076
39789a9998507J322884P147461P866906P62282p432975l518631R865177J2671357
39781H685954j666632j2845955m989123P467917L924279q140697o456138Q238098
39773e782297J3233007P25472j0341353m468611P708373P259400m995162j1009757
39765g670928j767699J0323765Q582963m609336r955120J923157J5307305J0348753
39757B2482860p495771j4392891l183303P141078J953282q208803q270901k489004
39749a2463453j824929j944147O472880J5573134J0299076m709982r918575j305230
39741A78774M810063q48221p905606n977840M34140L605755M547810N636983L561500
$$ y = [-7011927, -1968465, 1759835, 12503231, 24324230, 22444648, 5732506, -11912431, -19998507, -18675623, -11528162, -3661256, -2898974, -10331949, -13850580, -3985403, 8685954, 7019322, -5826633, -10815756, -3347839, 576440, -7564257, -14020395, -5782297, 7450710, 8176182, -2165171, -6633782, 1074591, 8333991, 3338829, -7670928, -9438627, 885138, 9468101, 4858765, -5096355, -3173198, 12134107, 22482860, 14987089, 594198, -2589105, 4551973, 6505255, -1703548, -9974449, -12463453, -14288382, -16232529, -9759649, 5813485, 16112561, 11402579, 1484004, 178774, 4988837, 4140616, -3764990, -9742830, -9308690, -5702935, -1155125, 4481858, 8043358]
39732H043358k505943n808632k392754J956479J408528j344405j946221j953206
39724d542796l620258m048499m04018M468057O281351M571144R69928k874160
39716H00749m324079k163742J07538m11649K34740N069535O141782m386836j6009632
39707a4941594j0449097Q760270J7235692N233960q441298o866372J155143P43322
39699g569974m310448l120803J303920O34843j535657J436979M309503J071435
39691g780202n99797N699112Q152881l789497j4996365n571049J2961184J2188858
39683F265125o693985j3251828L186740J7510635J0848663j717520o00174O964113
39675B2511769M545519m310257n804245j093322j354381o694436q328933n619628
$$ y = [8043358, 5537415, -271217, -2663971, -707492, 701036, -643369, -2589590, -4542796, -8163054, -12211553, -12615571, -8147514, -1866163, 2704981, 3674909, 800749, -3523330, -5687072, -5579534, -5991183, -5756443, -686908, 5454874, 1068038, -14941594, -25390691, -16630421, 605271, 5839231, -2602067, -9468439, -8313296, -7569974, -11880422, -15001225, -13697305, -13062462, -14598119, -13161140, -8851637, -7780202, -8379999, -2680887, 5471994, 1682497, -13313868, -18884917, -5923733, 6265125, -428860, -13680688, -10493948, 7016687, 17865350, 16147830, 15547656, 22511769, 27057288, 22747031, 16942786, 15849464, 14495083, 7800647, -528286, -6147914]
39667f147914m657898m430168O23832P248453O416607j351652n638932j355656
39659i293328N290318O797910K885472j857517l659542k534662k064684m509475
39651h945508n514487Q46579J0363323J0655078q42951j0320885o107204N125341
39643d740714R628054N953832K286189J113893j039354k893468m3601M824255
39635A5089086M999906J595608R67062J493176m540555j5051419j7076847n557491
39627a8081474P736490R741803K149579l983433l026424J850314N403687N013174
39619F803716J515230j160890J28940K603056O39199m505241m593529K265113
39611C695594N548906l014969j4185209j1129200O540745J9777938J4485487q43218
$$ y = [-6147914, -10805812, -15235980, -14612148, -7363695, -947088, -2298740, -7937672, -9293328, -4003010, 2794900, 5680372, 3822855, 163313, -2371349, -4436033, -8945508, -14459995, -13613416, -3250093, 7404985, 6562034, -3758851, -9866055, -4740714, 4887340, 10841172, 13127361, 14241254, 13201900, 10308432, 10264831, 15089086, 20088992, 21684600, 22651662, 24144838, 19604283, 4552864, -12523983, -18081474, -10344984, -603181, 1546398, -2437035, -5463459, -3613145, 1790542, 6803716, 8318946, 7158056, 7286996, 9890052, 10529251, 6024010, 1430481, 3695594, 9244500, 6229531, -7955678, -19084878, -12544133, 7233805, 21719292, 20876074]
39603B0876074q774350o455182m742945p721413o842400K016341Q742924M250821
39595A349870m246352m134643L044281N521800Q41473k579908k294606m909877
39587g407962j0085020p362480M800536J1975642N389721l129051n19735N481234
39579h57115K67938j0688983q952315O084378J4291471N223422p489544q904579
39571a1025327l480415k763854n404222k479070N427061R671504P876545N038804
39563B861026K584087k435097p566777n570490K744276O325057m16075p759838
39555i233831l661569Q864059J5640723J0075915l31974n976135n478327k211509
39547G687352J726241L976172R66523n832394p972349j035206O686994M399952
$$ y = [20876074, 12101724, 5646542, 903597, -6817816, -13660216, -11643875, -2900951, 1349870, -2896482, -7031125, -3986844, 1534956, 2376429, -203479, -2498085, -7407962, -17492982, -24855462, -20054926, -8079284, -2689563, -5818614, -6338349, -857115, -589177, -11278160, -20230475, -14146097, 145374, 5368796, -2120748, -11025327, -14505742, -17269596, -22673818, -25152888, -19725827, -10054323, -2177778, 2861026, 5445113, 3010016, -4556761, -10127251, -7382975, -1057918, -1473993, -9233831, -12895400, -4031341, 11609382, 21685297, 21353323, 15377188, 9898861, 7687352, 9413593, 13389765, 14356288, 8523894, 551545, -483661, 6203333, 10603285]
39539A0603285n261813r498780l408936M673191O629809L961592J265887q75028
39531H089207k534618j582932J270020J088193l262897n871020k796993J899086
39523c701954L435843L009978K553359q7337n080263o802966k602866J454917
39515g821289M83273q19312K416130N103786J480497k558306J473387Q536006
39507H294172O577481l664607r226718m771232J429239K526747J408772J121085
39499C694939j306611o819118r568792n254164K626469Q263426R226637N189971
39491F052757k009966o158004k492539L577566K661951l235827k798772N275978
39483H73144Q302533J3402q496290o552371m48902j197801n816097m068197L000994
$$ y = [10603285, 5341472, -4157308, -7566244, -2893053, 3736756, 7698348, 8964235, 8089207, 5554589, 3971657, 5241677, 6329870, 3066973, -2804047, -5601040, -3701954, -266111, 2743867, 5297226, 5209889, 129626, -6673340, -9276206, -7821289, -7338016, -8157328, -5741198, -637412, 843085, -1715221, -241834, 8294172, 14871653, 11207046, 1980328, -2790904, -1361665, 1165082, 2573854, 3694939, 2388328, -4430790, -13999582, -19253746, -16627277, -8363851, 862786, 6052757, 4042791, -2115213, -4607752, -1030186, 1631765, -1604062, -4402834, 873144, 9175677, 9189079, 692789, -5859582, -6308484, -7506285, -13322382, -17390579, -14389585]
39474a4389585N287267Q31169k416911p62822J367835J831150L701890O344776
39466A794769M118646l076858p343043m754408j438380k908360m813372o08108
39458a9029114P092198R862429N200064j267679l834445j959139J642009L920313
39450A626636K996114m9631j813874j617193l446445q868473j1188793l530422
39442b5892081Q719224J2282167M239325l260557p73639M991080L039473m154766
39434h09774n512805L02815L637139L48973k512263j03637K061547j501189o435892
39425a0525086n503417Q49548O743759Q752543O565156P10698n394166n845191
39417c646156J81553N436557L823909j596107m127161k347626P44164K542408
$$ y = [-14389585, -9102318, -8271149, -10688060, -11450882, -10083047, -8251897, -4550007, 1794769, 5913415, 2836557, -4506486, -9260894, -10699274, -13607634, -18421006, -19029114, -11936916, -2074487, 3125577, 1857898, -1976547, -3935686, -2293677, 1626636, 4622750, 4573119, 2759245, 1142052, -2304393, -11172866, -22361659, -25892081, -17172857, -4890690, -651365, -3911922, -4685561, 305519, 3344992, -809774, -6322579, -6019764, -2382625, -2033652, -4545915, -4649552, -2588005, -4089194, -10525086, -16028503, -15178955, -8435196, 317347, 6882503, 7593201, 2199035, -3646156, -3464603, 1971954, 5795863, 4199756, 72595, -2275031, -1530867, 1011541]
39409A011541P77342n557215j1167352p509176M159025J0992949O021444j799984
39401c071426k736737j073067m162695p165660k711390L063856N34485m277849
39393b1600483J097347J1966118J2189733J754546k626282L848113O355690l025705
39385I959077j1414159p026251K283337L506585k246294n856285m391023K15846
39377a4969167O459305R592910L708082n746030m662210O822971R623866n156699
39369E673028j8652394j1336338O584957J1185835O85223o246084k081909J872377
39361a2315305j391950m274076q04517L697482M369306M553829O351616N023833
39353E210218j195476n160370j044897O207935P233973k16531r634925j2556385
$$ y = [1011541, 1788883, -3768332, -14935684, -22444860, -18285835, -7292886, -1271442, -3071426, -5808163, -6881230, -11043925, -18209585, -20920975, -17857119, -17322634, -21600483, -20503136, -8537018, 3652715, 5407261, 2780979, 6629092, 12984782, 9959077, -1455082, -8481333, -6197996, -2691411, -4937705, -10793990, -15185013, -14969167, -8509862, 1083048, 4791130, -954900, -5617110, 1205861, 10829727, 5673028, -12979366, -24315704, -17730747, -6544912, -5859689, -12105773, -14187682, -12315305, -13707255, -17981331, -18785848, -15088366, -10719060, -6165231, 186385, 5210218, 4014742, -1145628, -2190525, 4017410, 11251383, 11034852, 1399927, -11156458]
39345a1156458n697934N571354J1216127P396503J250721L46188J318741l380968
39337F864274j0868580j0558055j095819O479618M913621J16566J66377L498900
39329d83098L857952P66594j231416j93614J551825J483266p75065l762026m888604
39320c674186k571335J167200K313170r8083k846829l082578j580752o82299j138441
39311a2194133j862491j512472r1932N19213j163880k967714r37671M182080O465311
39302i563689L531955Q75172K972123N186494J293176n045984n012230J089338
39294d673645L587790j937246q290973p343423l12216N789674P075309N124173
39286i80557L492811L818455L791037m71822q017644j1675044p007395N18047
$$ y = [-11156458, -16854392, -11283038, -66911, 7329592, 8580313, 8926501, 10245242, 6864274, -4004306, -14562361, -15658180, -9178562, -4264941, -4148375, -3981998, -483098, 3374854, 4141448, 2910032, 2716418, 4268243, 5751509, 4976444, 1214418, -3674186, -6245521, -5078321, -2765151, -2863234, -5710063, -8792641, -10373393, -11055692, -12194133, -14056624, -15569096, -15661028, -15141815, -16305695, -19273409, -20211080, -16029000, -9563689, -6031734, -5156562, -2184439, 3002055, 4295231, -750753, -5762983, -4673645, -1085855, -3023101, -11314074, -18657497, -18969713, -13180039, -6104730, -980557, 2512254, 6330709, 10121746, 9649924, 1632280, -10042764, -17050159, -16532112]
39278a6532112K894217R11501Q82217K818430J184086l492426m060317Q32461
39270a4561943L737869R16402j436787J944754O429094N161938m92478m029050
39262b330201k885736M05488K538028J251448l442925p004882l711379M914800
39254a0265359R855384N929281j543731m764609l045483o12244P5847j476641
39246e847555n447283q942286o271082K936449J0143679P957149J94509l659645
39238h936065r17988L227188M648310M179742L517945K486096O23109j726453
39230G101884l707881l791422j126006J874917J762115J16538K234290P624050
39222A2088485Q667242K792893j902245K58148K084125m002084j0349047m560510
$$ y = [-16532112, -13637895, -12726394, -11844177, -9025747, -7841661, -11334087, -15394404, -14561943, -10824074, -9907672, -11344459, -9399705, -2970611, 2191327, 1698849, -2330201, -5215937, -4810449, -2272421, -1020973, -4463898, -11468780, -15180159, -10265359, -409975, 5519306, 3975575, -789034, -3834517, -4446761, -4370914, -5847555, -11294838, -20237124, -26508206, -23571757, -13428078, -5470929, -5276420, -8936065, -9854053, -6626865, -1978555, 2201187, 5719132, 8205228, 8828337, 7101884, 3394003, -397419, -1523425, 351492, 2113607, 2230145, 4464435, 12088485, 20755727, 23548620, 21646375, 21904523, 23988648, 19986564, 9637517, 5077007]
39214E077007Q373812J0403116k366541j2739963p873576K798102M040176k453686
39206E258447l787224L109857R059385Q054478L338225j448009o733636j1067505
39198E784018r659276k131409N005060O958628O088695N490971L003928l435653
39190A7104962q991044o888862J605485P970517P086565K359838m92794o15820
39182A9138847j216976m450850r117489j1997276j0302346m093406K972547O635875
39174a2431074O323167N021921M686325L995331J520783j303573k070757m55160
39166E286963K268602N005417O360936M324845j060150o074211p034154m748924
39158D329324k785753k319219j700546m56740j42311r66447j039645J23011O15141
$$ y = [5077007, 13450819, 23853935, 21487394, 8747431, 873855, 3671957, 7712133, 5258447, 1471223, 4581080, 13640465, 21694943, 25033168, 23585159, 16851523, 5784018, -3875258, -6006667, -1001607, 5957021, 12045716, 17536687, 20540615, 17104962, 8113918, 1225056, 2830541, 10801058, 17887623, 20247461, 19754667, 19138847, 17921871, 13471021, 4353532, -7643744, -17946090, -22039496, -19066949, -12431074, -6107907, -1085986, 3600339, 7595670, 9116453, 7812880, 5742123, 5286963, 7555565, 12560982, 18921918, 23246763, 22186613, 16112402, 9078248, 4329324, 1543571, -775648, -2476194, -2932934, -3075245, -4041692, -5081337, -4958326, -4343185]
39149d343185L5327J090161M965804P880404N592486k29573l789447k883970j193566
39140G124441k172141m168999l692391p14014K457458N655927R764982J1543195
39132B5798458N251457p777132j6023283r796412N513900J3960313P071797p390673
39124A6608425j5402810j0701337K301952J4307081J7027583Q091351n624308
39117B6607937j2476180p818758Q91714L924017J170120j30070L058867O177117
39109B1404764N038065J951332K038540O301517J0390415R807489N618689L764675
39101F6315486P085303R917657N315697l245489m928599K043749O353263J015333
39093H9872400n118579k238207L302750j67772q460711p761857Q01813J627587
$$ y = [-4343185, -4307858, -3217697, 1748107, 9628511, 15220997, 14991424, 11201977, 8318007, 7124441, 4952300, 783301, -2909090, -3623104, -1165646, 4490281, 14255263, 25798458, 31049915, 23272783, 7249500, -2546912, 2966988, 16927301, 23999098, 16608425, 1205615, -9495722, -7193770, 7113311, 24140894, 32232245, 26607937, 14131757, 6312999, 7204713, 11128730, 12298850, 12168780, 15227647, 21404764, 26442829, 28394161, 30432701, 36734218, 47124633, 56932122, 62550811, 66315486, 73400789, 83318446, 88634143, 85388654, 80460055, 82503804, 88857067, 89872400, 84753821, 82515614, 85818364, 85650592, 77189881, 69428024, 70229837, 71857424]
39085G1857424q265443j2115620j073147R141114K317923j1928057j2886966l81953
39077C6665275P186263K301937l330679j155928J374653l281824q332115m113494
39069B7314088N465191Q854082L984896r20998j398171j685734m745726n863798
39061C1003830j41204R109251J4422037J3952242J2509201J3716675J5551445
39054A10123477J4661523J1805756J0787706J3481981J7836982K0384517J9670262
39047B18752204J7332084J5869383J4917176J0805691J716406q054900j2726032
39040B58612012j3338555j6082911k1557484k2680262j6648032j1479153j4237082
39033A42588533j9246805j6876201r217850o307699r321839r455221l661510M60634
$$ y = [71857424, 63591981, 51476361, 50403214, 59544328, 61862251, 49934194, 37047228, 36665275, 43851538, 46153475, 42822796, 41666868, 43041521, 39759697, 31427582, 27314088, 32779279, 41633361, 45618257, 44697259, 43299088, 41613354, 36867628, 31003830, 30862626, 39971877, 54393914, 68346156, 80855357, 94572032, 110123477, 124785000, 136590756, 147378462, 160860443, 178697425, 199081942, 218752204, 236084288, 251953671, 266870847, 277676538, 279392944, 271338044, 258612012, 245273457, 229190546, 207633062, 184952800, 168304768, 156825615, 142588533, 123341728, 106465527, 97247677, 90939978, 81618139, 72162918, 68501408, 68962042]
39025F8962042j945868n780634o142226n492168n857897l870247M38312k82801
39017D0028513q186048j2886060n940598N021304P120966J010941k580965o50124
39009B2937929N7385k985816m067451n4821M702186O079034M809803K125290j883340
39000C1720199m516317k278966K470795L650541J062692M22857K674863J713692
38992C6920356m415302q340981m187051L203916N716090L616679L343997O562916
38984D2420620P887998L381317l455065n940533k462778J598717P15873l535933
38976D0610216m895599j880565N1125k099139l421668j36985K040207l177746
38968B7089846j0057620p899816J561672N752497M29772n132535m488582k897907
$$ y = [68962042, 67016174, 61235540, 55093314, 49601146, 43743249, 39873002, 40311314, 40028513, 31842465, 18956405, 13015807, 18037111, 25158077, 26169018, 23588053, 22937929, 22995314, 20009498, 15942047, 15887226, 20589412, 26668446, 31478249, 33603539, 31720199, 27203882, 24924916, 27395711, 31046252, 32108944, 32531801, 35206664, 36920356, 32505054, 24164073, 19977022, 23180938, 28897028, 32513707, 35857704, 42420620, 50308618, 53689935, 50234870, 44294337, 41831559, 43430276, 44146149, 40610216, 35714617, 33834052, 33885177, 31786038, 28364370, 28227385, 30267592, 27089846, 17032226, 9132410, 10694082, 16446579, 16876351, 11743816, 7255234, 4357327]
38960D357327m938749n267589Q31810P711418Q436401N165950K547393o66761
38952A8177200m778277l094058O411427J1768965K514695j1899959j3769400k873320
38944B457273N022468L127492K55515J722094J022857m562070o042363J417128
38936D420394P941920M193887l479247m118998m8642j599520r056692j1924368
38928a3671266m795882N782476J0736483P901698J704373j727948M20180M098433
38920A0448547J898100o727984j2595349q482629Q79565O254158O531164O396503
38912D602075N578753M4431p773567r708422l492097M309927P703464O475761
38904G740325K114792l538150n429384Q5129O794619M291369n935202j0317332
$$ y = [4357327, -581422, -5849011, -5017201, 2694217, 11130618, 16296568, 18843961, 18177200, 13398923, 10304865, 16716292, 28485257, 30999952, 19099993, 5330593, 2457273, 7479741, 10607233, 10862748, 12584842, 13607699, 9045629, 3003266, 4420394, 12362314, 16556201, 13076954, 8957956, 8909314, 7309794, -1746898, -13671266, -18467148, -12684672, -1948189, 5953509, 7657882, 5929934, 6350114, 10448547, 12346647, 5618663, -6976686, -15459315, -14579750, -8325592, -1794428, 4602075, 10180828, 10225259, 2451692, -7256730, -10748827, -6438900, 1264564, 7740325, 9855117, 6316967, 887583, 972712, 7767331, 12058700, 6123498, -4193834]
38896d193834k835398N767752M425563k556647m566111j123784P77487j55900
38888d460872K98785J959081P16407k598559k895670K57563K350138J941394J388122
38879a043611L89432l090729n842632k256112M943152O021383j054305o108570
38871h041992j489953O374150O304350k275648r899494r614193l059539L959319
38863a7743000O859951M383978n64409k922637j260731o7184l287557p807576
38855b2409165p578513k579669J599304K764356M650252Q687394R418945L028744
38847b418352l898787j541660Q178375J1963371L186735p933136q108131R11079
38839C39494O468624L664116o51497j875202l707313p144151n334234L719042
$$ y = [-4193834, -7029232, -1261480, 3164083, 607436, -3958675, -5082459, -4304972, -4460872, -4162087, -2203006, -1486599, -4085158, -6980828, -6723265, -4373127, -2431733, -1043611, -654179, -3744908, -9587540, -11843652, -6900500, -879117, -1933422, -8041992, -9531945, -3157795, 3146555, 870907, -9028587, -18642780, -21702319, -17743000, -10883049, -6499071, -7063480, -9986117, -11246848, -11314032, -14601589, -22409165, -29987678, -32567347, -30968043, -28203687, -23553435, -14866041, -5447096, -2418352, -6317139, -7858799, 319576, 12282947, 15469682, 7536546, -571585, 339494, 6808118, 10472234, 9820737, 7945535, 4238222, -2905929, -8240163, -4521121]
38831d521121R547360L729703n950765o546071J038600N674108M008803K268580
38823I249197K793378J672390j076743j341787o80216l959996p527499l241307
38815d112583N243378N387805k959665n814290J139382M992201p30616l779915
38807f34303L796535Q836552l18223j0579720m152788J0439858J0907314k783032
38799A5512193r887862l669090P06448m499129o825557J952581R808463M657829
38791G755876n833002p706172j812013J356740r99659l617629l644585j423754
38783a5924198L738267R971935J0401666K376687o079427o692077k388539o33739
38775e229425j173863O87653L697342L307473J003943J264374K119877j286663
$$ y = [-4521121, 5026239, 8755942, 2805177, -3740894, -2702294, 2971814, 6980617, 9249197, 12042575, 13714965, 12638222, 11296435, 10616219, 6656223, -871276, -4112583, 1130795, 6518600, 3558935, -2255355, -1115973, 3876228, 3145612, -634303, 3162232, 11998784, 11680561, 1100841, -3051947, 7387911, 18295225, 15512193, 5624331, 1955241, 2661689, -1837440, -8662997, -6710416, 3098047, 7755876, 1922874, -5783298, -7595311, -6238571, -7238230, -10855859, -14500444, -15924198, -12185931, -2213996, 8187670, 10564357, 4484930, -2207147, -4595686, -5229425, -6403288, -5715635, -2018293, 1289180, 2293123, 3557497, 5677374, 4390711]
38767D390711n739266l085987N773355J0044880L915932n970994j0086184o356497
38759g114050P11872N248651L317292l208012n836236J061435J0343645R786317
38751A4310914j7412n481920l31948N022077M87779p701375p670923r03418J644844
38742f41382j448230k50820Q589527J4379466P817136n176704j1964375r499116
38734A805502m520935j267576K225127O050794N464520p77309n896375m278782
38726a195034l85462j586326n186579j725619Q505150J2470007K734687r986324
38718C644500j0970318k045176K541329k348958p305681m754049J347205N695245
38710a4195903J0047993J5017248J3668193K559028q534360q640060k024057j178518
$$ y = [4390711, -1348555, -4434542, 1338813, 11383693, 15299625, 9328631, -757553, -7114050, -6402178, -1153527, 2163765, -1044247, -6880483, -5819048, 4524597, 14310914, 14293502, 8811582, 8479634, 13501711, 13989490, 6288115, -1382808, -2286226, -641382, -2089612, -2340432, 6249095, 20628561, 28445697, 23268993, 11304618, 1805502, -2715433, -3983009, -1757882, 4292912, 9757432, 8980123, 3083748, -1195034, -1580496, -3166822, -8353401, -10079020, -1573870, 10896137, 13630824, 3644500, -7325818, -9370994, -6829665, -9178623, -16484304, -21238353, -19891148, -14195903, -4147910, 10869338, 24537531, 27096559, 18562199, 9922139, 7898082, 6719564]
38702F719564o855669p830092k27742N802294K120574n388966o325244L69293
38694a1615988P519884R183965M596997k790891p026692m780208m70211p80002
38686f163146l501981l17780P507127P583004l772289j1924999m178244R936056
38678d832252J1560389m62695r474415n168843N551348J1629691R701630J849048
38670B0353901p716177j2062115p086168J079774K964782j74710N60782N141973
38662C062042M153393l411853o262794M59889O392681L067385k780075j719021
38654B961647L768746O528239O221118M064149l217610j3471815j4252185q23871
38646h221582J1431244P565166l791855n137502J218781K96386o308178l335125
$$ y = [6719564, -136105, -7966197, -8193939, -2391645, -271071, -5660037, -11985281, -11615988, -4096104, 5087861, 9684858, 6893967, -132725, -4912933, -5383144, -6163146, -9665127, -9982907, -2475780, 5107224, 1334935, -10590064, -14768308, -4832252, 6728137, 6265442, -3208973, -8377816, -2826468, 8803223, 18504853, 20353901, 12637724, 575609, -6510559, -5430785, -2466003, -2640713, -2079931, 3062042, 7215435, 3803582, -2459212, -1999323, 4393358, 7460743, 4680668, 2961647, 6730393, 13258632, 19479750, 23543899, 20326289, 6854474, -7397711, -8221582, 3209662, 10774828, 6982973, 1845471, 3064252, 3360638, -2947540, -6282665]
38638f282665P493291O759190q231621j5225687l400263P687090J390723p098702
38630a6908644K655114J9000717J5005654p246951j8059488m535129J2779146
38623B690419J2617032L4650q273047p789300l873279R85255N393708L977492
38615E762930m175981q801614j494091R443177Q736385l687898j1851709n893129
38607a1961930N330335P955905J650486k307298K132335Q245866O915914p98276
38599A7163337n759557l463707P68937O57179k124000k076267P88455J815490
38591G769867J16373p78107n17004k767872o912406o481997O25057P153726O402599
38582D610236J323333j393371r08516k08662M46019J755263J751741M74202L064075
$$ y = [-6282665, 1210626, 7969816, -261805, -15487492, -18887755, -11200665, -9809942, -16908644, -14253530, 4747187, 19752841, 12505890, -5553598, -10088727, 2690419, 15307451, 15342101, 7069054, -720246, -4593525, -3608270, 1785438, 5762930, 1586949, -7214665, -8708756, 734421, 9470806, 5782908, -6068801, -11961930, -6631595, 1324310, 2974796, 667498, 2799833, 11045699, 17961613, 17163337, 11403780, 7940073, 8709010, 9366189, 7242189, 5165922, 5954377, 7769867, 7886240, 7108133, 6591129, 3823257, -3089149, -9571146, -8946089, -1792363, 4610236, 5933569, 4540198, 3631682, 3423020, 3869039, 5624302, 7376043, 7850245, 10914320]
38573A0914320J0431739J2501884J173510j4287931j7195992o682512K273237
38566h71745J744482o95359J217512K257903j720177m644309j833517R02323j304921
38557d947808k665654J622688M340459j521282q604341o312569J467109L773146
38549a2848252J374096K838901O397805K526917o918974q942974o6408Q554643
38541g084246R166405O153405L573775j513237q365430r008189j832793L564158
38533e346152J897161O38252N434932Q986336M018643l076626k672737K069351
38525A1949160J150413n729155r445736n270037K311505O625605M562029k047800
38517D105984o554745l161405M416795O280905J148253j430167K084515K073397
$$ y = [10914320, 21346059, 33847943, 35021453, 20733522, 3537530, -3144982, -871745, 872737, 177378, 1394890, 3652793, 1932616, -2711693, -4545210, -3642887, -4947808, -7613462, -5990774, -1650315, -3171597, -11775938, -18088507, -16621398, -12848252, -11474156, -8635255, -2237450, 289467, -6629507, -15572481, -15638889, -7084246, 2082159, 8235564, 11809339, 10296102, 1930672, -7077517, -8910310, -5346152, -3448991, -2810739, 2624193, 11610529, 15629172, 12552546, 9879809, 11949160, 13099573, 7370418, -2075318, -7345355, -5033850, 1591755, 6153784, 4105984, -2448761, -5610166, -1193371, 5087534, 6235787, 4805620, 6890135, 8963532]
38509H963532o829238j3767315q539567R75348K362645l76446L834290J0653084
38501b723667O540576o234383j0627875j233664Q483463Q010679K432442o69555
38493C978016j935142k899652j331227J156007p93568m395836j44016J0318913
38485C953495J2390108J384012p828247l813773L178583q68548r883089q422434
38477i909893J676133L831043o229440j3274223n488181R063858J4802026Q126464
38469B597787j944205o685377m941092n42183K143016O89207l624729n850652
38461a8158228j451797Q087750J4671499J0877785j363165j1319447j0455601
38454i111204j451744N695490M887564j280849o143861n223560N87792N055054
$$ y = [8963532, 2134294, -11633021, -20172588, -19197240, -16834595, -17211041, -13376751, -2723667, 3816909, -2417474, -13045349, -14279013, -5795550, 2215129, 4647571, 3978016, 2042874, -856778, -2188005, -1031998, -1825566, -6221402, -6365418, 3953495, 16343603, 17727615, 9899368, 6085595, 9264178, 8395630, -1487459, -9909893, -8233760, -4402717, -10632157, -23906380, -29394561, -20330703, -5528677, 2597787, 653582, -6031795, -10972887, -11515070, -9372054, -8682847, -12307576, -18158228, -19610025, -11522275, 3149224, 14027009, 12663844, 1344397, -9111204, -10562948, -4867458, 20106, -1260743, -7404604, -12628164, -12040372, -6985318]
38446f985318K019837n889990p673709J746348J2049601J0308546l24478n300699
38438d9862m86531L337242n40669m584347j322105M026467L446523p73532k153775
38429H99411j747563l701930m784183Q24370R405032J0857570L307867m261094
38421A0799480m461057O01799M627494M233516j52498n432312p074113l480768
38413c38459N68812j005605o903421r246232l952164L736697N956990J740413
38405i442969k323752n567P348317J1992492Q495659M76385l361691K49409N613101
38396A9041384N827381O16635n271767q006735o539893j823686K593631J868269
38388H305219m446505r600038o240490M571674J3639682J3105110M374111l285578
$$ y = [-6985318, -4965481, -10855471, -18529180, -16782832, -4733231, 5575315, 5250837, -49862, -536393, 2800849, 2260180, -2324167, -3646272, 380195, 3826718, 3053186, 899411, -848152, -4550082, -9334265, -8509895, 895137, 11752707, 15060574, 10799480, 6338423, 6940222, 11567716, 15801232, 15648734, 10216422, 3142309, -338459, 230353, -775252, -7678673, -16924905, -20877069, -17140372, -11183382, -9442969, -11766721, -11772288, -4423971, 7568521, 16064180, 16540565, 13178874, 13428283, 19041384, 24868765, 25485400, 20213633, 12206898, 5667005, 3843319, 6436950, 8305219, 3858714, -5741324, -11981814, -7410140, 6229542, 19334652, 23708763, 20423185]
38380B0423185j939986O297447J0518199L181556j0101321j6625204j1575764
38373A78112j941942M223712N727497L986486j405506q499386j0751441m854880
38365a3337348L415195O515087M526092K076582n5321l792388p071670n456949
38357a3180720L89098M995171N762153M971411L999243J066289l759957o073520
38349a830832k580494L590931N983038K371831l039922n257995m413513m261306
38341i438262n731266n355982j230681L184800M129977L012501K760641K036049
38333f632223j477993m860356l590331P62563L569280N516896R468703J1214433
38325A3970972M188490p072326j0250109l408739K600325K243808J978806M551996
$$ y = [20423185, 18483199, 24780646, 35298845, 38480401, 28379080, 11753876, 178112, -1763830, 2459882, 8187379, 12173865, 10768359, 2268973, -8482468, -13337348, -9922153, -3407066, 1119026, 3195608, 3140287, -652101, -7723771, -13180720, -12791622, -7796451, -2034298, 2937113, 6936356, 8002645, 4242688, -1830832, -4411326, -820395, 5162643, 7534474, 4494552, -763443, -5176956, -9438262, -15169528, -20525510, -21756191, -18571391, -14441414, -11428913, -8668272, -6632223, -8110216, -12970572, -16560903, -15798340, -12229060, -6712164, 2756539, 13970972, 18159462, 11087136, 837027, -2571712, 28613, 2272421, 4251227, 8803223]
38317H803223K005401p696380j2013183l152759P050858N099188k617567j736314
38309d257533N681609O122946j552298n134660j84344M228636J807192k826964
38301C884584m257485l191218j582168k34588j426600n138218m497518M928876
38293a1514335J4052282J0749090o43291m454366K222058O196938Q41026m388669
38285A3060733k231315M05418k901632n364443K36890O999661M270493n080418
38277I395387r726680p023883l560594j858484J955435P670736Q677421K518711
38269H048049m114194m593343j026359M80970o44065k2802K868926K581349l347807
38260B30724q425673n534808J831424M058828J99830j033748L099783L704360
$$ y = [8803223, 10808624, 3112244, -8900939, -12053698, -5002840, 96348, -2521219, -4257533, 1424076, 7547022, 5994724, 860064, 675720, 4904356, 6711548, 3884584, -372901, -3564119, -5146287, -5380875, -6807475, -11945693, -16443211, -11514335, 2537947, 13287037, 12643746, 8189380, 10411438, 16608376, 17449402, 13060733, 10829418, 11234836, 8333204, 2968761, 3205651, 10205312, 14475805, 9395387, -331293, -7355176, -10915770, -12774254, -10818819, -3148083, 5529338, 8048049, 3933855, -659488, -1685847, -1204877, -1848942, -1871744, 997182, 3578531, 230724, -8194949, -13729757, -11898333, -7839505, -7639675, -8673423, -5573640, -1869280]
38252a869280l741571q484912k56791J2158870J1775365j367141j0361720o188721
38244h335901J972307L773976J859385L109879O018130M666239p34066m467572
38236G862377l772636j641574j921413m160204l835613J684848P957856Q122512
38228A0296153L371404J830999M248490Q81474j0506732j5450946m102730R104218
38220c27670M862798r648806j0635751M277615J2490304L645575m842026J176877
38212I98916R084811K283079j1449269j2799262n67723R479447Q675255K550850
38204H256104k325925m988234n020014j556327K900740M710422L992802K846336
38196H815904J781181J237567J777530K82197o834691j4103527j0669812K271152
$$ y = [-1869280, -5610851, -14095763, -14352554, -2193684, 9581681, 8214540, -2147180, -8335901, -6363594, -2589618, -730233, 2379646, 8397776, 13064015, 12329949, 7862377, 4089741, 2448167, 526754, -3633450, -7469063, -5784215, 2173641, 10296153, 13667557, 15498556, 19747046, 20628520, 10121788, -5329158, -9431888, -327670, 4535128, -5113678, -15749429, -11471814, 1018490, 4664065, -177961, 998916, 10083727, 12366806, 917537, -11881725, -12449448, -2970001, 5705254, 8256104, 5930179, 941945, -4078069, -5634396, -2733656, 1976766, 5969568, 8815904, 10597085, 11834652, 13612182, 13894379, 7059688, -7043839, -17713651, -15442499]
38188a5442499R453826L577990l220954P68840Q153905O022217k896420p233276
38180h16371o187934o060173m732701L552665J2606945J0622514J987n318635
38172C668297j629973J167871j574094k714484J610976M770360J971579k304747
38164D965785l818789m773433o043439l356784L720607P924231M604967j590438
38156A632707m657521m590591k918988J423076P000343P761720J667455m183415
38148C134786k612393L791966O932526L878890j250556l614650k175777M59215
38140H544007M44500l482459p677799p419858l312921o02051j717661l257843
38132a8482085j252625M016824R187358J0703808O568001j341364p181656p257046
$$ y = [-15442499, -5988673, -2410683, -5631637, -4862797, 3291108, 9313325, 6416905, -816371, -7004305, -13064478, -17797179, -14244514, -1637569, 8984945, 8986932, 3668297, 2038324, 3206195, 1632101, -1082383, 528593, 5298953, 7270532, 4965785, 1146996, -3626437, -9669876, -13026660, -9306053, -1381822, 3223145, 1632707, -3024814, -7615405, -10534393, -9111317, -2110974, 5650746, 7318201, 3134786, 522393, 4314359, 11246885, 15125775, 13875219, 10260569, 8084792, 8544007, 8988507, 5506048, -2171751, -9591609, -12904530, -13506581, -15224242, -18482085, -19734710, -15717886, -6530528, 4173280, 10741281, 9399917, 2218261, -5038785]
38124e038785n089373n544473n718854R51380J1759635J4987858O014395n096786
38116G224997p089237j696092K006821J778373K500563N074002L945723l176470
38108A0568680j0109959j0001289m070243J092502K289753J778552J893202K130206
38100d428596K013276K396951K211720j367335o361213n076232M335557J0647785
38092D371913L262301j0214146j2431756j925236M502569j257644n637331L116874
38084a6212456J3747213R582559l844911p509344R44433N706581N8317m728368
38076b255976r36871L259346j16660n471871n086137j890784j591423j837419
38068a5927795J435759M892259M085778K065197K964977L198879j836258p481685
$$ y = [-5038785, -10128158, -15672631, -21391485, -20440105, -8680470, 6307388, 12321783, 7224997, 135760, -1560332, 446489, 2224862, 4725425, 9799427, 13745150, 10568680, 458721, -9542568, -13612811, -12520309, -10230556, -8452004, -6558802, -4428596, -2415320, -18369, 2193351, 826016, -5535197, -10611429, -6275872, 4371913, 7634214, -2579932, -15011688, -16936924, -12434355, -13691999, -19329330, -16212456, -2465243, 7117316, 3272405, -4236939, -3292506, 2414075, 2472392, -2255976, -3192847, 66499, -50161, -5522032, -10608169, -12498953, -14090376, -15927795, -14492036, -9599777, -5513999, -3448802, -483825, 2715054, 878796, -6602889]
38060f602889n851839J378910N376064K976122j323221m287542o434506o703460
38052b1472361l079576J369387J118892k068285J75147R724552J6401987J0051088
38044A2220831n962306j7713785j5329572j860114J0993948J3924999P649662
38037C923663O90416p02826P05122j357578o253160o890144j156435L763184K320247
38028d957511k69073L325629R141235O778863l381818q847201l819202J580316
38020d48762k296912q787887o210807K130852L241354l257380l821409O085682
38012a3365269J3126692O722906m441431o204885N44890M162407M39220m543073
38004c558543n749992l533282O40241M431456L534681j951907l958224K400262
$$ y = [-6602889, -12454728, -11075818, -5699754, -2723632, -4046853, -8334395, -14768901, -21472361, -24551937, -23182550, -22063658, -24131943, -23956796, -14232244, 2169743, 12220831, 6258525, -11455260, -26784832, -28644946, -17650998, -3725999, 3923663, 4614079, 3911253, 4616375, 3258797, -2994363, -9884507, -11040942, -7277758, -4957511, -5226584, -1900955, 7240280, 14019143, 10637325, 1790124, -2029078, -448762, -2745674, -11533561, -17744368, -15613516, -12372162, -15629542, -19450951, -13365269, -238577, 6484329, 2042898, -4161987, -3617097, 545310, 984530, -3558543, -9308535, -12841817, -12201576, -7770120, -4235439, -6187346, -10145570, -7745308]
37996g745308Q738200M669737m997931o571160J365637O547604K928647j648385
37988C287041l87778K549016J799425n13454j499455l422185o807260n905119
37980a0899769K350160J1349240J2829976O685789j822377q979999j2360843r756656
37972a0604479l464651l01816k474960l579463J541096Q227535Q710933K967424
37964A021619k549075l642772j200904J831924K625618L01807k119153r64751
37956d695687J994852J898438k72019J233981N411572L910874m152100p802416
37948b472505j495635M190822p84432q401529m964752O083540R216947J410811
37940B783267m441358j267808K666449M01965j608946L650847R392983M549955
$$ y = [-7745308, 992892, 5662629, 664698, -5906462, -4540825, 2006779, 4935426, 3287041, 2899263, 5448279, 7247704, 6734250, 5234795, 1812610, -4994650, -10899769, -8549609, 2799631, 15629607, 22315396, 20493019, 11513020, -847823, -10604479, -14069130, -14370946, -16845906, -20425369, -18884273, -10656738, -1945805, 1021619, -1527456, -5170228, -6371132, -4539208, -1913590, -1611783, -3730936, -4695687, -2700835, -802397, -1074416, 159565, 5571137, 9482011, 5329911, -2472505, -3968140, 222682, -561750, -8963279, -13928031, -7844491, 1372456, 2783267, -1658091, -2925899, -259450, 142515, -1466431, 2184416, 11577399, 16127354]
37932A6127354p803940j2772848l866436Q158467R582444Q27492n751569k729999
37924A770965L695992L666114k420117n244306l42120O007622O500515K463825
37916A6098490m64794j712521m605844p992899o087357K090348Q645648N781888
37908A1752959l635959q396036k166816Q483119J1675259M432125m621854p166786
37900A0356011m497678j935530R6981K999037L002007l285767r067226m422780
37892f754945O900259J0044846Q55507p634289n651420p43505k997816p823824
37884a3805187m973938L745085Q127887N309845N18328l150996m916660j191279
37876a0336915Q168148J3010097M906268p556679q986880n5635M534617k20311
$$ y = [16127354, 8323414, -4449434, -8315870, -157403, 9425041, 10252533, 4500964, 1770965, 5466957, 9133071, 6712954, 1468648, 1126528, 7134150, 13634665, 16098490, 15633696, 13921175, 9315331, 1322432, -4764925, -2674577, 5971071, 11752959, 8117000, -279036, -2445852, 6037267, 17712526, 22144651, 17522797, 10356011, 5858333, 3922803, 4019784, 7018821, 10020828, 6735061, -2332165, -6754945, 145314, 10190160, 11045667, 3411378, -2240042, -2983547, -5981363, -13805187, -18779125, -15034040, -6906153, -1596308, -1077980, -4228976, -9145636, -10336915, -2168767, 10841330, 15747598, 8190919, -795961, -851596, 3683021, 3462710]
37868C462710m075109j295897N53904l571704o859207m135185j058021j627290
37860a8605799N71970Q674485J2128070K593540r299579p562516M939959J0814425
37852D254555L746895m823629m812211J91189K681875K010077O11247j818990
37844B041008n096568n994884l652488k047658k916351j938169L129423O350584
37836a0125103K342886l582905k378007M367738O547894J749155j074328K887005
37828G34335N454888q62654q582906m971136Q127295J5344124Q309939m824434
37820A8729451j1932720j0145816m007140J376333J950487k986451o694906j057579
37812a4768341R786710J1415798J8433r582585n268090M034315L557180l500288
$$ y = [3462710, -612399, -1908296, -1354392, -4926096, -11785303, -15920488, -16978509, -18605799, -18033829, -9359344, 2768726, 5362266, -3937313, -11499829, -6559870, 4254555, 8001450, 3177821, -1634390, -1443201, 1238674, 3248751, 3859998, 2041008, -3055560, -9050444, -12702932, -14750590, -17666941, -19605110, -16475687, -10125103, -7782217, -11365122, -13743129, -9375391, -2827497, -1078342, -2152670, 734335, 6189223, 5326569, -3256337, -8227473, -100178, 15243946, 23553885, 18729451, 6796731, -3349085, -7356225, -5979892, -4029405, -7015856, -13710762, -14768341, -4981631, 6434167, 6452600, -3129985, -8398075, -4363760, -806580, -4306868]
37804d306868l432144L434970M568778j053068j376056N069640M869298n044618
37796B729932q735143J384815Q219949k739241j6316706r306129J1482659J7500222
37788D220358J411525j3012915p546336O569279J0753538O108861M061757L913119
37780A6479186k710544j2343932j2465007k277194N076105L032202K27316L860678
37772a121190P402463L213052l030838j682789M232424M437964p32850k078863
37764A0639373l9361n406452j7714667j9282839q35464K0178788K1061576M823442
37756A3424396o350753l380932J762007k87841l177382l71015K336440j117147
37748B837773m749476r99878N173623L731976m293784q149327j987393R463742
$$ y = [-4306868, -7739012, -4304042, 264736, -788332, -2164388, 2905252, 7774550, 2729932, -6005211, -4620396, 3599553, 860312, -15456394, -24762523, -13279864, 4220358, 5631883, -7381032, -14927368, -8358089, 2395449, 8504310, 12566067, 16479186, 13768642, 1424710, -11040297, -13317491, -8241386, -5209184, -4981868, -1121190, 6281273, 9494325, 6463487, 4780698, 9013122, 13451086, 12718236, 10639373, 10600012, 5193560, -12521107, -31803946, -32639410, -12460622, 8600954, 13424396, 7073643, 3692711, 5454718, 5166877, 1989495, 1618480, 3954920, 2837773, -1911703, -2911581, 2262042, 5994018, 1700234, -6449093, -8436486, 1027256]
37740A027256J7258115J4597376R29061j4544131j8366082q186089K737917L073263
37732a473314j490744J64505N131600J707315r922608j6675927j2016807l337280
37724c7913260J402032K486816K070808M65951J075623P742843J4780807J1481479
37716C593099n93945p645269m610871j733369m587357l706750O338438J3533324
37708E87300P730095p06571J801160Q049861K896744r050844j0844875l033063
37700b570193k051275r658709r045479M190217J1752198K990668o646158j413018
37692a2451749R331921Q579943n11940l424950R4623n10426m548969k068281N220754
37683b89074M955534l697167p517275j570733L498691J347361J33317N127599
$$ y = [1027256, 18285371, 32882747, 33811808, 19267677, 901595, -7284494, -4546577, -1473314, -2964058, -2799553, 2332047, 4039362, -5883246, -22559173, -34575980, -37913260, -36511228, -34024412, -31953604, -31487653, -30412030, -22669187, -7888380, 3593099, 2999154, -4646115, -9256986, -10990355, -15577712, -19284462, -12946024, 587300, 8317395, 7610824, 9411984, 17461845, 20358589, 11307745, 462870, -2570193, -4621468, -14280177, -23325656, -19135439, -7383241, -4392573, -11038731, -12451749, -3119828, 5460115, 4948175, 1523225, 1617848, 1107422, -3441547, -5509828, -289074, 4666460, 969293, -6547982, -8118715, -4620024, -3272663, -3139346, 1988253]
37675A988253O926920j777370j0790140p671592J307315J261061o241982n645627
37667b0643162O105908J3283687O281605l007542o57835O633441K752860j0560535
37659A88427j4650756k595678R493796O579433l531982m107732M474878P726066
37651C576452J603563k445507K109939P021773M671033k65408j762222l151446
37643A1358177p940510j0202166m366217L826320O394439N208843M761491J913015
37635A0953392m799924n293294O582782J6052250N748802j4160343j6920743N55864
37627a281214J2687730M728096p187300n360707K646445J599015n209477n362815
37619b740227J63371K148315J413236M347684P122671J714848o963823o889018
$$ y = [1988253, 8915173, 7137803, -3652337, -11323929, -10016614, -8755553, -14997535, -20643162, -14537254, -1253567, 5028038, 2020496, 1362661, 7996102, 10748962, 188427, -14462329, -17058007, -7564211, -984778, -4516760, -8624492, -4149614, 3576452, 5180015, 2734508, 4844447, 11866220, 16537253, 16271845, 14509623, 11358177, 3417667, -6784499, -11150716, -7324396, -929957, 4278886, 9040377, 10953392, 6153468, 860174, 7442956, 23495206, 29244008, 15083665, -1837078, -1281214, 11406516, 16134612, 8947312, 3586605, 6233050, 7832065, 2622588, -2740227, -2576856, -428541, 984695, 5332379, 12455050, 14169898, 7206075, 317057]
37611C17057O44535K803113l040974n346920J446516P384992K995733o503272
37603G00780r823824m843821J433954L756413L651550M761902O790628N638333
37595A2065915j81073n239526l239312L287109N604961J915029m94243J045225
37587A4764085q50296r205988j3698030n961435N255764O307689j122442n099707
37579i610360k957460j385311j036528L396929R041866O197891m926010j2680668
37571a3959651j1245672o498767k489988M213142J2499338J2609378J410460q859120
37563a2320880n689068O947275J4596802J0353063M67543n376933m658114l148989
37555A170699o431876j0715339o428257O339739J3545593N985756n382086m908630
$$ y = [317057, 961592, 3764705, 723731, -4623189, -3176673, 4208319, 7204052, 700780, -9123044, -13966865, -12532911, -8776498, -5124948, -363046, 6427582, 12065915, 11884842, 6645316, 3406004, 6693113, 12298074, 14213103, 13718860, 14764085, 13913789, 4707801, -8990229, -14951664, -9695900, -3388211, -4510653, -9610360, -12567820, -13953131, -14989659, -11592730, -2550864, 3647027, -1278983, -13959651, -25205323, -31704090, -34194078, -29980936, -17481598, -4872220, -3461760, -12320880, -18009948, -11062673, 3534129, 13887192, 14354735, 8977802, 4319688, 1170699, -5261177, -15976516, -22404773, -16065034, -2519441, 3466315, -1915771, -6824401]
37547f824401L526786L823565m657178o256141L198874Q504362J272724n365843
37539b777252J007926J1399108J0459499Q1015o374421m972793k599732k875914
37531C347436l006690j801122j013898m13446J504848L933527N488067O100032
37523A4138754M247482j939283q109781o325412K017337N507053R047m231078
37515E314119L05841N915570L802755p48703N07455K698737k674682j0197372
37507D923720q411845J70329L249627l06243k90695N042326N819318p99266m643753
37498D753518p066M737652J681993m032669m188618q33546o67245k696322j073605
37489b325908L270854L215489k591027o404931k687422L132742K200190m430508
$$ y = [-6824401, -3297615, 525950, -4131228, -10387369, -7188495, 1315867, 2588591, -2777252, -1769326, 9629782, 20089281, 20170296, 13795875, 8823082, 6223350, 3347436, 340746, -1460376, -2474274, -2887720, -1382872, 2550655, 8038722, 14138754, 18386236, 16446953, 8337172, 2011760, 4029097, 9536150, 9545197, 5314119, 5619960, 11535530, 15338285, 14589582, 15097037, 17795774, 15121092, 4923720, -3488125, -3317796, -68169, -374412, -665107, 4377219, 10196537, 9397271, 4753518, 4746452, 9484104, 11166097, 7133428, 2944810, 2111264, 1444019, -1252303, -2325908, 944946, 4160435, 1569408, -4835523, -7522945, -4390203, -2190013, -6620521]
37481f620521o654451k41002O075033L048242n175290p216451j104802M546318
37473a3342924M694706K850025J383794j877288m885681j082573P516299Q967009
37465D223367k44507p433059k976877M355514K501836m134417l756654K330324
37457e134473L634727m86179j259659K737615M043037P71767j007844J84691j142640
37448B341042n873589p626221l855551N9839M3542j426474q30758K289449O791632
37439h087089R553682N846636l119884o976180P60148J0916624J0571509K157177
37431B1622623k135212j032336l704145j0171157r325584J311074R892432Q509940
37423A4967635K736638j601543o770551j2342471j0119453K088912J3288178J3991361
$$ y = [-6620521, -13274972, -13515974, -7440941, -4392699, -9567989, -16784440, -17889242, -13342924, -8648218, -5798193, -4414399, -6291687, -11177368, -12259941, -4743642, 4223367, 3978860, -3454199, -6431076, -2075562, 426274, -3708143, -7464797, -5134473, -1499746, -1985925, -3245584, -507969, 3535068, 4306835, 3298991, 3483682, 2341042, -3532547, -11158768, -15014319, -14954480, -14910938, -16337412, -17168170, -14878721, -8087089, 1466593, 7313229, 4193345, -2782835, -2022687, 8893937, 19465446, 21622623, 19487411, 18455075, 14750930, 4579773, -4745811, -3434737, 6457695, 14967635, 17704273, 16102730, 9332179, -3010292, -13129745, -11040833, 2247345, 16238706]
37415A6238706Q037434K744680k123716p731648q940507l092698K420248N95163
37407H147662m257855m524466j527636j205381l266940k968696N55983M465875
37399d581454O753107N838523P87922m263728k800208L216027L990272k053982
37391F886479l892869L404095P835049q13863j2534049j1552319q73817L644996
37383g896298j391317m347134L54156M963810M000229K558633M836437O326763
37375I405279K863539j858093l137910k243022j804158p44775J553203J684704
37367E718767k261094n906426m058446J779502N263449K953073k391013n111216
37359d013404k084080L733573N203761j039107q809646q340302J293401R868526
$$ y = [16238706, 24276140, 27020820, 24897104, 17165456, 8224949, 5132251, 7552499, 8147662, 3889807, -634659, -2162295, -3367676, -6634616, -9603312, -9047329, -4581454, 2171653, 8010176, 8798098, 4534370, 1734162, 4950189, 8940461, 6886479, 2993610, 6397705, 14232754, 13418891, 884842, -10667477, -11541294, -7896298, -9287615, -13634749, -13280593, -8316783, -4316554, -1757921, 3078516, 9405279, 12268818, 10410725, 7272815, 5029793, 3225635, 2480860, 4034063, 5718767, 3457673, -2448753, -6507199, -4727697, 535752, 3488825, 1097812, -4013404, -6097484, -2363911, 2839850, 1800743, -7008903, -15349205, -14055804, -4187278]
37351d187278Q009781k124169j0701003j1692279p049576j259296M059792R228734
37343a5715294J2670649J0505824J142668j0098830j3453652m693792Q038862
37336a1603565J1492799K868572o121843m293515M039181N842688r95399m668648
37328c439730J390489P064999J417747q508880p458017L699654Q451502Q4674
37320B702438q719188o604172N25701K530101J219641K701889M266669J334725
37312d2196j265478J963162M945778L52172n315640k355409L470290P21643n173377
37303b699055p9504J1248188R240945p469593j7208775r075047J704487J382882
37295a2955472j596844L595279R507212N496800k452274l567488r50257k343195
$$ y = [-4187278, 3822503, 1698334, -9002669, -20694948, -27744524, -29003820, -24944028, -15715294, -3044645, 7461179, 8603847, -1494983, -14948635, -19642427, -11603565, -110766, 2757806, -3364037, -7657552, -3618371, 2224317, 1228918, -3439730, -2049241, 5015758, 6433505, -2075375, -9533392, -5833738, 2617764, 2702438, -6016750, -12620922, -12095221, -9565120, -8345479, -5643590, -1376921, -42196, -1307674, 655488, 5601266, 5953438, 637798, -1717611, 1752679, 2474322, -2699055, -2778559, 8469629, 17710574, 10240981, -6967794, -16042841, -14338354, -12955472, -14552316, -10957037, -1449825, 4046975, 1594701, -1972787, -2923044, -5266239]
37287e266239l798160J233040O589661L423174l126889l032335Q67834q9705l220344
37278f419963o02108M360051K998555j822139j537208R96438k470580p281542
37270a1778496k239767Q814007J1085062L468060k52282M203080N402047k022733
37262A6678978p864311m977397j274013m834250j0047670p605667J019287O965140
37254a1939903N616831k46740m132501q28379P177522R414003N07212r512613
37246c944568p725089K329018O392657J871052q06674J472670L9672p055845r342785
37237a6769892k355534L978577K399823p48789N88580J371928k345753l514073
37229a7395133K993418Q824773M953380l122660m378278Q39719L832092J913024
$$ y = [-5266239, -9064399, -7831359, -1241698, 2181476, -945413, -3977748, -3109914, -3199619, -6419963, -7022071, -2662020, 336535, -1485604, -3022812, -2026374, -4496954, -11778496, -14018263, -5204256, 5880806, 9348866, 9096584, 13299664, 18701711, 16678978, 8814667, 3837270, 2563257, -2270993, -12318663, -19924330, -18905043, -11939903, -6323072, -6569812, -10702313, -11530692, -4353170, 5060833, 5568045, -3944568, -11669657, -9340639, -2947982, -1076930, -1883604, -410934, -371262, -7427107, -16769892, -19125426, -15146849, -12747026, -13495815, -12907235, -11535307, -13881060, -17395133, -14401715, -5576942, -623562, -3746222, -8124500, -7284781, -3452689, -1539665]
37221a539665j97903M99754K701877M209133K642365l082389q566953p405872
37213a0739653j591221K1386l369500k217109N894001R417133J606676o670619
37205g648906l897124L668994L521623k570711l867051N91707L102733K316103
37197d782632L139872M839933K199580l496371o024729m631093k788483o1633
37189a1605556M357765M627383l123219r605384l673604Q431860J0276449J37026
37181a77280p175538l862116J723977K259713J855811L951984L301735k621276
37173g42990o318577k184971M316138O412463N371737L529305j659353q810312
37165h6560q488592K057800R580699K417686j0142056r979463L137240J1984589
$$ y = [-1539665, -1737568, -1237814, 1464063, 5673196, 8315561, 5233172, -3333781, -10739653, -12330874, -12309488, -15678988, -17896097, -12002096, -2584963, -978287, -7648906, -11546030, -7877036, -4355413, -6926124, -10793175, -10201468, -7098735, -4782632, -1642760, 3197173, 5396753, 1900382, -4124347, -8755440, -11543923, -11605556, -7247791, -2620408, -5743627, -15349011, -19022615, -10590755, -314306, -177280, -7352818, -11214934, -9490957, -7231244, -5375433, -1423449, 1878286, -742990, -7061567, -9246538, -4930400, 1482063, 6853800, 10383105, 8723752, -86560, -8575152, -6517352, 3063347, 5481033, -4661023, -14640486, -11503246, 481343]
37157D81343P725275J44217n16207K077770N55152k828011k145977M39916j026432
37148D907046m439720k417633M129821N342423k404643r381886n664073M841692
37140e086973J0052909N541549k319706o943372p619588n081663J071921P892353
37132b492570Q721284J736421n693043n516272J579478Q866130J1784182R316259
37124B8301869J458534q825639j4162907r876500j139836K955748J288971L81713
37116C81953L068913M944956L125063J113345J831682K011260j945694o900377
37108G631101o841407j503944L314344L134768q34407m312705m458566j884821
37100e755637K66251m35963k583784k212970J794562N465616M907999J976665
$$ y = [481343, 8206618, 8350835, 7834628, 9912398, 10467550, 7639539, 5493562, 5933478, 4907046, 467326, -1950307, 2179514, 7521937, 5117294, -4264592, -9928665, -5086973, 4965936, 10507485, 8187779, 1244407, -6375181, -11456844, -10384923, -2492570, 6228714, 7965135, 2272092, -3244180, -1664702, 7201428, 18985610, 28301869, 29760403, 20934764, 6771857, -3104643, -4244479, -1288731, 240, 381953, 3450866, 8395822, 11520885, 12634230, 14465912, 16477172, 14531478, 7631101, 789694, -714250, 2600094, 5734862, 4900455, 587750, -3870816, -5755637, -5489386, -5925349, -8509133, -10722103, -8927541, -3461925, 1446074, 3422739]
37092C422739J548747L878414L845764r83825n704797m794336m06550J098746
37084A904902o09406K92908M829522N900698K08402l902922J514987R507805O646009
37075B6292905o060163j3094572p098593R45323k20471n378635l370284M475236
37067c509254Q067330N372165L191659L310605J0766p714403j2282725q974573
37059a2528430k648454P09299J841783L373766L467822k93026m916823n106279
37051a6100342m1845O640113J1412448J2210442P785475k51927o163655n057564
37043A0433145O77033L175024j537961q299365q944764k671088K615562N30505
37035d021909m963369m885096J558064N067610n7833o462910l988789M775662
$$ y = [3422739, 4971486, 8849900, 12695664, 11711839, 6007042, 1212706, 806156, 1904902, 1295496, 1588404, 6417926, 12318624, 12527026, 8624104, 10139091, 19646896, 26292905, 20232742, 7138170, 39577, 984900, 764429, -4614206, -7984490, -3509254, 4558076, 9930241, 13121900, 16432505, 16443271, 8728868, -3553857, -12528430, -15176884, -14467585, -12625802, -9252036, -5784214, -6077240, -10994063, -16100342, -16142187, -9502074, 1910374, 14120816, 21906291, 21654364, 15490709, 10433145, 11110178, 14285202, 12747241, 4447876, -4496888, -7167976, -4552414, -4021909, -8985278, -13870374, -12312310, -7244700, -7302533, -13765443, -17754232, -12978570]
37027a2978570P837062J897578k581084K260414R025898O172649l813608p432035
37019C88304m93945N122071o41168r989216p986120N034088J3033600P148540
37011A1616154k311681k488243L158427K721959l819010n285714J305735N595817
37003A0493444Q21030o083930o596473k757290o35636j14411J499173K698326
36995f75767J927874K274125N014697M896833q60746n732086m240369j830561
36987G74000m638146o862737o06058P918461O518887k382476m825498K111026
36979a992541O471454J638342m519277m301282o46152J595683K950566L281365
36971D478158l37321n310021m352515J073363M18987p666589j0247317r25650
$$ y = [-12978570, -5141508, -3243930, -5825014, -3564600, 5461298, 11633947, 7820339, 388304, -105641, 5016430, 4375262, -5613954, -13600074, -8565986, 4467614, 11616154, 9304473, 6816230, 9974657, 12696616, 8877606, 3591892, 4897627, 10493444, 11314474, 5230544, -1365929, -4123219, -4758855, -4873266, -3374093, -675767, 1252107, 3526232, 8540929, 13437762, 12577016, 6844930, 2604561, 774000, -3864146, -10726883, -11332941, -3414480, 3104407, 721931, -4103567, -1992541, 4478913, 6117255, 1597978, -2703304, -3349456, -1753773, 1196793, 4478158, 4140837, -1169184, -5521699, -4448336, -4029349, -11695938, -21943255, -22868905]
36963b2868905P870766M016918n135530n674861R12824L475268J376122K878069
36955a3149329P495370O162099j565943n312779q79097L437707J161443k717246
36947e367775j391802L214523N159914L338916M15668k230148l773146k056510
36939b690360K920038O313395L646086k673704n814661l090650J144184J654117
36931A408445j400692m067431m454306l732909j802045L376617R949428J0545718
36923I822825J662660q612387r108396k81547P039333O998667M071428K175565
36915A3768148j442963p520911r557367l688361L801992N657322L656723K518590
36907G193173P38855m010749o570964j619553M944287K886953o088729r627816
$$ y = [-22868905, -14998139, -10981221, -16116751, -21791612, -20878788, -17403520, -16027398, -13149329, -5653959, 508140, -1057803, -6370582, -7249679, -3811972, -2650529, -5367775, -6759577, -3545054, 1614860, 4953776, 5369444, 3139296, -633850, -2690360, 229678, 6543073, 10189159, 7515455, 1700794, -1389856, -245672, 1408445, 7753, -4059678, -8513984, -12246893, -14048938, -10672321, -722893, 9822825, 11485485, 2873098, -6235298, -6516845, 522488, 7521155, 11592583, 13768148, 12325185, 4804274, -4753093, -8441454, -4639462, 1017860, 4674583, 7193173, 7932028, 3921279, -2649685, -4269238, 675049, 3562002, -2526727, -12154543]
36899a2154543k294521P687695J0578636N862397j069460o030082p292292m867221
36891i579391r06910K092729L886683M974099M272389J526974o25539q38405j796820
36882C005809m452136m410088J46719K877371m80348k749290L141732R321640
36874F401409L740184q112398r002554K807214R968571L263148n226354l363740
36866D75480K944650L251709J54973R28323K920574P23746j245895K748417O310960
36857A9212937P19903p843781o778689J170064J755450o205386q132032J422637
36849d678897Q590171K338650p924034p487865J954828P842514O477118M439620
36841A1552105M234676J205390n334676q726177n228180K94450J883632m40298
$$ y = [-12154543, -14449064, -6761369, 3817267, 9679664, 8610204, 2580122, -4712170, -9579391, -10486301, -8393572, -4506889, 467210, 4739599, 6266573, 5641034, 4802629, 3005809, -1446327, -5856415, -5709696, -2832325, -3312673, -6061963, -2920231, 6401409, 10141593, 2029195, -6973359, -4166145, 5802426, 9065574, 3839220, 475480, 3420130, 6671839, 6826812, 7755135, 10675709, 11399455, 10153560, 12901977, 19212937, 19932840, 12089059, 5310370, 6480434, 8235884, 2030498, -6101534, -4678897, 3911274, 6249924, -1674110, -9161975, -7207147, 635367, 7112485, 11552105, 15786781, 16992171, 11657495, 2931318, -2296862, -2002412, -118780, -559078]
36833e59078l648673n973860n418546K24756Q086414J0279544L944057l506863
36825C427751m458419j472192p44593k78491N303274J1179513O609877o235281
36817A3331439j1742326m226804K140692l875802j1027229l476580J1364108J1883609
36809D371107m204525j5241164p231382P785051J1790779M340242l106726m654770
36801f151388j826656L002802N769847J251072p327238q027353J725020P327915
36793d255979j118061j0206771k859233J2213599J1524299o223927j6954086p611785
36785b5491944O296438P544336J750351K356591O946459M728331k795035n386243
36777d050716k462811k281998n470822l866923M112744R570258O682609J12827
$$ y = [-559078, -4207751, -10181611, -15600157, -15375401, -7288987, 2990557, 6934614, 3427751, -1030668, -2502860, -3247453, -3525944, 1777330, 12956843, 19566720, 13331439, 1589113, -2637691, -496999, -4372801, -15400030, -18876610, -7512502, 4371107, 166582, -15074582, -22305964, -14520913, -2730134, 1610108, -1496618, -6151388, -7978044, -4975242, 794605, 2045677, -5281561, -13308914, -11583894, -4255979, -5374040, -15580811, -18440044, -6226445, 5297854, -926073, -17880159, -25491944, -19195506, -11651170, -9900819, -7544228, -597769, 4130562, 1335527, -4050716, -6513527, -8795525, -14266347, -18133270, -14020526, -4450268, 2232341, 2345168]
36769B345168l568649l532724j475887J816903M258065L066673m86511k410182
36761A2856k580414l594144l183181L502939J2468561J1850798q95784j2070040
36753E511591r290739J431502N216932l06358l694170J927956R499353R153379
36745A9449446J055052o726724q563941n639461k229529p67064m78064K94055
36737c606230J108954q5487l122455m423326j458320L338704N353495L119766
36729B25101j163287m696754n383090k236335K482183L676517l56954m150230
36721a1602849j994710L136642L375617j865368m179876J655447R828693J1318639
36713I672235N191089j954963m790241l355527k91482J863995J259388j851388
$$ y = [2345168, -1223481, -4756205, -6232092, -4415189, -157124, 2909549, 2423038, 12856, -2567558, -6161702, -9344883, -5841944, 6626617, 18477415, 17581631, 5511591, -3779148, -2347646, 2869286, 2562928, -1131242, 796714, 10296067, 19449446, 20504498, 13777774, 5213833, -425628, -2655157, -3422221, -3900285, -3606230, -2497276, -2582763, -5705218, -10128544, -11586864, -8248160, -2894665, 225101, -938186, -5634940, -11018030, -13254365, -10772182, -7095665, -7452619, -11602849, -13597559, -10460917, -7085300, -8950668, -13130544, -11475097, -1646404, 9672235, 14863324, 12908361, 8118120, 4762593, 4471111, 6335106, 7594494, 5743106]
36705E743106m215825k924064L46000J427923K92726J540609O138229P062707
36697A5411411j375065j2249900j2145194m430Q948523L664504o553713o034872
36689a0338736L258032N550335k837645p715740p53052P231613N313326L84664
36681I2797L427422R400658O388965k899491n514139l9675K389438k621519p762508
36672B861948q232266o430017k205334O798674J4101353R202849m102490r823339
36664B171378l675078J201136k795196o143184j150505M148935J315305l932223
36656h859432l740442j593793k361691j577766L380096M061666l976726r235654
36648b3903742j900515Q474504Q816142M506558P308148J1720742M589952q668466
$$ y = [5743106, 1527281, -1396783, -1050783, 377140, 669866, 2210475, 8348704, 15411411, 14036346, 1786446, -10358748, -10363178, -1414655, 2249849, -4303864, -10338736, -7080704, -1530369, -4368014, -12083754, -12836806, -5605193, -291867, 92797, 3520219, 12920877, 19309842, 16410351, 10896212, 10856537, 13245975, 10624456, 2861948, -5370318, -11800335, -14005669, -7206995, 6894358, 16097207, 11994717, 2171378, -1503700, -302564, -3097760, -9240944, -10391449, -6242514, -4927209, -8859432, -12599874, -14193667, -16555358, -18133124, -14753028, -10691362, -14668088, -23903742, -25804257, -17329753, -8513611, -4007053, 3301095, 15021837, 19611789, 10943323]
36640A0943323r966189K099725J0080781M851319m350573q193813p768994n091145
36632g395566M03828M046106J6628n786316k399908O702953P688817O8205k558553
36623G86194K899955M055851l268148p295998k912979j289062p687659r775625
36615b4487471m4481Q738622M803962k495332m8114N810970J736196p613019o296688
36606a9895355O745599J5688014J0332752k791951j1332711r261660Q30794J0147481
36598D62963J0139984J644673n726374o298409m045286k778400m6381M587979
$$ y = [10943323, 977134, 3076859, 13157640, 18008959, 13658386, 5464573, -2304421, -7395566, -6991738, -2945632, -2929004, -8715320, -11115228, -4412275, 3276542, 3344747, 786194, 3686149, 7742000, 4473852, -2822146, -5735125, -7024187, -14711846, -24487471, -24531952, -15793330, -10989368, -13484700, -13532814, -7721844, -5985648, -13598667, -19895355, -13149756, 2538258, 12871010, 10079059, -1253652, -10515312, -9684518, 462963, 10602947, 12247620, 6521246, 222837, -3822449, -6600849, -6647230, -2059251]
$$ [...]
##END NTUPLES=NMR SPECTRUM
##END=
