##TITLE=31Pdec_SR156_k TFA
 DMSO-d6, 24 sc
 27.1.2023
##JCAMPDX= 6.0         $$ Bruker NMR JCAMP-DX V2.0
##DATA TYPE= NMR SPECTRUM
##DATA CLASS= NTUPLES
##ORIGIN= UXNMR, Bruker Analytische Messtechnik GmbH
##OWNER= root
$$ XWIN-NMR		Version 3.5
$$ Fri Jan 27 15:45:17 2023 Russian Standard Time (UT+4h)  she@DPX200
##.OBSERVE FREQUENCY= 81.013821
##.OBSERVE NUCLEUS= ^31P
##.ACQUISITION MODE= SIMULTANEOUS
##.ACQUISITION SCHEME= undefined
##.AVERAGES= 24
##.DIGITISER RES= 16
##SPECTROMETER/DATA SYSTEM= spect
##.PULSE SEQUENCE= zgpg30
##.SOLVENT NAME= CDCl3
##.SHIFT REFERENCE= (INTERNAL, CDCl3, 0, 248.564)
##AUDIT TRAIL= $$ (NUMBER, WHEN, WHO, WHERE, WHAT)
$$ ##TITLE= Audit trail, XWIN-NMR		Version 3.5
$$ ##JCAMPDX= 5.01
$$ ##ORIGIN= Bruker BioSpin GmbH
$$ ##OWNER= she
$$ F:/spectra/data/she/nmr/P31/1/pdata/1/auditp.txt
$$ ##AUDIT TRAIL=  $$ (NUMBER, WHEN, WHO, WHERE, WHAT)
(   1,<2023-01-27 15:44:13.84 +0400>,<she>,<DPX200>,
      <created by zg, POWCHK disabled, PULCHK disabled
       configuration hash MD5:
       00 E9 B6 7A A2 85 ED C7 34 08 36 98 17 FE 4E 26
       data hash MD5: 32K
       EF 21 DA CE 21 86 0D 3E FB DF F7 A1 10 3A 1A 91>)
(   2,<2023-01-27 15:44:16.54 +0400>,<she>,<DPX200>,
      <Start of raw data processing
       efp BC_mod = 2 LB = 1 FT_mod = 6 PKNL = 1 PHC0 = -11109.34 PHC1 = 455.8113 SI = 64K 
       data hash MD5: 64K
       44 23 83 AD 22 86 B2 6C FC 47 EC 3D 50 62 B5 C4>)
(   3,<2023-01-27 15:44:36.79 +0400>,<she>,<DPX200>,
      <pk PHC0 = -22.39802 PHC1 = 0 
       data hash MD5: 64K
       36 8D E6 68 EC A8 C2 50 9A 48 E5 18 22 34 61 EF>)
(   4,<2023-01-27 15:44:40.01 +0400>,<she>,<DPX200>,
      <abs ABSG = 5 
       data hash MD5: 64K
       11 93 DF FF A2 7F 3E A9 51 A1 14 DA 24 E9 B2 A6>)
$$ ##END=
$$ 
$$ hash MD5
$$ EE 72 89 08 88 10 93 F0 0D 3E 0C 24 AC 2B 36 94
##$RELAX= 
##$RELAX= 
##$RELAX= 
##$RELAX= 
##$RELAX= 
##$RELAX= 
##$RELAX= 
##$RELAX= 
##$RELAX= 
$$ Bruker specific parameters
$$ --------------------------
##$DU= <F:/spectra>
##$EXPNO= 1
##$NAME= <P31>
##$PROCNO= 1
##$TYPE= <nmr>
##$USER= <she>
##$AMP= (0..31)
100 100 100 100 100 100 100 100 100 100 100 100 100 100 100 100 100 100 
100 100 100 100 100 100 100 100 100 100 100 100 100 100 
##$AQSEQ= 0
##$AQ_mod= 1
##$AUNM= <au_zg>
##$AUTOPOS= <>
##$BF1= 81.014009
##$BF2= 200.13
##$BF3= 200.13
##$BF4= 200.13
##$BF5= 200.13
##$BF6= 200.13
##$BF7= 200.13
##$BF8= 200.13
##$BYTORDA= 1
##$CFDGTYP= 0
##$CFRGTYP= 5
##$CHEMSTR= <none>
##$CNST= (0..31)
1 1 145 1 1 1 1 1 1 1 1 1 1 1 1 1 1 1 1 1 1 1 1 1 1 1 1 1 1 1 1 1 
##$CPDPRG= <waltz16>
##$CPDPRG1= <>
##$CPDPRG2= <waltz16>
##$CPDPRG3= <>
##$CPDPRG4= <mlev>
##$CPDPRG5= <mlev>
##$CPDPRG6= <mlev>
##$CPDPRG7= <mlev>
##$CPDPRG8= <mlev>
##$CPDPRGB= <>
##$CPDPRGT= <>
##$D= (0..31)
0 1 0 0 0 0 0 0 0 0 0 0.03 2e-05 3e-06 0 0 0 0 0 0 0 0 0 0 0 0 0 0 0 0 
0 0 
##$DATE= 1674819853
##$DBL= (0..7)
120 120 120 11 120 120 24 19 
##$DBP= (0..7)
150 150 150 150 150 150 150 150 
##$DBP07= 0
##$DBPNAM0= <>
##$DBPNAM1= <>
$$ [...]
##$SUBNAM3= <"">
##$SUBNAM4= <"">
##$SUBNAM5= <"">
##$SUBNAM6= <"">
##$SUBNAM7= <"">
##$SUBNAM8= <"">
##$SUBNAM9= <"">
##$SW= 501.771253377433
##$SWIBOX= (0..15)
0 1 3 0 0 0 0 0 0 0 0 0 0 0 0 0 
##$SW_h= 40650.406504065
##$TD= 32768
##$TD0= 1
##$TE= 0
##$TE2= 300
##$TE3= 300
##$TEG= 300
##$TL= (0..7)
0 120 53 12 22 120 120 120 
##$TP= (0..7)
150 150 150 150 150 150 150 150 
##$TP07= 0
##$TPNAME0= <>
##$TPNAME1= <>
##$TPNAME2= <>
##$TPNAME3= <>
##$TPNAME4= <>
##$TPNAME5= <>
##$TPNAME6= <>
##$TPNAME7= <>
##$TPOAL= (0..7)
0.5 0.5 0.5 0.5 0.5 0.5 0.5 0.5 
##$TPOFFS= (0..7)
0 0 0 0 0 0 0 0 
##$TUNHIN= 0
##$TUNHOUT= 0
##$TUNXOUT= 0
##$USERA1= <user>
##$USERA2= <user>
##$USERA3= <user>
##$USERA4= <user>
##$USERA5= <user>
##$V9= 5
##$VALIST= <valist>
##$VCLIST= <CCCCCCCCCCCCCCC>
##$VD= 0
##$VDLIST= <DDDDDDDDDDDDDDD>
##$VPLIST= <PPPPPPPPPPPPPPP>
##$VTLIST= <TTTTTTTTTTTTTTT>
##$WBST= 1024
##$WBSW= 4
##$XGAIN= (0..3)
0 0 0 0 
##$XL= 0
##$YL= 0
##$YMAX_a= 1371
##$YMIN_a= -1618
##$ZGOPTNS= <>
##$ZL1= 120
##$ZL2= 120
##$ZL3= 120
##$ZL4= 120
##$ABSF1= 248.5645
##$ABSF2= -253.2056
##$ABSG= 5
##$ABSL= 3
##$ALPHA= 0
##$AQORDER= 0
##$ASSFAC= 0
##$ASSFACI= 0
##$ASSFACX= 0
##$ASSWID= 0
##$AUNMP= <proc_1d>
##$AZFE= 0.1
##$AZFW= 0.5
##$BCFW= 0
##$BC_mod= 2
##$BYTORDP= 0
##$COROFFS= 0
##$CY= -3
##$DATMOD= 1
##$DC= 0
##$DFILT= <>
##$DTYPP= 0
##$F1P= 0
##$F2P= 0
##$FCOR= 1
##$FTSIZE= 65536
##$FT_mod= 6
##$GAMMA= 0
##$GB= 0
##$INTBC= 1
##$INTSCL= 6.047779e-11
##$ISEN= 30
##$LB= 1
##$LEV0= 0
##$LPBIN= 0
##$MAXI= 10000
##$MC2= 0
##$MEAN= 0
##$ME_mod= 0
##$MI= 50
##$NCOEF= 0
##$NC_proc= -10
##$NLEV= 6
##$NOISF1= 182.463
##$NOISF2= 159.3651
##$NSP= 0
##$NTH_PI= 0
##$NZP= 0
##$OFFSET= 248.5645
##$PC= 4
##$PHC0= -11131.74
##$PHC1= 455.8113
##$PH_mod= 1
##$PKNL= yes
##$PPARMOD= 0
##$PSCAL= 0
##$PSIGN= 0
##$REVERSE= no
##$SF= 81.0140089999694
##$SI= 65536
##$SIGF1= 159.3651
##$SIGF2= -187.1042
##$SINO= 113.3802
##$SIOLD= 16384
##$SREGLST= <1H.CDCl3>
##$SSB= 0
##$STSI= 65536
##$STSR= 0
##$SW_p= 40650.406504065
##$SYMM= 0
##$S_DEV= 0
##$TDeff= 32768
##$TDoff= 0
##$TI= <>
##$TILT= no
##$TM1= 0
##$TM2= 0
##$TOPLEV= 0
##$USERP1= <user>
##$USERP2= <user>
##$USERP3= <user>
##$USERP4= <user>
##$USERP5= <user>
##$WDW= 1
##$XDIM= 65536
##$YMAX_p= 300921330
##$YMIN_p= -98927029
$$ End of Bruker specific parameters
$$ ---------------------------------
##NTUPLES= NMR SPECTRUM
##VAR_NAME=  FREQUENCY,     SPECTRUM/REAL,   SPECTRUM/IMAG
##SYMBOL=    X,             R,               I
##VAR_TYPE=  INDEPENDENT,   DEPENDENT,       DEPENDENT
##VAR_FORM=  AFFN,          ASDF,            ASDF
##VAR_DIM=   65536,         65536,           65536
##UNITS=     HZ,            ARBITRARY UNITS, ARBITRARY UNITS
##FACTOR=    0.620285442955139, 1,           1
##FIRST=     20137.2065510682, 0,            0
##LAST=      -20513.1999529968, 0,           0
##MIN=       -20513.1999529968, -98927029,   0
##MAX=       20137.2065510682, 300921330,    0
$$ Real data points
##PAGE= N=1
##DATA TABLE= (X++(R..R)), XYDATA
$$ [...]
$$ plain form
41472 -14756288 -42111403 -36931649 -10313049 3985765 -10580617 -38427576 -54370048
41465 -54370048 -50684785 -37289381 -23132106 -8768203 3442745 5195104 -4178133
41458 -4178133 -9477799 3158408 25012964 33321434 21133084 6876029 10203406 27314948
41450 27314948 36475469 23214960 -5269902 -28546888 -32048617 -18316420 -1100572
41443 -1100572 9983597 15922602 19841201 19734883 14870145 11893183 14862735 14638181
41435 14638181 1137118 -16047302 -14605806 9753538 33530197 33452794 13405732 -5076901
41427 -5076901 -10373537 -8507626 -8681355 -11968855 -13944597 -11106058 -3631308 4358584
41419 4358584 7480209 4627805 499360 -668037 -574504 -3166402 -7865903 -10439979
$$ packed form
41472a4756288k7355115N179754K6618600J4298814j4566382k7846959j5942472
41465e4370048L685263J3395404J4157275J4363903J2210948J752359r373237
41458d178133n299666J2636207K1854556Q308470j2188350j4257055L327377J7111542
41450B7314948R160521j3260509k8484862k3276986l501729J3732197J7215848
41443a100572J1084169N939005L918599j06318m864738k976962K969552k24554
41435A4638181j3501063j7184420J441496K4359344K3776659p7403k0047062j8482633
41427e076901n296636J865911j73729l287500j975742K838539P474750P989892
41419D358584L121625k852404m128445j167397R3533k591898m699501k574076
$$ plain form
41411 -10439979 -9544903 -8295253 -8605081 -7379089 -1244224 6215196 6933383 1270914
41403 1270914 3795246 27379088 61484653 77450060 61421601 32571887 19170476
41396 19170476 24050876 25879559 9878565 -16380654 -36349506 -40664099 -29535402
41389 -29535402 -10909745 2326537 3537391 1119827 6455003 15689999 16580303 10258610
41381 10258610 8237146 8397038 -3840494 -25764015 -32760565 -14597083 5826080 5627515
41373 5627515 -5949784 -7775143 -1577842 -2891072 -10449175 -11224827 -8569641 -17820844
41365 -17820844 -35390422 -38676633 -20771576 -2314340 -1574845 -11663914 -15729021 -8989201
41357 -8989201 2641767 12418085 13793037 3990117 -7001035 -3997600 10005477 12368788
$$ packed form
41411a0439979Q95076J249650l09828J225992O134865P459420P18187n662469
41403A270914K524332K3583842L4105565J5965407j6028459k8849714j3401411
41396A9170476M880400J828683j6000994k6259219j9968852m314593J1128697
41389b9535402J8625657J3236282J210854k417564N335176R234996Q90304o321693
41381A0258610k021464J59892j2237532k1923521o996550J8163482K0423163j98565
41373E627515j1577299j825359O197301j313230p558103p75652K655186r251203
41365a7820844j7569578l286211J7905057J8457236P39495j0089069m065107O739820
41357h989201J1630968R776318J374952r802920j0991152L003435J4003077K363311
$$ plain form
41349 12368788 -7805254 -30916545 -32511376 -15921124 -3428147 -3082638 -2585554 6310717
41341 6310717 15410319 15920318 12817007 15934404 24671017 28550615 19229148 -2109334
41333 -2109334 -25630140 -37736683 -29440953 -5375063 17023360 21963770 9042280
41326 9042280 -9776377 -24276742 -31612292 -29840467 -16163289 3733850 13737428
41319 13737428 4351725 -13401596 -21594913 -18879272 -17574132 -20362200 -17527803 -9260831
41311 -9260831 -10118715 -22620826 -26912097 -11780708 2751318 -5239257 -23271315 -24050241
41303 -24050241 -10497519 -9324511 -23180947 -24621928 -4143264 10535457 -691722
41296 -691722 -16049326 -5865665 21407642 33973258 22893782 6452979 -3044265
$$ packed form
41349A2368788k0174042k3111291j594831J6590252J2492977L45509M97084Q896271
41341F310717R099602N09999l103311L117397Q736613L879598r321467k1338482
41333b109334k3520806j2106543Q295730K4065890K2398423M940410j2921490
41326I042280j8818657j4500365p335550J771825J3677178J9897139J0003578
41319A3737428r385703j7753321q193317K715641J305140k788068K834397Q266972
41311i260831q57884j2502111m291271J5131389J4532026p990575j8032058p78926
41303b4050241J3552722J173008j3856436j440981K0478664J4678721j1227179
41296f91722j5357604J0183661K7273307J2565616j1079476j6440803r497244
$$ plain form
41289 -3044265 -10321839 -17851995 -19625231 -16131678 -16348635 -21851867 -24333434 -20273348
41281 -20273348 -13632880 -4348456 9611419 18827450 10177851 -8561776 -11594046 9730545
41273 9730545 32685156 34659814 22270290 14993662 13881760 5036543 -13403089 -26734347
41265 -26734347 -25284581 -15560676 -7872480 -4110363 -755929 4283598 10847762 16989497
41257 16989497 18952608 15373748 11345407 13069257 18923365 21529219 18274531 13488368
41249 13488368 10044523 5585677 -1667039 -9606274 -16013352 -19212733 -14042241 4114855
41241 4114855 27682637 38467596 27992909 9234588 -135216 307384 -794611 -4674309
41233 -4674309 -1401920 8803233 9740371 -7344187 -26715070 -26232562 -5842353 13503969
$$ packed form
41289c044265p277574p530156j773236L493553k16957n503232k481567M060086
41281b0273348O640468R284424J3959875R216031q649599j8739627l032270K1324591
41273I730545K2954611J974658j2389524p276628j111902q845217j8439632j3331258
41265b6734347J449766R723905P688196L762117L354434N039527O564164O141735
41257A6989497J963111l578860m028341J723850N854108K605854l254688m786163
41249A3488368l443845m458846p252716p939235o407078l199381N170492J8157096
41241D114855K3567782J0784959j0474687j8758321r369804M42600j101995l879698
41233d674309L272389J0205153R37138j7084558j9370883M82508K0390209J9346322
$$ plain form
41225 13503969 16167974 6521478 -1463064 500558 10807041 20570596 18744742 1661913
41217 1661913 -20560178 -32584874 -29564727 -19096561 -8754865 490419 8688914 14097970
41209 14097970 17667652 21635549 22180016 13138074 -1458987 -10237673 -12319285 -18079488
41201 -18079488 -27536471 -25762232 -10026432 -2648105 -19192683 -39584095 -34123743 -7655689
41193 -7655689 8944538 6186265 5406916 18731457 29233691 21408524 6127585 -9595
41185 -9595 -185893 -5295754 -12532813 -14013162 -13981265 -18970837 -20943600 -9336534 7215283
41176 7215283 10103162 -2903778 -18349233 -29853672 -40540962 -44658155 -29280234
41169 -29280234 561848 18446240 8636432 -12709661 -19604951 -8549103 3555519
$$ packed form
41225A3503969K664005r646496p984542J963622J0306483R763555j825854j7082829
41217A661913k2222091j2024696L020147J0468166J0341696R245284Q198495N409056
41209A4097970L569682L967897N44467r041942j4597061q778686k081612n760203
41201a8079488r456983J774239J5735800P378327j6544578k0391412N460352K6468054
41193g655689J6600227k758273p79349J3324541J0502234p825167j5280939o137180
41185i595j76298n109861p237059j480349L1897m989572j972763J1607066J6551817
41176G215283K887879j3006940j5445455j1504439j0687290m117193J5377921
41169b9280234K9842082J7884392r809808k1346093o895290J1055848J2104622
$$ plain form
41162 3555519 6182039 5436215 8358082 9569829 -10522 -16160438 -21200446 -4171608
41154 -4171608 22808130 35522890 25616122 9208943 3481322 4526332 -1637486 -14141822
41146 -14141822 -18624242 -11091709 -4050775 -5737460 -7842813 -738277 10720234 15456826
41138 15456826 12196106 8375796 8223485 9731201 10444906 10152507 9434049 8852121 7502442
41129 7502442 1790774 -9366379 -17851872 -13010371 2481025 12781831 9984237 5526662
41121 5526662 12734849 26535203 31394317 24045284 16189598 15855595 16945325 9552087
41113 9552087 -6548189 -21731676 -26547981 -20903625 -14514000 -16264164 -21944781 -17534417
41105 -17534417 1930396 22836080 28323669 17822045 3883223 -5681218 -13154441
$$ packed form
41162C555519K626520p45824K921867J211747r580351j6149916n040008J7028838
41154d171608K6979738J2714760r906768j6407179n727621J045010o163818j2504336
41146a4141822m482420P532533P040934j686685k105353P104536J1458511M736592
41138A5456826l260720l820310j52311J507716P13705k92399p18458n81928j349679
41129G502442n711668j1157153q485493M841501J5491396J0300806k797594m457575
41121E526662P208187J3800354M859114p349033p855686l34003J089730p393238
41113I552087j6100276j5183487m816305N644356O389625j750164n680617M410364
41105a7534417J9464813K0905684N487589j0501624j3938822r564441p473223
$$ plain form
41098 -13154441 -21196721 -27799856 -30789856 -29203638 -20742657 -6064665 5400807 3867550
41090 3867550 -5962716 -9085841 -1653291 3024862 -4643549 -14403150 -10333749 5983090
41082 5983090 17755221 15771636 8109808 5857750 8065498 5500742 -5527186 -18178771
41074 -18178771 -22637778 -15758467 -3903078 2144949 -3331217 -13999509 -15500632 -739402
41066 -739402 18868265 23138284 6865312 -11967114 -13446173 -296669 7594622 318540
41058 318540 -12385567 -19949468 -25920449 -36598472 -45710354 -42229122 -27684782 -13893120
41050 -13893120 -6321503 -1091412 2663266 -204649 -8755792 -11398469 612504 21227331
41042 21227331 36225115 37633532 27774235 13398215 1085498 -3896390 -221246 6575028
$$ packed form
41098a3154441q042280o603135k990000J586218Q460981J4677992J1465472j533257
41090C867550r830266l123125P432550M678153p668411r759601M069401J6316839
41082E983090J1772131j983585p661828k252058K207748k564756j1027928j2651585
41074a8178771m459007O879311J1855389O048027n476166j0668292j501123J4761230
41066g39402J9607667M270019j6272972j8832426j479059J3149504P891291p276082
41058C18540j2704107p563901n970981j0678023r111882L481232J4544340J3791662
41050a3893120P571617N230091L754678k867915q551143k642677J2010973K0614827
41042B1227331J4997784J408417r859297j4376020j2312717m981888L675144O796274
$$ plain form
41034 6575028 7636981 785418 -4215512 4581079 23982097 33738860 19128012 -7768164
41026 -7768164 -19907360 -8963561 4924282 1462255 -14393327 -24229089 -22437080 -18464095
41018 -18464095 -20375421 -28652849 -40277217 -46660848 -34480067 -3610076 21850223
41011 21850223 18614726 -3064130 -11538310 2305571 15420537 9847246 -4359475
41004 -4359475 -12136193 -15947716 -20638725 -16329835 3293991 20595904 15176225 -3025596
40996 -3025596 -5401259 13320802 27430802 17377869 -5607660 -19504957 -19601952 -15206891
40988 -15206891 -10050461 -931653 8243031 6040490 -8969778 -20770807 -14708975 1394086
40980 1394086 6101607 -6089138 -17625498 -16093016 -14660894 -29778614 -49907724 -48759456
$$ packed form
41034F575028J061953o851563n000930Q796591J9401018R756763j4610848k6896176
41026g768164j2139196J0943799J3887843l462027j5855582r835762J792009L972985
41018a8464095j911326q277428j1624368o383631J2180781L0869991K5460299
41011B1850223l235497k1678856q474180J3843881J3114966n573291j4206721
41004d359475p776718l811523m691009M308890J9623826J7301913n419679j8201821
40996c025596k375663J8722061J4110000j0052933k2985529j3897297r6995M395061
40988a5206891N156430R118808R174684k202541j5010268j1801029O061832J6103061
40980A394086M707521j2190745j1536360J532482J432122j5117720k0129110J148268
$$ plain form
40972 -48759456 -25759906 -7707911 -6845805 -4865272 9756004 16268616 -4046953 -29408058
40964 -29408058 -23321036 11869987 37673748 32913555 16059026 11718618 21551122 35873426
40956 35873426 49779039 55519865 39623975 4091505 -24265100 -23007856 -3040745
40949 -3040745 7605010 1442338 -4196324 3140347 15280347 20180878 19081977 19066156
40941 19066156 18695417 11533438 -437788 -7603784 -7695164 -10628365 -23103571 -35450885
40933 -35450885 -33496055 -20610877 -15121541 -22766807 -25375607 -6883727 20210861 29769609
40925 29769609 18123873 7640574 13633048 25376539 26480117 18912771 15691077 20089997
40917 20089997 24672003 25065287 22978087 18708554 11239425 4238267 2402883 2521327
$$ packed form
40972d8759456K2999550J8051995Q62106J980533J4621276O512612k0315569k5361105
40964b9408058O087022L5191023K5803761m760193j6854529m340408R832504J4322304
40956C5873426J3905613N740826j5895890l5532470k8356605J257244J9967111
40949c040745J0645755o162672n638662P336671J2140000M900531j098901j5821
40941A9066156l70739p161979j1971226p165996r1380k933201j2475206j2347314
40933c5450885J954830J2885178N489336p645266k608800J8491880K7094588R558748
40925B9769609j1645736j0483299N992474J1743491J103578p567346l221694M398920
40917B0089997M582006L93284k087200m269533p469129p001158j835384J18444
$$ plain form
40909 2521327 -2612725 -11291354 -13618070 -7113708 -1814189 -5030160 -9640875 -5282068
40901 -5282068 4589667 6474240 -3732992 -13880957 -10234591 6792116 24107748 29246824
40893 29246824 20596206 8358586 6825167 20937035 38164651 38909940 18430639 -7034884
40885 -7034884 -20296025 -22224314 -23011235 -21935350 -9852002 10175959 21019252 15011818
40877 15011818 5437643 5932487 9835470 2174724 -15082602 -23851741 -14316940 3866412
40869 3866412 16500541 20743998 21645255 20450313 13876875 3086505 -3396111 1050548
40861 1050548 11676372 16980450 12959364 6553663 2029446 -7262276 -24582414 -35743957
40853 -35743957 -25763455 -6290032 -5323275 -25566281 -35776567 -15713119 11524407
$$ packed form
40909B521327n134052q678629k326716O504362N299519l215971m610715M358807
40901e282068R871735J884573j0207232j0147965L646366J7026707J7315632N139076
40893B9246824q650618j2237620j533419J4111868J7227616P45289k0479301k5465523
40885g034884j3261141j928289p86921J075885J2083348K0027961J0843293o007434
40877A5011818r574175M94844L902983p660746j7257326q769139R534801J8183352
40869C866412J2634129M243457R01257j194942o573438j0790370o482616M446659
40861A050548J0625824N304078m021086o405701m524217r291722j7320138j1161543
40853c5743957R980502J9473423R66757k0243006j0210286K0063448K7237526
$$ plain form
40846 11524407 11949419 -10602847 -23484453 -14054804 -1860627 -3043773 -9362024 -8971692
40838 -8971692 -5440120 -5415983 -5122971 -1375059 -1873439 -10990750 -16105004 -3179939 20005949
40829 20005949 31010311 22200338 10645485 15332663 33193161 44147161 36665216
40822 36665216 21307275 16635801 26773430 39174363 42403035 37129273 28706548 20117078
40814 20117078 16796588 25632867 40032311 38965651 15069770 -7602575 -2724421 19284810
40806 19284810 23759707 451317 -24149965 -25704320 -10259298 3429437 9181049
40799 9181049 10686436 10386330 12030217 20751761 31450498 30600317 17927664 11184180
40791 11184180 19499069 27903550 21089613 7612800 5066065 13652845 21176588 24392451
$$ packed form
40846A1524407M25012k2552266j2881606R429649J2194177j183146o318251L90332
40838h971692L531572K4137K93012L747912m98380r117311n114254J2925065K3185888
40829B0005949J1004362q809973j1554853M687178J7860498J0954000p481945
40822C6665216j5357941m671474J0137629J2400933L228672n273762q422725q589470
40814B0117078l320490Q836279J4399444j066660k3895881k2672345M878154K2009231
40806A9284810M474897k3308390k4601282j554355J5445022J3688735N751612
40799I181049J505387l00106J643887Q721544J0698737q50181j2672653o743484
40791A1184180Q314889Q404481o813937j3476813k546735Q586780P523743L215863
$$ plain form
40783 24392451 28170097 30530268 25238788 15171206 9383613 10974633 18804649 33738612
40775 33738612 50355785 51485435 27818983 -3399558 -16978653 -12555275 -10740256
40768 -10740256 -20290468 -29555710 -30387007 -29274909 -30218594 -25944180 -14223524 -6813080
40760 -6813080 -12331643 -22785794 -26660508 -24582363 -22304002 -18307264 -10363057 -7036421
40752 -7036421 -18406538 -36857355 -39938895 -16271458 19191363 40745034 38264445
40745 38264445 22698024 8303761 -2335922 -13387918 -24260967 -31076365 -34949331
40738 -34949331 -38350074 -35175094 -17167252 8334560 21023983 13092628 -1479382
40731 -1479382 -9841486 -17011651 -28573712 -32752207 -17848053 3676708 9451328 -567271
$$ packed form
40783B4392451L777646K360171n291480j0067582n787593J591020P830016J4933963
40775C3738612J6617173J129650k3666452l1218541j3579095M423378J815019
40768a0740256r550212r265242q31297J112098r43685M274414J1720656P410444
40760f813080n518563j0454151l874714K078145K278361L996738P944207L326636
40752g036421j1370117j8450817l081540K3667437L5462821K1553671k480589
40745C8264445j5566421j4394263j0639683j1051996j0873049o815398l872966
40738c4949331l400743L174980J8007842K5501812J2689423p931355j4572010
40731a479382q362104p170165j1562061m178495J4904154K1524761N774620j0018599
$$ plain form
40723 -567271 -6595205 -141921 8228920 10984058 11816091 9789466 -3119460 -22996070
40715 -22996070 -32397835 -26001247 -20215558 -27703253 -38369097 -36680659 -23863563 -11042539
40707 -11042539 -2199496 4223094 6945892 6304974 7928746 12053508 9300892 -2597333
40699 -2597333 -9569422 -1952288 6526814 -3045924 -25668087 -39435519 -36660316 -29481214
40691 -29481214 -26397168 -22199693 -13604363 -7723681 -9196249 -12140490 -10695756 -6360062
40683 -6360062 -79174 11027304 23071935 24153153 12714692 5308040 13132613 20239564
40675 20239564 2866577 -32396579 -49564355 -28597374 6323072 16720860 -1868077
40668 -1868077 -18310224 -10196762 8680014 12322173 -652494 -8945005 -1109953 10386309
$$ packed form
40723e67271o027934O453284Q370841K755138Q32033k026625j2908926j9876610
40715b2996070r401765O396588N785689p487695j0665844J688438J2817096J2821024
40707a1042539Q843043O422590K722798o40918J623772M124762k752616j1898225
40699b597333o972089P617134Q479102r572738k2622163j3767432K775203P179102
40691b9481214L084046M197475Q595330N880682j472568k944241J444734M335694
40683f360062O280888J1106478J2044631J081218j1438461p406652P824573P106951
40675B0239564j7372987l5263156j7167776K0966981L4920446J0397788j8588937
40668a868077j6442147Q113462J8876776L642159j2974667q292511P835052J1496262
$$ plain form
40660 10386309 9748850 -700529 -6382344 451079 14807608 27402747 32633196 30551706
40652 30551706 25153994 19097172 9467744 -6059415 -18585826 -13802201 6235462 18401487
40644 18401487 6831755 -12121245 -8026806 23796704 55703091 61502630 43041124
40637 43041124 20944515 12649608 23825300 47609304 64800775 57037247 29346777
40630 29346777 9523636 15401068 33178343 39858429 35558608 35712206 39200064 28134386
40622 28134386 984613 -17323348 -9153231 8960945 8469244 -11797965 -24953459
40615 -24953459 -12874916 10498247 17693910 1918956 -15248915 -11146854 9134524
40608 9134524 19630857 9573179 -393761 11534105 33408214 35137020 15050219
$$ packed form
40660A0386309o37459j0449379n681815O833423J4356529J2595139N230449k081490
40652C0551706n397712o056822r629428j5527159j2526411M783625K0037663J2166025
40644A8401487j1569732j8953000M094439L1823510L1906387N799539j8461506
40637D3041124k2096609q294907J1175692K3784004J7191471p763528k7690470
40630B9346777j9823141N877432J7777275O680086m299821J53598L487858j1065678
40622B8134386k7149773j8307961Q170117J8114176m91701k0267209j3155494
40615b4953459J2078543K3373163P195663j5774954j7167871M102061K0281378
40608I134524J0496333j0057678r966940J1927866K1874109J728806k0086801
$$ plain form
40601 15050219 5468149 25779063 54816006 63849745 54891835 45965509 36819808 15997561
40593 15997561 -8968513 -17266652 -7405824 2142817 4530402 10996689 23215850 25400270
40585 25400270 11651593 -2248714 -4563678 -4279122 -10850344 -16900660 -14081427 -8357266
40577 -8357266 -5752860 40297 10889783 12150919 -4572381 -21528863 -18198342 -2983716
40569 -2983716 -114480 -13453872 -25179032 -24980572 -18901149 -11578397 -469345 11400992
40561 11400992 14729844 8187974 -312669 -6253838 -9490389 -6020604 5368190 11648054
40553 11648054 -186654 -18353603 -16742023 7120353 25606301 18819694 -1052637
40546 -1052637 -12577446 -13674296 -14303460 -15963219 -14762433 -15084926 -23550238 -33559111
$$ packed form
40601A5050219r582070K0310914K9036943R033739q957910q926326r145701k0822247
40593A5997561k4966074q298139R860828R548641K387585O466287J2219161K184420
40585B5400270j3748677j3900307k314964K84556o571222o050316K819233N724161
40577h357266K604406N793157J0849486J261136j6723300j6956482L330521J5214626
40569b983716K869236j3339392j1725160J98460O079423P322752J1109052J1870337
40561A1400992L328852o541870q500643n941169l236551L469785J1388794O279864
40553A1648054j1834708j8166949J611580K3862376J8485948o786607j9872331
40546a052637j1524809j096850o29164j659759J200786l22493q465312j0008873
$$ plain form
40538 -33559111 -30000193 -9044674 16823110 34082250 40835277 42747466 42081930 34696390
40530 34696390 17552194 -3430074 -17041365 -19414054 -17244532 -14218586 -2110265
40523 -2110265 24356417 49626618 49733593 23364011 -3662731 -8951206 3584830 16160565
40515 16160565 20113555 18422977 14745120 9746793 3884520 -2985589 -11661240 -19489130
40507 -19489130 -20593166 -13423499 -3534182 3486098 6965277 8073411 8307723 11716149
40499 11716149 20173045 24845641 12561687 -15134581 -38895969 -43248057 -33059630
40492 -33059630 -22648527 -17160648 -12624500 -7472690 -4435851 -3930518 -3052942 -279355
40484 -279355 3083639 4817751 2825922 -3657121 -12646542 -21166722 -27099923 -26082428
$$ packed form
40538c3559111L558918K0955519K5867784J7259140O753027J912189o65536p385540
40530C4696390j7144196k0982268j3611291k372689K169522L025946J2108321
40523b110265K6466682K5270201J06975k6369582k7026742n288475J2536036J2575735
40515A6160565L952990j690578l677857m998327n862273o870109q675651p827890
40507a9489130j104036P169667R889317P020280L479179J108134K34312L408426
40499A1716149Q456896M672596j2283954k7696268k3761388m352088J0188427
40492c3059630J0411103N487879M536148N151810L036839N05333Q77576K773587
40484b79355L362994J734112j991829o483043q989421q520180n933201J017495
$$ plain form
40476 -26082428 -11375468 14907184 34794910 31307873 11043004 -4059946 -7561021
40469 -7561021 -14056160 -30120574 -39055786 -25515133 193161 16377775 17557859 14134167
40461 14134167 13136640 12984946 11517269 7133220 -3284234 -17302352 -23299626 -14218020
40453 -14218020 314194 5596418 207940 -6896527 -11155062 -13270400 -11752846 -7139365
40445 -7139365 -8219595 -20330560 -31446790 -24541223 -1868647 17318896 22223596 18936671
40437 18936671 13517787 3577167 -8685401 -11073627 1337862 14900873 14643258 5580851
40429 5580851 4755399 15073764 19890097 7294672 -9804996 -7528688 16970576 38124246
40421 38124246 32621687 10060901 1523724 19341593 41957620 43456103 25612331
$$ packed form
40476b6082428J4706960K6282652J9887726l487037k0264869j5102950l501075
40469g561021o495139j6064414q935212J3540653K5708294J6184614J180084l423692
40461A4134167r97527j51694j467677m384049j0417454j4018118n997274R081606
40453a4218020J4532214N282224n388478p104467m258535k115338J517554M613481
40445g139365j080230j2110965j1116230O905567K2672576J9187543M904700l286925
40437A8936671n418884r940620j2262568k388226J2411489J3563011k57615r062407
40429E580851q25452J0318365M816333j2595425j7099668K276308K4499264K1153670
40421C8124246n502559k2560786q537177J7817869K2616027J498483j7843772
$$ plain form
40414 25612331 10703254 11074362 18303224 18996677 9744185 -3515489 -12082755 -9786242
40406 -9786242 1289541 10005401 7291457 -2013305 -4916991 1750647 6358999 -1594223
40398 -1594223 -16519283 -23487404 -17988065 -12189587 -17860276 -27694372 -23010009 -1825364
40390 -1825364 12267563 -699037 -27332802 -35884005 -17961348 2709715 5331084
40383 5331084 -3147869 -6057594 -2224116 -25205 486484 4023691 6887648 1930040
40375 1930040 -8313294 -15525291 -18118912 -19281905 -17839182 -12094348 -7927242 -11799074
40367 -11799074 -19472596 -21870455 -17884887 -11495778 -1930915 11089503 17136295 4789170
40359 4789170 -18916757 -31738342 -21394051 1428053 17134181 17500856 10096032 6668709
$$ packed form
40414B5612331j4909077L71108P228862O93453r252492j3259674q567266K296513
40406i786242J1075783Q715860k713944r304762k903686O667638M608352p953222
40398a594223j4925060o968121N499339N798478n670689r834096M684363K1184645
40390a825364J4092927j2966600k6633765q551203J7922657K0671063K621369
40383E331084q478953k909725L833478K198911N11689L537207K863957m957608
40375A930040j0243334p211997k593621j162993J442723N744834M167106l871832
40367a1799074p673522k397859L985568O389109R564863J3020418O046792j2347125
40359D789170k3705927j2821585J0344291K2822104J5706128L66675p404824l427323
$$ plain form
40351 6668709 9105520 8396665 128809 -4738083 4008611 13541904 2041889 -23698099
40343 -23698099 -30976832 -11029133 3369405 -10362128 -24923016 -6219417 28241370
40336 28241370 34777440 12572209 1088044 12195013 13223912 -13115068 -36665525
40329 -36665525 -27766227 -1420517 11359928 8628012 7129906 8003731 1298728 -8129396
40321 -8129396 -5854567 6649478 12969141 5567126 -7488589 -17086455 -20824128 -18453634
40313 -18453634 -11567977 -7027398 -11351783 -21468744 -26620916 -18885174 446623 21834018
40305 21834018 33730984 32582608 26932021 26589395 30205915 30668236 27148892 20266275
40297 20266275 3089676 -24503258 -39329588 -19424353 15715933 21189610 -9582796
$$ packed form
40351F668709K436811p08855q267856m866892Q746694R533293j1500015k5739988
40343b3698099p278733J9947699J4398538j3731533j4560888J8703599L4460787
40336B8241370O536070k2205231j1484165J1106969J028899k6338980k3550457
40329c6665525Q899298K6345710J2780445k731916j498106Q73825o705003r428124
40321h129396K274829J2504045O319663p402015j3055715r597866l737673K370494
40313a8453634O885657M540579m324385j0116961n152172P735742J9331797K1387395
40305B1834018J1896966j148376n650587l42626L616520M62321l519344o882617
40297B0266275j7176599k7592934j4826330J9905235L5140286N473677l0772406
$$ plain form
40290 -9582796 -30926577 -11133194 20307881 18092989 -13470447 -34116855 -28118677
40283 -28118677 -14070503 -3904174 9932839 26245703 28400001 13699078 2433866
40276 2433866 7466453 16145902 12750396 1010773 -6393328 -6486015 -4238262 -3551510
40268 -3551510 -7966239 -19874268 -32216862 -31693409 -17390813 -5565514 -7511194 -12680085
40260 -12680085 -4431300 14841144 26401930 19866995 4240680 -6011148 -7058070
40253 -7058070 -4915950 -4553312 -4853885 -2961169 674825 3315999 3732689 2220242 -1656599
40244 -1656599 -7017577 -7978179 1390599 16170618 21722554 10732290 -6967771 -18096688
40236 -18096688 -23334790 -31451060 -40074112 -35155515 -11648821 15766928 27886832 20531411
$$ packed form
40290i582796k1343781J9793383L1441075k214892l1563436k0646408N998178
40283b8118677J4048174J0166329J3837013J6312864K154298j4700923j1265212
40276B433866N032587Q679449l395506j1739623p404101r2687K247753O86752
40268c551510m414729j1908029j2342594N23453J4302596J1825299j945680n168891
40260a2680085Q248785J9272444J1560786o534935j5626315j0251828j046922
40253g058070K142120L62638l00573J892716L635994K641174M16690j512447l876841
40244a656599n360978r60602R368778J4780019N551936j0990264j7700061j1128917
40236a8096688n238102q116270q623052M918597K3506694K7415749J2119904p355421
$$ plain form
40228 20531411 4613186 -7493180 -10470355 -6030292 -1767678 -8175129 -28856294 -51595084
40220 -51595084 -55416642 -31806199 3591076 25372500 23331892 8261210 -5195820
40213 -5195820 -12620956 -14906039 -10327042 -177523 5209815 -2181503 -13819446 -13227583
40205 -13227583 2141602 18638364 25793612 26025380 23509262 16381497 5253425 -1415186
40197 -1415186 2521501 12848958 22208046 27937193 28652108 21982478 11445867 7236382
40189 7236382 13508079 21744295 22820119 19170165 19362383 26771776 38421002 48544288
40181 48544288 49310094 35635964 13518438 -4184700 -13520634 -21907020 -32598036 -38972840
40173 -38972840 -37956585 -34568657 -27796143 -9333283 14924687 21892868 4252682 -12388670
$$ packed form
40228B0531411j5918225j2106366k977175M440063M262614o407451k0681165k2738790
40220e1595084l821558K3610443L5397275K1781424k040608j5070682j3457030
40213e195820p425136k285083M578997J0149519N387338p391318j1637943N91863
40205a3227583J5369185J6496762P155248K31768k516118p127765j1128072o668611
40197a415186L936687J0327457R359088N729147P14915o669630j0536611m209485
40189G236382O271697Q236216J075824l649954J92218P409393J1649226J0123286
40181D8544288P65806j3674130k2117526j7703138r335934q386386j0691016o374804
40173c8972840J016255L387928O772514J8462860K4257970O968181j7640186j6641352
$$ plain form
40165 -12388670 -4534957 13768176 14365818 259510 -1533342 14301400 23560124 11944732
40157 11944732 -5527850 -11473097 -9125758 -8652346 -9544496 -7891369 -6880001 -9615599
40149 -9615599 -12093526 -10865109 -7783392 -1926653 11353852 27279036 30467764 15942629
40141 15942629 317445 1220898 13557387 17347065 4041819 -15602946 -27428422
40134 -27428422 -27929911 -21903262 -13772337 -5056681 2810776 7780508 10674869 16243794
40126 16243794 26187342 32343988 24137673 4693727 -8744587 -4937044 9071869 21195979
40118 21195979 29646022 36484988 36864550 27802893 19153973 20741530 24930060 17786810
40110 17786810 2123377 -7722036 -9611847 -13207032 -18491216 -14983783 -2303825 8790852
$$ packed form
40165a2388670P853713J8303133N97642j4106308j792852J5834742R258724j1615392
40157A1944732j7472582n945247K347339M73412q92150J653127J011368k735598
40149i615599k477927J228417L081717N856739J3280505J5925184L188728j4525135
40141A5942629j5625184R03453J2336489L789678j3305246j9644765j1825476
40134b7428422n01489O026649Q130925Q715656P867457M969732K894361N568925
40126A6243794R943548O156646q206315j9443946j3438314L807543J4008913J2124110
40118B1195979Q450043O838966L79562r061657q648920J587557M188530p143250
40110A7786810j5663433r845413j889811l595185n284184L507433J2679958J1094677
$$ plain form
40102 8790852 17156902 32085108 50641148 56267446 45335144 33215766 27237765 16682136
40094 16682136 -1102083 -9157107 595340 10518074 6420723 2094516 13757572 29329156
40086 29329156 28183345 16229619 13395234 16533205 4814582 -21608426 -37518452
40079 -37518452 -29958110 -14705889 -9683488 -13242453 -16542785 -19062444 -22049267 -20761429
40071 -20761429 -13093334 -5886468 -5222608 -9006682 -14264097 -22115959 -29994507 -28889966
40063 -28889966 -15685518 -354559 6515553 7160430 10700124 18935956 25123811 23867771
40055 23867771 16392020 7566065 1882022 1581810 6164510 13384688 19872329 19998620
40047 19998620 8716634 -8936228 -15683652 370262 26779329 37229782 23949400
$$ packed form
40102H790852Q366050J4928206J8556040N626298j0932302j2119378n978001j0555629
40094A6682136j7784219q055024R752447R922734m097351m326207J1663056J5571584
40086B9329156j145811j1953726k834385L137971j1718623k6423008j5910026
40079c7518452P560342J5252221N022401l558965l300332k519659k986823J287838
40071b0761429P668095P206866O63860l784074n257415p851862p878548J104541
40063b8889966J3204448J5330959O870112O44877L539694Q235832O187855j256040
40055B3867771p475751q825955n684043l00212M582700P220178O487641J26291
40047A9998620j1281986j7652862o747424J6053914K6409067J0450453j3280382
$$ plain form
40040 23949400 8238939 12633172 32806802 46255786 41530751 28098691 20598060
40033 20598060 23168510 28949806 27947339 15540696 -1344348 -7476231 5754839 29046736
40025 29046736 43388211 38845659 21447488 3633473 -6907206 -10445287 -12736900
40018 -12736900 -18672372 -24719563 -20924882 -5538934 7510572 4640003 -7964151 -12549230
40010 -12549230 -5096197 1728676 1013079 -56315 1073197 -6114618 -23759520 -32529016
40002 -32529016 -16785931 9351426 20525618 16208066 16476481 26284717 28650286 16131205
39994 16131205 5406670 11206808 24696624 29731588 25595454 20628884 15437592 6523722
39986 6523722 -1900926 -3123856 707664 3503763 6176095 12707157 20915979 26969370
$$ packed form
40040B3949400j5710461M394233K0173630J3448984m725035j3432060p500631
40033B0598060K570450N781296j002467j2406643j6885044o131883J3231070K3291897
40025B9046736J4341475m542552j7398171j7814015j0540679l538081k291613
40018a2736900n935472o047191L794681J5385948J3049506k870569j2604154m585079
40010a2549230P453033O824873p15597j069394J129512p187815j7644902q769496
40002c2529016J5743085K6137357J1174192m317552K68415R808236K365569j2519081
39994A6131205j0724535N800138J3489816N034964m136134m966570n191292q913870
39986F523722q424648j222930L831520K796099K672332O531062Q208822O053391
$$ plain form
39978 26969370 33281224 41892313 46308346 41212706 34254345 35436897 40114474 37262541
39970 37262541 31176825 37835117 58238106 71353840 59709304 30951091 7545783
39963 7545783 2554142 10982008 19937004 22701384 24127766 32360074 44980949 49600565
39955 49600565 42959251 40220879 53681902 69556088 62945289 33910398 9817051
39948 9817051 8136620 15041801 9933764 -4154819 -8452400 2707870 16247941 20932487
39940 20932487 20600758 24666634 34535462 44321962 49905315 50733441 43535418 21949469
39932 21949469 -12264300 -42547651 -51278706 -39497450 -23495774 -11895186 1110123
39925 1110123 17346866 26453277 24755855 25393100 35624248 39681017 22795347 -1090494
$$ packed form
39978B6969370O311854Q611089M416033n095640o958361J182552M677577k851933
39970C7262541o085716O658292K0402989J3115734j1644536k8758213k3405308
39963G545783m991641Q427866Q954996K764380J426382Q232308J2620875M619616
39955D9600565o641314k738372J3461023J5874186o610799k9034891k4093347
39948I817051j680431O905181n108037j4088583m297581J1160270J3540071M684546
39940B0932487l31729M065876R868828R786500N583353Q28126p198023k1585949
39932B1949469l4213769l0283351q731055J1781256J6001676J1600588J3005309
39925A110123J6236743R106411j697422O37245J0231148M056769j6885670k3885841
$$ plain form
39917 -1090494 -8032499 -25915 3038028 -603125 4051381 14411396 9564534 -11815050
39909 -11815050 -23855980 -13629002 -758316 -3752019 -12611383 -11555419 -6118637 -7842468
39901 -7842468 -10214109 -944586 14366451 19881013 12264809 1223074 -4557849 -1409022
39893 -1409022 8883528 13879974 -412149 -26256218 -37319303 -25958452 -16549733
39886 -16549733 -26356486 -36314040 -23414818 -888633 3416708 -6881018 -5659208 9195864
39878 9195864 12784734 -4018176 -20654082 -20756521 -12644436 -8094567 -3903383 5202442
39870 5202442 13309440 13024761 5547968 -5359399 -17641401 -25225337 -20591411 -7042662
39862 -7042662 3246733 6381564 10288772 18931147 25520384 24722238 19760572 13344195
$$ packed form
39917a090494o942005Q006584L063943l641153M654506J0360015m846862k1379584
39909a1815050j2040930J0226978J2870686k993703q859364J055964N436782j723831
39901g842468k371641R269523J5311037N514562p616204j1041735n780923L148827
39893a409022J0292550M996446j4292123k5844069j1063085J1360851R408719
39886a6549733r806753r957554J2899222K2526185M305341j0297726J221810J4855072
39878I195864L588870j6802910j6635906j02439Q112085M549869M191184R105825
39870E202442Q106998k84679p476793j0907367j2282002p583936M633926J3548749
39862g042662J0289395L134831L907208Q642375O589237p98146m961666o416377
$$ plain form
39854 13344195 1822115 -17336815 -39519970 -56273473 -59539749 -46175201 -25898902
39847 -25898902 -18027875 -28415382 -36758426 -22189244 5397577 18567321 11346444
39840 11346444 2365567 1701094 434916 -4515406 -2022842 9389505 14507657 8762286
39832 8762286 8780785 22364413 30714799 17647856 -3473350 -11803619 -11370731 -19371960
39824 -19371960 -34393005 -39437734 -30152135 -19175577 -15219705 -15047842 -14172568 -10590180
39816 -10590180 -175064 17623413 31660033 29972572 16594674 4641558 -4332072
39809 -4332072 -19131500 -38351339 -47494649 -39725214 -25191745 -14505634 -5252421 8091361
39801 8091361 20781408 23220674 14502144 3655222 467181 9197512 26976851 43188892
$$ packed form
39854A3344195j1522080j9158930k2183155j6753503l266276J3364548K0276299
39847b5898902P871027j0387507q343044J4569182K7586821J3169744p220877
39840A1346444q980877o64473j266178m950322K492564J1412347N118152n745371
39832H762286J8499J3583628Q350386j3066943k1121206q330269M32888q001229
39824a9371960j5021045n044729R285599J0976558L955872J71863Q75274L582388
39816a0590180J0415116J7798477J4036620j687461j3377898j1953116q973630
39809d332072j4799428j9219839r143310P769435J4533469J0686111R253213J3343782
39801H091361J2690047K439266q718530j0846922l188041Q730331J7779339J6212041
$$ plain form
39793 43188892 44170575 25566610 -78544 -13337056 -6957372 8350172 18000527 19008356
39785 19008356 18088058 18238112 14547981 4364073 -5378878 -6060931 1105394 7050055
39777 7050055 6757245 4061449 4603801 7876730 7183878 -3461403 -21257506 -33965864
39769 -33965864 -32203113 -22870206 -22127727 -31918612 -34604289 -18864182 685995 2783645
39761 2783645 -11134438 -23297714 -27689648 -31420023 -32030972 -17381440 8991746 25057085
39753 25057085 19827408 5704740 -6039481 -20177311 -36305334 -35508625 -7950237
39746 -7950237 22855478 26431919 6511006 -6322776 2017062 14809342 13421872 822531
39738 822531 -9114848 -11470056 -11168324 -10972585 -5713938 11226935 36519647 54380798
$$ packed form
39793D3188892R81683j8603965k5645154j3258512O379684J5307544R650355J007829
39785A9008356r20298J50054l690131j0183908r742951o82053P166325N944661
39777G050055k92810k695796N42352L272929o92852j0645281j7796103j2708358
39769c3965864J762751R332907P42479r790885k685677J5740107J9550177K097650
39761B783645j3918083j2163276m391934l730375o10949J4649532K6373186J6065339
39753B5057085n229677j4122668j1744221j4137830j6128023P96709K7558388
39746g950237L0805715L576441j9920913j2833782Q339838J2792280j387470j2599341
39738H22531r937379k355208L01732J95739N258647J6940873K5292712J7861151
$$ plain form
39730 54380798 51254809 32975568 18596176 15625850 13166551 3580573 -4013093 -884691
39722 -884691 5461089 5720317 6079809 15282151 25483221 23948759 15162717 12328320
39714 12328320 13991428 9651128 3409981 9393748 24999166 31360012 22466203 12373492
39706 12373492 9546105 5466092 -4186665 -7545617 3168462 16084110 17179871 10737067
39698 10737067 9605958 14497472 15652507 10105291 7046061 16879134 38808536 57713093
39690 57713093 55263120 30611094 6448749 3395274 11988834 6362310 -15547199 -26771246
39682 -26771246 -11329460 12367252 19222454 9636720 -38203 -2952112 -1720834 3611741
39674 3611741 11000330 10820671 533783 -6097934 -346455 3437493 -9561917 -25868922
$$ packed form
39730E4380798l125989j8279241j4379392k970326k459299r585978p593666L128402
39722h84691O345780K59228L59492R202342J0201070j534462q786042k834397
39714A2328320J663108m340300o241147N983767J5605418O360846q893809j0092711
39706A2373492k827387m080013r652757l358952J0714079J2915648J095761o442804
39698A0737067j131109M891514J155035n547216l059230R833073K1929402J8904557
39690E7713093k449973k4652026k4162345l053475Q593560n626524k1909509j1224047
39682b6771246J5441786K3696712O855202r585734r674923k913909J231278N332575
39674C611741P388589j79659j0286888o631717N751479L783948j2999410j6307005
$$ plain form
39666 -25868922 -21618001 -1504172 6606842 -6628971 -22251988 -26167521 -25478794 -26007475
39658 -26007475 -19415013 -3598569 6772279 4096372 2882975 15117851 27451523
39651 27451523 21565553 4530671 -1160837 10232985 24739689 32719430 36832626 37735019
39643 37735019 30192671 16083072 6539690 7006542 11216599 12837020 12704199 12082843
39635 12082843 9329234 6291115 7606001 10172895 4288090 -9897521 -18322931 -12331868
39627 -12331868 -1371070 2279326 985873 2511602 2842866 -6230796 -18177955 -18125275
39619 -18125275 -6845518 -72073 -1634872 3266021 20605895 32791402 25291003 11777837
39611 11777837 13312480 23503392 17628956 -7780281 -28505429 -27676004 -14559487 -2248261
$$ packed form
39666b5868922M250921K0113829Q111014j3235813j5623017l915533O88727n28681
39658b6007475O592462J5816444J0370848k675907j213397J2234876J2333672
39651B7451523n885970j7034882n691508J1393822J4506704P979741M113196R02393
39643C7735019p542348j4109599r543382M66852M210057J620421j32821o21356
39635A2082843k753609l038119J314886K566894n884805j4185611q425410N991063
39627a2331868J0960798L650396j293453J525729L31264r073662j1947159N2680
39619a8125275J1279757O773445j562799M900893J7339874J2185507p500399j3513166
39611A1777837J534643J0190912n874436k5409237k0725148Q29425J3116517J2311226
$$ plain form
39603 -2248261 11216496 27892075 35791137 26197457 10982217 5831274 7783510 6370033
39595 6370033 5544903 14399437 25405731 24977536 19805367 27845094 45686179 51416163
39587 51416163 40997980 33601262 35430636 28339961 6151218 -7758709 1687021 12678704
39579 12678704 1187800 -17684556 -13601024 8800760 17253008 2767702 -9976852
39572 -9976852 -4047413 7976400 10145402 5603948 2764612 -968053 -9884358 -18246855
39564 -18246855 -18244607 -11211400 -5207577 -7509945 -19118573 -29139347 -20439785 6469687
39556 6469687 23767800 10087930 -13921201 -10560182 18152125 31626416 12495061
39549 12495061 -8693283 -4020506 10865797 8396401 -7104719 -14475738 -12696426 -13927728
$$ packed form
39603b248261J3464757J6675579P899062r593680j5215240n150943J952236j413477
39595F370033q25130Q854534J1006294m28195n172169Q039727J7841085N729984
39587E1416163j0418183p396718J829374p090675k2188743j3909927R445730J0991683
39579A2678704j1490904j8872356M083532K2401784Q452248j4485306j2744554
39572i976852N929439J2023813K169002m541454k839336l732665q916305q362497
39564a8246855K248P033207O003823k302368j1608628j0020774Q699562K6909472
39556F469687J7298113j3679870k4009131L361019K8712307J3474291j9131355
39549A2495061k1188344M672777J4886303k469396j5501120p371019J779312j231302
$$ plain form
39541 -13927728 -15326622 -5944687 9197359 17163564 19767091 25489386 29655446 25992201
39533 25992201 25774328 38790619 46289926 23535227 -17335928 -38717343 -29389733 -14184866
39525 -14184866 -11860762 -14252779 -10810965 -4168360 4875949 20434078 33102874 25505881
39517 25505881 3437783 -6019547 4096789 9978199 -1167844 -9337262 1493388
39510 1493388 14125441 8382252 -4137812 -1786600 10040018 11400251 3298263 2509052
39502 2509052 10057456 12573288 11037559 21719111 46428435 63776941 56324769 31465314
39494 31465314 9393483 848948 2302866 6868620 14555524 30575000 52399067 62807774
39486 62807774 46056459 11084129 -14970209 -20285399 -20433795 -30454609 -42011687
$$ packed form
39541a3927728j398894R381935J5142046P966205K603527N722295M166060l663245
39533B5992201k17873J3016291P499307k2754699m0871155k1381415R327610J5204867
39525a4184866K324104k392017L441814O642605R044309J5558129J2668796p596993
39517B5505881k2068098r457330J0116336N881410j1146043q169418J0830650
39510A493388J2632053n743189j2520064K351212J1826618J360233q101988p89211
39502B509052P548404K515832j535729J0681552K4709324J7348506p452172k4859455
39494C1465314k2071831q544535J453918M565754P686904J6019476K1824067J0408707
39486F2807774j6751315l4972330k6054338n315190j48396j0020814j1557078
$$ plain form
39479 -42011687 -40259288 -27895030 -16712783 -7261059 6203947 19290225 22372354
39472 22372354 15959590 7731052 624488 -4431268 -2406086 6760176 12139396 7519544
39464 7519544 2666149 5530458 5946104 -6364412 -20568132 -21305905 -14290681 -12755826
39456 -12755826 -9675368 9774680 35763088 42973142 29354793 17239942 16190442
39449 16190442 13533116 4086829 -367259 2529952 -1286016 -13442658 -15045261 -353834
39441 -353834 7742399 -7222187 -28008718 -31423260 -23784012 -25859033 -36966112 -38859697
39433 -38859697 -27736230 -18791916 -20033135 -20925017 -10204898 8815909 24993281 31998526
39425 31998526 29694931 18749948 -115906 -20708926 -28983067 -13884394 15085370
$$ packed form
39479d2011687J752399J2364258J1182247R451724J3465006J3086278L082129
39472B2372354o412764q228538p106564n055756K025182R166262N379220m619852
39464G519544m853395K864309M15646j2310516j4203720p37773P015224J534855
39456a2755826L080458J9450048K5988408P210054j3618349j2114851j049500
39449A6190442k657326r446287m454088K897211l815968j2156642j602603J4691427
39441c53834Q096233j4964586k0786531l414542P639248k075021j1107079j893585
39433c8859697J1123467Q944314j241219q91882J0720119J9020807J6177372P005245
39425C1998526k303595j0944983j8865854k0593020q274141J5098673K8969764
$$ plain form
39418 15085370 29427793 11977200 -19136566 -30744603 -16098047 651828 1242588
39411 1242588 -5547383 -5095504 705437 3669673 5846091 11823531 15878054 10378721
39403 10378721 -849671 -8721657 -11421032 -11557991 -8619683 -3215974 -913970 -3217993
39395 -3217993 -3191167 1328850 -103855 -14547439 -30686507 -31842526 -17602981 -1854389
39387 -1854389 4718646 648184 -10606408 -20574787 -18347900 -4145647 5905892 -944512
39379 -944512 -16532780 -24099531 -20737283 -15347700 -11360391 -5882198 -1216723 -2303745
39371 -2303745 -4979255 -569524 8883064 12715243 8649119 5711070 9117619 12538606
39363 12538606 7778280 -4275096 -13076847 -6125208 17742636 39236548 33275690 1324230
$$ packed form
39418A5085370J4342423j7450593l1113766j1608037J4646556J6749875N90760
39411A242588o789971M51879N800941K964236K176418N977440M054523n499333
39403A0378721j1228392p871986k699375j36959K938308N403709K302004k304023
39395c217993K6826M520017j432705j4443584j6139068j156019J4239545J5748592
39387a854389O573035m070462j1254592r968379K226887J4202253J0051539o850404
39379i44512j5588268p566751L362248N389583L987309N478193M665475j087022
39371b303745k675510M409731R452588L832179m066124k938049L406549L420987
39363A2538606m760326j2053376q801751O951639K3867844K1493912n960858l1951460
$$ plain form
39355 1324230 -23135433 -15403869 5853579 4305942 -22524433 -42058728 -34480504 -15165767
39347 -15165767 -4450002 -77051 8469696 18203890 20816958 19307905 21278550 24237405
39339 24237405 20803654 12511571 6970872 5805460 5569098 7243156 15364211 29167222
39331 29167222 42010968 49022417 50282526 47773220 43522772 39754884 37884734 38181245
39323 38181245 40705323 43411318 40185964 27637784 14777733 16550363 32960235 43895404
39315 43895404 33161083 10581273 -597297 6015078 14784287 12658826 5932658 8076529
39307 8076529 21598544 39383513 55502058 64496052 56283156 26533665 -7701843
39300 -7701843 -18277839 880225 23078708 21981451 5269996 551611 15036701
$$ packed form
39355A324230k4459663P731564K1257448j547637k6830375j9534295P578224J9314737
39347a5165767J0715765M372951Q546747R734194K613068j509053J970645K958855
39339B4237405l433751q292083n540699j165412k36362J674058Q121055J3803011
39331B9167222J2843746P011449J260109k509306m250448l767888j870150K96511
39323C8181245K524078K705995l225354j2548180j2860051J772630J6409872J0935169
39315D3895404j0734321k2579810j1178570O612375Q769209k125461o726168K143871
39307H076529J3522015J7784969J6118545Q993994q212896k9749491l4235508
39300g701843j0575996J9158064K2198483j097257j6711455m718385J4485090
$$ plain form
39293 15036701 28888902 27707998 20088999 16904387 13825208 6838518 7410225 24141743
39285 24141743 41334577 36645757 14867306 4232118 19057017 42732385 50352638
39278 50352638 34714549 6803538 -17595406 -27266057 -20455433 -5158684 9435306
39271 9435306 21388659 31648181 36093385 30867515 22042373 19693252 24748207 31390612
39263 31390612 38639661 47979085 53447840 47745093 35496907 26393731 18344976 3862893
39255 3862893 -9330206 -3805763 20001284 40787399 44161049 35558847 23480014 10691919
39247 10691919 5894662 20377393 44877060 53450677 41399901 35078673 49575534
39240 49575534 62177104 48860119 24146744 17856250 29673203 36443949 32847204
$$ packed form
39293A5036701J3852201j180904p618999l184612l079179o986690N71707J6731518
39285B4141743J7192834m688820k1778451j0635188J4824899K3675368P620253
39278E0352638j5638089k7911011k4398944r670651O810624J5296749J4593990
39271I435306J1953353J0259522M445204n225870q825142k349121N054955O642405
39263C1390612P249049R339424N468755n702747j2248186r103176q048755j4482083
39255C862893j3193099N524443K3807047K0786115L373650q602202j2078833j2788095
39247A0691919m797257J4482731K4499667Q573617j2050776o321228J4496861
39240D9575534J2601570j3316985k4713375o290494J1816953O770746l596745
$$ plain form
39233 32847204 34149107 44693377 53344532 58341662 68690303 80053147 76521157 60482461
39225 60482461 54836435 68090714 81028938 78227049 71189736 76712380 90035502 95161568
39217 95161568 89179653 80851563 73407437 63302547 52109411 47663370 53391681 63369827
39209 63369827 68736327 66777991 63939953 68431422 78027242 80817193 73872655 72483226
39201 72483226 88492574 107863595 109091686 99212698 106241004 133372772 148839910
39194 148839910 133013712 109645781 110935553 132121790 144672696 140179913 135068308
39187 135068308 139740146 148821570 159148595 173194666 183928566 179064396 164207194
39180 164207194 160685480 174113898 185029582 179766095 171606920 177839543 191457887
$$ packed form
39233C2847204J301903J0544270Q651155M997130J0348641J1362844l531990j6038696
39225F0482461n646026J3254279J2938224k801889p037313N522644J3323122N126066
39217I5161568n981915q328090p444126j0104890j1193136m446041N728311R978146
39209F3369827N366500j958336k838038M491469R595820K789951o944538j389429
39201G2483226J6009348J9371021J228091r878988P028306K7131768J5467138
39194A48839910j5826198k3367931J289772K1186237J2550906m492783n111605
39187A35068308M671838R081424J0327025J4046071J0733900m864170j4857202
39180A64207194l521714J3428418J0915684n263487q159175O232623J3618344
$$ plain form
39173 191457887 192894263 180218742 170320360 174908711 190979537 212511220 235901964
39166 235901964 252678293 251363804 232099145 209742722 197472524 194799922 195194331
39159 195194331 196575089 198785254 199229047 198680318 204573159 219956019 235158380 240352422
39151 240352422 241075999 248912557 260418673 260968686 250190799 246514841 260297450 277860323
39143 277860323 282145384 276206479 274001370 278897433 285366901 292662286 300842127 300921330
39135 300921330 287214415 273947117 278926817 293243935 290389224 267382640 251848382
39128 251848382 259867859 270643150 257664421 225463526 197346918 182013291 172769379
39121 172769379 168858113 175050260 184385478 181748520 165230871 148558339 141505546 140633430
$$ packed form
39173A91457887J436376j2675521r898382M588351J6070826K1531683K3390744
39166B35901964J6776329j314489j9264659k2356423j2270198k672602L94409
39159A95194331J380758K210165M43793n48729N892841J5382860J5202361N194042
39151B40352422P23577P836558J1506116N50013j0777887l675958J3782609J7562873
39143B77860323M285061n938905k205109M896063O469468P295385Q179841P9203
39135C00921330j3706915j3267298M979700J4317118k854711k3006584j5534258
39128B51848382Q019477J0775291j2978729l2200895k8116608j5333627r243912
39121A72769379l911266O192147R335218k636958j6517649j6672532p052793q72116
$$ plain form
39113 140633430 139553031 136468804 131003409 123611458 117855580 114755340 107714887 92332555
39105 92332555 76329889 68130977 61541908 47097178 33731698 39716260 62453152
39098 62453152 77655044 72560182 60960622 58566735 61400208 58521484 51153224 47607085
39090 47607085 50392269 58523575 72733560 88994201 95906762 87352055 70109955 53136401
39082 53136401 39416708 33549670 42888225 61721907 69040172 55305435 39073910
39075 39073910 42607969 62358237 79172407 86298238 88682283 84760543 71720842 63041375
39067 63041375 76000191 101720332 111011916 93811752 71430637 63716523 65064402
39060 65064402 62660371 59041255 61999347 66416448 62570754 54072548 52645455 59872120
$$ packed form
39113A40633430j080399l084227n465395p391951n755878l100240p040453j5382332
39105I2332555j6002666q198912o589069j4444730j3365480N984562K2736892
39098F2453152J5201892n094862j1599560k393887K833473k878724p368260l546139
39090D7607085K785184Q131306J4209985J6260641O912561q554707j7242100j6973554
39082E3136401j3719693n867038R338555J8833682P318265j3734737j6231525
39075C9073910L534059J9750268J6814170P125831K384045l921740j3039701q679467
39067F3041375J2958816K5720141R291584j7200164k2381115p714114J347879
39060F5064402k404031l619116K958092M417101l845694q498206j427093P226665
$$ plain form
39052 59872120 66735671 68096264 66181315 61340493 50140266 33713788 19656601 13087702
39044 13087702 11190491 9012496 7171658 11098281 23285354 37710451 43635750 36515869
39036 36515869 23722900 16275359 15857761 14584009 7726228 1317706 4993520 20873917
39028 20873917 40994987 52747565 47078354 26381914 5500418 -7213 10972930
39021 10972930 24216451 24530510 8130193 -16979711 -36940752 -39993164 -26388071
39014 -26388071 -10356556 -4498808 -2985756 9685383 33149141 47584670 40031356
39007 40031356 21626960 11084380 11807438 14544694 13588738 9939485 5242317 2562577
38999 2562577 7466984 19201179 26848652 23602617 18051319 20324943 23920585 15299829
$$ packed form
39052E9872120O863551J360593j914949m840822j1200227j6426478j4057187o568899
39044A3087702j897211k177995j840838L926623J2187073J4425097N925299p119881
39036C6515869j2792969p447541m17598j273752o857781o408522L675814J5880397
39028B0873917K0121070J1752578n669211k0696440k0881496n507631J0980143
39021A0972930J3243521L14059j6400317k5109904j9961041l052412J3605093
39014b6388071J6031515N857748J513052J2671139K3463758J4435529p553314
39007D0031356j8404396j0542580P23058K737256r55956l649253m697168k679740
38999B562577M904407J1734195P647473l246035n551298K273624L595642q620756
$$ plain form
38991 15299829 -2593947 -11628536 -2805382 14175602 26362345 30150911 27214277 20004110
38983 20004110 13964416 13925526 16477274 15694116 16044845 26616752 41804502 43951076
38975 43951076 30049492 19278242 25137002 35423293 32252089 18990216 12179351
38968 12179351 16197635 22006233 24415462 24262008 18038978 2381645 -13302705 -15763319
38960 -15763319 -9007061 -8748569 -14569363 -7978461 15176119 30740939 17966689 -10495248
38952 -10495248 -26336028 -21835674 -11344057 -5530232 -3486485 -5708147 -14553972 -21751132
38944 -21751132 -14682788 1639141 6885382 -4763710 -14482452 -6801870 8832039 16098076
38936 16098076 16357648 19671680 22587236 13116035 -7464989 -24253297 -28005005 -21562777
$$ packed form
38991A5299829j7893776r034589Q823154J6980984J2186743L788566k936634p210167
38983B0004110o039694l8890K551748p83158L50729J0571907J5187750K146574
38975D3951076j3901584j0771250N858760J0286291l171204j3261873o810865
38968A2179351M018284N808598K409229j53454o223030j5657333j5684350k460614
38960a5763319O756258K58492n820794O590902K3154580J5564820j2774250k8461937
38952a0495248j5840780M500354J0491617N813825K043747k221662q845825p197160
38944b1751132P068344J6321929N246241j1649092r718742P680582J5633909P266037
38936A6098076K59572L314032K915556r471201k0581024j6788308l751708O442228
$$ plain form
38928 -21562777 -10223038 492134 401181 -16180617 -36493605 -39124597 -19862974 4397306
38920 4397306 18182938 20830431 17159798 10203387 6097545 11053403 19029125 16702170
38912 16702170 4847534 -770087 5300393 9691495 4611082 1649793 9145207 13971597
38904 13971597 2579613 -14372802 -17151094 -6141469 2279453 510913 -7180545 -18157591
38896 -18157591 -29545894 -30124738 -14046684 2432427 -1634399 -21057695 -31739647
38889 -31739647 -26411261 -20693293 -22774920 -20625734 -5196807 14567412 27945064 35362832
38881 35362832 36666727 24508656 850559 -15305752 -10165791 5831804 13464747
38874 13464747 10119230 7737317 12235853 16890123 13510526 1985475 -9933445 -12444170
$$ packed form
38928b1562777J1339739J0715172r0953j6581798k0312988k630992J9261623K4260280
38920D397306J3785632K647493l670633o956411m105842M955858P975722k326955
38912A6702170j1854636n617621O070480M391102n080413k961289P495414M826390
38904A3971597j1391984j6952415k778292J1009625Q420922j768540p691458j0977046
38896a8157591j1388303n78844J6078054J6479111m066826j9423296j0681952
38889c1739647N328386N717968k081627K149186J5428927J9764219J3377652P417768
38881C5362832J303895j2158071k3658097j6156311N139961J5997595P632943
38874A3464747l345517k381913M498536M654270l379597j1525051j1918920k510725
$$ plain form
38866 -12444170 -2450223 11422238 17203942 13837625 11119889 15839896 25901806 37190226
38858 37190226 45983939 45213073 30561943 10658379 -1513950 -6589863 -13065875 -15878122
38850 -15878122 -2624683 16940922 14398733 -14478680 -36382242 -25740269 163024
38843 163024 10658339 4355290 -1287121 -3951083 -12145028 -20789487 -20059801 -18518571
38835 -18518571 -28180997 -34723522 -14470338 23016895 42826725 35881153 28247612 33874818
38827 33874818 33104274 11477896 -12434719 -18170187 -15860228 -23586672 -32938113 -24423875
38819 -24423875 -4241391 1899905 -13510917 -32104347 -38509143 -36003773 -31301362 -22387756
38811 -22387756 -8136075 3201794 3483508 -4252450 -10163019 -9035110 -3566294 896541
$$ packed form
38866a2444170R993947J3872461N781704l366317k717736M720007J0061910J1288420
38858C7190226Q793713p70866j4651130j9903564j2172329n075913o476012k812247
38850a5878122J3253439J9565605k542189k8877413k1903562J0641973K5903293
38843A63024J0495315o303049n642411k663962q193945q644459P29686J541230
38835a8518571r662426o542525K0253184L7487233J9809830o945572p633541N627206
38827C3874818p70544k1626378k3912615n735468K309959p726444r351441Q514238
38819b4423875K0182484O141296j5410822j8593430o404796K505370M702411Q913606
38811b2387756J4251681J1337869K81714p735958n910569J127909N468816M462835
$$ plain form
38803 896541 1743339 81808 -1770574 -2526877 -1346863 2209863 4325422 -3465438 -23184738
38794 -23184738 -40474839 -36667987 -13362936 6143592 5179537 -7785946 -16576558 -20942501
38786 -20942501 -29410886 -37569036 -31423826 -10851893 6514351 7460335 -3687788 -17069822
38778 -17069822 -29124778 -36520361 -30893917 -10266076 11951788 20560674 17413103 16706459
38770 16706459 23939813 30281116 28091736 21074785 15299795 10002790 4139329 4099472
38762 4099472 14915352 28094099 29337595 17577009 5609755 1019717 -1479791 -4937188
38754 -4937188 -1068635 13876267 25218449 16641595 -4358008 -13498602 -1970074 12595248
38746 12595248 10505981 -6636492 -21923527 -23140963 -11841514 128566 -223424 -13574939
$$ packed form
38803H96541Q46798j661531j852382p56303J180014L556726K115559p790860j9719300
38794b3184738j7290101L806852K3305051J9506528r64055j2965483q790612m365943
38786b0942501q468385q158150O145210K0571933J7366244R45984j1148123j3382034
38778a7069822j2054956p395583N626444K0627841K2217864Q608886l147571p06644
38770A6706459P233354O341303k189380p016951n774990n297005n863461l9857
38762D099472J0815880J3178747J243496j1760586j1967254m590038k499508l457397
38754d937188L868553J4944902J1342182q576854k0999603r140594J1528528J4565322
38746A2595248k089267j7142473j5287035j217436J1299449J1970080l51990j3351515
$$ plain form
38738 -13574939 -21974259 -6804114 23197723 35501221 14065670 -17087054 -24257007
38731 -24257007 -7591641 4112123 -2974004 -11079445 -1894989 15287104 19030488 7502448
38723 7502448 -1114630 3369999 9819252 4631522 -7353777 -10933616 -4791544 -4757667
38715 -4757667 -19680213 -35590378 -33451346 -15037720 1895585 9940631 17125176 25634823
38707 25634823 24859033 12506536 3560500 5616039 3237834 -14716803 -28214718 -12485382
38699 -12485382 18242619 24861270 1332928 -13800962 6261082 38047577 43669657
38692 43669657 21983800 823199 -5341017 -3809463 1071197 13916804 30154773
38685 30154773 34896344 24462495 12201220 8851304 11639154 16130032 23934886 33323157
$$ packed form
38738a3574939q399320J5170145L0001837J2303498k1435551l1152724p169953
38731b4257007J6665366J1703764p086127q105441R184456J7182093L743384j1528040
38723G502448q617078M484629O449253n187730j1985299l579839O142072L3877
38715d757667j4922546j5910165K139032J8413626J6933305Q045046P184545Q509647
38707B5634823p75790j2352497q946036K055539k378205j7954637j3497915J5729336
38699a2485382L0728001O618651k3528342j5133890K0062044L1786495N622080
38692D3669657k1685857k1160601o164216J531554M880660J2845607J6237969
38685C0154773M741571j0433849j2261275l349916K787850M490878P804854R388271
$$ plain form
38677 33323157 35769268 28956123 22624174 25152573 33361918 40204645 42725511 38258664
38669 38258664 24126969 6462389 -2582159 -2517481 -6447049 -18220480 -23227532 -13216636
38661 -13216636 -3909928 -10933289 -22386629 -17389462 -1909302 -18532 -13273774 -16863014
38653 -16863014 -1450 16410296 12764960 -1298167 -6541564 -3415611 -3679042 -5676428
38645 -5676428 1863279 17262744 25942031 22997405 20614496 28986294 40151568 37263905
38637 37263905 16308238 -6340829 -9836366 8161052 28515112 34216385 30894325
38630 30894325 33884055 39949604 29553410 -401780 -26046758 -29156410 -22892481 -29024256
38622 -29024256 -43048864 -42818206 -24998781 -10457956 -12290553 -18167126 -11847760 1608406
$$ packed form
38677C3323157K446111o813145o331949K528399Q209345O842727K520866m466847
38669C8258664j4131695j7664580r044548O4678l929568j1773431n007052J0010896
38661a3216636R306708p023361j1453340M997167J5480160J890770j3255242l589240
38653a6863014J6861564J6411746l645336j4063127n243397L125953k63431j997386
38645e676428P539707J5399465Q679287k944626k382909Q371798J1165274k887663
38637C7263905k0955667k2649067l495537J7997418K0354060N701273l322060
38630C0894325K989730O065549j0396194k9955190k5644978l109652O263929o131775
38622b9024256j4024608K30658J7819425J4540825j832597n876573O319366J3456166
$$ plain form
38614 1608406 3150769 -13101776 -29529271 -24186640 3007049 28896089 35146818 30857638
38606 30857638 36152739 48087297 42705155 14703647 -8057477 -3360313 12221597
38599 12221597 9463596 -9101222 -15118387 3601190 30481737 45153265 40233299
38592 40233299 17860798 -9392567 -18700899 -569763 21276165 16880573 -6735075
38585 -6735075 -15641359 -132095 14607216 11967074 6367835 13107133 24993726 31813291
38577 31813291 37092114 41653111 34788748 16550713 5901374 11689504 18046697 13622260
38569 13622260 11079639 20044177 26001330 17881162 12313308 24225102 34664701 17828452
38561 17828452 -16055442 -35273998 -31979715 -23749304 -19950948 -15966319 -13565094 -18257531
$$ packed form
38614A608406J542363j6252545j6427495N342631K7193689K5889040O250729m289180
38606C0857638N295101J1934558n382142k8001508k2761124M697164J5581910
38599A2221597k758001j8564818o017165J8719577K6880547J4671528m919966
38592D0233299k2372501k7253365r308332J8131136K1845928m395592k3615648
38585f735075q906284J5509264J4739311k640142n599239O739298J1886593O819565
38577C1813291N278823M560997o864363j8238035j0649339N788130O357193m424437
38569A3622260k542621Q964538N957153q120168n567854J1911794J0439599j6836249
38561A7828452l3883894j9218556L294283Q230411L798356L984629K401225m692437
$$ plain form
38553 -18257531 -21161895 -10270680 4561498 3493161 -11293367 -21017244 -21814582 -23205424
38545 -23205424 -21018431 -3573843 17230797 14621467 -10343847 -26995795 -21536230
38538 -21536230 -13694511 -18999147 -26516052 -26744473 -30984673 -45137262 -50606449 -32543231
38530 -32543231 -6845292 2355842 -3181792 -4247913 5035647 14082396 16391846 16707951
38522 16707951 19794835 22267889 15407474 -5514043 -30598969 -38226781 -19964381 2451008
38514 2451008 2142648 -15508199 -23234035 -16366935 -16796617 -29706026 -31540108 -13308368
38506 -13308368 -851351 -11407642 -21760221 -6658745 17701567 19824981 2096735
38499 2096735 -8427718 -2919404 7234969 18368103 32059044 35275272 16915918
$$ packed form
38553a8257531k904364J0891215J4832178j068337j4786528r723877p97338j390842
38545b3205424K186993J7444588K0804640k609330k4965314j6651948N459565
38538b1536230P841719n304636p516905k28421m240200j4152589n469187J8063218
38530c2543231K5697939R201134n537634j066121R283560R046749K309450L16105
38522A6707951L086884K473054o860415k0921517k5084926p627812J8262400K2415389
38514B451008l08360j7650847p725836O867100m29682j2909409j834082J8231740
38506a3308368J2457017j0556291j0352579J5101476K4360312K123414j7728246
38499B096735j0524453N508314J0154373J1133134J3690941L216228j8359354
$$ plain form
38492 16915918 -3101290 3293075 24023222 19076121 -16558130 -40377431 -23133677
38485 -23133677 12785096 31826618 31077491 26067752 17062620 -2410384 -19836057 -16169676
38477 -16169676 2019697 8640353 -3615767 -13109130 -2143931 18544160 27613391
38470 27613391 21520290 12002149 3904411 -7836458 -20436914 -20372432 -5462220 5250457
38462 5250457 -2646929 -14252248 -5150488 20209422 32333374 18820477 -1216017
38455 -1216017 -10085358 -13751058 -19798255 -18203363 -2673317 9914522 3996146 -7918969
38447 -7918969 -7241820 -2156245 -10169554 -21271452 -12514993 7661231 7054624 -17009853
38439 -17009853 -29179774 -10494833 12479854 9129866 -12878612 -26774416 -25537902
$$ packed form
38492A6915918k0017208O394365K0730147m947101l5634251k3819301J7243754
38485b3133677L5918773J9041522p49127n009739r005132j9473004j7425673L666381
38477a6169676J8189373O620656j2256120r493363J0965199K0688091R069231
38470B7613391o093101r518141q097738j1740869j2600456O4482J4910212J0712677
38462E250457p897386j1605319R101760K5359910J2123952j3512897k0036494
38455a216017q869341l665700o047197J594892J5530046J2587839n918376j1915115
38447g918969O77149N085575q013309j1101898Q756459K0176224o06607k4064477
38439a7009853j2169921J8684941K2974687l349988k2008478j3895804J236514
$$ plain form
38432 -25537902 -19387883 -11615725 -368436 6639648 2043121 -2344585 12334563 41791259
38424 41791259 58485235 45473725 17468635 1954834 7133417 16611548 14608892
38417 14608892 8068685 15561759 36329016 44844081 24963730 -3664260 -10283347 4329597
38409 4329597 11872617 473863 -10175653 -2050861 16413546 28133911 29454804 23168273
38401 23168273 8445627 -9089881 -14445442 -4644313 2885008 -2396597 -5756325 6320530
38393 6320530 18737829 10295515 -9480371 -12854772 3792576 17668960 18229703 20937430
38385 20937430 36718799 50905213 44215347 19803137 -2022838 -7628878 -522614
38378 -522614 6839581 6765432 4197475 10541620 26736618 37881700 32111519 18397304
$$ packed form
38432b5537902O150019P772158J1247289P008084m596527m387706J4679148K9456696
38424D1791259J6693976j3011510k8005090j5513801N178583R478131k002656
38417A4608892o540207P493074K0767257Q515065j9880351k8627990o619087J4612944
38409D329597P543020j1398754j0649516Q124792J8464407J1720365J320893o286531
38401B3168273j4722646j7535508n355561R801129P529321n281605l359728J2076855
38393F320530J2417299q442314j9775886l374401J6647348J3876384N60743K707727
38385B0937430J5781369J4186414o689866k4412210k1825975n606040P106264
38378e22614P362195p4149k567957O344145J6194998J1145082n770181j3714215
$$ plain form
38370 18397304 14073864 19729757 20658956 10476017 -2081098 -9188505 -11222318 -7761076
38362 -7761076 2066230 8542988 -963505 -18587310 -19433384 2901720 22857487 17296499
38354 17296499 -3938827 -18011478 -23887137 -35169996 -48340900 -44445564 -21927002
38347 -21927002 -3449009 -3286875 -7488989 2667726 21995183 29277482 15176488 -9585829
38339 -9585829 -28408213 -30955934 -15927447 7365640 22248838 19101494 5714692
38332 5714692 -3932282 -7343804 -9791790 -7775624 6956387 25632208 24057640 -4365322
38324 -4365322 -32940402 -33154498 -10705209 5381784 816283 -14381760 -28228216 -38282435
38316 -38282435 -41736221 -34265715 -22514805 -20142082 -26408828 -25288781 -11572154 -295457
$$ packed form
38370A8397304m323440N655893R29199j0182939j2557115p107407k033813L461242
38362g761076R827306O476758r506493j7623805q46074K2335104J9955767n560988
38354A7296499k1235326j4072651n875659j1282859j3170904L895336K2518562
38347b1927002J8477993J62134m202114J0156715J9327457P282299j4100994k4762317
38339i585829j8822384k547721J5028487K3293087J4883198l147344j3386802
38332E714692r646974l411522k447986K016166J4732011J8675821j574568k8422962
38324d365322k8575080k14096K2449289J6086993m565501j5198043j3846456j0054219
38316c8282435l453786P470506J1750910K372723o266746J120047J3716627J1276697
$$ plain form
38308 -295457 -1788632 -4915585 2848981 14291988 15780524 8731078 2757560 -1173772
38300 -1173772 -5169455 -2958318 8486024 15173254 3202075 -16763357 -21230162 -5530863
38292 -5530863 14401244 26842823 31351053 25995920 10039301 -2929818 1644704 12869972
38284 12869972 6420068 -15303147 -23001067 -6380321 9895817 7963010 3653390 12494461
38276 12494461 18001864 1573021 -19141095 -15403703 4086092 6316708 -11208007
38269 -11208007 -16736967 1631708 14242017 -4233606 -35613121 -44327352 -24224310
38262 -24224310 97616 7514372 -1081079 -12184240 -14158842 -5695185 1716895 -5060673
38254 -5060673 -20432300 -19573657 11096278 50473306 63701755 43460567 16527689
$$ packed form
38308b95457j493175l126953P764566J1443007J488536p049446n973518l931332
38300a173772l995683K211137J1444342O687230j1971179j9965432m466805J5699299
38292e530863J9932107J2441579M508230n355133j5956619j2969119M574522J1225268
38284A2869972o449904k1723215p697920J6620746J6276138j932807m309620Q841071
38276A2494461N507403j6428843k0714116L737392J9489795K230616j7524715
38269a1208007n528960J8368675J2610309j8475623l1379515q714231K0103042
38262b4224310K4321926P416756q595451j1103161j974602Q463657P412080o777568
38254e060673j5371627Q58643L0669935L9377028J3228449k0241188k6932878
$$ plain form
38247 16527689 8834932 17491598 22307278 13785364 98567 -8401056 -10740077 -10080388
38239 -10080388 -5441508 4768774 14670541 15460195 9535175 10437760 22295415 28640935
38231 28640935 14040069 -9492009 -15188712 307714 12240119 7009414 3852598
38224 3852598 22454682 48034295 51236942 30973149 12189222 6758518 3155393 -5032793
38216 -5032793 -7509913 -857752 750479 -10060113 -18753558 -11116969 6197862 19876966
38208 19876966 28146854 31340045 21674997 -329187 -14775482 -7676629 5403423 1740166
38200 1740166 -14236748 -21599637 -16845895 -10917795 -870543 24956945 56186452 66323043
38192 66323043 52224807 37940354 34691721 28608708 16696620 20372485 45531557
$$ packed form
38247A6527689p692757Q656666M815680q521914j3686797q499623k339021O59689
38239a0080388M638880J0210282R901767P89654n925020R02585J1857655O345520
38231B8640935j4600866k3532078n696703J5496426J1932405n230705l156816
38224C852598J8602084K5579613L202647k0263793j8783927n430704l603125q188186
38216e032793k477120O652161J608231j0810592q693445P636589J7314831J3679104
38208A9876966Q269888L193191r665048k2004184j4446295P098853J3080052l663257
38200A740166j5976914p362889M753742N928100J0047252K5827488L1229507J0136591
38192F6323043j4098236j4284453l248633o083013j1912088L675865K5159072
$$ plain form
38185 45531557 60689110 40267901 5203899 -7870785 816514 2790442 -10272913
38178 -10272913 -18464430 -9417417 5994785 14641789 15723018 12689834 8009134 5889855
38170 5889855 5430119 -5089722 -30800039 -53210216 -50742814 -31351633 -21426104 -24958307
38162 -24958307 -20482090 -565065 14570594 11861792 6652216 13784095 20407888 8307787
38154 8307787 -12653428 -16538180 624638 15755574 11175079 -3787287 -7338995 7968693
38146 7968693 27725400 32528612 20218817 8359192 11238347 19755901 14923521 -1442670
38138 -1442670 -6161674 11179545 30893570 30586417 15660622 7838976 13074206 17690637
38130 17690637 12211578 3007962 -392134 2802183 7651373 9017034 2055589 -14357560
$$ packed form
38185D5531557J5157553k0421209l5064002j3074684Q687299J973928j3063355
38178a0272913q191517R047013J5412202Q647004J081229l033184m680700k119279
38170E889855m59736j0519841k5710317k2410177K467402J9391181R925529l532203
38162b4958307M476217J9917025J5135659k708802n209576P131879O623793j2100101
38154H307787k0961215l884752J7162818J5130936m580495j4962366l551708J5307688
38146G968693J9756707M803212j2309795j1859625K879155Q517554m832380j6366191
38138a442670m719004J7341219J9714025l07153j4925795p821646N235230M616431
38130A7690637n479059r203616l400096L194317M849190J365661o961445j6413149
$$ plain form
38122 -14357560 -31431861 -34575562 -18687982 3929201 15069696 9109955 -2631460
38115 -2631460 -5843810 1509053 10540164 15805828 21100840 27952567 26935632 10442146
38107 10442146 -10535298 -16065210 -4760338 1996976 -11083268 -31831163 -37183733
38100 -37183733 -22743532 -4963983 1584177 -2231721 -9032521 -17019256 -27732325 -36614475
38092 -36614475 -33932890 -18480144 -5376658 -11195816 -30555815 -38955322 -25575652
38085 -25575652 -11138332 -19813535 -43455572 -53145711 -40808976 -25907257 -20486732
38078 -20486732 -13516228 2370807 13561299 9151675 1259328 4447189 11958842 11150845
38070 11150845 7786670 14255317 25377834 27566265 22916986 22402435 23019048 15010213
$$ packed form
38122a4357560j7074301l143701J5887580K2617183J1140495n959741j1741415
38115b631460l212350P352863R031111N265664N295012O851727j016935j6493486
38107A0442146k0977444n529912J1304872O757314j3080244k0747895n352570
38100c7183733J4440201J7779549O548160l815898o800800p986735j0713069q882150
38092c6614475K681585J5452746J3103486n819158j9359999q399507J3379670
38085b5575652J4437320q675203k3642037r690139J2336735J4901719N420525
38078b0486732O970504J5887035J1190492m409624p892347L187861P511653q07997
38070A1150845l364175O468647J1122517K188431m649279n14551O16613q008835
$$ plain form
38062 15010213 5719708 10847688 24980947 27719442 19438844 22097686 39068923 44300151
38054 44300151 24443290 3985983 8310617 24415786 24285038 11834253 16329505 43960109
38046 43960109 65414985 57181460 32050867 17288896 18664745 20331934 11456056 -1516683
38038 -1516683 -7424910 -4657780 -857483 -3444954 -11110237 -12211768 5179169 36115314
38030 36115314 55449408 42290204 8621595 -8651549 9781058 42363023 55874881
38023 55874881 47085204 38845933 41161431 38703808 20737857 2052565 1606125 14822320
38015 14822320 22114895 16364471 7473373 4295903 5163105 5070112 2661038 877441
38007 877441 6658973 25790666 51109195 61743605 44015922 9530069 -16739835
$$ packed form
38062A5010213r290505N127980J4133259K738495q280598K658842J6971237N231228
38054D4300151j9856861k0457307M324634J6105169j30748j2450785M495252K7630604
38046D3960109K1454876q233525k5130593j4761971J375849J667189q875878j2972739
38038a516683n908227K767130L800297k587471p665283j101531J7390937L0936145
38030C6115314J9334094j3159204l3668609j7273144J8432607L2581965J3511858
38023E5874881q789677q239271K315498k457623j7965951j8685292m46440J3216195
38015A4822320P292575n750424q891098l177470Q67202r2993k409074j783597
38007H77441N781532J9131693K5318529J0634410j7727683l4485853k6269904
$$ plain form
38000 -16739835 -23107538 -17442654 -11597979 -10629877 -15023366 -22519164 -27535438 -26550516
37992 -26550516 -22815160 -19639519 -13772059 -3644922 1957129 -5222555 -18240307 -23681308
37984 -23681308 -21132519 -20453334 -22782329 -19482552 -9542535 -3338386 -7498055 -18241073
37976 -18241073 -30097239 -39329005 -39978656 -30060668 -20192358 -21190633 -25352625 -17972695
37968 -17972695 -5344986 -7968490 -23347721 -22530926 5509471 31372748 24991888 -1929491
37960 -1929491 -14733293 -3127360 13196847 18016824 14521081 9432400 1653116 -8732153
37952 -8732153 -13941057 -7305055 7872719 21100787 22823938 10725779 -7893497 -21207459
37944 -21207459 -23197932 -17019423 -7757093 2428038 10720965 13327902 11995947 12695957
$$ packed form
38000a6739835o367703N664884N844675R68102m393489p495798n016274R84922
37992b6550516L735356L175641N867460J0127137N602051p179684j3017752n441001
37984b3681308K548789O79185k328995L299777R940017O204149m159669j0743018
37976a8241073j1856166r231766o49651R917988R868310r98275m161992P379930
37968a7972695J2627709k623504j5379231Q16795K8040397K5863277o380860k6921379
37960a929491j2803802J1605933J6324207M819977l495743n088681p779284j0385269
37952h732153n208904O636002J5177774J3228068J723151j2098159j8619276j3313962
37944b1207459j990473O178509R262330J0185131Q292927K606937j331955P00010
$$ plain form
37936 12695957 14177928 6888084 -12193267 -32844089 -44223019 -44583932 -35411590 -19272845
37928 -19272845 -7985099 -15553961 -33901525 -34368998 -7303494 18623923 15558875 -2848562
37920 -2848562 -4822335 9643462 12943585 -3155534 -17625802 -17793551 -14836434 -15302771
37912 -15302771 -7818107 9333216 15058140 -2140763 -21150702 -18546726 -3918499
37905 -3918499 -1674984 -11319023 -12500636 -2946171 -3344918 -21926427 -38526409 -33525652
37897 -33525652 -14864829 -3382339 -2889342 389816 13114192 23619035 18308068 613335
37889 613335 -12706432 -11858468 -4815055 -5420264 -14116971 -16773124 -4778961 9608934
37881 9608934 5672628 -18401952 -38722593 -31370090 -580668 25503983 26537602 10613037
$$ packed form
37936A2695957J481971p289844j9081351k0650822j1378930l60913R172342J6138745
37928a9272845J1287746p568862j8347564m67473K7065504K5927417l065048j8407437
37920b848562j973773J4465797L300123j6099119j4470268j67749K957117m66337
37912a5302771P484664J7151323N724924j7198903j9009939K603976J4628227
37905c918499K243515r644039j181613R554465l98747j8581509j6599982N000757
37897c3525652J8660823J1482490M92997L279158J2724376J0504843n310967j7694733
37889F13335j3319767Q47964P043413o05209q696707k656153J1994163J4387895
37881I608934l936306k4074580k0320641P352503L0789422K6084651J033619j5924565
$$ plain form
37873 10613037 651289 5994108 14098170 9378531 -6454148 -16763003 -10305862 5386001
37865 5386001 12961902 5601741 -5848563 -7813912 -1263836 2455850 717719 3981686
37857 3981686 17651410 30034123 26991553 11502022 -1267581 -3088332 3426791 14324130
37849 14324130 24523829 23004447 4290503 -16288200 -16749833 22834 7687523 -5566538
37841 -5566538 -20266226 -16139868 83355 10680339 12764700 11173997 1480894 -19191929
37833 -19191929 -36439689 -35926009 -27628314 -29892093 -36797603 -27638997 -5606336 1771653
37825 1771653 -15726555 -36234330 -40891258 -38187570 -40404700 -39054695 -22621681 -1725461
37817 -1725461 4765943 -1443804 -3531184 1875698 1362371 -10538653 -20665090 -15649109
$$ packed form
37873A0613037r961748N342819Q104062m719639j5832679j0308855O457141J5691863
37865E386001P575901p360161j1450304j965349O550076L719686j738131L263967
37857C981686J3669724J2382713l042570j5489531j2769603j820751O515123J0897339
37849A4324130J0199699j519382j8713944k0578703m61633J6772667P664689j3254061
37841e566538j4699688M126358J6223223J0596984K084361j590703r693103k0672823
37833a9191929j7247760N13680Q297695k263779o905510R158606K2032661P377989
37825A771653j7498208k0507775m656928K703688k217130J350005J6433014K0896220
37817a725461O491404o209747k087380N406882n13327j1901024j0126437N015981
$$ plain form
37809 -15649109 979399 15365430 18976520 13276751 5381935 4259417 16640213 40156394
37801 40156394 61316124 65996300 54222543 40777090 37564140 38729068 29735642 9570783
37793 9570783 -5877090 -5282308 3654376 7759227 6620616 7199407 8231236 2892117
37785 2892117 -7729946 -16647832 -22871720 -28534454 -28169921 -15753695 451561 6586721
37777 6586721 4950552 8764447 15966492 10109488 -9257838 -20667757 -13512107 -3918520
37769 -3918520 -5945715 -9361660 -2352219 5032867 1516133 150043 16583381 34755398
37761 34755398 24963238 -8286496 -26856576 -10955866 15823645 21964133 6349874
37754 6349874 -11393989 -21531568 -28461862 -33109399 -27592992 -8470723 13736151 22604887
$$ packed form
37809a5649109J6628508J4386031L611090n699769p894816j122518J2380796K3516181
37801D0156394K1159730M680176j1773757j3445453l212950J164928q993426k0164859
37793I570783j5447873N94782Q936684M104851j138611N78791J031829n339119
37785B892117j0622063q917886o223888n662734L64533J2416226J6205256O135160
37777F586721j636169L813895P202045n857004j9367326j1409919P155650R593587
37769c918520k027195l415945P009441P385086l516734j366090J6433338J8172017
37761C4755398r792160l3249734j8570080J5900710K6779511O140488j5614259
37754F349874j7743863j0137579o930294m647537N516407J9122269K2206874Q868736
$$ plain form
37746 22604887 12566604 -4159965 -10258401 -3510567 1045965 -7891139 -22397255 -27797562
37738 -27797562 -22903440 -16825541 -11375314 -749071 12967466 18329689 10579007 -2589150
37730 -2589150 -13595349 -22255213 -27794649 -25015030 -13589456 -2074354 3013093 5326673
37722 5326673 11294051 20434180 27052081 26986619 20192270 10844095 5630008 7120089
37714 7120089 9413966 6100004 363807 -844015 45369 -4780041 -12395968 -10485627
37706 -10485627 3431769 17860473 25743632 32035393 36826680 27293412 -1420541 -29911535
37698 -29911535 -34391658 -15978692 3630600 10895332 11049968 12282830 13347306 9675813
37690 9675813 1914101 -6101260 -12518567 -17317575 -19600212 -16881872 -6965084 8263343
$$ packed form
37746B2604887j0038283j6726569o098436O747834M556532q937104j4506116n400307
37738b7797562M894122O077899N450227J0626243J3716537N362223p750682j3168157
37730b589150j1006199q659864n539436K779619J1425574J1515102N087447K313580
37722E326673N967378R140129O617901o5462o794349r348175n214087J490081
37714G120089K293877l313962n736197j207822Q89384m825410p615927J910341
37706a0485627J3917396J4428704P883159O291761M791287r533268k8713953k8490994
37698b9911535m480123J8412966J9609292P264732J54636J232862J064476l671493
37690I675813p761712q015361o417307m799008k282637K718340R916788J5228427
$$ plain form
37682 8263343 21046153 23605981 17058275 10005417 6594078 1805622 -8102529 -16639018
37674 -16639018 -14401255 -2343564 6977183 1057778 -19427276 -36549642 -28174477 6198130
37666 6198130 35579859 27387619 -11468294 -39058749 -28730333 1932886 20141207
37659 20141207 16697036 2165700 -16655547 -35283866 -40168710 -23262384 -763282
37652 -763282 5559722 -268942 429758 4619746 -7659463 -31672729 -34567692 -4827943
37644 -4827943 24248353 19317156 -7168802 -18296047 -4435332 10594116 7864447
37637 7864447 -4686487 -9239318 -937959 10346175 12662621 3613364 -8029405 -13586091
37629 -13586091 -16449121 -25163418 -34864161 -29756985 -9376497 3971402 -4330962 -18088788
$$ packed form
37682H263343J2782810K559828o547706p052858l411339m788456r908151q536489
37674a6639018K237763J2057691R320747n919405k0485054j7122366Q375165L4372607
37666F198130K9381729q192240l8855913k7590455J0328416L0663219J8208321
37659B0141207l444171j4531336j8821247j8628319m884844J6906326K2499102
37652g63282O323004n828664O98700M189988j2279209k4013266k894963K9739749
37644d827943K9076296m931197k6485958j1127245J3860715J5029448k729669
37637G864447j2550934m552831Q301359J1284134K316446r049257j1642769n556686
37629a3586091k863030q714297r700743N107176K0380488J3347899q302364j3757826
$$ plain form
37621 -18088788 -14249027 1437421 3225201 -15928265 -35767533 -38581897 -28247700
37614 -28247700 -16238397 -6050298 1978043 4603809 2767517 4159755 10636080 11798110
37606 11798110 -210862 -16229238 -20217499 -10753250 -2831164 -7450521 -17516360 -18899512
37598 -18899512 -10553105 -5053829 -8723283 -11781260 -5765248 -899810 -10607106 -23818830
37590 -23818830 -15107364 13615740 26257035 1685042 -32057195 -34930955 -9928374
37583 -9928374 6722505 169481 -10145145 -10095643 -9937542 -16348480 -15748527 -302061
37575 -302061 13570491 10325131 7456 -380248 5813114 5856846 2831524 8102062
37567 8102062 16758569 12397817 -6353658 -22716888 -24463966 -14054066 2661627 21598525
$$ packed form
37621a8088788L839761J5686448J787780j9153466j9839268k814364J0334197
37614b8247700J2009303J0188099Q028341K625766j836292J392238O476325J162030
37606A1798110j2008972j6018376l988261R464249P922086m619357j0065839j383152
37598a8899512Q346407N499276l669454l057977O016012M865438r707296j3211724
37590b3818830Q711466K8723104J2641295k4571993l3742237k873760K5002581
37583i928374J6650879o553024j0314626M9502J58101o410938N99953J5446466
37575c02061J3872552l245360j0317675l87704O193362M3732l025322N270538
37567H102062Q656507m360752j8751475j6363230j747078J0409900J6715693J8936898
$$ plain form
37559 21598525 33751015 29754561 14999707 6166848 7688245 4699069 -13336374 -33381275
37551 -33381275 -33958590 -13726417 5366451 2813867 -19055113 -39142617 -39214483 -20126239
37543 -20126239 1858261 12690627 12354993 9388272 8605859 9087332 11494161 19460862
37535 19460862 31455760 37564325 30133513 15353898 7895042 12575829 17159619 8702680
37527 8702680 -6755001 -10237157 3623136 17593055 16171106 7849498 10259973 21233348
37519 21233348 22761485 11268469 3323797 7490510 10971160 3457941 -4556891 -1068406
37511 -1068406 5665942 1619922 -8861530 -12042425 -9057218 -11459781 -17925668 -15317858
37503 -15317858 -1175135 12954933 19737585 20196516 11054966 -11664787 -34228903 -32272956
$$ packed form
37559B1598525J2152490l996454j4754854q832859J521397k989176j8035443k0044901
37551c3381275n77315K0232173J9092868k552584k1868980k0087504p1866J9088244
37543b0126239K1984500J0832366l35634k966721p82413M81473K406829P966701
37535A9460862J1994898O108565p430812j4779615p458856M680787M583790q456939
37527H702680j5457681l482156J3860293J3969919j421949q321608K410475J0973375
37519B1233348J528137j1493016p944672M166713L480650p513219q014832L488485
37511a068406O734348m046020j0481452l180895K985207k402563o465887K607810
37503a5317858J4142723J4130068O782652M58931r141550k2719753k2564116J955947
$$ plain form
37495 -32272956 -4711745 17904004 10679566 -14103910 -25361941 -12359350 7670617
37488 7670617 14541056 6142465 -2776754 4175399 28123649 50294367 50911360 34727699
37480 34727699 26028925 32938198 32620126 5977937 -26404319 -25582065 11771419 44167373
37472 44167373 36751787 3189931 -16691454 -8119007 7360605 7038358 -5704273 -14301743
37464 -14301743 -13803376 -10681487 -6569133 2385808 11575838 8907101 -5889873 -16251581
37456 -16251581 -11336596 -2973123 -9499982 -30689537 -50380016 -57561890 -51933614 -34147155
37448 -34147155 -6698608 17143679 22323700 12659088 7620339 14405435 18085871 6375637
37440 6375637 -10068138 -13188059 -3298760 3504773 -1095968 -8389783 -6812616 2847404
$$ packed form
37495c2272956K7561211K2615749p224438k4783476j1258031J3002591K0029967
37488G670617O870439q398591q919219O952153K3948250K2170718O16993j6183661
37480C4727699q698774O909273l18072k6642189l2382256Q22254L7353484L2395954
37472D4167373p415586l3561856j9881385Q572447J5479612l22247j2742631q597470
37464a4301743M98367L121889M112354Q954941R190030k668737j4796974j0361708
37456a6251581M914985Q363473o526859k1189555j9690479p181874N628276J7786459
37448c4147155K7448547K3842287N180021r664612n038749O785096L680436j1710234
37440F375637j6443775l119921R889299O803533m600741p293815J577167R660020
$$ plain form
37432 2847404 9480190 6282007 203698 3391824 14976773 19163366 7675613 -4897566
37424 -4897566 -1072477 11130251 8505024 -10488391 -21397140 -11122823 2728629
37417 2728629 920812 -8913199 -8838176 19807 3594896 -69546 -939506 3807489 7769046
37408 7769046 8773630 9274999 6452717 -3564500 -13587504 -11438013 1966069 12254415
37400 12254415 9440246 -3350897 -17693470 -27372202 -30004946 -29475188 -33703660 -42400190
37392 -42400190 -42776329 -26708008 -4711461 9014912 17009188 28351063 35915023 24498146
37384 24498146 -1309192 -19285992 -21020912 -20049489 -24610882 -24057587 -11333232 563317
37376 563317 -2255562 -13414952 -17873218 -13637783 -8444666 -3072891 8056714 23137817
$$ packed form
37432B847404O632786l198183o078309L188126J1584949M186593j1487753j2573179
37424d897566L825089J2202728k625227j8993415j0908749J0274317J3851452
37417B728629j807817r834011P5023Q857983L575089l664442q69960M746995L961557
37408G769046J004584N01369k822282j0017217j0023004K149491J3404082J0288346
37400A2254415k814169j2791143j4342573r678732k632744N29758m228472q696530
37392d2400190l76139J6068321K1996547J3726373P994276J1341875P563960j1416877
37384B4498146k5807338j7976800j734920R71423m561393N53295J2724355J1896549
37376E63317k818879j1159390m458266M235435N193117N371775J1129605J5081103
$$ plain form
37368 23137817 31062016 23534080 4124344 -13634617 -16335952 -3611562 9390420
37361 9390420 9815250 5344767 12207947 26099550 24013446 704161 -17269579 -7087465
37353 -7087465 18011822 29116890 20751454 10047816 6881674 6107594 3877539 867571
37345 867571 -7845603 -26055367 -41131453 -35902268 -15954311 -3851143 -4222822 1936872
37337 1936872 22098563 36294622 29333076 16583926 19066337 30387708 30531288 20176326
37329 20176326 16965007 23872516 25630152 16079637 6827850 5371942 4541039 -286596
37321 -286596 -1424461 5101889 9280210 3424399 -3849164 -1483460 6228652 7593211
37313 7593211 1348967 -5288833 -10018300 -14763042 -16407486 -10781582 -3461972 -4766781
$$ packed form
37368B3137817P924199p527936j9409736j7758961k701335J2724390J3001982
37361I390420M24830m470483O863180J3891603k086104k3309285j7973740J0182114
37353g087465K5099287J1105068q365436j0703638l166142p74080k230055l009968
37345H67571q713174j8209764j5076086N229185J9947957J2103168l71679O159694
37337A936872K0161691J4196059o961546j2749150K482411J1321371J43580j0354962
37329B0176326l211319O907509J757636r550515r251787j455908q30903m827635
37321b86596j137865O526350M178321n855811p273563K365704P712112J364559
37313G593211o244244o637800m729467m744742j644444N625904P319610j304809
$$ plain form
37305 -4766781 -14509453 -21987818 -21250423 -17275110 -16618524 -19979366 -24174482 -24426262 -15889047
37296 -15889047 -471934 9978716 6273138 -4276853 -6623145 1014751 6273761 2339618
37288 2339618 -3508885 -1991066 8860457 26479256 42935946 41789397 12939677 -25739279
37280 -25739279 -39909450 -20119095 4893350 6568091 -7857489 -12032851 756673
37273 756673 12968558 9744994 -4811591 -15239229 -9261512 9909772 19713252 -2191972
37265 -2191972 -45755594 -70308881 -52087954 -15750071 -1294368 -13811118 -28322543
37258 -28322543 -31886580 -31793073 -27658323 -7904345 21600738 34080779 17540700 -7795705
37250 -7795705 -17952861 -12287938 -2561524 6235504 12022640 8990325 -1321008 -4743629
$$ packed form
37305d766781r742672p478365P37395L975313O56586l360842m195116k51780Q537215
37296a5889047J5417113J0450650l705578j0549991k346292P637896N259010l934143
37288B339618n848503J517819J0851523J7618799J6456690j146549k8849720l8678956
37280b5739279j4170171J9790355K5012445J674741j4425580m175362J2789524
37273G56673J2211885l223564j4556585j0427638N977717J9171284R803480k1905224
37265b191972m3563622k4553287J8220927L6337883J4455703j2516750j4511425
37258b8322543l564037R3507M134750J9753978K9505083J2480041j6540079k5336405
37250g795705j0157156N664923R726414Q797028N787136l032315j0311333l422621
$$ plain form
37242 -4743629 6845755 21655550 23905490 14137553 3570436 -1931313 -1830078 5214419
37234 5214419 15614203 17178188 3314429 -15041289 -22258801 -17010767 -8586889 -639862
37226 -639862 10012201 22787164 32749616 38498649 41902501 42444740 39500259 36936301
37218 36936301 37452542 35399048 23491717 4753329 -9550947 -12391675 -5493903 5877097
37210 5877097 15914676 18341724 11188706 1960013 2267351 15078743 29296069 28704585
37202 28704585 8370624 -16342081 -21520573 -1519117 20564121 19793413 3326742
37195 3326742 1656673 25050489 48096013 45785909 26629553 15742308 19629924 25651075
37187 25651075 26795124 27427706 28015540 21750549 7408664 -6887180 -13756203 -11846200
$$ packed form
37242d743629J1589384J4809795K249940r767937j0567117n501749J01235P044497
37234E214419J0399784J563985j3863759j8355718p217512N248034Q423878P947027
37226f39862J0652063J2774963R962452N749033L403852N42239k944481k563958
37218C6936301N16241k053494j1907331j8738388j4304276k840728O897772J1371000
37210E877097J0037579K427048p153018r228693L07338J2811392J4217326n91484
37202B8704585k0333961k4712705n178492K0001456K2083238p70708j6466671
37195C326742j670069K3393816K3045524k310104j9156356j0887245L887616O021151
37187B5651075J144049O32582N87834o264991j4341885j4295844o869023J910003
$$ plain form
37179 -11846200 -3070764 6708488 7617916 -3620603 -15633566 -14724178 -3072184 4557774
37171 4557774 183057 -9758979 -13947255 -6390109 9166044 18910590 9550658 -13484547
37163 -13484547 -26848840 -17178898 1942530 11538166 12578969 14217014 10902483 -5841248
37155 -5841248 -22882695 -20010878 -4460884 -2285789 -15601775 -18809758 -2485812 10070481
37147 10070481 2009146 -10063189 -6022922 4939834 3417311 -6232750 -4733581 10237664
37139 10237664 22740569 22990928 15291687 6278734 364799 2570116 12484361 19424293
37131 19424293 15068504 5975494 3147748 5915474 7373901 8008182 10983042 11531552
37123 11531552 5589119 2296117 12256998 28973338 38192143 40154007 44112450 45430202
$$ packed form
37179a1846200Q775436R779252R09428j1238519j2012963R09388J1651994P629958
37171D557774m374717r942036m188276P557146J5556153R744546r359932k3035205
37163a3484547j3364293R669942J9121428R595636J040803J638045l314531j6743731
37155e841248j7041447K871817J5549994K175095j3315986l207983J6323946J2556293
37147A0070481q061335j2072335M040267J0962756j522523r650061J499169J4971245
37139A0237664J2502905K50359p699241r012953n913935K205317R914245O939932
37131A9424293m355789r093010k827746K767726J458427O34281K974860N48510
37123A1531552n942433l293002R960881J6716340R218805J961864L958443J317752
$$ plain form
37115 45430202 30732931 6364309 -2052801 14374724 32602373 29265079 11120364
37108 11120364 1173287 6959602 16564444 18307076 11513973 1859457 -3948897 -1390465
37100 -1390465 6762170 11239936 7278053 811456 -905842 321124 -2211675 -10983391
37092 -10983391 -24673322 -41677409 -56723322 -59964529 -47478378 -28449335 -14774796
37085 -14774796 -8289321 -5484945 -7887690 -16355473 -20402113 -8247971 12983055 22101340
37077 22101340 12027254 -807547 -1031278 5029493 2812477 -7436463 -14082704 -13765296
37069 -13765296 -13202986 -13717573 -8497947 2488319 7958729 2140691 -3586490 5031467
37061 5031467 24555930 37145033 32988764 20719197 13543576 12123754 6466566 -8486800
$$ packed form
37115D5430202j4697271k4368622q417110J6427525J8227649l337294j8144715
37108A1120364r947077N786315R604842J742632o793103r654516n808354K558432
37100a390465Q152635M477766l961883o466597j717298J226966k532799q771716
37092a0983391j3689931j7004087j5045913l241207J2486151J9029043J3674539
37085a4774796O485475K804376k402745q467783m046640J2154142K1231026R118285
37077B2101340j0074086j2834801k23731O060771k217016j0248940o646241L17408
37069a3765296N62310n14587N219626J0986266N470410n818038n727181Q617957
37061E031467J9524463J2589103m156269j2269567p175621j419822n657188j4953366
$$ plain form
37053 -8486800 -25407122 -33507113 -30182368 -20523326 -8438425 5952951 20072030 26737499
37045 26737499 22263261 11935402 2049037 -9236521 -25187875 -37531140 -31825926
37038 -31825926 -8460042 12571640 14641834 4148839 -1051385 3932330 9138584 8696669
37030 8696669 9000729 16280475 26094430 29358747 22482675 8803498 -4038333 -6242206
37022 -6242206 6946012 25998823 32165478 17973222 -2261569 -8690178 1402216
37015 1402216 14107615 18641715 17429797 16305311 14057389 7124771 -563760 -158668
37007 -158668 9129168 15672560 9004195 -4479244 -6622948 8920112 25038505 20413419
36999 20413419 -3500723 -24305358 -26039617 -13180993 4158165 24747732 47938244
$$ packed form
37053h486800j6920322q099991L324745R659042J2084901J4391376J4119079O665469
37045B6737499m474238j0327859r886365j1285558j5951354j2343265N705214
37038c1825926K3365884K1031682K070194j0492995n200224M983715N206254m41915
37030H696669L04060P279746R813955L264317o876072j3679177j2841831k203873
37022f242206J3188218J9052811O166655j4192256k0234791o428609J0092394
37015A402216J2705399M534100j211918j124486k247922o932618p688531M05092
37007a58668R287836O543392o668365j3483439k143704J5543060J6118393m625086
36999B0413419k3914142k0804635j734259J2858624J7339158K0589567K3190512
$$ plain form
36992 47938244 62983527 59624959 42753424 24490847 7532136 -10325734 -20927291
36985 -20927291 -13318154 3862696 6972678 -10235415 -26126232 -21734239 -5979599
36978 -5979599 1544776 -978559 -1851506 1954912 4856296 8637289 19396954 30560943
36970 30560943 27893545 13589057 7677907 19731480 34499701 33611260 18630335 3594997
36962 3594997 -3830171 -3380134 5360916 18785165 24392825 13403220 -4906560 -12775481
36954 -12775481 -5747671 5175732 10744950 11830496 11523298 10050739 8782985 9728092
36946 9728092 9682553 3926238 -3197657 -1431095 9289822 16147677 11051296 1522094
36938 1522094 -1120241 4461048 13649882 24709503 35131525 36019839 20003338 -8120057
$$ packed form
36992D7938244J5045283l358568j6871535j8262577j6958711j7857870j0601557
36985b0927291P609137J7180850L109982j7208093j5890817M391993J5754640
36978e979599P524375k523335q72947L806418K901384L780993J0759665J1163989
36970C0560943k667398j4304488n911150J2053573J4768221q88441j4980925j5035338
36962C594997p425168M50037Q741050J3424249N607660j0989605j8309780p868921
36954a2775481P027810J0923403N569218J085546l07198j472559j267754R45107
36946I728092m5539n756315p123895J766562J0720917O857855n096381r529202
36938A522094k642335N581289R188834J1059621J0422022Q88314j6016501k8123395
$$ plain form
36930 -8120057 -35449883 -52300724 -54423845 -40886576 -18649089 -3432517 -4567285
36923 -4567285 -12084063 -10520430 -3083960 -7817654 -28708801 -46044990 -41725460 -21324773
36915 -21324773 -2681388 5861699 5136203 -5810964 -24424073 -34741427 -21916273
36908 -21916273 2932064 11216288 -3818927 -14373540 2914894 30477096 31910608
36901 31910608 2852253 -23240829 -21373117 -4726172 1179864 -4793948 -4772943 7594265
36893 7594265 20507630 23587605 17667058 6337348 -6955047 -12601137 -1046718 20421404
36885 20421404 30681245 21014927 6977152 6724447 17596207 22996381 14485839 -2236226
36877 -2236226 -17118868 -22308732 -13735748 4540132 19956198 22634835 15109882 6249111
$$ packed form
36930h120057k7329826j6850841k123121J3537269K2237487J5216572j134768
36923d567285p516778J563633P436470m733694k0891147j7336189M319530K0400687
36915b1324773J8643385Q543087p25496j0947167j8613109j0317354J2825154
36908b1916273K4848337Q284224j5035215j0554613J7288434K7562202J433512
36901C1910608k9058355k6093082J867712J6646945N906036n973812K1005J2367208
36893G594265J2913365L079975n920547j1329710j3292395n646090J1554419K1468122
36885B0421404J0259841r666318j4037775k52705J0871760N400174q510542j6722065
36877b236226j4882642n189864Q572984J8275880J5416066K678637p524953q860771
$$ plain form
36869 6249111 -282242 -6077289 -11481644 -15440210 -17456011 -14131896 66255 21589393
36861 21589393 34559020 28722126 15299099 14078327 28244600 42027414 39749636
36854 39749636 17711743 -17221261 -48747345 -56606897 -36421696 -10772645 -4168842
36847 -4168842 -9933772 -1636789 23517442 37644330 25098566 6939331 7350137 17159714
36839 17159714 12681170 -3916820 -9079236 3086462 11832804 2595779 -12247497 -13335611
36831 -13335611 289429 15618913 24900837 29607548 31181950 28466630 23150256 19725411
36823 19725411 18899578 16748800 12329398 10930236 15536278 18868870 11030997 -5378683
36815 -5378683 -16201683 -14707025 -10398326 -11850454 -10422316 5549492 26428013 29523055
$$ packed form
36869F249111o531353n795047n404355l958566k015801L324115J4198151K1523138
36861B1589393J2969627n836894j3423027j220772J4166273J3782814k277778
36854C9749636k2037893l4933004l1526084p859552K0185201K5649051O603803
36847d168842n764930Q296983K5154231J4126888j2545764j8159235M10806R809577
36839A7159714m478544j6597990n162416J2165698Q746342r237025j4843276j088114
36831a3335611J3625040J5329484R281924M706711J574402k715320n316374l424845
36823A9725411q25833k150778m419402j399162M606042L332592p837873j6409680
36815e378683j0823000J494658M308699j452128J428138J5971808K0878521L095042
$$ plain form
36807 29523055 12323518 -1668626 3192462 13327742 10168136 -689377 -1891858
36800 -1891858 5882462 7486475 1040387 438423 10011908 17019654 13904069 9741668
36792 9741668 11753512 11830571 2759413 -5666721 -1198926 9447192 9835081 -49756
$$ packed form
36807B9523055j7199537j3992144M861088J0135280l159606j0857513j202481
36800a891858P774320J604013o446088o01964R573485P007746l115585m162401
36792I741668K011844P7059r071158q426134M467795J0646118L87889r884837
$$ [...]
##END NTUPLES=NMR SPECTRUM
##END=
