##TITLE=31Pdec_SR155_rm1k
 , 24 sc
 15.11.2022
##JCAMPDX= 6.0         $$ Bruker NMR JCAMP-DX V2.0
##DATA TYPE= NMR SPECTRUM
##DATA CLASS= NTUPLES
##ORIGIN= UXNMR, Bruker Analytische Messtechnik GmbH
##OWNER= root
$$ XWIN-NMR		Version 3.5
$$ Tue Nov 15 15:27:40 2022 Russian Standard Time (UT+4h)  she@DPX200
##.OBSERVE FREQUENCY= 81.013821
##.OBSERVE NUCLEUS= ^31P
##.ACQUISITION MODE= SIMULTANEOUS
##.ACQUISITION SCHEME= undefined
##.AVERAGES= 24
##.DIGITISER RES= 16
##SPECTROMETER/DATA SYSTEM= spect
##.PULSE SEQUENCE= zgpg30
##.SOLVENT NAME= CDCl3
##.SHIFT REFERENCE= (INTERNAL, CDCl3, 0, 248.564)
##AUDIT TRAIL= $$ (NUMBER, WHEN, WHO, WHERE, WHAT)
$$ ##TITLE= Audit trail, XWIN-NMR		Version 3.5
$$ ##JCAMPDX= 5.01
$$ ##ORIGIN= Bruker BioSpin GmbH
$$ ##OWNER= she
$$ F:/spectra/data/she/nmr/P31/1/pdata/1/auditp.txt
$$ ##AUDIT TRAIL=  $$ (NUMBER, WHEN, WHO, WHERE, WHAT)
(   1,<2022-11-15 15:26:38.42 +0400>,<she>,<DPX200>,
      <created by zg, POWCHK disabled, PULCHK disabled
       configuration hash MD5:
       00 E9 B6 7A A2 85 ED C7 34 08 36 98 17 FE 4E 26
       data hash MD5: 32K
       32 C7 21 5B 40 A3 74 81 0A E8 11 2E 78 AC 7C D6>)
(   2,<2022-11-15 15:26:40.59 +0400>,<she>,<DPX200>,
      <Start of raw data processing
       efp BC_mod = 2 LB = 1 FT_mod = 6 PKNL = 1 PHC0 = -10232.29 PHC1 = 26.45589 SI = 64K 
       data hash MD5: 64K
       D1 EC D4 90 1D 94 80 A8 40 A0 AA 1B 56 46 72 41>)
(   3,<2022-11-15 15:27:02.25 +0400>,<she>,<DPX200>,
      <pk PHC0 = -119.9401 PHC1 = 264.0001 
       data hash MD5: 64K
       8B 94 9F CB 59 D7 62 15 32 EE 85 2C 41 86 E1 05>)
$$ ##END=
$$ 
$$ hash MD5
$$ 4E 93 73 B7 17 A2 AF 6A 38 7A 53 F7 43 42 29 55
##$RELAX= 
##$RELAX= 
##$RELAX= 
##$RELAX= 
##$RELAX= 
##$RELAX= 
##$RELAX= 
##$RELAX= 
##$RELAX= 
$$ Bruker specific parameters
$$ --------------------------
##$DU= <F:/spectra>
##$EXPNO= 1
##$NAME= <P31>
##$PROCNO= 1
##$TYPE= <nmr>
##$USER= <she>
##$AMP= (0..31)
100 100 100 100 100 100 100 100 100 100 100 100 100 100 100 100 100 100 
100 100 100 100 100 100 100 100 100 100 100 100 100 100 
##$AQSEQ= 0
##$AQ_mod= 1
##$AUNM= <au_zg>
##$AUTOPOS= <>
##$BF1= 81.014009
##$BF2= 200.13
##$BF3= 200.13
##$BF4= 200.13
##$BF5= 200.13
##$BF6= 200.13
##$BF7= 200.13
##$BF8= 200.13
##$BYTORDA= 1
##$CFDGTYP= 0
##$CFRGTYP= 5
##$CHEMSTR= <none>
##$CNST= (0..31)
1 1 145 1 1 1 1 1 1 1 1 1 1 1 1 1 1 1 1 1 1 1 1 1 1 1 1 1 1 1 1 1 
##$CPDPRG= <waltz16>
##$CPDPRG1= <>
##$CPDPRG2= <waltz16>
##$CPDPRG3= <>
##$CPDPRG4= <mlev>
##$CPDPRG5= <mlev>
##$CPDPRG6= <mlev>
##$CPDPRG7= <mlev>
##$CPDPRG8= <mlev>
##$CPDPRGB= <>
##$CPDPRGT= <>
##$D= (0..31)
0 1 0 0 0 0 0 0 0 0 0 0.03 2e-05 3e-06 0 0 0 0 0 0 0 0 0 0 0 0 0 0 0 0 
0 0 
##$DATE= 1668511597
##$DBL= (0..7)
120 120 120 11 120 120 24 19 
##$DBP= (0..7)
150 150 150 150 150 150 150 150 
##$DBP07= 0
##$DBPNAM0= <>
##$DBPNAM1= <>
##$DBPNAM2= <>
##$DBPNAM3= <>
##$DBPNAM4= <>
##$DBPNAM5= <>
##$DBPNAM6= <>
##$DBPNAM7= <>
##$DBPOAL= (0..7)
0.5 0.5 0.5 0.5 0.5 0.5 0.5 0.5 
##$DBPOFFS= (0..7)
$$ [...]
##$SUBNAM2= <"">
##$SUBNAM3= <"">
##$SUBNAM4= <"">
##$SUBNAM5= <"">
##$SUBNAM6= <"">
##$SUBNAM7= <"">
##$SUBNAM8= <"">
##$SUBNAM9= <"">
##$SW= 501.771253377433
##$SWIBOX= (0..15)
0 1 3 0 0 0 0 0 0 0 0 0 0 0 0 0 
##$SW_h= 40650.406504065
##$TD= 32768
##$TD0= 1
##$TE= 0
##$TE2= 300
##$TE3= 300
##$TEG= 300
##$TL= (0..7)
0 120 53 12 22 120 120 120 
##$TP= (0..7)
150 150 150 150 150 150 150 150 
##$TP07= 0
##$TPNAME0= <>
##$TPNAME1= <>
##$TPNAME2= <>
##$TPNAME3= <>
##$TPNAME4= <>
##$TPNAME5= <>
##$TPNAME6= <>
##$TPNAME7= <>
##$TPOAL= (0..7)
0.5 0.5 0.5 0.5 0.5 0.5 0.5 0.5 
##$TPOFFS= (0..7)
0 0 0 0 0 0 0 0 
##$TUNHIN= 0
##$TUNHOUT= 0
##$TUNXOUT= 0
##$USERA1= <user>
##$USERA2= <user>
##$USERA3= <user>
##$USERA4= <user>
##$USERA5= <user>
##$V9= 5
##$VALIST= <valist>
##$VCLIST= <CCCCCCCCCCCCCCC>
##$VD= 0
##$VDLIST= <DDDDDDDDDDDDDDD>
##$VPLIST= <PPPPPPPPPPPPPPP>
##$VTLIST= <TTTTTTTTTTTTTTT>
##$WBST= 1024
##$WBSW= 4
##$XGAIN= (0..3)
0 0 0 0 
##$XL= 0
##$YL= 0
##$YMAX_a= 4160
##$YMIN_a= -6521
##$ZGOPTNS= <>
##$ZL1= 120
##$ZL2= 120
##$ZL3= 120
##$ZL4= 120
##$ABSF1= 0
##$ABSF2= 0
##$ABSG= 0
##$ABSL= 0
##$ALPHA= 0
##$AQORDER= 0
##$ASSFAC= 0
##$ASSFACI= 0
##$ASSFACX= 0
##$ASSWID= 0
##$AUNMP= <proc_1d>
##$AZFE= 0.1
##$AZFW= 0.5
##$BCFW= 0
##$BC_mod= 2
##$BYTORDP= 0
##$COROFFS= 0
##$CY= -3
##$DATMOD= 1
##$DC= 0
##$DFILT= <>
##$DTYPP= 0
##$F1P= 0
##$F2P= 0
##$FCOR= 1
##$FTSIZE= 65536
##$FT_mod= 6
##$GAMMA= 0
##$GB= 0
##$INTBC= 1
##$INTSCL= 6.047779e-11
##$ISEN= 30
##$LB= 1
##$LEV0= 0
##$LPBIN= 0
##$MAXI= 10000
##$MC2= 0
##$MEAN= 0
##$ME_mod= 0
##$MI= 50
##$NCOEF= 0
##$NC_proc= -8
##$NLEV= 6
##$NOISF1= 182.463
##$NOISF2= 159.3651
##$NSP= 0
##$NTH_PI= 0
##$NZP= 0
##$OFFSET= 248.5645
##$PC= 4
##$PHC0= -10352.23
##$PHC1= 290.456
##$PH_mod= 1
##$PKNL= yes
##$PPARMOD= 0
##$PSCAL= 0
##$PSIGN= 0
##$REVERSE= no
##$SF= 81.0140089999694
##$SI= 65536
##$SIGF1= 159.3651
##$SIGF2= -187.1042
##$SINO= 113.3802
##$SIOLD= 16384
##$SREGLST= <1H.CDCl3>
##$SSB= 0
##$STSI= 65536
##$STSR= 0
##$SW_p= 40650.406504065
##$SYMM= 0
##$S_DEV= 0
##$TDeff= 32768
##$TDoff= 0
##$TI= <>
##$TILT= no
##$TM1= 0
##$TM2= 0
##$TOPLEV= 0
##$USERP1= <user>
##$USERP2= <user>
##$USERP3= <user>
##$USERP4= <user>
##$USERP5= <user>
##$WDW= 1
##$XDIM= 65536
##$YMAX_p= 352584327
##$YMIN_p= -163496296
$$ End of Bruker specific parameters
$$ ---------------------------------
##NTUPLES= NMR SPECTRUM
##VAR_NAME=  FREQUENCY,     SPECTRUM/REAL,   SPECTRUM/IMAG
##SYMBOL=    X,             R,               I
##VAR_TYPE=  INDEPENDENT,   DEPENDENT,       DEPENDENT
##VAR_FORM=  AFFN,          ASDF,            ASDF
##VAR_DIM=   65536,         65536,           65536
##UNITS=     HZ,            ARBITRARY UNITS, ARBITRARY UNITS
##FACTOR=    0.620285442955139, 1,           1
##FIRST=     20137.2065510682, 0,            0
##LAST=      -20513.1999529968, 0,           0
##MIN=       -20513.1999529968, -163496296,  0
##MAX=       20137.2065510682, 352584327,    0
$$ Real data points
##PAGE= N=1
##DATA TABLE= (X++(R..R)), XYDATA
$$ [...]
42201E592136k558889l673511l253009j64983K315906M62571l215226k015819
42193f510824M577524Q139485K902827n057196o171735q27790K878281K086775
42185B017347J275340K181690Q54595l430694m862054n96978L425889J263971
42177B129106l848507m832394j371386J018159L12485J4464K055498L427099J693058
42168E97582l77669J208249N230534O234366J811165l976682n792175l644608
42160A290762j888654k521808k773565j36387L374631M191044K209878J44652
42152C890553p17840j245353j727053j342111l43660k04655j067119j058242J015756
42143b799724L591810L861378R53429k839219m237806k575830n92039p60920j898342
$$ y = [5592136, 3033247, -640264, -3893273, -4058256, -1742350, -1279779, -4495005, -6510824, -1933300, 6206185, 9109012, 4051816, -2119919, -2947709, -69428, 2017347, 3292687, 5474377, 6328972, 2898278, -1963776, -2560754, 865135, 2129106, -1719401, -6551795, -7923181, -6905022, -6592537, -6578073, -4522575, -1095476, 597582, 219913, 1428162, 6658696, 12893062, 14704227, 10727545, 4935370, 1290762, -597892, -3119700, -5893265, -6029652, -2655021, 1536023, 3745901, 3890553, 3172713, 1927360, 200307, -1141804, -1485464, -1690119, -2757238, -3815480, -2799724, 792086, 4653464, 5606893, 2767674, -1470132, -4045962, -4638001, -5398921, -7297263]
42134g297263j359689N27152J430132J704722L726858O322457N162416K60976
42126A0477761k554284m59071J763587q5503k476443p14625K260115N46396m558227
42117D199706o351703k957923R62400J890389R08215K7761J91591K117490M571334
42108E559260L480296k438108p574988o431062j849580J01852J61381K846652
42100f144297O341414N011544M79604j79535K939986K530677k492747m771534
42092C715112j957767q51903m202323m797915J488136P267760N423400J72955
42084F257455j413031p28400k056435k980340M13390M457414L230977j307488
42076E873542k918055j053693N55248J508487L157494L058253j095636n231363
$$ y = [-7297263, -8656952, -8129800, -6699668, -4994946, -1268088, 5054369, 10216785, 10477761, 7923477, 7464406, 9227993, 9142490, 6666047, 5951422, 8211537, 8757933, 4199706, -2151997, -5109920, -4147520, -2257131, -1348916, -1321155, -1129564, 987926, 5559260, 9039556, 6601448, -973540, -7404602, -9254182, -9152330, -8990949, -6144297, 197117, 5208661, 5688265, 5508730, 8448716, 10979393, 8486646, 3715112, 1757345, 905442, -3296881, -8094796, -6606660, 661100, 6084500, 6257455, 4844424, 4116024, 2059589, -920751, -507361, 3950053, 7181030, 5873542, 2955487, 1901794, 2457042, 3965529, 7123023, 10181276, 9085640, 3854277]
42068C854277m290101o68584K90637m00318J233446L204550J225808j931405o30506
42059A887804K753350J734835j664635M8519N134335L789449m817048r642594
42051g75985n146143P94907J121895j12773J795084K517530j946818n442446j169621
42042h364370N757489N596940p66948l955817p91323K687203J992951m86283j490628
42033A79214j417543j607425j960003k089863j499369Q70351M177484M632830
42025A285676P53150k823682j657386J047683l67140l597775j285332N957369
42017f87437Q471025J956859n352881m540939J766240M958904L041847O81753
42009A0295371r2585j634105l927458l207406J283323M686197L076062j311012
$$ y = [3854277, -435824, -1104408, -813771, -1214089, 19357, 3223907, 4449715, 2518310, 1887804, 4641154, 6375989, 4711354, 4759873, 9894208, 13683657, 8866609, -775985, -5922128, -5127221, -4005326, -4118099, -2323015, 194515, -1752303, -7194749, -8364370, -2606881, 2990059, 2223111, -1732706, -2524029, 163174, 2156125, 1669842, 179214, -1238329, -2845754, -4805757, -6895620, -8394989, -7524638, -3347154, 1285676, 2038826, -784856, -2442242, -1394559, -1761699, -5359474, -6644806, -687437, 7783588, 9740447, 4387566, -153373, 1612867, 6571771, 9613618, 10295371, 10202786, 8568681, 4641223, 1433817, 2717140, 7403337, 10479399, 9168387]
42001I168387l809242l159839j168743P77750K018424J426554j045427k819594
41993A388270j554795J182825J832069q5630j612864r46798M80372Q36270J28294
41984A648013r06797j626414q26847J857401L520809O50280m698110n734922k72303
41975f388890N224978M559693N84616k6813K568382K499781j594024m429656k601076
41966C96991R51261K456063K014972J011140m64138j714643j335671o69169k704877
41957e8071n801694m022192L392724Q614929N653318q90765k896526k64568J022391
41948D749546p29911j732880o19872m17996k139180k553916Q5630K940987L004455
41939B586863R01996j163328k067275j276518J219565L465841K866282j71215
$$ y = [9168387, 5359145, 2199306, 1030563, 1808313, 3826737, 5253291, 4207864, 1388270, -166525, 1016300, 2848369, 2762739, 1149875, 203077, 683449, 1519719, 1648013, 741216, -885198, -1712045, 145356, 3666165, 4316445, -381665, -6116587, -6388890, -1163912, 3395781, 3980397, 3953584, 6521966, 9021747, 7427723, 2998067, 396991, 1348252, 3804315, 5819287, 6830427, 6366289, 4651646, 3315975, 2646806, -58071, -5859765, -9881957, -6489233, 2125696, 7779014, 6888249, 3991723, 3727155, 4749546, 4019635, 2286755, 1666883, 1248887, -890293, -3444209, -3358579, -417592, 2586863, 3488859, 2325531, 258256, -1018262, 201303, 3667144, 6533426, 6362211]
41931F362211k488245k477525j350205n5909J615503K543186Q23628k259652k785799
41922g2807r5611J815343N65260j013878J4034J863551J531512r7500k87633P98378
41912E020649R58419k08624j517919k624972l275464j966987J404243L424307
41904A213652J502009j164550N82932N646660P068867J472813o088914q587573
41896A645896n151294l93976K166059L072958L836291L556682K51012n044542
41888C939086p627891m362087J412957L134228m15194l197853l52538M896340
41880b572952O003504K107935j935681k968368k400063k140157k069615j928096
41872g903493j839272m87984L359900O897095N138954j674845o595784m378261
$$ y = [6362211, 3873966, 1396441, 46236, -9673, 1605830, 4149016, 4972644, 2712992, -72807, -168418, 1646925, 2212185, 1198307, 1212341, 3075892, 4607404, 4509904, 4222271, 5020649, 5979068, 5770444, 4252525, 1627553, -1647911, -3614898, -2210655, 1213652, 2715661, 1551111, 2134043, 7780703, 14849570, 16322383, 10233469, 1645896, -3505398, -3899374, -1733315, 1339643, 5175934, 8732616, 8983628, 3939086, -3688805, -8050892, -6637935, -3503707, -3918901, -7116754, -7469292, -2572952, 3430552, 5538487, 3602806, 634438, -1765625, -3905782, -5975397, -7903493, -9742765, -10230749, -6870849, 26246, 5165200, 3490355, -3105429, -7483690]
41864g483690J802769M782934K088233k561155m519834k317856K147220N128916
41856i32463L736396q82797l964909k424443J315213K531712K29813k096743j330336
41847c818557J574395L235229K183584O43365J445818L552889K666474k437844
41839I045353o719430n234718o33184O29164j450804m94644M936831P497056K320900
41830I896524m446061m319933J156237L678437P15886k580373k617738j376256
41822A06723j057436r04615k23947M36252J614461L809036M286172M08947m159580
41813D316013l129586K083535L257331j552078m098394Q77228O616722M821038
41805A3191809j557336l993665j942638j600537l960080l792211j02720J734623
$$ y = [-7483690, -5680921, -897987, 1190246, -1370909, -5890743, -8208599, -6061379, -932463, 2803933, 1921136, -2043773, -4468216, -3153003, -621291, -391478, -2488221, -3818557, -2244162, 991067, 3174651, 3818016, 5263834, 8816723, 11483197, 9045353, 2325923, -2908795, -3541979, -2912815, -4363619, -4858263, 78568, 7575624, 9896524, 5450463, 1130530, 2286767, 5965204, 6681090, 4100717, 1482979, 106723, -950713, -1855328, -2079275, -1643023, -28562, 3780474, 8066646, 8475593, 4316013, 1186427, 3269962, 6527293, 4975215, 876821, 1754049, 8370771, 13191809, 11634473, 7640808, 5698170, 4097633, 137553, -3654658, -3757378, -2022755]
41797b022755j83326q37168K324360M235195R22015l165651k265157J256813J154544
41788A418870k253245k875765J203311N149900N024246K336366j19920j948259
41780G935504k869124j213023K705494N116501L442646j88186k489965l401681
41772I038166m168578l729905p58649K431796K137731j163671l240350k091135
41764a544595o3074L90098j72815j42325P96156K169811L243903K540394o03442
41755F614111l622841k990910L86416J632166q93772k838005p39808K267525J448591
41746A263473j883088k488283N81127K826816J297524j589425k157987o7299K476951
41737B59809L578344K417180q21261m298031n096508j989331K641384M629291
$$ y = [-2022755, -2206081, -3043249, -718889, 3516306, 4438321, 1272670, -992487, 264326, 1418870, -834375, -3710140, -2506829, 2643071, 7667317, 10003683, 9883763, 7935504, 5066380, 3853357, 6558851, 11675352, 15117998, 14929812, 12439847, 9038166, 4869588, 1139683, 381034, 2812830, 4950561, 3786890, 546540, -1544595, -1607669, -1217571, -1390386, -1532711, -736555, 1433256, 4677159, 7217553, 6614111, 2991270, 360, 386776, 2018942, 1125170, -1712835, -2452643, -185118, 1263473, -619615, -3107898, -2526771, 300045, 1597569, 8144, -2149843, -2217142, 259809, 3838153, 6255333, 5434072, 1136041, -3960467, -5949798, -3308414, 1320877]
41729A320877K234013j618610k208228J117501L331028K42701m634044m010643
41721d225405K193968N474145R25321n008547m030105J600995L255924l91942
41713b05646k213329J261031M825097L608947O3765j313038o80912n21543q31044
41704C993328m29793k310n17974r83877l80902L84652N24409R20185J807754J667597
41694F983069L00363l5483J309302J407654j543631m702467m778267k831271j527115
41685e417846l51442K418620M985660L740973r32073m355136l265796P64401L734885
41676A322246L214059J27939k155469j078098K013632L240972J165033j665684
41668F184630k804532k733768k440498j472349k22456o57456k424383j908966
$$ y = [1320877, 3554890, 1936280, -271948, 845553, 4176581, 4419282, -214762, -4225405, -2031437, 3442708, 4368029, -640518, -4670623, -3069628, 186296, -205646, -2418975, -1157944, 3667153, 7276100, 7339865, 6026827, 5345915, 4824372, 3993328, 3563535, 3561225, 3043251, 2059374, 1678472, 2063124, 2587533, 3507718, 5315472, 6983069, 7283432, 7247949, 8557251, 9964905, 8421274, 3718807, -1059460, -3890731, -5417846, -5769288, -3350668, 1634992, 5375965, 4443892, 88756, -3177040, -2412639, 1322246, 4536305, 4664244, 2508775, 1430677, 3444309, 6685281, 7850314, 6184630, 3380098, 646330, -1794168, -3266517, -3488973, -4146429, -6570812, -8479778]
41660h479778J879228M277015J551742k993993l756460n41722K842669M471762
41652g49537L990404M4919n981036p095427Q88121J0298384R557204l84314o563776
41643D004942k175482M777426M327739j981949n682852l532866P06766K932081
41635C375805K018681j133036l838602k822981J692589N014660L600111n78112
41627G329115l530169m351868m187551k931609k52480K204119K799930K492505
41619d28008K822512L044121J748236m33049k103001l177835l499517j753735
41611c780276J689665L461105J733927n13972j70776Q40966p20741l056447j908316
41602b424865J980509L547169J136027j736652k424365j767640k83961K751723
$$ y = [-8479778, -6600550, -2323535, -771793, -3765786, -7522246, -8063968, -5221299, -749537, 3240867, 3285786, -2695250, -9790677, -8902556, 1395828, 10953032, 10568718, 4004942, 1829460, 6606886, 10934625, 8952676, 3269824, -263042, 443724, 3375805, 5394486, 4261450, 422848, -2400133, -707544, 4307116, 7907227, 7329115, 3798946, -552922, -4740473, -7672082, -7924562, -5720443, -2920513, -428008, 2394504, 5438625, 7186861, 6753812, 4650811, 1472976, -2026541, -3780276, -2090611, 1370494, 3104421, 2590449, 2419673, 3260639, 2539898, -516549, -2424865, -444356, 3102813, 4238840, 2502188, 77823, -1689817, -1973778, 777945]
41594G77945N304130L357914k173596m821135j816563J353934l71042l514817
41586a903230k124018K128093K710702j092559l397857j137144K454219M313904
41578A952110N001317M281642k7004n999892o890817p92301M731315L112086j342827
41569D025629r79476K238436L93710n954701p500625j316709M082599K483697
41561b527440p33614R29795L667621Q33819m365957l757902J651951L106062j122793
41552b318458l010315J417848N500833L271757j088030r80930K004777K142372
41544F939854l85238q88149R72575R78239j819373l613177k569738j264649j201180
41535b850836j50438K871053M465601J869666k029150k221982J568635M717185
$$ y = [777945, 6082075, 9439989, 7266393, 2445258, 628695, 1982629, 1611587, -1903230, -4027248, -1899155, 811547, -281012, -3678869, -4816013, -2361794, 1952110, 6953427, 11235069, 11208065, 5208173, -1682644, -2474945, 2256370, 5368456, 4025629, 3046153, 5284589, 5678299, -276402, -7777027, -9093736, -5011137, -2527440, -3261054, -2331259, 1336362, 2170181, -2195776, -5953678, -4301727, -1195665, -2318458, -5328773, -3910925, 1589908, 4861665, 3773635, 2792705, 4797482, 6939854, 6554616, 5666467, 6639042, 7617281, 5797908, 2184731, -385007, -1649656, -2850836, -3001274, -130221, 4335380, 6205046, 4175896, 1953914, 3522549, 8239734]
41527H239734L577269j039306n743674p495247m893980P66421N112778L852188
41519B376183k089114o310973l878425K523044N764313L188990n86570n45893
41511D41555K157159K909598P07060j140701q17807n86758k370762m024925k519182
41502e244763J151407L218863K498587J443810J611725J150485j519431l891068
41494D19615k232891K514248N056943K757103p46840r33192J246937J696020K8612
41485I806555m04141R79255N88360k745572m693012k035230J732065J522302j731938
41476C018644l290289k115342r64241m31520J404689L666397K751545j301221
41468B738662l645850j521636J986421K847185R26962j654741l269168k419841
$$ y = [8239734, 11817003, 10777697, 5034023, -2461224, -7355204, -6588783, -1476005, 2376183, 287069, -6023904, -9902329, -7379285, -1614972, 1574018, 987448, 441555, 2598714, 5508312, 6215372, 5074671, 4256864, 3670106, 1299344, -2725581, -5244763, -4093356, -874493, 1624094, 3067904, 4679629, 5830114, 4310683, 419615, -1813276, 700972, 5757915, 8515018, 7768178, 6834986, 8081923, 9777943, 9806555, 9402414, 10381669, 10970029, 8224457, 3531445, 1496215, 3228280, 4750582, 3018644, -271645, -2386987, -3351228, -3782748, -2378059, 1288338, 4039883, 2738662, -907188, -2428824, -442403, 2404782, 3331744, 1677003, -1592165, -4012006]
41460d012006J387589M878252L447680j790544m171433j078849J955966K63164
41452H79819k454859q64434K614212K000479j825204k411250J730807N046951
41444D716521L719915K16037k116454l432223m503018m135655j871608K00346
41436g206139N15895K74271R00887J594123R37465q17778k140551j613579J080486
41427f474920M025979L821075q8920l048867p02073M163978M847722M11907l304964
41418C650917k940390j730262k295117j627475K672860O487584M919418K81170
41410I418705j351238P76709K048042J47360k571973l876681l883411k494892
41402a787379P81708L948430L679256K86541k173452j677043n32346q23768j208214
$$ y = [-4012006, -2624417, 2253835, 5701515, 3910971, -260462, -1339311, 616655, 879819, -1575040, -2439474, 174738, 2175217, 350013, -2061237, -330430, 4716521, 8436436, 8652473, 6536019, 3103796, -1399222, -5534877, -7406485, -7206139, -6690244, -6415973, -5515086, -3920963, -2983498, -3801276, -5941827, -7555406, -6474920, -2448941, 1372134, 1283214, -1765653, -2467726, 1696252, 6543974, 6955881, 3650917, 710527, -1019735, -3314852, -4942327, -2269467, 4218117, 9137535, 9418705, 8067467, 8844176, 10892218, 11039578, 8467605, 4590924, 707513, -1787379, -1005671, 2942759, 6622015, 6908556, 4735104, 3058061, 2525715, 1701947, 493733]
41393D93733q038J598881J588887Q7548j330881j561271k36950J870242K286295
41384D788446n51204l798121l116154K21367J96381m009750n012442J539403Q580982
41375a161092P224149L20972k062984J691813L354067p83511m216906j885716
41367B480792J670593R68729j275641k10020K045579P86844k318043k503181q47665
41358G97987j798413m011896k328880K079796K616736j144476j973956K665777
41350c097325N782793K406168k290813k082460K61515q60157l320689j180682
41342d381650M331873O246208K699745j493502l510591n004032n555167j686604
41334h353720N344232Q144752L490136k001892j348020K519771J834548l880974
$$ y = [493733, 485695, 2084576, 3673463, 3761011, 2430130, 868859, 631909, 2502151, 4788446, 4237242, 439121, -2677033, -2455666, -2259285, -6269035, -11281477, -9742074, -1161092, 6063057, 6384029, 4321045, 6012858, 9366925, 8583414, 4366508, 2480792, 4151385, 5120114, 3844473, 3634453, 5680032, 6466876, 4148833, 1645652, 797987, -1000426, -5012322, -7341202, -5261406, -2644670, -3789146, -5763102, -3097325, 2685468, 5091636, 2800823, 718363, 979878, 119721, -3200968, -4381650, -49777, 6196431, 8896176, 7402674, 3892083, -1111949, -6667116, -8353720, -3009488, 5135264, 8625400, 6623508, 5275488, 7795259, 9629807, 5748833]
41326E748833p406429m646558L00628J957129M28393p07243k5983J068782J416685
41317a865763J161078M37117q97334k240167k396820j001650J020745K453025
41309c329769K621074J454942l83690j464905p44186Q88264J199704n46018k211468
41300b516052j401620J064817J976745L44362o81338J848787N577739M903000
41292A1116440j286774o855699n799895l05893K364168K17269j307233J259178
41284e98439L529459P52459l690641l574996l72041n40708l546421j894899N417337
41275d518890R165323L967195k746725k437548J495693Q46106l287996l577004
41267a093846K20950J686558l03933n52031J873357K214210j71928o15312R36265
$$ y = [5748833, -1657596, -6304154, -6003526, -4046397, -3618004, -4325247, -4351230, -3282448, -1865763, -704685, -267568, -1164902, -3405069, -5801889, -6803539, -5782794, -3329769, -708695, 746247, 362557, -1102348, -1846534, -958270, 241434, -304584, -2516052, -3917672, -2852855, -876110, -531748, -1213086, 635701, 6213440, 11116440, 9829666, 2973967, -2825928, -3131821, -767653, -550384, -1857617, -598439, 2931020, 3683479, -7162, -3582158, -3954199, -4494907, -8041328, -9936227, -4518890, 4646433, 8613628, 5866903, 3429355, 4925048, 5771154, 2483158, -1093846, -872896, 813662, 509729, -42302, 1831055, 4045265, 3873337, 3258025, 4194290]
41258D194290r15236n689784n631752O87745M255757L87134l093935N23937N205498
41249g6346L163144j376582r6789M516814L751542k330513n778114l976435j489784
41240c693063l69715J489469L243895J649324j623049j715562P51753Q77198j339458
41231g29208j454372L65422k66436k540438q89910M190945N290956J85345m131321
41222B0983k399394J997689M066324L557816J416748k589476n754244l593814
41214c277368J767030K357160k970728n279676K68216N863745L405851k622415
41206d88185l120538J039081K041383j101204j798726K103188M620349J564052
41198D859400k681581j657992L719933N958188O92675o987973q068321j124542
$$ y = [4194290, 3279054, -2410730, -8042482, -7354737, -3098980, -2711846, -5805781, -5281844, -76346, 3086798, 1710216, 1613427, 6130241, 9881783, 7551270, 1773156, -2203279, -3693063, -4062778, -2573309, 670586, 2319910, 696861, -1018701, -266948, 610250, -729208, -2183580, -1818158, -2084594, -4625032, -5514942, -1323997, 3966959, 4152304, 20983, -2378411, -380722, 3685602, 7243418, 8660166, 6070690, 316446, -3277368, -1510338, 846822, -2123906, -7403582, -7135366, -1271621, 2134230, -488185, -3608723, -2569642, -528259, -1629463, -3428189, -1325001, 3295348, 4859400, 2177819, 519827, 4239760, 10197948, 10890623, 3902650, -4165671, -5290213]
41190e290213N374505M539404L82569M80825L527242K497830k236353l391035
41182E884774k34849j13834m413796n027504P65359M003061o61053m956459j136044
41173e890345M482410K839527k208845j816606J792099O33759l215606j323413
41165d707020M856741N660643j7925l179980l65674J883145j30645j791637k84404
41156A923244N32951j252598j656046R92548K529257J100613O22021K590492K452029
41147I834511j841574n090719l143340N38844J055180q35095j952629j991631
41139c426453j679152n6019K921079M713721L624355O32685l047077o176594n578763
41130h072218K25958N755862M077251k226034l828234Q31838L426944K07014k105262
$$ y = [-5290213, 84292, 4623696, 5006265, 5487090, 9014332, 11512162, 9275809, 5884774, 5649925, 5536091, 1122295, -3905209, -3139850, 863211, 202158, -4754301, -5890345, -1407935, 1431592, -777253, -2593859, -801760, -168001, -3383607, -4707020, 149721, 5810364, 5792439, 2612459, 2246785, 4129930, 3999285, 2207648, 1923244, 2456195, 1203597, -452449, 540099, 3069356, 4169969, 4791990, 7382482, 9834511, 7992937, 2902218, -241122, 297722, 1352902, 517807, -1434822, -3426453, -5105605, -5161624, -2240545, 2473176, 6097531, 6730216, 3683139, -2493455, -8072218, -7846260, -2090398, 1986853, -239181, -4067415, -3235577, 191367, 398381, -1706881]
41121a706881R13005L476544P62812j975878O38662L890325J706983k040416q42474
41112D822682K306798P00755l239317k172908K501513K672767k272675m317586
41104A002029k27832L869918L003467k3527q93047K25295J346401J899471J406687
41095A1608862o56561k724920k785801j975789k388510k467878K65669L309742
41087B184814K267024j168043j403943J294436J254470j807092j393817L815258
41079E043107N727491m30407p068379m945413K912052O134729K346023j054955
41071H664248M55053K512785N62734k339588r60209L060614L348389j140342l940533
41062A0223151o76048L956010K905412k550563m593449n63135L529770K604899
$$ y = [-1706881, -793876, 2682668, 3445480, 1469602, 2108264, 5998589, 7705572, 5665156, 4822682, 7129480, 7830235, 4590918, 2418010, 4919523, 7592290, 5319615, 1002029, 774197, 4644115, 7647582, 7624055, 6731008, 6956303, 8302704, 10202175, 11608862, 10952301, 8227381, 5441580, 3465791, 1077281, -1390597, -1124928, 2184814, 4451838, 3283795, 1879852, 3174288, 4428758, 2621666, 1227849, 5043107, 10770598, 10340191, 3271812, -1673601, 1238451, 7373180, 9719203, 8664248, 9119301, 11632086, 12194820, 9855232, 8895023, 11955637, 15304026, 14163684, 10223151, 9547103, 13503113, 16408525, 13857962, 9264513, 8701378, 12231148, 14836047]
41054A4836047o76652j926510k016179l265449l651690p91482K221516J456599
41046F186200o75650P9044J233095k137688o635633l989032M736556Q696581L288102
41037A0781575l196252k908777O79757R31438q75038R8122K633919K006262j484277
41028H666729l625264l534967l424218k892730M54652N436629P589308N074337
41020A3744476N33027k614767k806749l85136K165712J526924k191788m469028
41012E502671k395018R74612J537070K22714l6281p7309j798073k495205J461889
41003B897070O874114O774544J058883k986504j667252M86052r11518l547362
40995H978027l499424j522707l07931M17637J931943K689868N10942l227472m923736
$$ y = [14836047, 14159395, 12232885, 10216706, 6951257, 3299567, 2508085, 4729601, 6186200, 5510550, 5589594, 6822689, 4685001, -1950632, -5939664, -1203108, 7493473, 10781575, 7585323, 4676546, 5356303, 6287741, 5412703, 5510825, 8144744, 10151006, 8666729, 5041465, 1506498, -1917720, -4810450, -4355798, 1080831, 8670139, 13744476, 14277503, 11662736, 8855987, 8470851, 10636563, 12163487, 9971699, 5502671, 3107653, 4082265, 5619335, 5842049, 5805768, 5728459, 3930386, 1435181, 2897070, 9771184, 16545728, 17604611, 14618107, 12950855, 13436907, 12525389, 8978027, 5478603, 3955896, 3647965, 4065602, 5997545, 8687413, 9198355, 5970883, 1047147]
40986A047147l193595K20830K698831K386614n35872k848387r58848L856867N824436
40977H498023K414727j607445j074352J806950J118691l303164n432940k038556
40969C81934K809053L771889J199841l76009J147237K808781P52144m023446n526306
40960B945118J03600Q085684R157917J481329n939998n181068l40969m62232m797574
40951E051807m155116L153113P103611J797128m075257n08352P158569N567451
40943B1092954n921693j3473019q565597J143668M557153J703290m89433o8937
40935b1614l3223n53340Q71309L155085K570963m03558j431280K28975O47943
40926E031260j341064j674115J610705M094290J771981k219657k317958R41157
$$ y = [1047147, -2146448, -1925618, 773213, 3159827, 2623955, -224432, -1183280, 2673587, 8498023, 10912750, 9305305, 8230953, 10037903, 11156594, 7853430, 2420490, 381934, 3190987, 6962876, 8162717, 7786708, 8933945, 11742726, 12494870, 8471424, 2945118, 3048718, 11134402, 20292319, 21773648, 15833650, 10652582, 10311613, 9849381, 5051807, 896691, 4049804, 11153415, 12950543, 8875286, 8366934, 15525503, 21092954, 15171261, 1698242, -6867355, -5723687, -1166534, 536756, 47323, -21614, -54837, -608177, 263132, 3418217, 5989180, 5585622, 4154342, 4383317, 5031260, 3690196, 2016081, 3626786, 7721076, 9493057, 7273400, 4955442, 5896599]
40918E896599K215082k04452k388384j489848J56310m67542j874054m74854L334539
40909D703396M872416J509814l257906m089497q92134J171472j015238m303786
40901a301463m174380j151334Q72743R72733J683436L573648L844983J414574
40893E734940o33953L15089K537013K979273J458426m48901k262203l865060m006130
40884A808494k050602M25331J882698K830586L669923K867005k82185l283685
40876G867565l492181j556370M55929J842116J829976j139029n369623n161323
40868d722940J200316O591516M196603k022798l422865l41479l99057m321681
40860c242385m210261K337939P061952M263553m17581m68697Q61826j849864n157725
$$ y = [5896599, 8111681, 7907229, 5518845, 4028997, 4185307, 3717765, 1843711, 1368857, 4703396, 9575812, 11085626, 7827720, 3738223, 2846089, 4017561, 3002323, -1301463, -5475843, -6627177, -5754434, -4781701, -3098265, 475383, 4320366, 5734940, 5100987, 5416076, 7953089, 10932362, 12390788, 11941887, 9679684, 5814624, 1808494, -242108, 183223, 2065921, 4896507, 8566430, 11433435, 11151250, 7867565, 4375384, 2819014, 3274943, 5117059, 6947035, 5808006, 438383, -4722940, -3522624, 3068892, 7265495, 5242697, 1819832, 1478353, 1079296, -3242385, -7452646, -5114707, 1947245, 6210798, 5793217, 5324520, 6186346, 4336482, -821243]
40851h21243k708396K626013K709555k221807l836271Q18192N455125N383941
40843G405109L637823L525819K587713j726131o041495n739964k015723L73646
40835B006797K2272o92667n82774q87367j743753j036096K043163M568219K979165
40826F676959j959301n143295k988293J829077L419283L14575k544501o35151
40818a030647L883696N203937J550984l058140m131903j282571K336354L286506
40810F758216Q29320k006762j281394K708729M979816K311933k372900m688852
40802G238106m814667m953882l873291M05579M560146L369858j460608k910618
40794b439377M92985K710118N55897j568621j95398J437757M40850J25355L159276
$$ y = [-821243, -3529639, -903626, 1805929, -415878, -4252149, -3433957, 2021168, 7405109, 11042932, 14568751, 17156464, 15430333, 9388838, 3648874, 1633151, 2006797, 2029069, 1336402, 753628, -133739, -1877492, -2913588, -870425, 3697794, 6676959, 4717658, -425637, -3413930, -1584853, 1834430, 2149005, -395496, -1030647, 2853049, 8056986, 9607970, 6549830, 2417927, 1135356, 3471710, 6758216, 7587536, 5580774, 4299380, 7008109, 11987925, 14299858, 11926958, 7238106, 2423439, -2530443, -6403734, -5998155, -1438009, 1931849, 471241, -2439377, -1946392, 763726, 1319623, -248998, -444396, 993361, 1434211, 1559566, 4718842]
40785D718842M999248J033754m511203m378419L83404K664987P22065n28740J173431
40776F277369K403356Q18243j640871l239669m336162l997505n06927L753646
40768d68520L772615k60898k310655M61040L700048L297667J141478K69748l71472
40759I231051k378516l708387k341352k37976N30674J761501M699170N473502
40751A3029667N14680o303857p868203l471926J294961K958382K815879K030437
40743E000020l8815k375162k404442k00905J709713K655905L449772K548468j658786
40734H685768n257262k555732L996105N501394P1159l956371j643525R20775j654641
40725D107670l923367K18396N129349K275912m254227l864592K235776K873975
$$ y = [4718842, 9718090, 10751844, 6240641, 1862222, 2245626, 4910613, 5632678, 5103938, 6277369, 8680725, 9498968, 7858097, 4618428, 282266, -3715239, -4222166, -468520, 3304095, 3043197, 732542, 1193582, 4893630, 8191297, 9332775, 9602523, 9231051, 6852535, 3144148, 802796, 564820, 1095494, 2856995, 7556165, 13029667, 13544347, 7240490, -627713, -4099639, -2804678, 153704, 2969583, 5000020, 4961205, 2586043, 181601, -19304, 1690409, 4346314, 7796086, 10344554, 8685768, 3428506, 872774, 4868879, 10370273, 10441432, 6485061, 4841536, 5762311, 4107670, 184303, 402699, 5532048, 7807960, 3553733, -310859, 1924917, 4798892]
40717D798892l435478n493144J109839O069593K016497l237862r49743L636117
40709D514711J793028k645966q39135M168432K445427m582831n627212J329897
40701E56351N631760J742520k706620r19020K660621J858409j087607j671256
40693F065158j298977k229991j262560L936851P772390L911742m282260p827940
40685D784413m015406J969393M881189L363799j356483n484506m113181K266825
40677B296043N920843J822923m371362m537592k26684J121316j230454j567473
40669g72440J192863K186691K78236j11527K105456K562547o1038j537155k40204
40660E603429O0188j927594k206203L70008J017064k056172l418586O5591K912723
$$ y = [4798892, 1363414, -4129730, -3019891, 3049702, 5066199, 1828337, 878594, 4514711, 6307739, 3661773, 2822638, 6991070, 9436497, 4853666, -773546, 556351, 6188111, 7930631, 5224011, 4304991, 6965612, 8824021, 7736414, 6065158, 4766181, 2536190, 1273630, 5210481, 12982871, 16894613, 12612353, 4784413, 769007, 2738400, 7619589, 10983388, 9626905, 4142399, 29218, 2296043, 8216886, 10039809, 5668447, 1130855, 904171, 2025487, 795033, -772440, 420423, 2607114, 2885350, 2773823, 4879279, 7441826, 7380788, 5843633, 5603429, 5663617, 3736023, 1529820, 1899828, 2916892, 860720, -2557866, -2492275, 420448]
40651D20448J44504l854033k443263K609546M744643K894700J222568J522170
40643G261283K183371K412445K092512n7702l363820l485924J122595M870025
40635A3034785K879935r19985l04286K695579J787256k243369l185967m62116
40627A3281832P06996p89093j186603o35168l003348o379568m024077L301536
40619A272507O241215J299989l564820k065252J461642J628142R98549K670127
40611I942099K728955j623463m243196K19539N333339K062631o083630q087058
40603B49216k257800L000942L235666J770931M21890k609918n245894k675207
40595d110174K747865L167440j474097k572896K107072M065724q47226m603312
$$ y = [420448, 564952, -3289081, -5732344, -3122798, 1621845, 4516545, 5739113, 7261283, 9444654, 11857099, 13949611, 13891909, 10528089, 7042165, 8164760, 13034785, 15914720, 14994735, 14690449, 17386028, 19173284, 16929915, 13743948, 13281832, 13988828, 13199735, 12013132, 11377964, 8374616, 1995048, -2029029, 1272507, 7513722, 8813711, 5248891, 3183639, 4645281, 6273423, 7271972, 9942099, 12671054, 11047591, 6804395, 7023934, 12357273, 14419904, 8336274, 249216, -2008584, 992358, 4228024, 5998955, 6420845, 3810927, -1434967, -4110174, -1362309, 1805131, 331034, -2241862, -134790, 3930934, 3083708, -1519604]
40587a519604q48855M270874L473884O11809J714720K790018j725170n941428
40579B826248j518034N829940L827610n307557p214675J248117P117325K830586
40571I639560k920478j755195J267063m48214k431381J033533M585324J036757
40563A0006969m782132l777053J494843J442366l629110m225660J868913O240912
40555D640048L928770j39071r48125m5304K72642Q93046J246630j381976n186033
40546C280627m265968J291432L651995p57483n242596l417877J518442L448795
40538d92633K588826K017453Q63491k374733m493848k268919J407736K298794
40530d53833J877154L237190L920218J91147m621714m047830J053519L741926
$$ y = [-1519604, -2368459, 1902415, 5376299, 5988108, 7702828, 10492846, 8767676, 2826248, 1308214, 7138154, 10965764, 5658207, -1556468, -308351, 6808974, 9639560, 6719082, 4963887, 6230950, 5782736, 3351355, 4384888, 8970212, 10006969, 5224837, 1447784, 2942627, 4384993, 755883, -3469777, -1600864, 4640048, 8568818, 8429747, 7481622, 7436318, 7708960, 8602006, 9848636, 8466660, 3280627, -985341, 306091, 3958086, 3200603, -2041993, -5459870, -3941428, -492633, 2096193, 4113646, 4977137, 2602404, -1891444, -4160363, -2752627, -453833, 1423321, 4660511, 8580729, 8771876, 4150162, 102332, 1155851, 4897777]
40522D897777J744553p11743j466746k875888m765528k744340L732336Q012988
40514E823409M709382k802510o699230l718165K427773N429349J934842n107601
40506A997249q284200l430482M664218P449764L204214j499680j040658K929247
40498E989672N436121M423923J403479j070479j227731K82566K79142k903799
40490A2612894n856799m070009J222125M449120L459665R77395j331587m372819
40482G089985o771250n029686k04407J937711k11785j386128J454141L802314
40474F80895J469087k298824k554233k74804J001651J385200K008751Q78184k609367
40465c13460l521985J310404N964478L402176k535410k427045L246355M452458
$$ y = [4897777, 6642330, 5930587, 4463841, 1587953, -3177575, -5921915, -2189579, 5823409, 10532791, 7730281, 1031051, -2687114, -259341, 5170008, 7104850, 1997249, -6286951, -9717433, -5053215, 2396549, 5600763, 4101083, 3060425, 5989672, 11425793, 15849716, 17253195, 16182716, 14954985, 15237551, 15516693, 12612894, 6756095, 2686086, 3908211, 8357331, 11816996, 12794391, 11462804, 7089985, 318735, -4710951, -4915358, -2977647, -3189432, -4575560, -3121419, 680895, 2149982, -148842, -2703075, -2977879, -1976228, -591028, 1417723, 2295907, -313460, -3835445, -2525041, 3439437, 6841613, 4306203, 1879158, 5125513, 9577971]
40457I577971j774306n819091o03156P038488O678484n59878m982683k750119
40449F805710P31081R30527J47799J393781K190033j304291o993447q530562l975282
40440h604651J490208K861220J596612J690895K586361Q52512k492453k376738
40432b396034J804662M086772R15906l311350l492422j422858j061963q98312
40424e775599K251833N305017K790986k937117l860368J138672M327585J544842
40416D785851j749080m51586J854703R2402l034588j930985J895599K252033j397933
40407B316416l287498p30141K360684K207709j69256k472589m202518m207920
40399h185113j41108O447585Q759523K907299n420336p294855j981668K915443
$$ y = [9577971, 7803665, 1984574, 1381418, 8419906, 15098390, 14538512, 9555829, 6805710, 7536791, 8467318, 8615117, 10008898, 12198931, 10894640, 3901193, -4629369, -8604651, -7114443, -4253223, -2656611, -965716, 1620645, 2473157, -19296, -2396034, -591372, 3495400, 4411306, 1099956, -2392466, -3815324, -4877287, -5775599, -3523766, 1781251, 4572237, 1635120, -2225248, -1086576, 3241009, 4785851, 3036771, 2585185, 4439888, 4532290, 1497702, -433283, 1462316, 3714349, 2316416, -971082, -1701223, 659461, 2867170, 2697914, 225325, -3977193, -8185113, -8326221, -1878636, 6880887, 9788186, 4367850, -2927005, -4908673, -1993230]
40391a993230K214375j134721k020690l668K149255L038582K901438J947779R65174
40382H064294J270013J973409K10507l557898m244497L39132M708092L399000
40374A2162052m95506r62128L92032k002357n864599l567247L519688N059284
40366H241219r78167l381305L845949R929733L845341p432295r502301k502667
40358B065507J256803k122749m287849r69406J631360n75239k542901m1487L200436
40349b385525L223528K371757L146808L058569O94791j66216K034458K036459
40341A4014629l002286o103082l23793Q680341Q975093q63614r819115r255892
40333B302281k193814L676464N766862O061551N144724J386900m678035q691081
$$ y = [-1993230, 221145, -913576, -2934266, -2937934, -788679, 2249903, 5151341, 7099120, 8064294, 9334307, 11307716, 11518223, 7960325, 3715828, 4054960, 8763052, 12162052, 11666546, 10704418, 11096450, 9094093, 3229494, -337753, 3181935, 8241219, 7263052, 3881747, 7727696, 17657429, 21502770, 14070475, 4568174, 2065507, 3322310, 1199561, -3088288, -4057694, -2426334, -3001573, -5544474, -5585961, -2385525, 838003, 3209760, 6356568, 9415137, 10109928, 9943712, 11978170, 14014629, 11012343, 4909261, 4585468, 13265809, 22240902, 21377288, 11558173, 2302281, 108467, 3784931, 9551793, 15613344, 20758068, 22144968, 17466933, 8775852]
40325H775852p014290j877571N74467j783729l953245j301888K815808K004465
40317a760131k406405k621576L055038O693549K857324k951627l019778J303714
40309A150108L301661J482167k86898l80815m86243o57507O12984K240474J825922
40300H801853L60414O52153J850461O80360k354874l277402j227477L25715m42673
40291E368530j313733o90401l00942j551626k650742j360222J514544K863228
40283A878636O48384l493614m760713k91165N405114M151059m071776q302379
40275h836454j156257Q876914Q212168k031208p642398k205646N156064N434514
40267E807697J865526R55250J190617j552882m683738l513936j21615N66893l88262
$$ y = [8775852, 1761562, -116009, 458458, -1325271, -5278516, -6580404, -3764596, -1760131, -4166536, -6788112, -3733074, 2960475, 5817799, 2866172, -153606, 1150108, 4451769, 5933936, 5647038, 5266223, 4779980, 4122473, 4735457, 6975931, 8801853, 9162267, 9814420, 11664881, 12345241, 9990367, 6712965, 5485488, 5811203, 5368530, 4054797, 3364396, 3063454, 1511828, -1138914, -2499136, -984592, 1878636, 2527020, -966594, -5727307, -6018472, -613358, 3537701, -534075, -8836454, -9992711, -1115797, 7096371, 5065163, -2577235, -4782881, 373183, 5807697, 7673223, 8628473, 9819090, 8266208, 3582470, 68534, -53081, 513812, 125550]
40258A25550J008971L105353J392600k387832k474295P27087J252411j684649
40250A065196k216713J541768L684177K96245m107127l851899o7390K695898L043583
40241B083738J941814m53985l123849k974244O88978L643079K461540l81504q64685
40232C020882M44304P94811M79346Q45383K07301k715575m025008K77246O414823
40223E743513P158131K976736J111199L379804L351195k271183p628698o904205
40215F916492k507684N16450J943623L021280J623366k945312n344956j470495
40207A752764L692717K942732j745616k808872M43249J902321p502n56317J363635
40198F979111J082386k232821l158775l28172J07009m053582n237288J516754
$$ y = [125550, 1134521, 4239874, 5632474, 3244642, 770347, 1497434, 2749845, 1065196, -1151517, 390251, 4074428, 4370673, 263546, -3588353, -3655743, -959845, 2083738, 4025552, 3571567, 447718, -2526526, -1837548, 1805531, 4267071, 3885567, 3020882, 3465186, 4259997, 4739343, 5584726, 5792027, 3076452, -948556, -671310, 5743513, 12901644, 15878380, 16989579, 20369383, 23720578, 21449395, 13820697, 6916492, 4408808, 4925258, 6868881, 9890161, 11513527, 8568215, 3223259, 1752764, 5445481, 8388213, 6642597, 3833725, 4276974, 6179295, 6171793, 5615476, 6979111, 8061497, 5828676, 2669901, 2341729, 2448738, -1604844, -6842132, -5325378]
40190e325378Q401430N835280k383435m858719J41029L650088J041946k134402
40182D367839p55004K289927K353129J64709j051725p27260J84628J704773L365058
40173A1896074L527612K428183K524701L724963K170151l360190p635466n461433
40165I814595Q04456M370980K760234n83987k086651j414575K37672J475026O41058
40156A6018808k162111l476550n70874L424269K918327j619213l851584j326639
40148I354433J022003j82663p47942L153946O840708M257141q75015j46758N176613
40139B7852466N113224k823275q713602n195755K013664M132614J670471j34820
40131B3914987j037052k729647k148937K823878N827138N15240p061827n955966
$$ y = [-5325378, 3076052, 8911332, 6527897, 1669178, 1810207, 5460295, 6502241, 4367839, 3612835, 5902762, 8255891, 8420600, 7368875, 6641615, 6826243, 8531016, 11896074, 15423686, 17851869, 20376570, 24101533, 26271684, 22911494, 15276028, 9814595, 10619051, 14990031, 17750265, 17166278, 15079627, 13665052, 13902724, 15377750, 16018808, 13856697, 10380147, 9809273, 13233542, 16151869, 14532656, 10681072, 9354433, 10376436, 10193773, 9445831, 12599777, 19440485, 23697626, 22822611, 22675853, 27852466, 32965690, 30142415, 21428813, 16233058, 18246722, 22379336, 24049807, 23914987, 22877935, 20148288, 17999351, 20823229, 26650367, 27165607, 20103780, 14147814]
40123A4147814K017412M613657j075455m550756q1961M304632J402878l459241
40115A7318980k783681P70911Q99241j257728j111924M78088M40807J99944J504306
40106A6458944R44512l587189o407785k413067L295817L291443L44661J742493
40098A3669829N311879K975682m015416n928489o71662L036099N61880j905700
40090A3034102Q05375M379990L622226J406941K980346O990450P832944L422938
40082D4475312l376078q379617q740935m807034p40601l43426j909467q68867
40074A5309287K807231M590231K552700p09587l018020l685864l54789P963898
40066B5455087J4711127J1184811l90277p961034o299490l311630n812657q762908
$$ y = [14147814, 16165226, 20778883, 19703428, 15152672, 15070711, 19375343, 20778221, 17318980, 14535299, 15306210, 16205451, 14947723, 13835799, 14313887, 14754694, 14954638, 16458944, 17403456, 13816267, 7408482, 4995415, 8291232, 11582675, 11927336, 13669829, 18981708, 21957390, 17941974, 12013485, 11341823, 14377922, 14939802, 13034102, 13839477, 18219467, 21841693, 23248634, 26228980, 33219430, 41052374, 44475312, 41099234, 32719617, 23978682, 19171648, 18431047, 18087621, 16178154, 15309287, 18116518, 22706749, 25259449, 24549862, 21531842, 17845978, 17491189, 25455087, 40166214, 51351025, 50960748, 42999714, 36700224, 33388594, 27575937, 18813029]
40058A8813029n269145J067636K287060j342515l548484k836849k604736l000836
40050C565160q18686L304787M713321K188034j10435P97049K576240J548774j938300
40041A5825944l719537p06242M969160P505670M252768n16855j479354p0943j465829
40032B4594782m969822m486659P69600L949025J538945j220125J8621J255118
40024B1449485k073707o536327o455648k804422R1714J827259L493881K875707
40016A1867942j096951l665811j094341K286985J293516o77048J903811N299656
40008A6117759J989770n252088o095258J021305O251444L359639k556798m787193
40000A0048580l504145j306872J771928M819960M211850n62520m363119l295820
$$ y = [18813029, 13543884, 14611520, 16898580, 15556065, 12007581, 9170732, 6565996, 3565160, 2746474, 6051261, 10764582, 12952616, 12842181, 13639230, 16215470, 17764244, 15825944, 12106407, 11400165, 16369325, 23874995, 28127763, 27610908, 26131554, 26060611, 24594782, 19624960, 15138301, 15907901, 19856926, 21395871, 20175746, 20194367, 21449485, 19375778, 12839451, 6383803, 3579381, 3671095, 5498354, 8992235, 11867942, 10770991, 7105180, 6010839, 8297824, 9591340, 8914292, 10818103, 16117759, 18107529, 12855441, 6760183, 7781488, 14032932, 17392571, 14835773, 10048580, 6544435, 5237563, 7009491, 11829451, 16041301, 15478781, 11115662, 7819842]
39992G819842K25863K202739K510938K789078K815365J851187M57688j142294
39984A9530406l542477n591080m676877q75940K480345L336702K626611J104008
39976A4391698j308803k524302L09568N064767N413820m71062o588915o866188
39968G420583k075487L205894O202502N975967K266764k448266l489283K7942
39960A7086616K863731N35319m396965o185428l451726M35304K496729K501092
39952A1884672J564250Q88563R07776L89494j932395m170014k703724J965697
39944H794319M411236J550238k745039l174765o9060K361689K247378R93375j00229
39935A4269142p55963n45074M03936P24715J4896k57J420596K135683R10207L72530
$$ y = [7819842, 8045705, 10248444, 12759382, 15548460, 18363825, 20215012, 20672700, 19530406, 15987929, 10396849, 5719972, 4844032, 7324377, 10661079, 13287690, 14391698, 13082895, 10558593, 10868161, 15932928, 21346748, 20875686, 14286771, 7420583, 5345096, 8550990, 14753492, 20729459, 22996223, 20547957, 17058674, 17086616, 19950347, 20485666, 16088701, 9903273, 6451547, 6886851, 9383580, 11884672, 13448922, 14337485, 15245261, 15634755, 13702360, 9532346, 6828622, 8794319, 13205555, 14755793, 12010754, 8835989, 8766929, 11128618, 13375996, 14369371, 14269142, 13513179, 12968105, 13372041, 14096756, 14111652, 14111395, 15531991, 17667674, 18577881, 18950411]
39925A8950411K715956M987542L063138j419793l023529p13844Q89524j088518
39917B4360887l686170k856382J178615M970911N726314K977020j365029l849863
39909B7456303k709279o85820j837227n133264n115114l24385L514264J973240
39901A7138718p11448J884913P302401O690736j551179p909550m596925L610388
39893B1858054O448891K175655j805800p51777J759998J179824p66822L44142
39885C0442165M182560N863383K758208j837140k372397K760287R172096J0910677
39877F1879839P387076M829432Q946336J6837434J9202974J1151279k022332j0950637
39869A17261401j1526278o783516k001916J9647L21499J993245O090759R108880
$$ y = [18950411, 21666367, 26653909, 29717047, 28297254, 25273725, 24559881, 25449405, 24360887, 20674717, 17818335, 18996950, 23967861, 29694175, 32671195, 31306166, 27456303, 24747024, 24061204, 22223977, 17090713, 11975599, 11651214, 15165478, 17138718, 16427270, 18312183, 25614584, 32305320, 30754141, 22844591, 18247666, 21858054, 28306945, 30482600, 28676800, 27925023, 29685021, 30864845, 30098023, 30442165, 34624725, 40488108, 43246316, 41409176, 39036779, 41797066, 50969162, 61879839, 69266915, 74096347, 83042683, 99880117, 119083091, 130234370, 128212038, 117261401, 105735123, 98951607, 96949691, 96969338, 97290837, 99284082, 105374841, 114483721]
39861A14483721O493636j229160q641718j2099860j2795007j2527366j0716794
39854F2967452p366122m768995l824283k500649l62464l94305l523650n916890
39846C4310094n151451m216984n226344m471885O31223M749772K051133l413947
39838A9261611l002272L109393O411879L285911p46048q82886O30465L02772r19774
39829B7451051p20922O32674K079985L839701N615897N716389L520300N88992
39821D8724067j235633q83545K086406O177947P885222O027448M373786O343523
39813G9499221R379892R033195O088033M209659L125735Q60181N41083O639755
39805A19376754J4830819J4387643K513190j1096520j6328292j2891667o259644
$$ y = [114483721, 120977357, 119748197, 111106479, 99006619, 86211612, 73684246, 62967452, 55601330, 50832335, 47008052, 44507403, 44144939, 43750634, 40226984, 34310094, 29158643, 24941659, 19715315, 15243430, 15874653, 20624425, 22675558, 19261611, 16259339, 19368732, 25780611, 29066522, 28320474, 27437588, 28068053, 28370825, 27451051, 26730129, 27362803, 29442788, 33282489, 38898386, 44614775, 48135075, 48724067, 47488434, 46604889, 48691295, 54869242, 62754464, 68781912, 73155698, 79499221, 88879113, 97912308, 104000341, 108210000, 111335735, 112195916, 112736999, 119376754, 134207573, 148595216, 151108406, 140011886, 123683594, 110791927, 104532283]
39798A04532283L28284O579203J2466768J7447119J9195849J3102084j920847
39791A71730743j7037286j9602256q023694M670196M651822q878937k4629544
39784A02881044l0188881k1853029p478487O18479j206266m264044q60209M245010
39776D1893617L504161J564892P770545J6873311J3061330n297432k0581728k0316522
39768C8472174j2144658p684630n513547q8743M352672J242917m970264n146427
39760H519494q7010K068201l81281j581474R78526L214283J939101r55871k307926
39751A1406043j471555m4774J55345o28095P1093K664186K864789k010192o497380
39742F509460l957394K090774L054664k1384J276582O322981N720861l67657m32796
$$ y = [104532283, 104860567, 111439770, 123906538, 141353657, 160549506, 173651590, 171730743, 154693457, 135091201, 127067507, 131737703, 136389525, 127510588, 102881044, 72692163, 50839134, 43360647, 43979126, 42772860, 38508816, 37648607, 41893617, 45397778, 46962670, 54733215, 71606526, 84667856, 79370424, 58788696, 38472174, 26327516, 18642886, 13129339, 13040596, 17393268, 18636185, 13665921, 8519494, 8432484, 10500685, 10119404, 8537930, 9516456, 12730739, 14669840, 13713969, 11406043, 9934488, 9889714, 10045059, 9416964, 9488057, 12152243, 15017032, 13006840, 6509460, 2552066, 4642840, 7697504, 7676120, 8952702, 15275683, 20996544, 20628887, 20196091]
39733B0196091P261128R013164r34477q468795k306041P159754N623359k197200
39725C5346983l124328K092358L434184J79772j138382p15502k753936m775490
39717B8545659l030870j921398n009824m705756M656357J2037098M754736q982771
39709B6343231j0868351m41732O522949L941527P30281J758736J860665o90642
39701B9156664j111482N71482n47546l098423j514398K300718K514968J323177
39693B9595160L578845M573706j155172n171162K260924J1634891P990336r44963
39685E2362565M015760J8470665K0480323J1389054J6933183M0531114M9218934
39678B13401598K1381294j9805908l8805960l0306105j1539425O259164J9046794
$$ y = [20196091, 27457219, 36470383, 35535906, 27067111, 24761070, 31920824, 37544183, 35346983, 32222655, 34315013, 37749197, 37928969, 36790587, 36075085, 33321149, 28545659, 25514789, 23593391, 18583567, 13877811, 18534168, 30571266, 35326002, 26343231, 15474880, 15033148, 21556097, 25497624, 26227905, 27986641, 29847306, 29156664, 28045182, 28616664, 28069118, 24970695, 23456297, 25757015, 28271983, 29595160, 33174005, 37747711, 36592539, 31421377, 33682301, 45317192, 53307528, 52362565, 56378325, 74848990, 95329313, 106718367, 123651550, 164182664, 213401598, 234782892, 214976984, 176171024, 145864919, 134325494, 140584658, 159631452]
39671A59631452K1095321J5049537J5952404K7355139K8434948L069424l2801146
39664B37787079n1673039m8838908l7584623k4132619q615212R82201j328015
39657F6596864m406873L848317J3459784P364053q346974j3118664n620172l554577
39649E6221758j1533717j4567365o191573P18261k435615o235171j788982M124472
39641A8312068K370206l416336m852116k057783k06043j60413K95167J216879
39633A1501629J627540J708654R74920j556741l998996l000456P96058L298037
39625A1350645K939002J596610M01306p21021q09424J94960m37788l510354m681776
39616F322160j152849K727547K445612Q14792J670848J976421j487334l665400
$$ y = [159631452, 180726773, 195776310, 211728714, 239083853, 267518801, 270588225, 237787079, 186114040, 137275132, 99690509, 75557890, 66942678, 67924879, 66596864, 62189991, 66038308, 79498092, 86862145, 78515171, 65396507, 59776335, 56221758, 44688041, 30120676, 23929103, 24647364, 22211749, 15976578, 14187596, 18312068, 20682274, 17265938, 12413822, 10356039, 10149996, 9989583, 10284750, 11501629, 13129169, 14837823, 15812743, 14256002, 10257006, 7256550, 8052608, 11350645, 14289647, 15886257, 16287563, 15566542, 14757118, 14952078, 14514290, 11003936, 6322160, 5169311, 7896858, 10342470, 11157262, 12828110, 14804531, 13317197, 9651797]
39608I651797O13689N654943L257175k750015k410460L733026O532671M053729
39600B8336555K889923N415264P727719Q936997J1624097J5532736K1035912L3040683
39592A34539886M8110285M5567234J1450704l2389656m6402401k2866393M515194
39585A42524853N784933j1573355k2271825j6601301k412868R985464J2076456
39578A17512357j051052k1406585l1099193k3935614j3088258r645017p666969
39571I619669n00318L767126k507698r471621m772834M960325N258676j994143
39563D359182l922132O5929k71074m686592k348312O817720R500776J040488o644915
39554C911070m531714P55843N39652k219688j155247J677747J231040o95468K01606
$$ y = [9651797, 10265486, 15920429, 19177604, 16427589, 14017129, 17750155, 24282826, 28336555, 31226478, 36641742, 44369461, 53306458, 64930555, 80463291, 101499203, 134539886, 182650171, 228217405, 239668109, 207278453, 160876052, 138009659, 142524853, 148309786, 136736431, 114464606, 97863305, 95450437, 105435901, 117512357, 116461305, 95054720, 63955527, 40019913, 26931655, 17286638, 9619669, 9119351, 12886477, 10378779, 907158, -3865676, 1094649, 6353325, 4359182, 437050, 502979, 231905, -4454687, -6802999, 14721, 9515497, 10555985, 3911070, -620644, 135199, 674851, -1544837, -2700084, -1022337, 208703, -486765, -285159]
39545b85159J931142M4965l469343k942251J522789M414271L596962K277273K171467
39536I262116P76371k992824n488753l543509L85609J603173l14839j806243j062195
39527c181094J25488K56981K74956Q59860R19230L45020R86489K795516K592118
39518E974564l59005j436400K266833N607259K225286m762216o193035k41748
39510C081538N206016M401109O16140r90829o30103o06717l89186J045971K021043
39501A3754982R11207r27875j568436j067648n6767J045352N98246k433058m715244
39492E540759j848424L651488L960533k445615p472718m968795Q06338K559834
39484b16600J35848j577492l38949K452864M677368L875797j109904o119881m733279
$$ y = [-285159, 1645983, 1690948, -1778395, -4720646, -3197857, 1216414, 4813376, 7090649, 9262116, 10038487, 7045663, 1556910, -1986599, -1600990, 2183, -312656, -2118899, -3181094, -3055606, -2798625, -2523669, -1663809, -744579, -399559, 586930, 3382446, 5974564, 5615559, 4179159, 6445992, 12053251, 14278537, 9516321, 3323286, 3081538, 8287554, 12688663, 13304803, 12313974, 11683871, 11077154, 10687968, 11733939, 13754982, 14666189, 13738314, 12169878, 11102230, 11045463, 12090815, 12689061, 10256003, 5540759, 3692335, 7343823, 11304356, 8858741, 1386023, -3582772, -2776434, -216600, -80752, -1658244, -1997193, 455671, 5133039, 9008836, 7898932, 1779051, -2954228]
39475b954228J688943L826874j610399n546973m17152P281346O770910p47748
39467H291573n204976k874140J091044K562252J802323j059095n343783o417573
39459g152375j357655L872549J786043l862651k673383N645083R921337M361096
39451A0540044l634303n617267k761316j75705J319727K716024K661084P72540
39443E820828r1834J045943R55403j467636k236691K93983J154024k752105n722156
39434c000241j757216M627647M362051j953065m607787M89001O059936M780138
39426I000464p20074l359355j924172m96883o07105O8098J885848J937733o7700
39417E716854J92242M535750P375705K996072m845976o985321j992222J900701
$$ y = [-2954228, -1265285, 2561589, 951190, -4595783, -5012935, 2268411, 9039321, 8291573, 3086597, 212457, 1303501, 3865753, 5668076, 4608981, -734802, -7152375, -8510030, -4637481, -2851438, -6714089, -9387472, -3742389, 6178948, 10540044, 6905741, 1288474, -1472842, -1648547, -328820, 2387204, 5048288, 5820828, 5728994, 6774937, 7730340, 6262704, 4026013, 4319996, 5474020, 2721915, -3000241, -4757457, -129810, 4232241, 2279176, -2328611, -1839610, 4220326, 9000464, 8280390, 4921035, 2996863, 2499980, 1892875, 1960973, 3846821, 5784554, 5716854, 5909096, 10444846, 17820551, 20816623, 15970647, 8985326, 6993104, 8893805]
39409H893805k34137k615718J009132O237147M588554k681804o093578k329004
39401F774397J438122q35068n553262n997973j711774K746455M468327L574844
39393D904068P90676k435854l217218j55659L963049N087064K747662r1927j112355
39384A0479506n71138M7123m97402k425547m154381l128582J035957N085052N468158
39375A1338746K556946n5449m7042J357238J460072p77052l701365m422236j712119
39366E997739K014185K582630j117332n281802n571982k302096O81273J487778
39358a509607J842438L092001L522407J279110k090042l267203j454007R50106
39350B365203J574941K65151j736875l051181k554529k42173J980986K005892
$$ y = [8893805, 8659668, 6043950, 7053082, 13290229, 17878783, 15196979, 9103401, 6774397, 8212519, 7377451, 1824189, -4173784, -5885558, -3139103, 1329224, 4904068, 5694744, 3258890, 41672, -113987, 3849062, 8936126, 11683788, 11591861, 10479506, 9908368, 9955491, 9458089, 7032542, 2878161, -250421, 785536, 5870588, 11338746, 13895692, 13840243, 13793201, 15150439, 16610511, 15833459, 12132094, 7709858, 5997739, 8011924, 10594554, 9477222, 4195420, -1376562, -3678658, -2997385, -1509607, 332831, 3424832, 6947239, 8226349, 6136307, 2869104, 1415097, 2365203, 3940144, 4205295, 2468420, -582761, -3137290, -3379463, -1398477, 607415]
39342F07415M52836J69116K135101L791933K648690k27061j966235j679896n88801
39333E343098M58720J442684J797896O78423j522423l371998l797960k289996
39325a261556J116329M537335M536872K39611m042186l378025J138503L624964
39317F511847J359887j952020j882247P85403J797563o11146l558917l138138
39309f87768P95500M138142L416553M09628l21365J623765J889898r33701k112202
39300H218450J053693L107023j238441o878295m874836K997010O007104R35849
39292I327557l398263p51313L211329J424359l026116l051340N44112J188280
39284E468605k523237n159900k759898K561463O203088N735351K139785j447399
$$ y = [607415, 1060251, 1229367, 3364468, 7156401, 9805091, 9578030, 7611795, 5931899, 5343098, 5801818, 7244502, 9042398, 9720821, 8198398, 4826400, 1028440, -1261556, -145227, 4392108, 8928980, 9168591, 5126405, 1748380, 2886883, 6511847, 7871734, 5919714, 4037467, 4822870, 6620433, 6009287, 2450370, -687768, 107732, 4245874, 7662427, 8072055, 7750690, 9374455, 11264353, 10330652, 8218450, 9272143, 12379166, 11140725, 4262430, -612406, 2384604, 8391708, 9327557, 5929294, 5177981, 8389310, 9813669, 6787553, 3736213, 4280325, 5468605, 2945368, -2214532, -4974430, -2412967, 3790121, 9525472, 11665257, 10217858]
39276A0217858k679727k263354j711925L45578N569192J0007694O997003k457839
39268B4024480q780594o370727p36840P90031q79687q94080R07482J629647J103871
39259A0793583L80346j534656m316621m152710j66355J966906j288414m312379
39251b630300r74426M758476M971820M26271j698204L66768K204260K110534K200665
39242A1735864K187845K47697j306346P46753L078972n8319o335407p559530k019733
39233G17796L543251M145344J115428k880138n642714l528550L851289Q586064
39225I907770L594865m772321m215455M403263Q155281K979021n90521L832576
39217B3294479Q099942M360560k265832m130039l536305n619946p640821m983802
$$ y = [10217858, 7538131, 5274777, 3562852, 3908430, 9477622, 19485316, 26482319, 24024480, 15243886, 8873159, 8136319, 8926350, 8046663, 7152583, 8060065, 9689712, 10793583, 11173929, 9639273, 5322652, 1169942, 1003587, 2970493, 1682079, -2630300, -3604726, 1153750, 6125570, 6551841, 4853637, 5220405, 7424665, 9535199, 11735864, 13923709, 14171406, 12865060, 13611813, 16690785, 16632466, 10297059, 2737529, 717796, 4261047, 8406391, 9521819, 6641681, 998967, -2529583, 1321706, 9907770, 13502635, 8730314, 4514859, 8918122, 17073403, 20052424, 19461903, 23294479, 31394421, 35754981, 33489149, 29359110, 25822805, 20202859, 12562038, 7578236]
39209G578236o70525L95685M50645L146369M729195M54394n204770m668743K90138
39200F500624K100799L76208J073032M406327M158414o92810l528610j196808
39192A3197176J086990r51937l816844k879354k0769L78863q10617Q05733N260649
39183A2249890P245525L915663j69829J197759O856128Q903996L103917n175472
39175C8127577q130852n352801k245681j267502n57912N7991j439894l515818
39167A5675108j863024K580711L395866j091709m218234r65657M956572P845046
39159B6314679P455357N481860J216302m009646m489241J321311N526081J074657
39151C9891360p417318j0346982o415730j790175K40530Q75036J27194k401043
$$ y = [7578236, 6907711, 7303396, 7754041, 10900410, 15629605, 16083999, 10879229, 6210486, 6500624, 8601423, 8977631, 10050663, 14456990, 18615404, 17922594, 14393984, 13197176, 14284166, 13332229, 9515385, 6636031, 6615262, 6994125, 6183508, 6989241, 12249890, 19495415, 23411078, 23241249, 24439008, 31295136, 40199132, 43303049, 38127577, 29996725, 24643924, 22398243, 21130741, 20572829, 20630820, 19190926, 15675108, 13812084, 16392795, 19788661, 18696952, 14478718, 13513061, 18469633, 26314679, 33770036, 39251896, 40468198, 36458552, 31969311, 33290622, 38816703, 39891360, 32474042, 22127060, 15711330, 13921155, 14161685, 15036721, 15163915, 12762872]
39143A2762872l387181k06385K750718J29889m357249k903680L045805M409174
39135A2243963o78074m001151j010322K598256J569343p21008J84058J669119
39127A1854184l92370l523982k609507J492016L260613P48932k295497k026403
39119F507986J087569L482595K446271j036752l123062j663507Q24441P79864
39111I305405r77488r23713Q17902M60981k660939m277249j873019J306987J480330
39102B659197k12537m38998J019363J760678P48414o78685p27781J180851L413750
39093H724252K581918k647394q012750p261525k29247O138095O222051J731105
39085G246505k316045l745055k963356k86984L109752M339498K257266l48786
$$ y = [12762872, 9375691, 9169306, 11920024, 12049913, 7692664, 4788984, 7834789, 12243963, 11565889, 7564738, 6554416, 9152672, 10722015, 10001007, 10185065, 11854184, 11461814, 7937832, 5328325, 6820341, 10080954, 10829886, 8534389, 6507986, 7595555, 11078150, 13524421, 12487669, 9364607, 7701100, 8525541, 9305405, 8327917, 7404204, 8222106, 8683087, 6022148, 1744899, -128120, 1178867, 2659197, 2446660, 2007662, 3027025, 4787703, 5536117, 4857432, 4129651, 5310502, 8724252, 11306170, 8658776, 646026, -6615499, -6844746, -706651, 5515400, 7246505, 4930460, 1185405, -1777951, -2064935, 1044817, 5384315, 7641581, 7292795]
39077G292795q50083n68537j362827j320794J765062M759027K408967m211627
39069G911983p708638l898650K909939N941817L848337L26785j502749j508133
39061F320691o81936L72223J086554Q59654j48158r35317o71294M81170J474612
39052H158199J145096p65601l058334l954679k908215j122887J22496R91284K131894
39043G39253K910330K085550J11796j016629o97038o04736j591291j743945M68149
39034F61439K892281K468447K41815K5328K236832L118279J090992k44796K174272
39025A4664889N642353N545815K103443m64003k31682N11400p45376l737830o349256
39016A6939753o352087k785120K181726L696792n92810o439478p332068k758628
$$ y = [7292795, 6442712, 5874175, 4511348, 3190554, 4955616, 9714643, 12123610, 7911983, 203345, -3695305, -785366, 5156451, 9004788, 9331573, 7828824, 6320691, 5638755, 6010978, 7097532, 7957186, 7809028, 6873711, 6202417, 6683587, 8158199, 9303295, 8537694, 5479360, 1524681, -1383534, -2506421, -2383925, -1392641, 739253, 3649583, 5735133, 5846929, 4830300, 4133262, 3528526, 1937235, 193290, 661439, 3553720, 6022167, 6263982, 6289310, 8526142, 11644421, 12735413, 12490617, 14664889, 20307242, 25853057, 27956500, 27492497, 27260815, 27772215, 27026839, 23289009, 16939753, 10587666, 7802546, 9984272, 13681064, 13088254, 6648776, -683292, -3441920]
39008c441920J446121J426155o7479Q76558L041480K652406j2209q14884J555206
38999F661434K999749J9832m228740l234321L760047R355773O630531k112796
38991A9851509q273694p446173l158941k00245J092049J947063J105599k294394
38983B622773m723689k181883K978194M119555m05875m563881k886890K182555
38975b859141L930518K98666l897452l442150R90373M216867L177808K58307o64177
38966B009619L90564M11320j202672j552281Q35656L405189L590031K506658K527663
38957A2921747L762601N083523N957022N132314R08759m507531n044969O15055
38949B4828521M661213L41378p043653p095555k12252K746796k822774q575333
$$ y = [-3441920, -1995799, -569644, -637123, 239435, 3280915, 5933321, 5921112, 5106228, 6661434, 9661183, 9681015, 5452275, 2217954, 5978001, 15333774, 21964305, 19851509, 11577815, 4131642, 972701, 772456, 1864505, 3811568, 4917167, 2622773, -2100916, -4282799, -1304605, 2814950, 2409075, -2154806, -5041696, -2859141, 1071377, 1370043, -2527409, -5969559, -4979186, -762319, 2415489, 2673796, 2009619, 2400183, 2811503, 1608831, 56550, 892206, 4297395, 7887426, 10394084, 12921747, 16684348, 21767871, 27724893, 32857207, 33765966, 29258435, 24213466, 24828521, 29489734, 29831112, 22787459, 15691904, 15479652, 18226448, 15403674, 6828341]
38941F828341o640653r60452P54286n06957J419478N899909N839332n38734n951325
38932F143225m188311J587584L991408J241616k165572k881525k386917k638463
38924a296955j957539J754049N773624M733667j705065p173702o188977l80468
38916f441366M734427O095407L852180p95581m999781m590349O11452M314846
38908B781235J447943l972318m304857L10577K789093M87673j785887p95043P23453
38899b318131O93388J439663L686955L602390j79754k745586o96279J958516R10596
38890F351758q39923J222457M240065K258585l378174n433595j582877K913753
38882E752049L351884O13620k314929l695450k351735J583335M518801K588121
$$ y = [6828341, 187688, -772764, -18478, -525435, 894043, 6793952, 12633284, 12094550, 6143225, 1954914, 3542498, 7533906, 8775522, 6609950, 3728425, 1341508, -1296955, -3254494, -1500445, 4273179, 9006846, 7301781, 128079, -6060898, -6441366, -1706939, 4388468, 8240648, 7445067, 2445286, -2145063, -1533611, 2781235, 4229178, 256860, -4047997, -3737420, -948327, -460654, -2246541, -3041584, -2318131, -1624743, -185080, 3501875, 7104265, 6924511, 4178925, 3482646, 5441162, 6351758, 5511835, 6734292, 10974357, 13232942, 9854768, 4421173, 2838296, 5752049, 9103933, 9717553, 7402624, 3707174, 1355439, 2938774, 7457575, 10045696]
38874A0045696k117257l154690R92541M043987R88915m214966m137384J422652
38866C869494M991531J531778n031322p119578k877330K519462M258966L399180
38858E542181L565911M859221M422338J952592L31579J33310j982227o981220
38850A1843685r549005m605630M538324R145791N667638n68437k709087j19805
38842A3643474K462150J342193k180361l757885j195574K724855L461518M70597
38834A6970967k315559k177815q47973o07949n69218L42627n145l152056n391828
38825B246051k247129L605151M685215p02373n791148m785618m280K852557K384153
38816B242579J213799R83851J001110L51885j055746k526847k508700l15530J376129
$$ y = [10045696, 7928439, 4773749, 5766290, 9810277, 10799192, 6584226, 2446842, 3869494, 8861025, 10392803, 5361481, -1758097, -4635427, -2115965, 2143001, 5542181, 9108092, 13967313, 18389651, 20342243, 20673822, 20807132, 18824905, 11843685, 2294680, -2310950, 2227374, 11373165, 17040803, 16472366, 13763279, 13643474, 16105624, 17447817, 15267456, 11509571, 10313997, 13038852, 16500370, 16970967, 14655408, 12477593, 11629620, 11021671, 10452453, 10795080, 10789935, 7637879, 2246051, -1078, 3604073, 8289288, 7586915, 1795767, -2989851, -2994131, -141574, 2242579, 3456378, 4440229, 5441339, 5793224, 4737478, 2210631, -298069, -613599, 762530]
38807G62530j063330n810160n723353J821724R138864P383334j105795n884020
38799d80206k871093J308283O81883j572943m5419L263665K518305j783840l190604
38790b171969M95427L767352J888296k340616l331700n64564J993398K111144
38782A846768J140046N02278k28467j462381k320357j980443q45279J20811L42661
38773b884363j32293p16808r24768j340027k962857m992000m849119j597918K401330
38764a7998823M738769N737008O023930M087345m54875l718759k203453J285158
38756b503700J594204l37568N82754L733477K686638l344259o145485p70766O009540
38747A504835N441435p30454m376011l223983j438677q66759L48053J705825N83581
$$ y = [762530, -300800, -6110960, -11834313, -10012589, -873725, 6509609, 5403814, -480206, -3351299, -2043016, -1361133, -2934076, -2979495, 284170, 2802475, 1018635, -2171969, -1676542, 2090810, 3979106, 1638490, -1693210, -2257774, -264376, 1846768, 2986814, 3489092, 3260625, 1798244, -522113, -2502556, -3347835, -3227024, -2884363, -3016656, -3733464, -4658232, -5998259, -8961116, -13953116, -18802235, -20400153, -17998823, -13260054, -7523046, -1499116, 2588229, 2133354, -1585405, -3788858, -2503700, -909496, -1247064, -664310, 3069167, 5755805, 2411546, -3733939, -4504705, 1504835, 6946270, 6215816, 1839805, -1384178, -2822855, -3689614, -3341561, -1635736, -1052155]
38738a052155j583289n06526L015810L285353r64581m205397l007831o54198j70520
38729e843334O28182L267718M001588K64102l368785j718520K308596K044806
38721A584353k464115m915514k429496J557835L793233M615208M358772J997937
38713H098213j258496j947677L29960J865344P65957l57443M91193J335265M98883
38704I821199j29231O78185J78116l323383n803211k876930K771127M611768J293035
38695G220675k731582m376975m301902k771016R87732M791284M457633J30273
38687C406122l186289k765192j090002l43838P60677K640741K784829Q73445O53679
38678C734172L221831L744485p13146n157870l938794K96352J169228j353934
$$ y = [-1052155, -2635444, -3141970, -126160, 3159193, 2194612, -2010785, -5018616, -5672814, -5843334, -5215152, -1947434, 2054154, 2318256, -1050529, -2769049, -460453, 1584353, -879762, -5795276, -8224772, -6666937, -2873704, 1741504, 6100276, 8098213, 6839717, 4892040, 5222000, 7087344, 7853301, 7495858, 7987051, 9322316, 9821199, 9691968, 10370153, 10548269, 7224886, 1421675, -1455255, 1315872, 5927640, 7220675, 4489093, 112118, -4189784, -6960800, -5973068, -1181784, 3275849, 3406122, 219833, -2545359, -3635361, -3979199, -3218522, -577781, 2207048, 3080493, 3734172, 6956003, 10700488, 9987342, 4829472, 890678, 1187030, 2356258, 1002324]
38670A002324k277473n58746L50580l00632J56151J539802M33409l246815n065620
38661g967020k536549J934678N150572N843776L478443r32788l244535o24978
38653A101599K959995J549053l111605l622085J164879M175045J616655j595875
38645D237661r36201Q04430j25502j812917j265571n8224n46877j256731n70249
38636a530181l64025j520233n64818M289499Q090139N418750j700023o862404
38628E256704p069608l501459J607153M752355K147461m478536p383853k826957
38620a1496740L118507L805282J573618J695841K451695l70284l529116o48277
38612c399474N912824P337581J916958k781656j831980J269568K006396O07150
$$ y = [1002324, -1275149, -1833895, -1483315, -1783947, -1627796, -87994, 345415, -2901400, -7967020, -10503569, -8568891, -3418319, 2425457, 5903900, 4971112, 1726577, 1101599, 4061594, 5610647, 2499042, -1123043, 41836, 4216881, 5833536, 4237661, 3301460, 4105890, 3980388, 2167471, 901900, 843676, 296799, -959932, -1530181, -1894206, -3414439, -3979257, 310242, 8400381, 13819131, 12119108, 5256704, -1812904, -5314363, -3707210, 1045145, 3192606, -1285930, -8669783, -11496740, -8378233, -4572951, -2999333, -1303492, 1148203, 777919, -2751197, -3399474, 2513350, 9850931, 11767889, 8986233, 7154253, 8423821, 10430217, 11037367]
38604A1037367j285732l258150l807019j158068K303753J964500j613912k854086
38596A328653J43979K816586J629894j101150j921272j027475l12167m98151j636118
38587e77221l019888k251745J699031M800761K248364l572573m994117L44560
38579e322828O365596P197323L632127m78124l140731l770841k356057p29691
38571A396774r29268j679431m19392J604885J222784l92153O63090L577017L729971
38562H774277R25464o07172m73720k159589m411404j990545L518471L952927j609743
38553E918966m119354K56762L633091R56267p68383L882069P194503J341544o652890
38544A1642575n753792P36181J550984l147729l467198J982596M417306J114113
$$ y = [11037367, 9751635, 6493485, 2686466, 1528398, 3832151, 5796651, 4182739, 1328653, 1472632, 4289218, 5919112, 4817962, 2896690, 1869215, 1557048, 1058897, -577221, -3597109, -5848854, -4149823, 650938, 2899302, -673271, -5667388, -5322828, 1042768, 8240091, 11872218, 11394094, 8253363, 4482522, 2126465, 1396774, 467506, -1211925, -1631317, -26432, 1196352, 804199, 1467289, 5044306, 8774277, 9699741, 9092569, 8618849, 6459260, 2047856, 57311, 3575782, 7528709, 5918966, 1799612, 2056374, 5689465, 6645732, 5877349, 9759418, 16953921, 18295465, 11642575, 5888783, 6624964, 8175948, 5028219, 1561021, 3543617, 7960923, 9075036]
38536I075036q82026J055081N95668m475501o920055k763480J482250L49970j374139
38527c857196J954878O305533M899221k91965k195750J79654J842594M86915j847945
38518G475939m009863o143092n890406n46550O779739Q895211L794990k370473
38510G985495l452968o28742Q94872m87010j835112j113275n0195p90559k175455
38501a652949j450700J200917K308986J5065k682806j485535L333947O875547
38493F462472N570793J232292j630881j018720J228991K304264J153888j394067
38485A3909032l782414m538290l018753l72903Q11721p51263k695055j255304
38477a693229L287244N511725J354855n696275p899233k543773M914177P501072
$$ y = [9075036, 8193010, 9248091, 9843759, 5368258, -1551797, -4315277, -2833027, -2483057, -3857196, -1902318, 4403215, 9302436, 9010471, 6814721, 6994375, 8836969, 9323884, 7475939, 3466076, -2677016, -8567422, -9113972, -2334233, 6560978, 10355968, 7985495, 4532527, 3903785, 4798657, 4311647, 2476535, 1363260, 1313065, 522506, -1652949, -3103649, -1902732, 406254, 421319, -2261487, -3747022, -413075, 6462472, 12033265, 13265557, 11634676, 10615956, 11844947, 14149211, 15303099, 13909032, 10126618, 5588328, 2569575, 2196672, 3008393, 2257130, -437925, -1693229, 1594015, 7105740, 8460595, 2764320, -5134913, -7678686, -2764509, 4736563]
38469D736563L996131j255134l553904j765727J357321J983527m99475k223099
38461B776203L25674M976104O278484K723243k052467n008152o191457n234156
38453a406524q41754M582583N438931R49086k519326o64030K328486R61148k836962
38444E991638l649602j283163N59149J320103K944339M218170K114796k178591
38436A0036839m297815l212970j660174q06690M99579J717870P41522k129456
38428H88705m378254m764582l213489P39277N371017N714463L77877l991047j632723
38419d888756K627946J018965l289744q74462O960572Q681150J326146m421673
38411G140144k080243P07360k959436o448279j603919N983938N564631j252508
$$ y = [4736563, 8732694, 7477560, 3923656, 2157929, 3515250, 5498777, 4999302, 2776203, 3101877, 8077981, 14356465, 17079708, 15027241, 10019089, 3827632, -1406524, -2248278, 2334305, 7773236, 8722322, 6202996, 5538966, 7867452, 8828600, 5991638, 2342036, 1058873, 1618022, 2938125, 5882464, 10100634, 12215430, 10036839, 5739024, 2526054, 865880, 59190, 558769, 2276639, 3018161, 888705, -3489549, -8254131, -11467620, -10728343, -5357326, 357137, 735014, -3256033, -4888756, -2260810, -1241845, -4531589, -5406051, 1554521, 10235671, 11561817, 7140144, 5059901, 5767261, 2807825, -3640454, -5244373, 739565, 6304196, 5051688]
38403E051688l816143K09887K710953n49190m281251l660914j045084j02089L5267
38394e446876J759339M612291O180068M611039k38281n619646o782633k295406
38386c220105K958534L824330J880214J709520K504579j49402n149174n854853
38378a496357j69023N889097O622248L152761n55530l022839m173122l461803
38370B785432j704338j141769j739279j021930J031556J220389j147391k448171
38362d165501p52186J154476J140714J045838J810517Q33929k137838k344774
38354c414825J939476M663652J588884j227297L128575R353115O845755k840570
38346B0036765p350021k645155J506886j516396m784144j066692L940779J458923
$$ y = [5051688, 1235545, 1445432, 4156385, 3607195, -674056, -4334970, -5380054, -5482143, -5446876, -3687537, 924754, 7104822, 11715861, 11477580, 5857934, -924699, -3220105, -261571, 3562759, 5442973, 7152493, 9657072, 9507670, 4358496, -1496357, -1665380, 4223717, 10845965, 13998726, 13443196, 10420357, 6247235, 2785432, 1081094, -60675, -1799954, -2821884, -1790328, -569939, -1717330, -4165501, -4917687, -3763211, -2622497, -1576659, 233858, 1067787, -1070051, -3414825, -1475349, 3188303, 4777187, 3549890, 6678465, 16031580, 22877335, 20036765, 12686744, 10041589, 11548475, 10032079, 5247935, 4181243, 8122022, 9580945]
38338I580945m731318m066390L260788O481859J409951l830112k433367J600216
38330G272572J964519o0150j03400R17994l61031k421056j199041K259257K938216
38321A1207880N0192j823227l68800R85919j043030m530147n580838l523400l60724
38312d986175K594122M908206N497403L590255N12323j593401k340484k651951
38304E530298k433147q83382J037992R06134j571455l194770j021405L592795
38296A963060O297553M710770O78327k420838l293182l129669l348411l861435
38288b403825l457053j456645J116497K267369J352927K62199J164795L223515
38280B069779L321260O64201j463100k28624K328909K111796q99550k668493j219613
$$ y = [9580945, 4849627, 783237, 4044025, 10525884, 11935835, 8105723, 5672356, 7272572, 9237091, 9176941, 9073541, 9991535, 9630504, 7209448, 6010407, 8269664, 11207880, 11258072, 9434845, 9066045, 10051964, 9008934, 4478787, -1102051, -4625451, -4986175, -2392053, 2516153, 8013556, 11603811, 12116134, 10522733, 8182249, 5530298, 3097151, 2213769, 3251761, 4157895, 2586440, -608330, -1629735, 1963060, 8260613, 12971383, 13649710, 11228872, 7935690, 4806021, 1457610, -2403825, -5860878, -7317523, -6201026, -3933657, -2580730, -2318531, -1153736, 2069779, 5391039, 6055240, 4592140, 4363516, 6692425, 8804221, 7904671, 5236178, 4016565]
38271D016565Q04427P67424q0888N29545J686920P77780k176487m336238l744584
38262a755536j198611J318415K467730K009488P10597l09256q31577j582146k614390
38253a785286k944698k487196k521639k994301j532180K713532O202230M942049
38245d07489J87969k806396j259086K555268M760775L401248r49441n387001n967157
38236e871310j697617L124700L584031O52434n45977J446662K936090J943305
38228E572318J291338K686328K773787j127054n327195m622404l76576J381712
38220B252254j086252l199887j330572K347625L792652K436651L87887j337011
38212D263347l111069m264671l010813P09286L962186L631515P9325l034416k743884
$$ y = [4016565, 4820992, 5588416, 5507528, 6037073, 7723993, 8501773, 6325286, 1989048, -1755536, -2954147, -1635732, 831998, 2841486, 3552083, 3242827, 2411250, 829104, -1785286, -4729984, -7217180, -9738819, -12733120, -14265300, -11551768, -5349538, -407489, -219520, -3025916, -4285002, -1729734, 3031041, 6432289, 5482848, 95847, -5871310, -7568927, -4444227, -860196, -207762, -753739, 692923, 3629013, 5572318, 6863656, 9549984, 12323771, 11196717, 5869522, 1247118, 870542, 2252254, 1166002, -2033885, -3364457, -1016832, 2775820, 5212471, 5600358, 4263347, 1152278, -3112393, -6123206, -5413920, -1451734, 2179781, 2259106, -775310, -3519194]
38203c519194K86573L213394M282996L552060J368617j848102m424771m164353
38195a252780j012844K472401L977442L472956K038130L58874q74163q26716J34700
38186H488000M48065k95514o04647K38914N94600r66637l238951m225219l719426
38177c280815k235405O30986M225315N168249J263622l928170m437241J52830
38169b440629M049020L384538R82108R57460K184404O67769l552253n830222l179264
38160b777069J912004M721896L406907q748k410850k423545j147420o67444j518099
38151i12368j797660L44558L677541N051542L855430L013764M189279M600102
38143B2022188J802391k00117N055107J5443057J8869385P305944j1252717k0716038
$$ y = [-3519194, -3232621, -19227, 4263769, 7815829, 9184446, 7336344, 2911573, -1252780, -2265624, 206777, 4184219, 7657175, 9695305, 10054179, 9180016, 8353300, 8488000, 8936065, 8640551, 8035904, 8274818, 8869418, 7902781, 4663830, 438611, -3280815, -5516220, -4885234, -659919, 4508330, 5771952, 1843782, -2593459, -2440629, 1608391, 4992929, 5975037, 6932497, 9116901, 9784670, 6232417, 402195, -2777069, -865065, 3856831, 7263738, 7254990, 4844140, 2420595, 1273175, 605731, -912368, -2710028, -2365470, 1312071, 6363613, 10219043, 13232807, 17422086, 22022188, 23824579, 23624462, 28679569, 44122626, 62992011, 70297955, 59045238, 38329200]
38135C8329200j5725880o427236l601404n645718m323883J664881N508590L105385
38127A2883935j493863k800417j073630k3013o20786o58645R81421K707401K668215
38118A2570618P23447k024239m097528m186535k298002j76595Q65280K000695
38110C377141M654587O702229M303055j574818m379231n46027M456892L092662
38102B0086490l304228o210043k213339K695824K906105R43268J474653L137876
38094A9516606K573416K707033Q804570J7119719J6166673K069539j4122887j8979487
38086C5855182j2011264l647801j257898k865076l473333j922988k51531o08r86262
38077I438421j872099j108833J177496K206133l61051m249242m504339n84782
$$ y = [38329200, 22603320, 16176084, 12574680, 6928962, 2605079, 4269960, 9778550, 12883935, 11390072, 8589655, 7516025, 7493012, 6872226, 6213581, 7195002, 9902403, 12570618, 13294065, 11269826, 7172298, 2985763, 687761, 511166, 1376446, 3377141, 8031728, 14733957, 19037012, 17462194, 13082963, 12536936, 16993828, 20086490, 16782262, 10572219, 8358880, 11054704, 13960809, 14904077, 16378730, 19516606, 22090022, 24797055, 33601625, 50721344, 66888017, 68957556, 54834669, 35855182, 23843918, 20196117, 18938219, 16073143, 12599810, 10676822, 10425291, 10424683, 9438421, 7566322, 6457489, 7634985, 9841118, 9480067, 5230825, 726486, 141704]
38069A41704J921544q98489m981498l915309J270468L597610J209289K91255M411000
38060C047574P484237K958124m857193o414492j473938R14966k832222n540579
38052f713523j826080K990836K345789n83736Q54532M916982M890926J224445
38044H100171O30353L903531M062897j860973p403047o081003P2259M668253M774430
38035A0866871J682315k077424m023446l234444j861241k003458j489096K413863
38027B73940N935412K619340n269673p639519j367122M571303K983746j322223
38019G85204j324983N53287j173386l860562j699529K813766K593853j647301
38011b959651k798207K60221J612349l44239l13743L366572M611521m29086o395506
$$ y = [141704, 2063248, 1164759, -3816739, -7732048, -6461580, -2863970, -1654681, -1363426, 3047574, 10531811, 13489935, 8632742, 2218250, 744312, 1659278, -1172944, -6713523, -8539603, -5548767, -3202978, -3786714, -2932182, 1984800, 6875726, 8100171, 8730524, 12634055, 16696952, 14835979, 7432932, 1351929, 1424188, 6092441, 10866871, 12549186, 10471762, 6448316, 3213872, 1352631, -650827, -2139923, 273940, 6209352, 8828692, 3559019, -4080500, -5447622, -876319, 2107427, 785204, -539779, 13508, -1159878, -5020440, -6719969, -3906203, -1312350, -2959651, -5757858, -5497637, -3885288, -4229527, -4543270, -1176698, 3434823, 3005737, -3389769]
38002c389769o105525l2942N488844O171945K897056o18950j205707J075552K966725
37993G247229K136753J76177p60324j841960m208906m654440m16004M162747L003215
37984D844487j274582q13153M038947M565615j536501n668952k522962J332708
37976B965607q23367m580617k847256J763780K299329j56680N71447L814601L245924
37967F252768j336498l240894l91155J459720r40177k892826j06187M137590M587349
37958G529690J853227l4447k86589p38947r02272J340738M704607M715219m9837
37949A8131389n253114o115079l207847p13024l89181k94452P40292R80164l77737
37940C501411o65467J793795L374171o8691n516447n589930O30103N557888L857235
$$ y = [-3389769, -9495294, -9528236, -4039392, 2132553, 5029609, 4410659, 3204952, 4280504, 7247229, 9383982, 9560159, 8799835, 6957875, 2748969, -1905471, -2321475, 1841272, 4844487, 3569905, 2756752, 6795699, 11361314, 9824813, 4155861, 1632899, 2965607, 2142240, -2438377, -5285633, -3521853, -1222524, -1379204, -807757, 3006844, 6252768, 4916270, 1675376, 1284221, 2743941, 1803764, -1089062, -1195249, 2942341, 7529690, 9382917, 9348470, 9061881, 8322934, 7420662, 8761400, 13466007, 18181226, 18131389, 12878275, 6763196, 3555349, 2842325, 2453144, 2158692, 2898984, 3879148, 3501411, 2835944, 4629739, 8003910, 7935219, 2418772, -3171158, -2541055, 3016833, 6874068]
37931F874068n42454j643421k65110o93050k586394k383008l27106K86743j64493
37922a444225K012238O412222P350511J901401n340968p814686m301463J067731
37914a57239L716833K144141j522935l469547k013046N68515J507835J585125
37906B359682K893922M031482J879531k294285l619835j184474M50749j106913
37898C409859k335174m27674J595840M43051j355460K1474K595215J788707j627546
37889D108292k820231q70609N79589K64904P09517K129841J208216k179841l010883
37880A18795R59801M618092L057056p25682r10529J696377J458451k436182m529021
37871C307158j706955K300976K707615l30710l393065l993199j396142L319509
$$ y = [6874068, 6331614, 4688193, 4423083, 3730033, 1143639, -1239369, -1566475, -1279732, -1444225, 568013, 6980235, 14330746, 16232147, 10891179, 3076493, -1224970, -157239, 3559594, 5703735, 4180800, 711253, -1301793, -733278, 774557, 2359682, 5253604, 9285086, 11164617, 8870332, 5250497, 4066023, 4516772, 3409859, 1074685, 647011, 2242851, 2685902, 1330442, 1351916, 3947131, 5735838, 4108292, 1288061, 417452, 997041, 1261945, 1971462, 4101303, 5309519, 3129678, 118795, 1078596, 5696688, 8753744, 8028062, 7117533, 8813910, 10272361, 7836179, 3307158, 1600203, 3901179, 6608794, 6278084, 2885019, -1108180, -2504322, 815187]
37863H15187O150978K855084m568265p757936k227512N311734M918619k999148
37855B498741p973860l624644M363792O915191L452657O61262J801050K603962
37847A0698151j342629p160735p814297j514975N363020O006840J415467j831951
37839C818891q90255L39125j594576l852838j981891K664835M818175L171602
37831F493068J375179J269984K80505l038286n489968l938961j01733K295839
37823h54373K530064K102574J227370n15692j513099K61206L308514L484619o08104
37814I423079n299068n758495j137208M527397O001469J867624l571965m358652
37806A694181K98858M639768L246924k163005n182910l022545O26272J300640
$$ y = [815187, 6966165, 9821249, 5252984, -2504952, -4732464, 579270, 5497889, 2498741, -5475119, -9099763, -4735971, 2179220, 5631877, 6293139, 8094189, 10698151, 9355522, 2194787, -5619510, -7134485, -1771465, 4235375, 5650842, 3818891, 2928636, 3267761, 1673185, -2179653, -4161544, -1496709, 3321466, 6493068, 7868247, 9138231, 9418736, 6380450, 890482, -3048479, -3150212, -854373, 1675691, 3778265, 5005635, 4489943, 2976844, 3238050, 6546564, 10031183, 9423079, 4124011, -1634484, -2771692, 1755705, 7757174, 9624798, 6052833, 1694181, 1993039, 6632807, 9879731, 7716726, 2533816, -488729, 137543, 1438183]
37798A438183n65760j309829M26487K144730J350931q59193j212699J328378M000443
37789F741671L584907J50688l612553n685884n561750k757779K583588P413981
37781B856869P371296K250392k640326k604781R80879L465974L208940K251264
37773A7140507J994840J442180k31652j850851j638955P72838L823103M906842
37765B6358852K726214l65864l5982M412560Q110101O963515M079972N857255
37757E8106623J2172137J4952013P905557n668931j6705385j9576475j5610240
37750C5575299r603939n414893m062014l858189k324181Q18373K829551J274470
37742A5234477k266463l529275r62090J963996J220413k237245l756790j624982
$$ y = [1438183, 872423, -437406, -10919, 2133811, 3484742, 2625549, 1412850, 2741228, 6741671, 10326578, 10477266, 6864713, 1178829, -4382921, -7140700, -4557112, 2856869, 10228165, 12478557, 9838231, 7233450, 8214329, 11680303, 14889243, 17140507, 19135347, 20577527, 20345875, 18495024, 16856069, 17628907, 21452010, 26358852, 29085066, 28719202, 28683220, 33095780, 41205881, 48169396, 52249368, 58106623, 70278760, 85230773, 93136330, 87467399, 70762014, 51185539, 35575299, 25971360, 20556467, 16494453, 12636264, 10312083, 11130456, 13960007, 15234477, 12968014, 9438739, 8476649, 10440645, 11661058, 9423813, 5667023, 4042041]
37734D042041P06908M54391K59350L630814P950992P181651J095822l853872l978052
37725A7490045k746913l191944k202733K703429O440726L299539k742880k976015
37717A6073254K213233L415902k867558q189834m821795K833699N228293J131617
37709A5016811k426379j212868J549519J473343j054742k645168j621173O52045
37701I731388J826412R68743p04078j293792m37210M77919L37634m81607j165839
37692I259570j554865j797674k021167k528262l131582k516107n5265K039907
37684b305445R76387k059303k734762J58874K672343J668016n11176l6473K445456
37675B73917L134968O62559k726017m383504l041270J236567O073559P164516
$$ y = [4042041, 4748949, 5203340, 5462690, 9093504, 17044496, 24226147, 25321969, 21468097, 17490045, 14743132, 11551188, 9348455, 12051884, 18492610, 21792149, 19049269, 16073254, 18286487, 21702389, 18834831, 10644997, 5823202, 8656901, 13885194, 15016811, 12590432, 11377564, 12927083, 14400426, 13345684, 10700516, 9079343, 9731388, 11557800, 12526543, 11822465, 10528673, 10091463, 10569382, 10907016, 10425409, 9259570, 7704705, 5907031, 3885864, 1357602, -1773980, -4290087, -4345352, -2305445, -1329058, -3388361, -6123123, -5964249, -3291906, -1623890, -2135066, -2171539, 273917, 3408885, 4071444, 1345427, -3038077, -6079347, -4842780, 1230779, 8395295]
37667H395295K915180k284522k867081N64051K531742J035824J8417K335934M751054
37658A7395894K829631k210474n082059l362509M47770L238810M514206M798024
37650B2569293L495206K5288m134814o230472n007377j914310L92503K70143j796602
37641G668858l521224k563154R55960L739508K521868j651830m028002k054606
37633A067378J057124O31283k903607m542612j638182K599304L583100J133432
37625I87220r83169k47173J676715J486650j109000k455761L58732M691860M960909
37616I366983P65539j322274L140007R299237R806541N815943M401425O665654
37608D7939055P263386O530266J2483855K5533007L0874688J5732028j1382354
$$ y = [8395295, 11310475, 9025953, 6158872, 6722923, 9254665, 10290489, 10308906, 12644840, 17395894, 20225525, 18015051, 12932992, 9570483, 10018253, 13257063, 17771269, 22569293, 26064499, 26089787, 21954973, 15724501, 10717124, 8802814, 9195317, 9465460, 7668858, 4147634, 1584480, 2540440, 6279948, 8801816, 7149986, 3121984, 1067378, 2124502, 2755785, -147822, -4690434, -6328616, -3729312, -146212, 987220, 4051, -243122, 1433593, 2920243, 1811243, -644518, -285786, 4406074, 9366983, 10132522, 8810248, 11950255, 21249492, 31056033, 36871976, 41273401, 47939055, 55202441, 61732707, 74216562, 99749569, 130624257, 146356285, 134973931]
37601A34973931k9120944k8679448k0577237j6470101j5013178r443011n13377
37594A5156635M730433K928054k405549n966745n328042j701179J431247J327972
37586A0172826q97414j365715J452483M447995L800980m58911m937430o547602
37578E667212m844027j848326l8128K60233R09186K370567K042173j251734l515683
37569b48527q19341L494059K870715j798823k887310J530363M093669L74471l461890
37560C147386j078069L039917J087695m613407n169164L07155L425420M4052l868798
37551c677813k203693K778278N332024M090439J410826r82465k279512j597324
37543B870760M18801J414420P07918K54049P80224L29262j466959j502507J524900
$$ y = [134973931, 105852987, 77173539, 56596302, 40126201, 25113023, 15670012, 15156635, 19887068, 22815122, 20409573, 14442828, 9114786, 7413607, 8844854, 10172826, 9275412, 7909697, 9362180, 13810175, 17611155, 17152244, 12214814, 5667212, 823185, -1025141, -1063269, -803036, 106150, 2476717, 4518890, 3267156, -248527, -1067868, 2426191, 5296906, 3498083, 610773, 2141136, 6234805, 6609276, 3147386, 2069317, 5109234, 6196929, 1583522, -3585642, -3278487, 146933, 190985, -3677813, -5881506, -3103228, 2228796, 6319235, 7730061, 6747596, 4468084, 2870760, 3289561, 4703981, 5411899, 5665948, 6446172, 6775434, 5308475, 3805968, 5330868]
37534E330868L531566O35875m322678n260811j381556K121112J487452j386832
37526G54996k632160j203276R57952J469916n26310l479334m240909j224621L146091
37517f977655M705017K459462l62654o47802Q13611R50283j205615l281894k757452
37508f304699j02705K214500L106533L501958L547063J708854j783666l230049
37500B657789l54360L055569J825302k321009k686372J882016M768917J963778
37492A0791630j945311k061839j043108k804416m050809j4771N337110M119462
37484H327948k255845m368814N66477M977841L616894M91941k32844j066666l814841
37475F242091l901978J067291M380364J01873n948611m422859K591880N055232
$$ y = [5330868, 8862434, 9498309, 5175631, -85180, -1466736, 654376, 2141828, 754996, -1877164, -3080440, -2122488, -652572, -1178882, -4658216, -8899125, -10123746, -6977655, -2272638, 186824, -175830, -823632, -10021, 940262, -265353, -3547247, -6304699, -6407404, -4192904, -1086371, 2415587, 5962650, 7671504, 5887838, 2657789, 2303429, 5358998, 7184300, 4863291, 2176919, 4058935, 8827852, 10791630, 8846319, 6784480, 5741372, 2936956, -1113853, -1128624, 4208486, 8327948, 6072103, 1703289, 2269766, 7247607, 10864501, 11356442, 11123598, 10056932, 6242091, 2340113, 3407404, 7787768, 7889641, 1941030, -2481829, 110051, 5165283]
37467E165283J048585j516599Q05127J979848j604207m236457r04529L789408
37459D526459L125450j070755k117961Q37751K565417M59880k377384k538667
37451C410190m10813J365816O73413k477177m971723k707611L692837P375927
37443E950859L253039m216905o001404m30216N244878N525887K914436J428774
37435A3669348q1239l652912n875959k258154M048723M680328k203715q571434
37427b45014p132536l53059M479029N031618M076865K734239m52008m229798m358424
37418d49088j52396L441898K709761K19127J40631J921935K202468M54589j189271
37409I299654j930386k269809j505875O74136J442176j668918n299796l614010
$$ y = [5165283, 6213868, 4697269, 5502396, 7482244, 5878037, 1641580, 737051, 4526459, 7651909, 6581154, 4463193, 5300944, 7866361, 8326241, 5948857, 3410190, 2999377, 4365193, 5038606, 2561429, -2410294, -5117905, -1425068, 5950859, 9203898, 4986993, -1014411, -1444627, 3800251, 9326138, 12240574, 13669348, 13588109, 9935197, 4059238, 1801084, 5849807, 10530135, 8326420, -245014, -7377550, -7730609, -3251580, 1780038, 5856903, 8591142, 8139134, 3909336, -449088, -601484, 2840414, 5550175, 5769302, 5909933, 7831868, 10034336, 10488925, 9299654, 7369268, 5099459, 3593584, 4267720, 5709896, 4040978, -1258818, -4872828]
37401d872828K626105N893453K286266l205192m285476j381714J192636J851542
37393A04792J500095J15423j973386j935438J798484N359669L684657j965141
37385F689155n109268k453513K648708N191334L584911l90352l645793l657019
37377B858163q71676J054508j22301j567938L46983L568889K879544j741500m759422
37368A645250l568920j573287j278742l17358K724134M195096J429258j761415
37360A494016p41660K446327K777562O20516L36282K211022K181526p18740k745875
37351G860976j985007r03896r75218l5908K742364M020644J556899j486409j052119
37342I742326J718827K441603k71154l690003m888205l190233J97524K774270
$$ y = [-4872828, -2246723, 3646730, 5932996, 2727804, -1557672, -2939386, -1746750, 104792, 1604887, 1720310, -253076, -2188514, -390030, 4969639, 8654296, 6689155, 1579887, -873626, 1775082, 6966416, 10551327, 10160975, 6515182, 2858163, 1986487, 3040995, 2918694, 1350756, 1697739, 5266628, 8146172, 6404672, 1645250, -1923670, -3496957, -4775699, -5093057, -2368923, 1826173, 3255431, 1494016, 752356, 3198683, 5976245, 6596761, 6933043, 9144065, 11325591, 10606851, 7860976, 5875969, 4972073, 3996855, 3960947, 6703311, 10723955, 12280854, 10794445, 9742326, 11461153, 13902756, 13631602, 9941599, 5053394, 1863161, 2060685, 4834955]
37334D834955K170481r16327k590593o68661K024580J848525j23745l61320P85240
37325G003135l90351m115184n636027k193698K472425L295959P63789o09553Q68179
37316A458674K227678Q67995j547732j709884M39524J647674K61227j004143R59531
37307C600544M203393L520185j819540n814631l628801J379597K411341j046150
37299B805938l182316r63264K126076K490730J438903J328121J131280n73544
37291F601924j584491N95206L499396K461061k000534m059578o50577M099605
37283H962012M448127M20392l109717l447243k830161l461608l048307J490762
37275e75743P366929P719376J141931n291770n486323k402849k021771l283285
$$ y = [4834955, 7005436, 6089109, 3498516, 2829855, 4854435, 6702960, 6579215, 6217895, 7003135, 6612784, 2497600, -3138427, -5332125, -2859700, 436259, 1200048, 590495, 1458674, 3686352, 4554347, 3006615, 1296731, 1736255, 3383929, 3645156, 2641013, 3600544, 7803937, 11324122, 9504582, 3689951, 61150, 1440747, 3852088, 2805938, -376378, -1339642, 786434, 3277164, 4716067, 6044188, 7175468, 6601924, 5017433, 5612639, 9112035, 11573096, 9572562, 5512984, 4862407, 8962012, 13410139, 13830531, 10720814, 7273571, 4443410, 981802, -2066505, -575743, 6791186, 14510562, 15652493, 10360723, 4874400, 2471551, 449780, -2833505]
37267b833505r71377L860009M892464J685209O85678L449493L339778k206776
37259A1900973n525446j051726M535036K659290l363109m378404m08348P41050
37251E109316k699592m367992j119886K761928L631915K926934K252276P86207
37243I281106j068061j239240j25193r8131r21981p82058q49673k898365l930617
37234b632213k66485M528792M007817q5551m86709K494140J385408m220562n817094
37225a092457j067413J590020j820166l208889K904595Q454024M733896l115448
37217G378162m716809k43934K630928J762519N02795o79696k942151l270684R63583
37208A384713N036133L088736j970699l201837q18517M3245o96305M08982J830820
$$ y = [-2833505, -3804882, 55127, 4947591, 6632800, 7318478, 10767971, 14107749, 11900973, 6375527, 5323801, 9858837, 12518127, 9155018, 4776614, 4368266, 5109316, 2409724, -1958268, -3078154, -316226, 3315689, 6242623, 8494899, 9281106, 8213045, 6973805, 6848612, 6750481, 5828500, 5046442, 4196769, 1298404, -2632213, -2898698, 1630094, 5637911, 5552360, 5065651, 7559791, 8945199, 4724637, -1092457, -2159870, -569850, -2390016, -5598905, -2694310, 5759714, 10493610, 7378162, 2661353, 2417419, 5048347, 6810866, 7313661, 6633965, 3691814, 421130, 1384713, 6420846, 9509582, 7538883, 4337046, 3518529, 3561774, 2865469, 3274451, 5105271]
37199E105271j50093k590916K5527M633971L157163l579268o414519k692944L53954
37190b151854j322118k721285k6402K932110K513791J331616K071046K271264
37182D898168k52708k635968j834280M49097J164465K55831q22948j154241M08857
37173D76273L890690N603248J992777l665629m461746k82254J826402r94481l159708
37164A225572l27914L725893L588462k81349m101659n825848m668948m10814M223610
37155b852995N173206K977083K101067L126205J909604j856831k684411J161341
37147I054269L604391L61268m229217m593689j869705L28735K070160L875055
37139H601267K971633j623839n096741l337557P09961K013470N82044q10562j605640
$$ y = [5105271, 4955178, 2364262, 2389789, 7023760, 10180923, 6601655, 187136, -2505808, -2151854, -3473972, -6195257, -6221659, -3289549, -775758, 555858, 2626904, 4898168, 4645460, 2009492, 175212, 624309, 1788774, 2044605, 1221657, 67416, 476273, 4366963, 9970211, 11962988, 8297359, 3835613, 3553359, 5379761, 4385280, 1225572, 897658, 4623551, 8212013, 7930664, 3829005, -1996843, -6665791, -7076605, -2852995, 2320211, 5297294, 7398361, 10524566, 12434170, 10577339, 7892928, 9054269, 12658660, 13019928, 8790711, 4197022, 2327317, 2656052, 4726212, 8601267, 11572900, 9949061, 4852320, 1514763, 2224724, 4238194, 4820238, 4009676, 2404036]
37130B404036j807974K5039K886583K413674j808410l624917K19522M108330K742234
37121G558117n804J649186N102262M290335K14637j719633j099438j160520j439285
37112A3389857J49663J047795j839819m712954k300019J899062L51579n238090
$$ y = [2404036, 596062, 621101, 3507684, 5921358, 4112948, 488031, 707553, 4815883, 7558117, 7552313, 9201499, 14303761, 18594096, 18808733, 17089100, 15989662, 14829142, 13389857, 13539520, 14587315, 12747496, 8034542, 5734523, 7633585, 7985164, 2747074]
$$ [...]
##END NTUPLES=NMR SPECTRUM
##END=
