##TITLE=31Pdec_SR153_rm1d
 , 24 sc
 16.11.2022
##JCAMPDX= 6.0         $$ Bruker NMR JCAMP-DX V2.0
##DATA TYPE= NMR SPECTRUM
##DATA CLASS= NTUPLES
##ORIGIN= UXNMR, Bruker Analytische Messtechnik GmbH
##OWNER= root
$$ XWIN-NMR		Version 3.5
$$ Wed Nov 16 13:52:09 2022 Russian Standard Time (UT+4h)  she@DPX200
##.OBSERVE FREQUENCY= 81.013821
##.OBSERVE NUCLEUS= ^31P
##.ACQUISITION MODE= SIMULTANEOUS
##.ACQUISITION SCHEME= undefined
##.AVERAGES= 24
##.DIGITISER RES= 16
##SPECTROMETER/DATA SYSTEM= spect
##.PULSE SEQUENCE= zgpg30
##.SOLVENT NAME= CDCl3
##.SHIFT REFERENCE= (INTERNAL, CDCl3, 0, 248.564)
##AUDIT TRAIL= $$ (NUMBER, WHEN, WHO, WHERE, WHAT)
$$ ##TITLE= Audit trail, XWIN-NMR		Version 3.5
$$ ##JCAMPDX= 5.01
$$ ##ORIGIN= Bruker BioSpin GmbH
$$ ##OWNER= she
$$ F:/spectra/data/she/nmr/P31/1/pdata/1/auditp.txt
$$ ##AUDIT TRAIL=  $$ (NUMBER, WHEN, WHO, WHERE, WHAT)
(   1,<2022-11-16 13:50:27.45 +0400>,<she>,<DPX200>,
      <created by zg, POWCHK disabled, PULCHK disabled
       configuration hash MD5:
       00 E9 B6 7A A2 85 ED C7 34 08 36 98 17 FE 4E 26
       data hash MD5: 32K
       10 4F 1F D5 9E 3F 4A 1F 5D 7C 32 B8 FF BA 51 24>)
(   2,<2022-11-16 13:50:29.78 +0400>,<she>,<DPX200>,
      <Start of raw data processing
       efp BC_mod = 2 LB = 1 FT_mod = 6 PKNL = 1 PHC0 = -10296.19 PHC1 = 157.456 SI = 64K 
       data hash MD5: 64K
       00 4B 2C FA CF 04 2A BF 6A 94 C4 19 94 1E 65 78>)
(   3,<2022-11-16 13:50:52.50 +0400>,<she>,<DPX200>,
      <pk PHC0 = -6.228098 PHC1 = 19.39999 
       data hash MD5: 64K
       3F DC 5D 42 35 7E BB 13 EA 68 55 11 17 3F C3 34>)
$$ ##END=
$$ 
$$ hash MD5
$$ 16 6A A6 B3 4D C7 40 79 82 AB EA F3 2F 29 3F 19
##$RELAX= 
##$RELAX= 
##$RELAX= 
##$RELAX= 
##$RELAX= 
##$RELAX= 
##$RELAX= 
##$RELAX= 
##$RELAX= 
$$ Bruker specific parameters
$$ --------------------------
##$DU= <F:/spectra>
##$EXPNO= 1
##$NAME= <P31>
##$PROCNO= 1
##$TYPE= <nmr>
##$USER= <she>
##$AMP= (0..31)
100 100 100 100 100 100 100 100 100 100 100 100 100 100 100 100 100 100 
100 100 100 100 100 100 100 100 100 100 100 100 100 100 
##$AQSEQ= 0
##$AQ_mod= 1
##$AUNM= <au_zg>
##$AUTOPOS= <>
##$BF1= 81.014009
##$BF2= 200.13
##$BF3= 200.13
##$BF4= 200.13
##$BF5= 200.13
##$BF6= 200.13
##$BF7= 200.13
##$BF8= 200.13
##$BYTORDA= 1
##$CFDGTYP= 0
##$CFRGTYP= 5
##$CHEMSTR= <none>
##$CNST= (0..31)
1 1 145 1 1 1 1 1 1 1 1 1 1 1 1 1 1 1 1 1 1 1 1 1 1 1 1 1 1 1 1 1 
##$CPDPRG= <waltz16>
##$CPDPRG1= <>
##$CPDPRG2= <waltz16>
##$CPDPRG3= <>
##$CPDPRG4= <mlev>
##$CPDPRG5= <mlev>
##$CPDPRG6= <mlev>
##$CPDPRG7= <mlev>
##$CPDPRG8= <mlev>
##$CPDPRGB= <>
##$CPDPRGT= <>
##$D= (0..31)
0 1 0 0 0 0 0 0 0 0 0 0.03 2e-05 3e-06 0 0 0 0 0 0 0 0 0 0 0 0 0 0 0 0 
0 0 
##$DATE= 1668592226
##$DBL= (0..7)
120 120 120 11 120 120 24 19 
##$DBP= (0..7)
150 150 150 150 150 150 150 150 
##$DBP07= 0
##$DBPNAM0= <>
##$DBPNAM1= <>
##$DBPNAM2= <>
##$DBPNAM3= <>
##$DBPNAM4= <>
##$DBPNAM5= <>
##$DBPNAM6= <>
##$DBPNAM7= <>
##$DBPOAL= (0..7)
0.5 0.5 0.5 0.5 0.5 0.5 0.5 0.5 
##$DBPOFFS= (0..7)
$$ [...]
##$SUBNAM2= <"">
##$SUBNAM3= <"">
##$SUBNAM4= <"">
##$SUBNAM5= <"">
##$SUBNAM6= <"">
##$SUBNAM7= <"">
##$SUBNAM8= <"">
##$SUBNAM9= <"">
##$SW= 501.771253377433
##$SWIBOX= (0..15)
0 1 3 0 0 0 0 0 0 0 0 0 0 0 0 0 
##$SW_h= 40650.406504065
##$TD= 32768
##$TD0= 1
##$TE= 0
##$TE2= 300
##$TE3= 300
##$TEG= 300
##$TL= (0..7)
0 120 53 12 22 120 120 120 
##$TP= (0..7)
150 150 150 150 150 150 150 150 
##$TP07= 0
##$TPNAME0= <>
##$TPNAME1= <>
##$TPNAME2= <>
##$TPNAME3= <>
##$TPNAME4= <>
##$TPNAME5= <>
##$TPNAME6= <>
##$TPNAME7= <>
##$TPOAL= (0..7)
0.5 0.5 0.5 0.5 0.5 0.5 0.5 0.5 
##$TPOFFS= (0..7)
0 0 0 0 0 0 0 0 
##$TUNHIN= 0
##$TUNHOUT= 0
##$TUNXOUT= 0
##$USERA1= <user>
##$USERA2= <user>
##$USERA3= <user>
##$USERA4= <user>
##$USERA5= <user>
##$V9= 5
##$VALIST= <valist>
##$VCLIST= <CCCCCCCCCCCCCCC>
##$VD= 0
##$VDLIST= <DDDDDDDDDDDDDDD>
##$VPLIST= <PPPPPPPPPPPPPPP>
##$VTLIST= <TTTTTTTTTTTTTTT>
##$WBST= 1024
##$WBSW= 4
##$XGAIN= (0..3)
0 0 0 0 
##$XL= 0
##$YL= 0
##$YMAX_a= 4424
##$YMIN_a= -7447
##$ZGOPTNS= <>
##$ZL1= 120
##$ZL2= 120
##$ZL3= 120
##$ZL4= 120
##$ABSF1= 0
##$ABSF2= 0
##$ABSG= 0
##$ABSL= 0
##$ALPHA= 0
##$AQORDER= 0
##$ASSFAC= 0
##$ASSFACI= 0
##$ASSFACX= 0
##$ASSWID= 0
##$AUNMP= <proc_1d>
##$AZFE= 0.1
##$AZFW= 0.5
##$BCFW= 0
##$BC_mod= 2
##$BYTORDP= 0
##$COROFFS= 0
##$CY= -3
##$DATMOD= 1
##$DC= 0
##$DFILT= <>
##$DTYPP= 0
##$F1P= 0
##$F2P= 0
##$FCOR= 1
##$FTSIZE= 65536
##$FT_mod= 6
##$GAMMA= 0
##$GB= 0
##$INTBC= 1
##$INTSCL= 6.047779e-11
##$ISEN= 30
##$LB= 1
##$LEV0= 0
##$LPBIN= 0
##$MAXI= 10000
##$MC2= 0
##$MEAN= 0
##$ME_mod= 0
##$MI= 50
##$NCOEF= 0
##$NC_proc= -7
##$NLEV= 6
##$NOISF1= 182.463
##$NOISF2= 159.3651
##$NSP= 0
##$NTH_PI= 0
##$NZP= 0
##$OFFSET= 248.5645
##$PC= 4
##$PHC0= -10302.42
##$PHC1= 176.856
##$PH_mod= 1
##$PKNL= yes
##$PPARMOD= 0
##$PSCAL= 0
##$PSIGN= 0
##$REVERSE= no
##$SF= 81.0140089999694
##$SI= 65536
##$SIGF1= 159.3651
##$SIGF2= -187.1042
##$SINO= 113.3802
##$SIOLD= 16384
##$SREGLST= <1H.CDCl3>
##$SSB= 0
##$STSI= 65536
##$STSR= 0
##$SW_p= 40650.406504065
##$SYMM= 0
##$S_DEV= 0
##$TDeff= 32768
##$TDoff= 0
##$TI= <>
##$TILT= no
##$TM1= 0
##$TM2= 0
##$TOPLEV= 0
##$USERP1= <user>
##$USERP2= <user>
##$USERP3= <user>
##$USERP4= <user>
##$USERP5= <user>
##$WDW= 1
##$XDIM= 65536
##$YMAX_p= 414623646
##$YMIN_p= -131003030
$$ End of Bruker specific parameters
$$ ---------------------------------
##NTUPLES= NMR SPECTRUM
##VAR_NAME=  FREQUENCY,     SPECTRUM/REAL,   SPECTRUM/IMAG
##SYMBOL=    X,             R,               I
##VAR_TYPE=  INDEPENDENT,   DEPENDENT,       DEPENDENT
##VAR_FORM=  AFFN,          ASDF,            ASDF
##VAR_DIM=   65536,         65536,           65536
##UNITS=     HZ,            ARBITRARY UNITS, ARBITRARY UNITS
##FACTOR=    0.620285442955139, 1,           1
##FIRST=     20137.2065510682, 0,            0
##LAST=      -20513.1999529968, 0,           0
##MIN=       -20513.1999529968, -131003030,  0
##MAX=       20137.2065510682, 414623646,    0
$$ Real data points
##PAGE= N=1
##DATA TABLE= (X++(R..R)), XYDATA
$$ [...]
39377C604301n77332J639016K274350J39810j772036j033209N35966J42802j383096
$$ 3604301 3026969 4665985 6940335 7080145 5308109 4274900 4810866 4953668 3570572
39368C570572j198885P48806J757197P99097j96528J36550O46277J85590l68625
$$ 3570572 2371687 3120493 4877690 5676787 5480259 5616809 6263086 6448676 6080051
39359F080051J7785O48938N50792J16805j28778p39974j780034j761492K0603
$$ 6080051 6097836 6746774 7297566 7414371 7285593 6545619 4765585 3004093 3024696
39350C024696J725647J578026O17005M90696K17408j783739l788238k679366P23066
$$ 3024696 4750343 6328369 6945374 7436070 7653478 5869739 2081501 -597865 125201
39341A25201K244081O13375p96280M25878K185460J861357M97389L83616R77340
$$ 125201 2369282 2982657 2186377 2612255 4797715 6659072 7156461 7540077 8517417
39332H517417K45389j513538k138304j124875j29895k07934n91907k78758O36829
$$ 8517417 8762806 7249268 5110964 3986089 3856194 3648260 3056353 2777595 3414424
39323C414424J294569Q82669n56974j568547m44327K284964L820353K688327Q15896
$$ 3414424 4708993 5591662 5034688 3466141 3021814 5306778 9127131 11815458 12631354
39314A2631354M05003N77410k54615l40712L039414P452197O378405j707443r460258
$$ 12631354 13036357 13613767 13359152 13018440 16057854 23510051 29888456 28181013 18720755
39305A8720755r316367l146653J026392J50793j327465K1520J497483J15082j533203
$$ 18720755 9404388 6257735 7284127 7434920 6107455 6128975 7626458 7741540 6208337
39296F208337K84166L493489L096708o74339k739364j332979Q8407L006J714457
$$ 6208337 6492503 9985992 13082700 12408361 9668997 8336018 8424425 8427431 10141888
39287A0141888O312343Q382725L396664m584645p840018n037940j096685J095507
$$ 10141888 16454231 24836956 28233620 23648975 15808957 10771017 9674332 10769839
39279A0769839K953907M756266L970577K82995k639854k506081j738896l189340
$$ 10769839 13723746 18480012 22450589 22733584 20093730 17587649 15848753 12659413
39271A2659413n504896n303459k048993J493105K708271J610462M21423J229993
$$ 12659413 7154517 1851058 -197935 1295170 4003441 5613903 6035326 7265319
39263G265319L606372M981461M258708L667611N091383O274201L994742j32832
$$ 7265319 10871691 15853152 20111860 23779471 28870854 35145055 39139797 39006965
39255C9006965j228264J653050M223293L311889J21634l625031p887612j0983490
$$ 39006965 37778701 39431751 43655044 46966933 47088567 43463536 35575924 24592434
39247B4592434r187063k705975K265943J173189k695330l438599q51296Q30902
$$ 24592434 15405371 12699396 14965339 16138528 13443198 10004599 9153303 9984205
39239I984205P6951q12610n31370k96467p60506q98910m9295J508856L588242
$$ 9984205 10061156 9248546 8717176 8420709 7660203 6761293 6711998 8220854 11809096
39230A1809096N355099M502320p385n085280o397264l757965q38273J36250K96137
$$ 11809096 17164195 21666515 21659130 16573850 10176586 6418621 5580348 5716598 6012735
39221F012735P35923N76610o02906j188694L8033J731762J764216L4139j721090
$$ 6012735 6748658 7325268 6722362 5533668 5571701 7303463 9067679 9101818 7380728
39212G380728k145453j284287J09779J325854J770268J039030n30923j551290
$$ 7380728 5235275 3950988 4060767 5386621 7156889 8195919 7664996 6113706
39204F113706o77207J482647K418422P64057j454718j206475J389018L231521
$$ 6113706 5436499 6919146 9337568 10101625 8646907 7440432 8829450 12060971
39196A2060971K443709M21100k45388K144410P895102J4547255J6263454Q641931
$$ 12060971 14504680 14925780 14680392 16824802 24719904 39267159 55530613 64172544
39188F4172544m701724j4135410j4369130r453252n814844m458471k916109r20633
$$ 64172544 59470820 45335410 30966280 21513028 15698184 11239713 8323604 7402971
39180G402971R8812N72317J638812K150177N67127j560639j499088M38537J689196
$$ 7402971 7501783 8074100 9712912 11863089 12430216 10869577 9370489 9809026 11498222
39171A1498222J326560L22523p73227j739015j728668q47393p87813j623058p61387
$$ 11498222 12824782 13147305 12374078 10635063 8906395 8059002 7271189 5648131 4886744
39162D886744K145523K933125m90002l266710o93090L469884K585682j783866
$$ 4886744 7032267 9965392 9475390 6208680 5515590 8985474 11571156 9787290
39154I787290k449304J174480K263864j553898m413872k492377J64773l58058
$$ 9787290 7337986 8512466 10776330 9222432 4808560 2316183 2480956 2122898
39146B122898j376414K66417J892789J93949k250333j337961J427069J791078
$$ 2122898 746484 1012901 2905690 3099639 849306 -488655 938414 2729492
39138B729492j0387l05323J500847K471015J257062n62668j681424k069803j400519
$$ 2729492 2719105 2413782 3914629 6385644 7642706 7080038 5398614 3328811 1928292
39129A928292L66940J473838L82164j367865j160595N62508J153960K06086l9290
$$ 1928292 2295232 3769070 4151234 2783369 1622774 2185282 3339242 3545328 3506038
39120C506038J248705K102597J129921k95198l72118M46044M41104p85766j933547
$$ 3506038 4754743 6857340 7987261 7692063 7319945 7765989 8207093 7421327 5487780
39111E487780j813135o95421K16503K51286j19366j04336M72174J368421K381940
$$ 5487780 3674645 2979224 3195727 3447013 3327647 3223311 3695485 5063906 7445846
39102G445846K906767J846782p81215k826532k260842j02448P74387l59484j302613
$$ 7445846 10352613 12199395 11418180 8591648 6330806 6228358 7002745 6643261 5340648
39093E340648l61138J437052K132973J164977o31660j938944j629028K9521Q72422
$$ 5340648 4979510 6416562 8549535 9714512 9082852 7143908 5514880 5544401 6416823
39084F416823p44953l128109k826627Q55300M843396N888930L459563o64317l760992
$$ 6416823 5671870 2543761 -282866 572434 5415830 11304760 14764323 14100006 10339014
39075A0339014l657052r23478J173366Q98890N23511K014916L195333K490075
$$ 10339014 6681962 5758484 6931850 7830740 8354251 10369167 13564500 16054575
39067A6054575L948221J0528330J5124048Q130772o114085j1756701l520120M903988
$$ 16054575 20002796 30531126 45655174 53785946 47671861 35915160 32395040 37299028
39059C7299028Q53680r340313j1733165n717028j743549l189731l400015M82028
$$ 37299028 38152708 28812395 17079230 11362202 9618653 6428922 3028907 3510935
39051C510935K853437N05842j969598q42631Q53814n3468j049584Q14994K975305
$$ 3510935 6364372 6870214 4900616 4057985 4911799 4858331 3808747 4623741 7599046
39042G599046J524097j852499j706920L500263Q786230Q010483P33657o730508
$$ 7599046 9123143 7270644 5563724 9063987 17850217 25860700 26594357 19863849
39034A9863849p746490k828745J322194Q00564j135410p24542M6197j750109l445803
$$ 19863849 12117359 9288614 10610808 11411372 10275962 9551420 9597617 7847508 4401705
39025D401705j398578J367286k87995l894393k742164K320652L778083J99164
$$ 4401705 3003127 4370413 4082418 188025 -2554139 -233487 3544596 3743760
39017C743760j674662R07779K428768o97j280062J638140L586037P61918k005430
$$ 3743760 2069098 2976877 5405645 5404948 4124886 5763026 9349063 10110981 8105551
39008H105551j06462K575329J504051K93408L555818P519931O500457K828037
$$ 8105551 7999089 10574418 12078469 12371877 15927695 23447626 29948083 32776120
39000C2776120J356203J95355k939535j669594Q781243J7402784R465222q857999
$$ 32776120 34132323 34327678 31388143 29718549 38499792 55902576 65367798 56509799
38992E6509799j5317417l534617P250702J118874j1975234j3726501m661499O37696
$$ 56509799 41192382 37657765 44908467 46027341 34052107 20325606 15664107 16301803
38984A6301803k557056n426676k776305K85599l53122j387921J29295J392884
$$ 16301803 13744747 8318071 5541766 5827365 5474243 4086322 4215617 5608501
38976E608501j79277k099762j457592M75481J299184J195353R95564k0403j908594
$$ 5608501 5429224 3329462 1871870 2347351 3646535 4841888 5837452 5817049 3908455
38967C908455k511151n27521K026429K459934Q28807q40497j272685o47582J81925
$$ 3908455 1397304 869783 2896212 5356146 6184953 5344456 4071771 3424189 3606114
38958C606114L25891k70656m06666O95874J668437P59948j201970j949310j344026
$$ 3606114 3932005 3661349 3254683 3950557 5618994 6378942 5176972 3227662 1883636
38949A883636r53762n46730J372437L552924K807053l73858j603059L71378J236173
$$ 1883636 929874 383144 1755581 5308505 8115558 7741700 6138641 6510019 7746192
38940G746192j615638m213614k422207J004746R61088j582769j643763J147343
$$ 7746192 6130554 1916940 -505267 499479 1460567 -122202 -1765965 -618622
38932f18622K303435M09519q68875N42122K105631J892988J608055K145786J014408
$$ -618622 1684813 2094332 1225457 1767579 3873210 5766198 7374253 9520039 10534447
38923A0534447k659456m812005k138017K138070K669019n2682r48022J466390
$$ 10534447 7874991 3062986 924969 3063039 5732058 5679376 4731354 6197744
38915F197744L075112Q48519k697207l423936j025272J498219K040833J114329
$$ 6197744 9272856 10121375 7424168 4000232 2974960 4473179 6514012 7628341
38907G628341K07096l1729o1949o11869j581418j887624r26149J59960j73266
$$ 7628341 7835437 7803708 7741759 7129890 5548472 3660848 2734699 2894659 2721393
38898B721393j373816j277756M98074J564572L96050q61737N54193L279414L129632
$$ 2721393 1347577 69821 567895 2132467 2528517 1666780 2220973 5500387 8630019
38889H630019p18142l957091k962565K76002J414826r049q06323L22583J135699
$$ 8630019 7911877 3954786 992221 1268223 2683049 2674000 1867677 2190260 3325959
38880C325959R5347j203040j176788q32340j255852j108892Q59155K793845K097780
$$ 3325959 3421306 2218266 1041478 209138 -1046714 -2155606 -1296451 1497394 3595174
38871C595174m95007k025635j568761o36874r6364M44015O84481L3411l71399
$$ 3595174 3100167 1074532 -494229 -1131103 -1227467 -783452 -98971 -65560 -436959
38862d36959R00222K355722J224678j622814k279868k4661J232806o70571k483466
$$ -436959 463263 2818985 4043663 2420849 140981 116320 1349126 678555 -1804911
38853a804911r38546J792215J635824r81091k252410j011070K92165Q5440m14372
$$ -1804911 -2743457 -951242 684582 -296509 -2548919 -3559989 -3267824 -3182384 -3596756
38844c596756o8020L22835j28619o78206r4930J508214K641723J926832l71678
$$ -3596756 -3664776 -3341941 -3470560 -4148766 -4243696 -2735482 -93759 1833073 1461395
38835A461395k265884k094202n54387M49557P23152J526276K415175J298085j473110
$$ 1461395 -804489 -2898691 -3453078 -3003521 -2280369 -754093 1661082 2959167 1486057
38826A486057k410743j27512K021342J083464q81105n86219J042446J171539K67120
$$ 1486057 -924686 -1052198 969144 2052608 1171503 585284 1627730 2799269 3066389
38817C066389M85993R29966m88084k025383n23255K092737Q72158l525221m718132
$$ 3066389 3552382 4482348 3994264 1968881 1445626 3538363 4410521 885300 -3832832
38808c832832m64723L661489K960294J67303j83862J109699Q29032n73591n92233
$$ -3832832 -4297555 -636066 2324228 2491531 2307669 3417368 4246400 3672809 3080576
38799C080576L62119K48901k78244P32781K117402Q83016k561071m238332j845387
$$ 3080576 3442695 3691596 3413352 4146133 6263535 7146551 4585480 347148 -1498239
38790a498239K628212N556660M805485P02693l913162n251928k422722R42347
$$ -1498239 1129973 6686633 11492118 12194811 8281649 3029721 606999 1549346
38782A549346J063045j028605j491212M43310J905696J317978L47960M58361O96903
$$ 1549346 2612391 1583786 92574 535884 2441580 3759558 4107518 4565879 5262782
38773E262782j555r04721j136287j178388j504874j424892m59328N17015N58190
$$ 5262782 5261227 4356506 3220219 2041831 536957 -887935 -1347263 -830248 -272058
38764b72058k9585m48338m85998j92887N76905J737114K798744L350447L054491
$$ -272058 -301643 -749981 -1235979 -1428866 -851961 885153 3683897 7034344 10088835
38755A0088835J488052r12031k275915j350377K33238j70822k162821k589318
$$ 10088835 11576887 10664856 8388941 7038564 7271802 7100980 4938159 2348841
38747B348841l32228J877171J555025j61840r37879p98504j029350j222224r1447
$$ 2348841 2016613 3893784 5448809 5286969 4349090 3550586 2521236 1299012 1207565
38738A207565J591184J493454q28391l018238k859151p36425J198550J339655
$$ 1207565 2798749 4292203 3463812 445574 -2413577 -3150002 -1951452 -611797
38730f11797j42972j651526j570641K34725K317750L133131K236375J30456k051904
$$ -611797 -754769 -2406295 -3976936 -3742211 -1424461 1708670 3945045 4075501 2023597
38721B023597k661705r36609J196957P16645k007524k647910J121649N360424
$$ 2023597 -638108 -1574717 -377760 338885 -1668639 -4316549 -3194900 2165524
38713B165524M695680j13882l306808k224445k7915J99127l16830M35849J310997
$$ 2165524 6861204 6747322 3440514 1216069 1188154 1387281 1070451 1506300 2817297
38704B817297N15148o97657j93360R97662L14786j631218j591878J043238K813098
$$ 2817297 3332445 2634788 2441428 3439090 3753876 2122658 530780 1574018 4387116
38695D387116J068075k207721l065356o26088K190684K445577L82567j359050
$$ 4387116 5455191 3247470 182114 -443974 1746710 4192287 4574854 3215804
38687C215804j068840J97648L82469o22805j002772j019P96717K0584j231967
$$ 3215804 2146964 2344612 2727081 2104276 1101504 1100485 1897202 1917786 685819
38678F85819j205869k87041o9673m81759n7241J228900J651136N17327o91358
$$ 685819 -520050 -807091 -876764 -1358523 -1415764 -186864 1464272 1981599 1290241
38669A290241n29059O17151J511137J566292Q83929q2725n70570k49411k340p75897
$$ 1290241 761182 1378333 2889470 4455762 5339691 5256966 4686396 4436985 4434645 3658748
38659C658748j736464j142167Q35377J959517J085736k71836l10541O76526J245445
$$ 3658748 1922284 780117 1615494 3575011 4660747 4388911 4078370 4754896 6000341
38650F000341Q39522j11977j070957j405467m04035J747367L496271L190730Q14848
$$ 6000341 6839863 6727886 5656929 4251462 3847427 5594794 9091065 12281795 13096643
38641A3096643j524549q85752L632039Q478428P769189k3185q672971j0400948
$$ 13096643 11572094 10686342 14318381 22796809 30565998 30542813 21869842 11468894
38633A1468894m938217P74693J664489n49790j999099j898372j276737k11221
$$ 11468894 6530677 7305370 8969859 8420069 6420970 4522598 3245861 3034640
38625C034640J073531J133967k35338r10748Q8460P04439l88786j117440J67284
$$ 3034640 4108171 5242138 5006800 4096052 4184512 4888951 4500165 3382725 3550009
38616C550009J226628l01730k326702j398151J597161K813658J152565j088924
$$ 3550009 4776637 4474907 2148205 750054 2347215 5160873 6313438 5224514
38608E224514k125261j853242l18146J729492K073636P439j598266n05830Q25469
$$ 5224514 3099253 1246011 927865 2657357 4730993 4738432 3140166 2634336 3459805
38599C459805o18343k673889j469716J483351J634842n56061m98028K104105K660771
$$ 3459805 2841462 167573 -1302143 181208 1816050 1259989 761961 2866066 5526837
38590E526837N9001j336403N91394K713457L217954M327247N973177L875093k385074
$$ 5526837 5585838 4249435 4840829 7554286 10772240 15099487 21072664 24947757 22562683
38581B2562683o181109l441700Q42219J151973L83551L368436O667908L412016
$$ 22562683 16381574 12939874 13782093 14934066 15317617 18686053 25353961 28765977
38573B8765977m585471q428122n179325j158620j385598l133287k317810j39431
$$ 28765977 24180506 15752384 10573059 9414439 8028841 4895554 2577744 2438313
38565B438313J86268r21069p61189J051449K410354J913812J51541j510091k153835
$$ 2438313 2624581 1703512 942323 1993772 4404126 6317938 6469479 4959388 2805553
38556B805553j750236r21420n11J295840K590613K278298k45130k727042k516756
$$ 2805553 1055317 133897 133386 1429226 4019839 6298137 6053007 3325965 809209
38547H09209l23567P55026k92963j320952n94421R77249J839246J897338J629008
$$ 809209 485642 1240668 947705 -373247 -967668 9581 1848827 3746165 5375173
38538E375173Q41768m19507r88941j5887J366327J164410o99773j865378m40454
$$ 5375173 6216941 5797434 4808493 4792606 6158933 7323343 6623570 4758192 4317738
38529D317738K187358K719758L97279j444215L57717M132085N185262J825183
$$ 4317738 6505096 9224854 9622133 8177918 8535635 12667720 17852982 19678165
38521A9678165k902875n547020n608706m056157j432819J221065K096796R20096
$$ 19678165 16775290 11228270 5619564 1563407 130588 1351653 3448449 4368545
38513D368545m03179o15190m83522n08954J6101O22470m25270k449059k283298
$$ 4368545 3965366 3350176 2866654 2357700 2373801 2996271 2571001 121942 -2161356
38504b161356L14500J448594k35184o07761K452483L955156j79454m765574k519870
$$ -2161356 -1846856 -398262 -633446 -1241207 1211276 5166432 4986978 221404 -2298466
38495b298466L674487M402158j615873n655830k737312J592377J244574j332166
$$ -2298466 1376021 5778179 4162306 -1493524 -4230836 -2638459 -1393885 -2726051
38487b726051p66577K306825L343797J297408r91751j650182j062410J98370J616325
$$ -2726051 -3492628 -1185803 2157994 3455402 2463651 813469 -248941 -50571 1565754
38478A565754K079941J299649O66017J008621J132591J70705n46376K09447J231008
$$ 1565754 3645695 4945344 5611361 6619982 7752573 7923278 7376902 7586349 8817357
38469H817357P74538p72666j913288k288538k241233j506581K339J202806J069860
$$ 8817357 9591895 8819229 6905941 4617403 2376170 869589 871928 2074734 3144594
38460C144594K3595q12660q18903Q2461J327566J496711j33884j824402j280640
$$ 3144594 3168189 2355529 1536626 1619087 2946653 4443364 4309480 2485078 1204438
38451A204438P16889J285259J46730R812J563035J883306n10481k585310j166306
$$ 1204438 1921327 3206586 3353316 3363128 4926163 6809469 6298988 3713678 2547372
38442B547372K459716M734908M254316J884817j102901k913561j767449J173716
$$ 2547372 5007088 9741996 13996312 15881129 14778228 11864667 10097218 11270934
38434A1270934J909681j053626m062646l524808r90580l4120o96226n67601P04424
$$ 11270934 13180615 12126989 8064343 4539535 3548955 3514835 2818609 2251008 2955432
38425B955432J658800K115731K537071J848002o21985k580886j810973k30969
$$ 2955432 4614232 6729963 9267034 11115036 10493051 7912165 6101192 5870223
38417E870223r47703k699168j827287J156442K152781O16456O79286L844664N675624
$$ 5870223 4922520 2223352 396065 1552507 3705288 4321744 5001030 8845694 14521318
38408A4521318K446073k856001m571109j917618Q73183O83630j268299k157797
$$ 14521318 16967391 14111390 9540281 7622663 8495846 9179476 7911177 5753380
38400E753380j211104M1018P6548q78133j447804j031272m02975j97023K16965
$$ 5753380 4542276 4583294 4659842 3781709 2333905 1302633 899658 702635 919600
38391I19600J567480L257694M087203L633888K025173o04739l299904m194608
$$ 919600 2487080 5744774 9831977 13465865 15491038 14886299 11586395 7391787
38383G391787k775501j069391r15564j323695m81569R91114J248146N27667M67546
$$ 7391787 4616286 3546895 2631331 1307636 826067 1817181 3065327 3592994 4060540
38374D060540R25280M42818o49672p02321m2908n37862j819828j415293Q19020
$$ 4060540 4985820 5428638 4778966 4076645 4033737 3495875 1676047 260754 1079774
38365A079774J867763K79573j511050j121307M22805J126027J273903K054837
$$ 1079774 2947537 3227110 1716060 594753 1017558 2143585 3417488 5472325
38357E472325K900200K465539R48872n02018j639041k700937l110816k186262
$$ 5472325 8372525 10838064 11786936 11284918 9645877 6944940 3834124 1647862
38349A647862m86981Q23526J377082J421972J022986L77506J60496O25477R91437
$$ 1647862 1160881 1984407 3361489 4783461 5806447 6183953 6344449 6969926 7961363
38340G961363M68327o94357j675190j918529j256157j08086L32753o24554j610048
$$ 7961363 8429690 7735333 6060143 4141614 2885457 2777371 3110124 2485570 875522
38331H75522o14331J671836K080578m33158k575416r51710L036385M785890K265690
$$ 875522 261191 1933027 4013605 3580447 1005031 53321 3089706 7875596 10141286
38322A0141286j888177l911001k792384l49155J230645J228271L68383l74414
$$ 10141286 8253109 4342108 1549724 1200569 2431214 3659485 4027868 3653454
38314C653454o96374p33170m42772J50911M61036M1397m00907J61200J294833
$$ 3653454 2957080 2223910 1781138 1932049 2393085 2434482 2033575 2194775 3489608
38305C489608J480173L52411q66545j381770j649392j756381p67749J402133L014449
$$ 3489608 4969781 5322192 4455647 3073877 1424485 -331896 -1099645 302488 3316937
38296C316937K536714N12779j477989k544219k371351q07743J323665K224255
$$ 3316937 5853651 6366430 4888441 2344222 -27129 -834872 488793 2713048
38288B713048J123771o48070j460194j144646k45724R73021J766536Q48788j506472
$$ 2713048 3836819 3188749 1728555 583909 338185 1311206 3077742 3926530 2420058
38279B420058k905780j975771m74433m39033r23915O405J485154J089829q48483
$$ 2420058 -485722 -2461493 -2935926 -3374959 -4298874 -4292469 -2807315 -1717486 -2565969
38270b565969j454627P9543J235312L33111q51072j29119J619631J980533P26047
$$ -2565969 -4020596 -3941053 -2705741 -2372630 -3223702 -3352821 -1733190 247343 973390
38261I73390l8080Q93267K104551J484193j008128l163786l033552j119948L93454
$$ 973390 935310 1828577 3933128 5417321 4409193 1245407 -1788145 -2908093 -2514639
38252b514639L87037j12940J66098Q99564J067167O95257M21615M3309r45515
$$ -2514639 -2127602 -2240542 -2074444 -1174880 -107713 587544 1009159 1052468 106953
38243A06953j751238r64051J055009K123213J067030p64288j460438q45589j9909
$$ 106953 -1644285 -2608336 -1553327 569886 1636916 872628 -587810 -1433399 -1453308
38234a453308L91141N06722L37377k34103p74753n43848L86410R30479L49128
$$ -1453308 -1062167 -555445 -218068 -452171 -1226924 -1770772 -1384362 -453883 -104755
38225a04755o23851p11173k0052j0603j090744j469645K76674K480241K352278
$$ -104755 -728606 -1439779 -1459831 -1470434 -2561178 -4030823 -3754149 -1273908 1078370
38216A078370L07746m17200J068044J679275n20178k715098j660386R87384J396855
$$ 1078370 1386116 968916 2036960 3716235 3196057 480959 -1179427 -192043 1204812
38207A204812j88964l66499J139944J087685j048142j597853Q88537K604794O84694
$$ 1204812 1015848 649349 1789293 2876978 1828836 230983 1119520 3724314 4409008
38198D409008j824344r64435J631223J811682l4806j93237J447856J222921j502735
$$ 4409008 2584664 1620229 3251452 5063134 5028328 4835091 6282947 7505868 6003133
38189F003133k752499n47876J676417O29281j809834k115155n61047K81879K78464
$$ 6003133 3250634 2702758 4379175 5008456 3198622 1083467 522420 804299 1082763
38180A082763J297381L280979M221502L583488K694195J869806K5667k614254
$$ 1082763 2380144 5661123 9882625 13466113 16160308 18030114 18055781 15441527
38172A5441527m063005l447339k159577j489780j046124j82738P79195J381863
$$ 15441527 11378522 7931183 5771606 4281826 3235702 3052964 3832159 5214022
38164E214022J473333M93645j784212l507632k140423J610732L765789K176858
$$ 5214022 6687355 7181000 5396788 1889156 -251267 1359465 5125254 7302112
38156G302112p88590k109277j967314j715226p65558J503412K945178J340243
$$ 7302112 6513522 4404245 2436931 721705 -43853 1459559 4404737 5744980
38148E744980j481092j851548K85457J838622J878675K377550L516744K603910
$$ 5744980 4263888 2412340 2697797 4536419 6415094 8792644 12309388 14913298
38140A4913298j045067l939247l140652k49554J419450J258382Q15524P05969
$$ 14913298 13868231 9928984 6788332 6538778 7958228 9216610 10032134 10738103
38132A0738103K60496q12936j949004k158253m52732K724914M394980J800693
$$ 10738103 10998599 10185663 8236659 6078406 5625674 8350588 12745568 14546261
38124A4546261l169111n281774k835547K0291l67235k004788j311989Q58682J176646
$$ 14546261 11377150 6095376 3259829 3280120 2912885 908097 -403892 454790 1631436
38115A631436l42540p61229N65155J283493L54964n25015j40263N97817P27749
$$ 1631436 1288896 527667 1092822 2376315 2731279 2206264 2066001 2663818 3391567
38106C391567N33991K82921l39725j159794j463577j090208l33235P67907J774231
$$ 3391567 3925558 4208479 3868754 2708960 1245383 155175 -178060 589847 2364078
38097B364078J485353j98374j326494o40528L34327J51507L57671K429250L803068
$$ 2364078 3849431 3651057 2324563 1684035 2018362 2169869 2527540 4956790 8759858
38088H759858J196374l296590m224690p60995K094491R83465j635320k180196
$$ 8759858 9956232 6659642 2434952 1673957 3768448 4751913 3116593 936397
38080I36397q39554J73709J82703n1430J70117J221044K526885K115406p77109
$$ 936397 96843 270552 453255 401825 571942 1792986 4319871 6435277 5658168
38071E658168l161814j749659J596920K184071j4982n08147J577282J703141j838504
$$ 5658168 2496354 746695 2343615 4527686 4512704 4004557 5581839 7284980 5446476
38062E446476m207676j849643J669941J819222J9467k86844N5058j206083k355857
$$ 5446476 1238800 -610843 1059098 2878320 2897787 2610943 2666001 1459918 -895939
38053h95939p93573J559252J406126m0109K32120J065683k10988j479982J162261
$$ -895939 -1689512 -130260 1275866 1235757 1467877 2533560 2322572 842590 2004851
38044B004851N435010M913436r21029n214448l412414J228501L378085K196215
$$ 2004851 7439861 12353297 11432268 6217820 2805406 4033907 7411992 9608207
38036I608207M18756M60805K660124M677670K731267l493408q212518o029455
$$ 9608207 10026963 10487768 13147892 17825562 20556829 17063421 8850903 2821448
38028B821448O7974K463602p1374j491381J047881K944610N76059k656269k380326
$$ 2821448 2889422 5353024 5281650 3790269 4838150 7782760 8358819 5702550 3322224
38019C322224m4131N61149m63046n50161O06801J475017J645149J435578N03620
$$ 3322224 3278093 3839242 3376196 2826035 3432836 4907853 6553002 7988580 8492200
38010H492200q69734j149751M7770J197412J717319K619422L203829R49945l537831
$$ 8492200 7622466 6472715 6520485 7717897 9435216 12054638 15258467 16208412 12670581
38001A2670581n608336l018382O28281J533816P74359P47976P23715m60896j156422
$$ 12670581 7062245 4043863 4672144 6205960 6980319 7728295 8452010 7991114 6834692
37992F834692l10797m49633l059288m647128k114823J392311J301089p69791r1386
$$ 6834692 6523895 6074262 3014974 -1632154 -3746977 -2354666 -1053577 -1823368 -1914754
37983a914754K823291L297768O15374j245901o45757j13485p83767m53998J747004
$$ -1914754 908537 4206305 4821679 3575778 2930021 2816536 2032769 1578771 3325775
37974C325775L337510K439036J97199j613963k368771j699105J88611J387386
$$ 3325775 6663285 9102321 9299520 7685557 5316786 3617681 3806292 5193678
37966E193678M26960r67632l59318J100315M82777j784828k680576j671195p30771
$$ 5193678 5620638 4653006 4293688 5394003 5876780 4091952 1411376 -259819 -990590
37957i90590q4603J376623K174091J1123k874340j866306K265621L760547R16962
$$ -990590 -1075193 301430 2475521 2486644 -387696 -2254002 11619 3772166 4689128
37948D689128j410416J116K185434K052487J189206J457608J055940j405542l418542
$$ 4689128 3278712 3279828 5465262 7517749 8706955 10164563 11220503 9814961 6396419
37939F396419k807426j436586j279724p82301J305127K423193M73459j960844
$$ 6396419 3588993 2152407 872683 90382 1395509 3818702 4292161 2331317
37931B331317j703859o3312K00171j97437N58103J058062o03048k271881q00233
$$ 2331317 627458 564146 764317 566880 1124983 2183045 1579997 -691884 -1492117
37922a492117K179648K397672l48228k201452j244356O33986J424730R46466m83511
$$ -1492117 687531 3085203 2736975 535523 -708833 -74847 1349883 2296349 1812838
37913A812838k172660k419044n66913J192681P32311o19933l96805R42455J404547
$$ 1812838 -359822 -2778866 -3345779 -2153098 -1420787 -2040720 -2437525 -1495070 -90523
37904i0523J185191J531755J605014K37183q55327L08961J753950L92155k345998
$$ -90523 1094668 2626423 4231437 4468620 3613293 3922254 5676204 6068359 3722361
37895C722361k586376n65823J50786p17924j8174K390323K827164K33793j987492
$$ 3722361 1135985 570162 720948 3024 -15150 2375173 5202337 5436130 3448638
37886C448638j706885n55684L57141J897206K885231M69112l646911l564616J414632
$$ 3448638 1741753 1186069 1543210 3440416 6325647 6794759 3147848 -416768 997864
37877I97864M108372J76116m605308l204405J851751L218763L48155j150162M42986
$$ 997864 5106236 5282352 677044 -2527361 -675610 2543153 2891308 1741146 2184132
37868B184132J219433m71822j533442m25433K79135o82165p94473J035318J756685
$$ 2184132 3403565 2931743 1398301 972868 1252003 569838 -224635 810683 2567368
37859B567368m58129k373817p10789K349753K557331J11695j229487j64677R54485
$$ 2567368 2109239 -264578 -975367 1374386 3931717 4043412 2813925 2649248 3603733
37850C603733M80020n15555q44279q73861r51346n62598J78942K47787l49129
$$ 3603733 4083753 3568198 2723919 1850058 898712 336114 515056 762843 413714
37841D13714k69267P18744R48556l68013j448549n49867J248592J636825L69849
$$ 413714 144447 863191 1811747 1443734 -4815 -554682 693910 2330735 2700584
37832B700584q07684q11827j35823M19779N17483J55474j69463K10683Q29105
$$ 2700584 1892900 1081073 945250 1365029 1882512 2037986 1868523 2079206 2908311
37823B908311L27963r85140p16694J747919L181663J023691k143400k235524q1421
$$ 2908311 3236274 2251134 1534440 3282359 6464022 7487713 5344313 3108789 3027368
37814C027368K67001j414031j393300J079741K264004N12068r76153M7976J329230
$$ 3027368 3294369 1880338 487038 1566779 3830783 4342851 3366698 3414674 4743904
37805D743904Q27025K42351R70982J117002k61063m93538J517584K171629m45962
$$ 4743904 5570929 5813280 6784262 7901264 7640201 7146663 8664247 10835876 10389914
37796A0389914j745828K385956P810962P515921J791337l208993m734901m931127
$$ 10389914 8644086 11030042 18841004 26356925 28148262 24939269 20204368 15273241
37788A5273241m834903l319828j142803k72980M7511J515486K713619K277487
$$ 15273241 10438338 7118510 5975707 5702727 5750238 7265724 9979343 12256830
37780A2256830L587478R358714J3783291Q614536l546490j0862623p787851n42128
$$ 12256830 15844308 25203022 38986313 47600849 44054359 33191736 25403885 24861757
37772B4861757L875111N141383M084567r05106q014029j0724988o977583k688652
$$ 24861757 28736868 33878251 37962818 37057712 29043683 18318695 11341112 8652460
37764H652460k112106j890847R18671K507123l67733l614695k659490o0327O5623
$$ 8652460 6540354 4649507 5568178 8075301 7707568 4092873 1433383 1373056 1438679
37755A438679m62222J343426K711578J92064k935890j768699J602004J940712
$$ 1438679 976457 2319883 5031461 5223525 2287635 518936 2120940 4061652
37747D061652j46791m82874N56632k77567j956659j212252N67734r3200j488213
$$ 4061652 3914861 3431987 3988619 3711052 1754393 542141 1109875 1016675 -471538
37738d71538L50330L465945K742230p00996j216085J269819J499802j056252j275343
$$ -471538 -121208 3344737 6086967 5385971 4169886 5439705 6939507 5883255 4607912
37729D607912J763829K717326n11190l295486k610581j326802j582165r59997
$$ 4607912 6371741 9089067 8577877 5282391 2671810 1345008 -237157 -1197154
37721a197154J680475L037913J303463m39497K57253J571482J848569K311292
$$ -1197154 483321 3521234 4824697 4385200 4642453 6213935 8062504 10373796
37713A0373796L035083J952085K98171K820691R354814J2314880O592376l253463
$$ 10373796 13408879 15360964 15659135 18479826 27834640 40149520 46741896 43488433
37705D3488433r376091r188048m373759K691168P529669M728753m290262j0002767
$$ 43488433 34112342 24924294 20550535 23241703 30771372 35500125 31209863 21207096
37697B1207096o681734n06303q1402m051232n107738k045204J28568m38510p46714
$$ 21207096 14525362 14019059 13937657 9886425 4778687 2733483 2862051 2423541 1676827
37688A676827M48585J171700R84887J361771J675586J03234k012658j817764k85380
$$ 1676827 2125412 3297112 4281999 5643770 7319356 7422590 5409932 3592168 3306788
37679C306788p18039k553551k093387Q52695K518066J514601K94875o8249j176511
$$ 3306788 2588749 35198 -2058189 -1205494 1312572 2827173 3122048 3053799 1877288
37670A877288k652846j666522J493451K582444R2061k034719p64253J386288R82995
$$ 1877288 -775558 -2442080 -948629 1633815 1725876 -308843 -1073096 313192 1296187
37661A296187q73646j122794J19497N09600k86820n24897L62973R81475K18915
$$ 1296187 422541 -700253 -580756 -71156 -357976 -882873 -519900 461575 680490
37652F80490j234871j579581K60152L003682L723548J642003M01504L824558R603561
$$ 680490 -554381 -2133962 -1873810 1129872 4853420 6495423 6896927 10721485 20325046
37643B0325046J0744506M340580m364396q402044o723095l339350j454248j255064
$$ 20325046 31069552 35410132 31045736 22643692 15920597 12581247 11126999 9871935
37635I871935j868045k553766k478293j423468m67696n53915r48803m27530O79628
$$ 9871935 8003890 5450124 2971831 1548363 1080667 526752 -422051 -849581 -169953
37626a69953R92163J61200p64660p89719N3138Q96546P79166k55694o90579P13223
$$ -169953 822210 983410 218750 -570969 -517831 378715 1157881 902187 211608 924831
37616I24831K522775J764541j769443m333321k909213O19186K113288Q11114k78962
$$ 924831 3447606 5212147 3442704 -890617 -3799830 -3180644 -1067356 -256242 -535204
37607e35204P56535K197984J723120j82999j286243q51256k09083m07456p51884
$$ -535204 221331 2419315 4142435 3959436 2673193 1821937 1612854 1205398 453514
37598D53514j52113J026437J403566N94934k55507j96318K49802J62206k68427
$$ 453514 301401 1327838 2731404 3326338 3070831 2874513 3124315 3286521 3018094
37589C018094k80456L5697K8666k04561p3451J85363j91016r48848j010381l00240
$$ 3018094 2737638 2773335 2802001 2597440 2523989 2709352 2518336 1569488 559107 258867
37579B58867Q9068j88148j34302Q16239J794988J819883R13005n08143k058768
$$ 258867 347935 159787 25485 841724 2636712 4456595 5369600 4861457 2802689
37570B802689k852093k047932m23097K23309k17593O6619J536739K032128K48323
$$ 2802689 -49404 -2097336 -2520433 -2297124 -2514717 -2448098 -911359 1120769 1369092
37561A369092j644511j006053J256943K127006Q69031n45978q35563p06141q22495
$$ 1369092 -275419 -1281472 -24529 2102477 2971508 2425530 1589967 883826 61331
37552F1331p82290m83510o15827j217177j192870J43263K030638L059773K312366
$$ 61331 -720959 -1204469 -1820296 -3037473 -4230343 -4087080 -2056442 1003331 3315697
37543C315697o4623k541839k970807q67532J558579J961854P99874J55102M24753
$$ 3315697 3251074 709235 -2261572 -3129104 -1570525 391329 1191203 1346305 1771058
37534A771058L12950m12432o47822k94697k87684k66012R22317K158537Q63560
$$ 1771058 2084008 1671576 1023754 729057 441373 175361 1097678 3256215 4119775
37525D119775k274479l088545k11608K131540L67759k718521k246963J291116
$$ 4119775 1845296 -1243249 -1454857 676683 1044442 -1674079 -3921042 -2629926
37517b629926L162355J560472p60580j475022j099915l62145Q78860J578119J17439
$$ -2629926 532429 2092901 1332321 -142701 -1242616 -1604761 -725901 852218 969657
37508I69657k241628k131830O78632K463928J284683k39354K20667R41758q1101
$$ 969657 -1271971 -3403801 -2725169 -261241 1023442 784088 1004755 1946513 1865412
37499A865412j195971l67779O72539m26531j826600m08053K244981J812153j525453
$$ 1865412 669441 301662 974201 547670 -1278930 -1686983 557998 2370151 844698
37490H44698k990965p13349J629314R71215q24439q96441J67045M14024Q8130
$$ 844698 -2146267 -2859616 -1230302 -259087 -1083526 -1979967 -1812922 -1398898 -1310768
37481a310768L84999R03723Q14693O49007P53402J9904j612664j708372Q64424
$$ -1310768 -925769 -22046 792647 1441654 2195056 2214960 602296 -1106076 -241652
37472b41652K967132J459739j496845j516503R56142J440589j041317k388812
$$ -241652 2725480 4185219 2688374 1171871 2128013 3568602 2527285 138473
37464A38473l94898J728619J071431k28687O69407J935124M02314k262545j751328
$$ 138473 -256425 1472194 2543625 2314938 2984345 4919469 5321783 3059238 1307910
37455A307910J598180K808070j07776l219119k833443m68335O53832O42685J296677
$$ 1307910 2906090 5714160 5606384 2387265 -446178 -914513 -260681 382004 1678681
37446A678681J870668K56685k681376l586373j458956R87380J383754N68183M38582
$$ 1678681 3549349 3806034 1124658 -2461715 -3920671 -2933291 -1549537 -981354 -542772
37437e42772J050383J185409M15927o56155j364258j312306m70716M95278P63591
$$ -542772 507611 1693020 2108947 1452792 88534 -1223772 -1694488 -1199210 -435619
37428d35619N65791R01911J804327K134248J441393N37031k61555j645042l223478
$$ -435619 130172 1032083 2836410 4970658 6412051 6949082 6687527 5042485 1819007
37419A819007k987279l94056J852910J170148j162785j894112l76308J201273
$$ 1819007 -1168272 -1562328 290582 1460730 297945 -1596167 -1972475 -771202
37411g71202J465748J135897Q46222K69620l29689l2216O98504J01300j915257
$$ -771202 694546 1830443 2676665 2946285 2616596 2584380 3282884 3384184 1468927
37402A468927k876290j060727J760786K364246R1334k404445k267847M21770K803787
$$ 1468927 -1407363 -2468090 -707304 1656942 1748276 -656169 -2924016 -2502246 301541
37393C01541K455894J75383j145453l46921P63740N74439Q4409O29755J164099
$$ 301541 2757435 2932818 1787365 1440444 2204184 2778623 2863032 3492787 4656886
37384D656886K02293j130626r40618j80289r61354k157868q04119K273428K743491
$$ 4656886 4859179 3728553 2787935 2607646 1646292 -511576 -1315695 957733 3701224
37375C701224m61408l108278k107889J27704J90534j102760j018650M27417J322032
$$ 3701224 3239816 131538 -1976351 -1848647 -1658113 -2760873 -3779523 -3352106 -2030074
37366b030074J293908J154667P48296k36090p90372k09619L65339P6816J45080
$$ -2030074 -736166 418501 1166797 930707 140335 -69284 296055 372871 517951
37357E17951J362005J915555K84882j735252j735263n21351k72892p24696m28574
$$ 517951 1879956 3795511 4080393 2345141 609878 88527 -184365 -909061 -1337635
37348a337635j03942j170827k334276j326386J013783K042279J696890J842433
$$ -1337635 -1441577 -2612404 -4946680 -6273066 -5259283 -3217004 -1520114 322319
37340C22319K169463P90479j653430k569445j733463j004295k37629J991814L921589
$$ 322319 2491782 3282261 1628831 -940614 -2674077 -3678372 -3916001 -1924187 1997402
37331A997402K090910k229447l575645n64141J856374M90678j263428K35586K778089
$$ 1997402 4088312 1858865 -1716780 -2280921 -424547 66131 -1197297 -961711 1816378
37322A816378K648856Q10130R1071l13456k392613m028056j815895K247337K644129
$$ 1816378 4465234 5275364 5366435 5052979 2660366 -1367690 -3183585 -936248 1707881
37313A707881j225006l827751j655528K155152L172451J639232M90947L94523
$$ 1707881 482875 -3344876 -5000404 -2845252 327199 1966431 2457378 2851901
37305B851901o7280r20294o88631O17253J044307k75618j575236r26709R97119
$$ 2851901 2784621 1864327 1175696 1792949 2837256 2561638 986402 59693 1056812
37296A056812J928475J117643j7968k60561m0174k7189J57299P12486N08696j166501
$$ 1056812 2985287 4102930 4084962 3824401 3784227 3757038 3914337 4626823 5135519 3969018
37286C969018k697372k010098J81084J206396L53755m11239J17146O82513P8601
$$ 3969018 1271646 -738452 -557368 649028 1002783 591544 708690 1391203 1469804
37277A469804r05921j213470j229786j432519j016902O56026K546672L205717
$$ 1469804 563883 -649587 -1879373 -3311892 -4328794 -3672768 -1126096 2079621
37269B079621K490149J048600o28081j735654j263834L27872J086333L46552j94699
$$ 2079621 4569770 5618370 4990289 3254635 1990801 2318673 3405006 3751558 3556859
37260C556859N18996Q73900n48184k040500j267687P27134R03522j105152k546295
$$ 3556859 4075855 4949755 4401571 2361071 1093384 1820518 2724040 1618888 -927407
37251i27407j658774L11886J470815J474376Q93295J50552l30841k18261J19949
$$ -927407 -2586181 -2274295 -803480 670896 1564191 1714743 1383902 1165641 1285590
37242A285590P3199j90040j73616j37281m40464l52092P78343J635647M19085
$$ 1285590 1358789 1168749 995133 857852 417388 65296 843639 2479286 2898371
37233B898371j852658k057255L75267K103444O29836j847585j639845Q76375J856781
$$ 2898371 1045713 -1011542 -636275 1467169 2097005 249420 -1390425 -514050 1342731
37224A342731j29514j900196n07024K231135K448499J10013j016942O42289J933000
$$ 1342731 1213217 -686979 -1194003 1037132 3485631 3595644 2578702 3220991 5153991
37215E153991J57586k213628j285247J712351J932187j405900l536812j556511
$$ 5153991 5311577 3097949 1812702 3525053 5457240 4051340 514528 -1041983
37207a041983J171706O32946j595280j449692R25829J917985M85396q24144n05738
$$ -1041983 129723 762669 -832611 -2282303 -1356474 561511 1046907 222763 -282975
37198b82975J60296K12975L67147P10998J88997q83121o92551Q54618J589772
$$ -282975 -122679 90296 457443 1168441 1357438 474317 -218234 636384 2226156
37189B226156O80253m8234M64609O43182n95015j562150o57484Q32960R71130
$$ 2226156 2906409 2858175 3322784 3965966 3370951 1808801 1151317 1984277 2955407
37180B955407J81227j84408l71061r07493o09492J298800K608950Q77377k249711
$$ 2955407 3136634 2952226 2581165 1673672 1064180 2362980 4971930 5849307 3599596
37171C599596k858880m91438J405779Q52469l53643m64531m81684j413031j766147
$$ 3599596 740716 249278 1655057 2507526 2153883 1689352 1207668 -205363 -1971510
37162a971510p9480K083501K101134K8191j741235j690700k94034J278634J941862
$$ -1971510 -2050990 32511 2133645 2161836 420601 -1270099 -1564133 -285499 1656363
37153A656363J036223n24140m86491J577134K660926L33053k890722k569308Q31786
$$ 1656363 2692586 2168446 1681955 3259089 5920015 6253068 3362346 793038 1624824
37144A624824K298796P5626j453646J094273M296646L083662j300372l251790
$$ 1624824 3923620 3999246 2545600 3639873 7936519 11020181 9719809 6468019
37136F468019j214342Q84867M57934m04461M20931J471320R19677m5603K53909
$$ 6468019 5253677 6138544 6596478 6192017 6612948 8084268 9003945 8958342 9212251
37127I212251P48483j79252j306745n40271J080701O24371j997561l558921j999903
$$ 9212251 9960734 9781482 8474737 7934466 9015167 9639538 7641977 4083056 2083153
37118B083153J001494K414352J122851j420911k505335l96656L390319M933654
$$ 2083153 3084647 5498999 6621850 5200939 2695604 2298948 5689267 10622921
37110A0622921K950613J711802N618465J1492150J0829641J059364r772080j2427345
$$ 10622921 13573534 15285336 20903801 32395951 43225592 44284956 34512876 22085531
37102B2085531p280777k048124j203663k280645j844366l07327L03986k06224
$$ 22085531 14804754 12756630 11552967 9272322 7427956 7120629 7424615 7218391
37094G218391q03629j021378p17461J82233O67047o95320l027202l286724o19121
$$ 7218391 6414762 5393384 4675923 4858156 5525203 4829883 1802681 -1484043 -2103164
37085b103164J747708J044662q01541l20765J868357K214520K10031q14975P61622
$$ -2103164 -355456 689206 -112335 -433100 1435257 3649777 3859808 3044833 3806455
37076C806455K347895J491863n83795j693337k074557k708716k642458p80846
$$ 3806455 6154350 7646213 7062418 5369081 3294524 585808 -2056650 -2837496
37068b837496J368870J645869O94270N68492Q80393m24678k878276l501885j364513
$$ -2837496 -1468626 177243 871513 1440005 2320398 1895720 -982556 -4484441 -5848954
37059e848954J020667J657518J487139J677488J347923j88787j305279m48304
$$ -5848954 -4828287 -3170769 -1683630 -6142 1341781 1152994 -152285 -600589
37051f00589J061403R42515n50821j338187q46671l11564k38444R6812O69027
$$ -600589 460814 1403329 852508 -485679 -1332350 -1643914 -1882358 -1785546 -1116519
37042a116519M76843l35634k02017J272131K279414J465365J6716l66866k86592
$$ -1116519 -639676 -975310 -1177327 94804 2374218 3839583 3856299 3489433 3202841
37033C202841j455165l360219l453271r92035J445183J397298j80002o29181N98406
$$ 3202841 1747676 -1612543 -5065814 -6057849 -4612666 -3215368 -3395370 -4024551 -3426145
37024c426145J810039K046778J924327J606794L35816j514585k221318j466547
$$ -3426145 -1616106 430672 2354999 3961793 4297609 2783024 561706 -904841
37016i04841j052144j613066j031424J924148M625110L915457P52857j406213
$$ -904841 -1956985 -3570051 -4601475 -2677327 1947783 5863240 6616097 5209884
37008E209884j559194j298270j024882K51422J636623P95173j816309k830546
$$ 5209884 3650690 2352420 1327538 1578960 3215583 4010756 2194447 -636099
37000f36099j063416P37286N25572r7480O31828J462494P91875k66132j09717
$$ -636099 -1699515 -962229 -436657 -534137 97691 1560185 2352060 2085928 1976211
36991A976211L70093k26430q65438m3404R93243J42641j624442j489799O23537
$$ 1976211 2346304 2119874 1254436 1211032 2204275 2346916 722474 -767325 -143788
36982a43788J823608O70892r16543p29852Q63264J861801J096421p62286j926220
$$ -143788 1679820 2350712 1434169 704317 1567581 3429382 4525803 3763517 1837297
36973A837297j277687J04270j276j743465k494655o13301J786948J822931P8693
$$ 1837297 559610 663880 662604 -1080861 -3575516 -4188817 -2401869 -578938 -500245
36964e00245o99320J3096M33667J34710M91732J403509Q50161j485476l063157
$$ -500245 -1199565 -1186469 -752802 -618092 -126360 1277149 2127310 641834 -2421323
36955b421323k133936n3353J327446K174187K965906K570157K54019k037905j938084
$$ -2421323 -4555259 -4608612 -3281166 -1106979 1858927 4429084 4683103 2645198 707114
36946G07114k72299O2784j493505k317085n43239K217622L096665J482009q46295
$$ 707114 434815 497599 -995906 -3312991 -3856230 -1638608 1458057 2940066 2093771
36937B093771k183104k242146j458756k25926R71419J504143J132535L11265j91417
$$ 2093771 -89333 -2331479 -3790235 -4016161 -3044742 -1540599 -408064 -96799 -288216
36928b88216J51270J209701J967598J145256j164196k868048k068223K76746J372848
$$ -288216 -136946 1072755 3040353 4185609 3021413 153365 -1914858 -1638112 -265264
36919b65264L69068p20947l87088K40772j66579o74363O3449J215655J215870
$$ -265264 103804 -617143 -1004231 -763459 -930038 -1604401 -1540952 -325297 890573
36910H90573M01661l1287l82375j308346j628852n5420J959050K060823P57592
$$ 890573 1292234 1260947 878572 -429774 -2058626 -2114046 -154996 1905827 2663419
36901B663419K61365N46167N309q43153j87880J162551Q66955l83929Q5944J589083
$$ 2663419 2924784 3470951 3476260 2633107 2445227 3607778 4474733 4090804 4176748 5765831
36891E765831Q42033j761493k234508j42100L14120k084770l077142m98004J798040
$$ 5765831 6607864 4846371 2611863 2469763 2783883 699113 -2378029 -2876033 -1077993
36882a077993Q73525l55468Q80065J886290r3735k256821j230380P93898L43644
$$ -1077993 -204468 -559936 320129 2206419 2112684 -144137 -1374517 -580619 -236975
36873b36975r62245N9722J925226J553733K53341P49759J337005q47575l461586
$$ -236975 -1199220 -1139498 785728 2339461 2592802 3342561 4679566 3831991 370405
36864C70405k290985J276547K498229J125441O78180J532409J135599j97305l4030
$$ 370405 -1920580 -644033 1854196 2979637 3657817 5190226 6325825 6128520 6094490
36855F094490P26187o70056k987142k786194q71788o30805j251988N53944L232455
$$ 6094490 6820677 6150621 3163479 377285 -494503 -1125308 -2377296 -1823352 1409103
36846A409103K263947j230727j610224J458802K292787q43451l008954j418839
$$ 1409103 3673050 2442323 832099 2290901 4583688 3740237 731283 -687556
36838f87556O02381O11247P70236K099068J822817p52909k026476n37231L70916
$$ -687556 -85175 526072 1296308 3395376 5218193 4465284 2438808 1901577 2272493
36829B272493j010870j609422L39717J885037J012633J29294Q93111R75643r37256
$$ 2272493 1261623 -347799 -8082 1876955 2889588 3018882 3911993 4887636 3950380
36820C950380k104175p84656N60089L2016m99699L54120Q13497j245j06380R52603
$$ 3950380 1846205 1061549 1621638 1653654 1153955 1508075 2321572 2320327 2213947 3166550
36810C166550P24141j010048j009557J371967K457099P70349m73158L53020N69300
$$ 3166550 3890691 2880643 1871086 3243053 5700152 6470501 5997343 6350363 6919663
36801F919663q91935j180044L42923K31296k142685k677077k83854P39159r71910
$$ 6919663 6027728 4847684 5190607 5421903 3279218 602141 318287 1057446 85536
36792H5536j023585J819368K330295j339553l190068J92139L350241J813541l42202
$$ 85536 -938049 881319 3211614 1872061 -1318007 -1125868 2224373 4037914 3695712
36783C695712R08612J935388n92647k528149n50858N91786k749539m854436m21379
$$ 3695712 4604324 6539712 5947065 3418916 2868058 3459844 710305 -4144131 -4565510
36774d565510N026659M020260m98796j329242Q62942J136931K8767M72585P64203
$$ -4565510 461149 4481409 3982613 2653371 3516313 4653244 4682011 5154596 5918799
36765E918799q70208j009275J789695K263606j311576j745553L698457O270250
$$ 5918799 5048591 4039316 5829011 8092617 6781041 5035488 8733945 15004195
36757A5004195K015537J063162Q315468J1402395L974068K072661J5821936K6124494
$$ 15004195 17019732 18082894 26398362 37800757 41774825 43847486 59669422 85793916
36749H5793916J9825312K6149186P3055410J19702622R0097200j7450655j09708437
$$ 85793916 105619228 131768414 204823824 324526446 414623646 397172991 287464554
36742B87464554j11662333n4064888j5512783j7967625k4633496j4038332l403378
$$ 287464554 175802221 121737333 106224550 88256925 63623429 49585097 46181719
36735D6181719n448031q219880l658364j700063p144048r044836k056495L273778
$$ 46181719 40733688 32513808 28855444 27155381 20011333 10966497 8910002 12183780
36727A2183780k6592l927945j478454J648609l15492k882494j305503O43700r11077
$$ 12183780 12157188 8229243 6750789 8399398 8083906 5201412 3895909 4539609 3628532
36718C628532k613011j224812L72134j87565k33407J359276J089541j585800j709191
$$ 3628532 1015521 -209291 162843 -24722 -258129 1101147 2190688 604888 -1104303
36709a104303J987693L510002j90140l374149j160529K312160J310056k148847
$$ -1104303 883390 4393392 4203252 829103 -331426 1980734 3290790 1141943
36701A141943k668876l29874R24305J80208n31986n54326m33765K93645J665220
$$ 1141943 -1526933 -1856807 -932502 -752294 -1284280 -1838606 -2272371 -1978726 -313506
36692c13506J899040K57207j144375p83152k38930r55302j435918j46671J553624
$$ -313506 1585534 1842741 698366 -84786 -323716 -1279018 -2714936 -2861607 -1307983
36683a307983J849515J316491J076370N37469q88027k069178k029348j376476
$$ -1307983 541532 1858023 2934393 3471862 2583835 514657 -1514691 -2891167
36675b891167m83927J200329K768047J882794j102875k293231K81667L348592
$$ -2891167 -3375094 -2174765 593282 2476076 1373201 -920030 -638363 2710229
36667B710229L064802L01118j504466j413597r14865o05554j4798L51192m78173
$$ 2710229 5775031 6076149 4571683 3158086 2243221 1637667 1622869 1974061 1495888
36658A495888j901082k284588j145953O45244K155694K637154J448116q54938
$$ 1495888 -405194 -2689782 -3835735 -3190491 -1034797 1602357 3050473 2195535
36650B195535k165375j037742J215543J887308J46999j969697j929719L32449
$$ 2195535 30160 -1007582 207961 2095269 2242268 272571 -1657148 -1324699
36642a324699K103931R95458j726597k303481K99263K351578N14098k899619l014287
$$ -1324699 779232 1774690 48093 -2255388 -1956125 395453 909551 -1990068 -5004355
36633e004355M59825L118863K628266J264106R62316K76519j767407k742325p07041
$$ -5004355 -4544530 -1425667 1202599 2466705 3429021 3705540 1938133 -804192 -1511233
36624a511233J928957J762280l92130j020509N87654J703872O72332r59968j281485
$$ -1511233 417724 2180004 1787874 767365 1355019 3058891 3731223 2771255 1489770
36615A489770o36277m21413p84616p36105N4397O44201J77219p61021q22482J57715
$$ 1489770 853493 432080 -352536 -1088641 -1034244 -390043 -212824 -973845 -1796327 -1638612
36605a638612Q46657M87106J98971J172065K493271K266799L48943j584116k316361
$$ -1638612 -791955 -304849 -105878 1066187 3559458 5826257 6175200 4591084 2274723
36596B274723j920602p77577M92335N52153j168627k747938j746208J088942K455944
$$ 2274723 354121 -423456 68879 621032 -547595 -3295533 -5041741 -3952799 -1496855
36587a496855J129178m99494j76523J314113K057044J666514P74794k89257r77026
$$ -1496855 -367677 -867171 -1043694 270419 2327463 3993977 4768771 4479514 3502488
36578C502488l08625J437003K239841R19225j046217j612341r17856n01572p45092
$$ 3502488 3193863 4630866 6870707 7789932 6743715 5131374 4213518 3711946 2966854
36569B966854p06110l1290M34829R205q08135r49611r9888P72180M20462r75321
$$ 2966854 2260744 2229454 2664283 2673488 1865353 915742 815854 1588034 2008496 1033175
36559A033175j680577o08975J006103J202710j44q30383l52042O06105R21433
$$ 1033175 -647402 -1256377 -250274 952436 952292 121909 -230133 375972 1297405
36550A297405K50227j077360j960788r95627J381011K220124j90826k901677j721103
$$ 1297405 1547632 470272 -1490516 -2486143 -1105132 1114992 924166 -1977511 -3698614
36541c698614K450427M461728K354834j71258l620Q81399l84506k513519k621354
$$ -3698614 -1248187 3213541 5568375 5397117 5393497 6274896 5890390 3376871 755517
36532G55517j216969q78174j564320r77545J158741K588460K135100R19372o7764
$$ 755517 -461452 -1339626 -2903946 -3881491 -2722750 -134290 2000810 2920182 2852418
36523B852418r15458j099524M39692K752124K869160k64513l640492l649089o20001
$$ 2852418 1936960 837436 1277128 4029252 6898412 6633899 2993407 -655682 -1275683
36514a275683J820912J492614j94o7865J191850J466239j60044j803405j574151
$$ -1275683 545229 2037843 2037649 1969784 3161634 4627873 4467829 2664424 1090273
36505A090273k72206J10276m16957j26674J213003J612985p4300k252162k776262
$$ 1090273 818067 928343 511386 384712 1597715 3210700 3136400 884238 -1892024
36496a892024j603854j06264J014572J777438J856818J022063K02017O56279K029486
$$ -1892024 -3495878 -3602142 -2587570 -810132 1046686 2068749 2270766 2927045 4956531
36487D956531K325590K13339l135700m857558l121374Q36851L582137K823850
$$ 4956531 7282121 7495460 4359760 -497798 -3619172 -2782321 799816 3623666
36479C623666k10190k270744j740702L2354R24786M29408m36876o61602j48408
$$ 3623666 3413476 1142732 -597970 -565616 359170 788578 351702 -309900 -458308
36470d58308M04699L13781j16852K19739J487504K086344P67177j141362j342744
$$ -458308 -53609 260172 143320 363059 1850563 3936907 4704084 3562722 2219978
36461B219978K4182O69415k33235j039146o35567o6178k50676k74883P40692J831739
$$ 2219978 2244160 2913575 2680340 1641194 1005627 939449 688773 413890 1154582 2986321
36451B986321J612049J60954j524214k608626k270785k41729J763167J311112
$$ 2986321 4598370 4759324 3235110 626484 -1644301 -1886030 -122863 1188249
36443A188249j029337j723026N30659K442040J195306r64538m23031J814165J833887
$$ 1188249 158912 -1564114 -1033455 1408585 2603891 1639353 1216322 3030487 4864374
36434D864374p82781k551557j777453n21303l94766k41588Q13354J364192M01862
$$ 4864374 4081593 1530036 -247417 -768720 -1163486 -1405074 -591720 772472 1174334
36425A174334p57483r01049q29330j128563m87014J632525K871292J176070j569248
$$ 1174334 416851 -484198 -1313528 -2442091 -2929105 -1296580 1574712 2750782 1181534
36416A181534k050372n05859M068j187662j342318R26187L067558K326838k56037
$$ 1181534 -868838 -1374697 -1370629 -2558291 -3900609 -2974422 93136 2419974 2163937
36407B163937j542574n74973P55665O12389p88381j823556j139679R85486K450774
$$ 2163937 621363 46390 802055 1414444 626063 -1197493 -2337172 -1351686 1099088
36398A099088J332797j417229k640046j183541L60868l24302j564459n47538J809920
$$ 1099088 2431885 1014656 -1625390 -2808931 -2448063 -2772365 -4336824 -4884362 -3074442
36389c074442K327850R48698O05500J765512J517921r00682k099643j09427K038146
$$ -3074442 -746592 202106 807606 2573118 4091039 3190357 1090714 981287 3019433
36380C019433J103630j427843k393285j851115j393690m26920J752954K617097
$$ 3019433 4123063 2695220 301935 -1549180 -2942870 -3369790 -1616836 1000261
36372A000261j65191l714153l351419R4006J583587o8792r41778Q37001K224802
$$ 1000261 835070 -2879083 -6230502 -6136496 -4552909 -4621701 -5563479 -4726478 -2501676
36363b501676R73449p78359o83299L01306P78892J454880K511394K003520o16160
$$ -2501676 -1528227 -2306586 -2989885 -2688579 -1909687 -454807 2056587 4060107 3443947
36354C443947k514137j521734O16441J313690P09939R556q49820j577814n58769
$$ 3443947 929810 -591924 24517 1338207 2048146 2057702 1207882 -369932 -928701
36345i28701J994160K878921N98576j762810j258496M39599N98819K44435J326739
$$ -928701 1065459 3944380 4542956 2780146 1521650 1961249 2560068 2804503 4131242
36336D131242J967261n80333m261008m661768j896159L3846Q681O81777K649851
$$ 4131242 6098503 5518170 1257162 -3404606 -5300765 -5266919 -5258238 -4576461 -1926610
36327a926610L054321R82804n39525L87865J600554R42201l12034l39135l4560
$$ -1926610 1127711 2110515 1570990 1958855 3559409 4501610 4189576 3850441 3815881
36318C815881r10567k072983j812787n90555j51250p14925r40251m9127J357966
$$ 3815881 2905314 832331 -980456 -1571011 -1722261 -2437186 -3377437 -3426564 -2068598
36309b068598K089082J172700j326552l670832l642026j120814J442754J806246
$$ -2068598 20484 1193184 -133368 -3804200 -7446226 -8567040 -7124286 -5318040
36301e318040L11634j034846q62731P39491K653433L323896J921084l60171j092624
$$ -5318040 -5006406 -6041252 -6903983 -6164492 -3511059 -187163 1733921 1373750 281126
36292B81126M89368K246379J737999o03164k036959r97645J111126J857560O94620
$$ 281126 770494 3016873 4754872 4151708 2114749 1117104 2228230 4085790 4780410
36283D780410p30812q59391N3990P55279O96157J19103r17854k315095l016712
$$ 4780410 4049598 3190207 3244197 3999476 4695633 4814736 3896882 1581787 -1434925
36274a434925j939333L0219P21122j35565l36480J210841K375476R79128j561833
$$ -1434925 -3374258 -3344039 -2622917 -2758482 -3094962 -1884121 491355 1470483 -91350
36265i1350k008965J20084J898932P94299k393230m447512k868850J501430M667325
$$ -91350 -2100315 -1980231 -81299 713000 -1680230 -6127742 -8996592 -7495162 -2827837
36256b827837L419945n70474k447272n63930J460146N06982j389706r14977Q86285
$$ -2827837 592108 21634 -2425638 -2989568 -1529422 -1022440 -2412146 -3327123 -2440838
36247b440838P47855r91101j159924N47205J139070m06042j567273n63810J323544
$$ -2440838 -1692983 -2684084 -3844008 -3296803 -2157733 -2563775 -4131048 -4694858 -3371314
36238c371314K385665K325352J048325j248406k537603r41967J476802P71317
$$ -3371314 -985649 1339703 2388028 1139622 -1397981 -2339948 -863146 -91829
36230i1829k517206l451217m01229K118454O76666j630557n64363K226681K139029
$$ -91829 -2609035 -6060252 -6461481 -4343027 -3666361 -5296918 -5861281 -3634600 -1495571
36221a495571q01429k127948J03084K811910K720146M60021j070248m36614J179810
$$ -1495571 -2297000 -4424948 -4321864 -1509954 1210192 1670213 599965 163351 1343161
36212A343161J647086K80635j293000j139241K52770O57605l70515q50067Q1753
$$ 1343161 2990247 3270882 1977882 838641 1091411 1749016 1378501 528434 610187
36203F10187O06499l73507j031864J6797Q18748n15867j845032j54237K907894
$$ 610187 1216686 843179 -188685 -171888 646860 130993 -1714039 -1868276 1039618
36194A039618K915138m62550k791958j529505P31808R89760J48133L72315R81239
$$ 1039618 3954756 3492206 700248 -829257 -97449 892311 1040444 1412759 2393998
36185B393998m8972k036143k118152M00494K723824K243100j40570j485240o95716
$$ 2393998 2345026 308883 -1809269 -1408775 1315049 3558149 3417579 1932339 1236623
36176A236623M58527K08501p11567l96797J210796K187120J454975R9779o47941
$$ 1236623 1695150 1903651 1192084 795287 2006083 4193203 5648178 5747957 5100016
36167E100016j088192j667814j482561J59922J747626J153367j190142k626849
$$ 5100016 4011824 2344010 861449 1021371 2768997 3922364 2732222 105373
36159A05373j802672j09215O85345O33485P93118J486066K207553K462834J974837
$$ 105373 -1697299 -1806514 -1121169 -487684 305434 1791500 3999053 6461887 8436724
36150H436724O44371j058698k080248j766501p06120j29414m32590o25817M14287
$$ 8436724 9081095 8022397 5942149 4175648 3469528 3340114 2907524 2281707 2695994
36141B695994K127943K327681j70331l340969l777711j042267J417540P35212
$$ 2695994 4823937 7151618 6981287 3640318 -137393 -1179660 237880 973092
36133I73092j530388j825637K40520J668771P67152o53320n79093J36539l47818
$$ 973092 -557296 -2382933 -2142413 -473642 293510 -359810 -938903 -802364 -1150182
36124a150182j642066j877044p43642L56357Q39927J480560K245127J761611j63604
$$ -1150182 -2792248 -4669292 -5412934 -5056577 -4216650 -2736090 -490963 1270648 1107044
36115A107044j394293l54642J324644R96423j030468k000000r61027K4801m95111
$$ 1107044 -287249 -641891 682753 1679176 648708 -1351292 -2312319 -2287518 -2782629
36106b782629j050858k1624J370753R78287p41063j478104n87626N07771J009083
$$ -2782629 -3833487 -3855111 -2484358 -1506071 -2247134 -3725238 -4312864 -3805093 -2796010
36097b796010J400976J471003K04454j858175k520028j043696O99035J140223
$$ -2796010 -1395034 75969 280423 -1577752 -4097780 -5141476 -4442441 -3302218
36089c302218J041909J435629J567911N43792o31274n12125M61203Q38852M11184
$$ -3302218 -2260309 -824680 743231 1287023 655749 143624 604827 1443679 1854863
36080A854863j2243j80426k18524K41518J193668J424852J83201j216759j184262
$$ 1854863 1842620 1662194 1443670 1685188 2878856 4303708 4486909 3270150 2085888
36071B085888l10033j01041k34029N49605J509582O55765j657456k673810j209851
$$ 2085888 1775855 1674814 1440785 1990390 3499972 4155737 2498281 -175529 -1385380
36062a385380Q40250J609583J435850J105828L55659o99775q90415j19156m9444
$$ -1385380 -545130 1064453 2500303 3606131 3961790 3262015 2371600 2252444 2203000
36053B203000j179757j449911L45237J960126R96190j084057j201155M86476J269420
$$ 2203000 1023243 -426668 -81431 1878695 2874885 1790828 589673 1076149 2345569
36044B345569N13131o160j1351j035204k481512j551235J623426K920324N32626
$$ 2345569 2858700 2852540 2841189 1805985 -675527 -2226762 -603336 2316988 2849614
36035B849614j593372J44104K955143K037488j586968k827696p96367L53740j057837
$$ 2849614 1256242 1400346 4355489 6392977 4806009 1978313 1181946 1535686 477849
36026D77849j637240N72660K231443K64407k891029l139424p05619J344238K042379
$$ 477849 -1159391 -586731 1644712 1909119 -981910 -4121334 -4826953 -3482715 -1440336
36017a440336K286540J734586j92365j704592q47035Q80666Q14065k33036K73219
$$ -1440336 846204 2580790 2388425 683833 -163202 717464 1531529 1298493 1571712
36008A571712J358536l8602k902725k851601M58847K255717M84634r20227Q10788
$$ 1571712 2930248 2891646 -11079 -2862680 -2403833 -148116 336518 -583709 227079
35999B27079K337648K76759k564372j910300P48764J122526m01155j56053J583294
$$ 227079 2564727 2841486 277114 -1633186 -884422 238104 -163051 -319104 1264190
35990A264190J013248j945104k940579n68669J265480J43933r78895N58894K218096
$$ 1264190 2277438 332334 -2608245 -3176914 -1911434 -1767501 -2746396 -2187502 30594
35981C0594P66062j866403j615236J089343K230256O71072n98811L33117J715786
$$ 30594 796656 -1069747 -2684983 -1595640 634616 1305688 706877 1039994 2755780
35972B755780J563400M60756l65475j154424k141604k094009k98374J458857R99511
$$ 2755780 4319180 4779936 4414461 3260037 1118433 -975576 -1273950 184907 1184418
35963A184418j036786k100591j322150j63916L28122P71669J574370J867675J237589
$$ 1184418 147632 -1952959 -3275109 -3439025 -3110903 -2339234 -764864 1102811 2340400
35954B340400P90916J229161J295498k67852k271083k428097o27072R70862R84780
$$ 2340400 3131316 4360477 5655975 5388123 3117040 688943 61871 1032733 2017513
35945B017513K53000r549N2587l40690j208247j790311j371717J28733J887513
$$ 2017513 2270513 2260964 2313551 1972861 764614 -1025697 -2397414 -2268681 -381168
35936c81168K548790J534780j32215j009160r40385p38639o10197j16630N55393
$$ -381168 2167622 3702402 3570187 2561027 1620642 882003 271806 155176 710569
35927G10569O57834K05082j9609K07443L85335L58914L57044J62123m85793r67836
$$ 710569 1368403 1573485 1553876 1761319 2146654 2505568 2862612 3024735 2538942 1571106
35917A571106o27945l3422J19104N16395J657989J848677m35520l039445k554656
$$ 1571106 943161 909739 1028843 1545238 3203227 5051904 4616384 1576939 -977717
35908i77717R1521O45095j522663k166371P23056L349350K203880o16751j520504
$$ -977717 -886196 -241101 -1763764 -3930135 -3207079 142271 2346151 1729400 208896
35899B08896j053136j495588j994635m98827J730156J931939N34933m9224J82763
$$ 208896 -844240 -2339828 -4334463 -4833290 -3103134 -1171195 -636262 -685486 -502723
35890e02723k90100o71911P48482K446638J486083j138797j635911L02289J083720
$$ -502723 -792823 -1464734 -716252 1730386 3216469 2077672 441761 744050 1827770
35881A827770n62513j661614l39028J241477Q65309m82974j027966p45026o8740
$$ 1827770 1265257 -396357 -735385 506092 1371401 888427 -139539 -884565 -953305
35872i53305J033872J559830O3973k207522k079744M95509J795748K96907o94763
$$ -953305 80567 1640397 1704370 -503152 -2582896 -2087387 -291639 5268 -689495
35863f89495J236081L174621J570635j806296k662225p68540M56295k65190q28866
$$ -689495 546586 3721207 5291842 3485546 823321 54781 511076 245886 -582980
35854e82980q767P68785L99046j82429j33650j94100r92426j647846j145080J51177
$$ -582980 -591747 177038 576084 393655 260005 65905 -926521 -2574367 -3719447 -3568270
35844c568270J291422K039096K442567J971939L32133j207089p70189J343007
$$ -3568270 -2276848 -237752 2204815 4176754 4508887 3301798 2531609 3874616
35836C874616K149056l95432m027733m436225r03099K625878K864345J014605
$$ 3874616 6023672 5628240 1600507 -2835718 -3738817 -1112939 1751406 2766011
35828B766011k94254j115865k444892k772468l26477K641521K248420p89203j891174
$$ 2766011 2471757 1355892 -1089000 -3861468 -4187945 -1546424 701996 -87207 -1978381
35819a978381J72655J604344K20501j103167J74165J852070J039513r98884j438196
$$ -1978381 -1805726 -201382 19119 -1084048 -909883 942187 1981700 982816 -455380
35810d55380m35844K99727R43764K113089K278668K56480j676668r30626Q41150
$$ -455380 -891224 -591497 352267 2465356 4744024 5000504 3323836 2393210 3234360
35801C234360L39816j652399j593515N72730J267629m92894j440538K59173J941370
$$ 3234360 3574176 1921777 328262 900992 2168621 1675727 235189 494362 2435732
35792B435732R93945j066453j488120m97544K9871O6389P97412J755255J341134
$$ 2435732 3429677 2363224 875104 377560 407431 473820 1271232 3026487 4367621
35783D367621k68193j142954n48947J95765J48907R1214O16182O13396q22137
$$ 4367621 4099428 2956474 2407527 2603292 2752199 2843413 3459595 4072991 3250854
35774C250854k157840j187899J328895K131980Q5484j975563j383841N01127P55633
$$ 3250854 1093014 -94885 1234010 3365990 3451474 1475911 92070 593197 1348830
35765A348830m77405p36751L51336P68109L8884J75J070401J156246n36874j773775
$$ 1348830 871425 134674 486010 1254119 1293003 1293178 2363579 3519825 2982951 1209176
35755A209176r66916L31459M41108K36235P24654P45517m23158q48099P36922
$$ 1209176 242260 573719 1014827 1251062 1975716 2721233 2298075 1449976 2186898
35746B186898J886519J26680k485252k361508k58847J55698j399450j589566N52130
$$ 2186898 4073417 4200097 1714845 -646663 -905510 -749812 -2149262 -3738828 -3186698
35737c186698K015396J107362J81843J309808K661410J601915j010176k176482
$$ -3186698 -1171302 -63940 117903 1427711 4089121 5691036 4680860 2504378
35729B504378j038343M91776P91096K82402j0652k45493j210288k457520k252038
$$ 2504378 1466035 1957811 2748907 3031309 3020657 2775164 1564876 -892644 -3144682
35720c144682j01055J737824R70925j123208j258009P46922J615815J59656n98032
$$ -3144682 -3245737 -1507913 -536988 -1660196 -2918205 -2171283 -555468 -395812 -993844
35711i93844J226075K764770J234892j155531j088167K10653j43554r46683M30113
$$ -993844 232231 2997001 4231893 3076362 1988195 2198848 2055294 1108611 1538724
35702A538724J861391n62327m554042l745558J994443N527518L184530l79177
$$ 1538724 3400115 2837788 -1716254 -5461812 -3467369 2060149 5244679 4865502
35694D865502n51207O26122j58946j365469m26771J006055M54519n31867L65149
$$ 4865502 4314295 4940417 4781471 3416002 2989231 3995286 4449805 3917938 4283087
35685D283087J388003q1329k259352j861116R71j07824j645457j082426J663813
$$ 4283087 5671090 5589761 3330409 1469293 1470264 1362440 -283017 -1365443 298370
35676B98370K867083J110212p71063n52208L60150j46760j798569k830697k128327
$$ 298370 3165453 4275665 3504602 2952394 3312544 3165784 1367215 -1463482 -3591809
35667c591809n8301J525754O57671j920261k647273J19243L026425K241728p19855
$$ -3591809 -3650110 -2124356 -1466685 -3386946 -6034219 -5914976 -2888551 -646823 -1366678
35658a366678j416501N88617J672484N61033k8379J210798J739792k35410k604871
$$ -1366678 -2783179 -2194562 -522078 38955 10576 1221374 2961166 2725756 120885
35649A20885k835472j494462k55860Q68771K144375K295643M12793j928649k436083
$$ 120885 -2714587 -4209049 -4464909 -3596138 -1451763 843880 1256673 -671976 -3108059
35640c108059q54383J344877K708558K249954j63290k734174k762071M2344K862046
$$ -3108059 -3962442 -2617565 90993 2340947 2177657 -556517 -3318588 -3276244 -414198
35631d14198L373856K183079P23588q91583k446283k504921p47441P18765M99866
$$ -414198 2959658 5142737 5866325 4974742 2528459 23538 -723903 -5138 494728
35622D94728J97298J203543J640038l69360k549951j561563J245213J630523o30975
$$ 494728 692026 1895569 3535607 3166247 616296 -945267 299946 1930469 1299494
35613A299494j471108N14764J798200J32049j624921n47423J432369J097994o12952
$$ 1299494 -171614 343150 2141350 2273399 648478 101055 1533424 2631418 2018466
35604B018466p14347M55408K80172r86061o72253R98466P18923j914750k717164
$$ 2018466 1304119 1759527 2039699 1053638 381385 1379851 2098774 184024 -2533140
35595b533140O14582M088771K715996k274874n164921l415627k0337J502540J065917
$$ -2533140 -1918558 2170213 4886209 2611335 -2553586 -5969213 -5989550 -4487010 -3421093
35586c421093L37114j1340l4549M51533J114516Q71234k65140m87081J144554
$$ -3421093 -3083979 -3095319 -3129868 -2678335 -1563819 -692585 -957725 -1444806 -300252
35577c00252K592692J364781j605223k863637j209253P33207M87058p88010m25918
$$ -300252 2292440 3657221 2051998 -811639 -2020892 -1287685 -800627 -1588637 -2014555
35568b014555J471391K135082K78536k048098k482631j460681q87426r15696m9910
$$ -2014555 -543164 1591918 1870454 -177644 -2660275 -4120956 -5008382 -5924078 -5973988
35559e973988J859989K877500J841493J88486k40818J69089p0836p56511k61563
$$ -5973988 -4113999 -1236499 604994 793480 552662 721751 650915 -105596 -367159
35550c67159J580612K730497J585780r31957k586499k270389p23369N30421N41651
$$ -367159 1213453 3943950 5529730 4597773 2011274 -259115 -982484 -452063 89588
35541H9588l06499p13637o863R43768R85970L95759K05058K30430n72544j782358
$$ 89588 -216911 -930548 -937411 6357 992327 1388086 1593144 1823574 1251030 -531328
35531e31328j512380O04566K283141J588483m24053j418181q98247j34370P8509
$$ -531328 -2043708 -1439142 843999 2432482 2008429 590248 -307999 -442369 -363860
35522c63860j802j38243l05390j80507L16904L85122n41671j450589q50179J007600
$$ -363860 -365662 -503905 -809295 -989802 -672898 -287776 -829447 -2280036 -3130215 -2122615
35512b122615K264861J752402Q8290j383984j732119o96095J086496K181393J680398
$$ -2122615 142246 1894648 1982938 598954 -1133165 -1829260 -742764 1438629 3119027
35503C119027L48701m21362m75169n93560o86558J57270J699299K200546O91565
$$ 3119027 3467728 3046366 2571197 1977637 1291079 1448349 3147648 5348194 6039759
35494F039759j544859k534625j903155q88947n47822o14864r2547J318644K511613
$$ 6039759 4494900 1960275 57120 -831827 -1379649 -1994513 -2087060 -768416 1743197
35485A743197K004754j18052j854257j501262K22124J130278L35345r74431j432243
$$ 1743197 3747951 3629899 1775642 274380 496504 1626782 1962127 987696 -444547
35476d44547j028765m60086P8258P99962J524394J627884Q60003o7943o1363R37483
$$ -444547 -1473312 -1933398 -1855140 -1055178 469216 2097100 2957103 2889160 2827797 3765280
35466C765280J469116K77981j613136j775311L01335K097922J182146j674711
$$ 3765280 5234396 5512377 3899241 2123930 2425265 4523187 5705333 4030622
35458D030622l595407k941412n36206J557929J509332r17139l361027k644235
$$ 4030622 435215 -2506197 -3042403 -1484474 24858 -892281 -4253308 -6897543
35450f897543J009288L228983J082504k311153j782384K416326M866024K625787
$$ -6897543 -5888255 -2659272 -1576768 -3887921 -5670305 -3253979 1612045 4237832
35442D237832j183402k399156j049784J89955K13287O533M29264J242552J660505
$$ 4237832 3054430 655274 -394510 -204555 8732 15265 444529 1687081 3347586
35433C347586J018638l97990j081558m3847J390642J255694L6077k73391J07269
$$ 3347586 4366224 3968234 2886676 2842829 4233471 5489165 5525242 5251851 5359120
35424E359120q79562k811340k643963k9012J221692q63474k744282q00184K759650
$$ 5359120 4479558 1668218 -975745 -1004757 216935 -646539 -3390821 -4191005 -1431355
35415a431355L222497L16471k182159k272899j194937k746J392292K060324O26247
$$ -1431355 1791142 2107613 -74546 -2347445 -3542382 -3545128 -2152836 -92512 533735
35406E33735j745527k147810j56223J580958J417849N99402M36076L08474m19823
$$ 533735 -1211792 -3359602 -3515825 -1934867 -517018 82384 518460 826934 407111
35397D07111q02924q738J033167R53784j95445j311016j597203r90323Q022O15328
$$ 407111 -395813 -404551 628616 1582400 1386955 75939 -1521264 -2511587 -2503565 -1888237
35387a888237N26136L05638L80531K28852m02705l71800J128715K483465J458278
$$ -1888237 -1362101 -1056463 -675932 -447080 -849785 -1221585 -92870 2390595 3848873
35378C848873j197567k263671m02737K092448K446011N48059j633194k362884
$$ 3848873 2651306 387635 -15102 2077346 4523357 5071416 3438222 1075338
35370A075338j377708N1170J16305j460865k659078j663791N10457J545113J168396
$$ 1075338 -302370 -251200 -134895 -1595760 -4254838 -5918629 -5408172 -3863059 -2694663
35361b694663Q19093O55641l98008j841004j711986J94656J864224K163087J872214
$$ -2694663 -1875570 -1219929 -1617937 -3458941 -5170927 -4976271 -3112047 -948960 923254
35352I23254J423314L87102n08037J12275J307272O40801j459746j812067J17976
$$ 923254 2346568 2733670 2225633 2337908 3645180 4285981 2826235 1014168 1132144
35343A132144R60894q13574k085663m26570J701621J181951p41884j107431J1790
$$ 1132144 2093038 1279464 -806199 -1232769 468852 1650803 908919 -198512 -186722
35334a86722Q29142J259779J592094M47107k275216l154198o8616L340980K596680
$$ -186722 642420 1902199 3494293 3941400 1666184 -1488014 -1556630 1784350 4381030
35325D381030o45057j638339l68722m45649j745972q07877J891953K001567p07431
$$ 4381030 3735973 2097634 1728912 1283263 -462709 -1270586 621367 2622934 1915503
35316A915503j362672J280662K067753j593008m502139j787567L179338M250397
$$ 1915503 552831 1833493 3901246 2308238 -2193901 -3981468 -802130 3448267
35308C448267J700901K18966O46756j84303k756006l783345j897189L35133Q03467
$$ 3448267 5149168 5368134 6014890 5830587 3074581 -708764 -2605953 -2270820 -1467353
35299a467353M92040P68247J127970Q13078L44230L34577M51522L34563J95520
$$ -1467353 -975313 -207066 920904 1733982 2078212 2412789 2864311 3198874 3394394
35290C394394L1556n15634j180555j107746j72334O87955O83559r220o63453o43459
$$ 3394394 3425950 2910316 1729761 622015 449681 1137636 1821195 1811975 1148522 505063
35280E05063J81558J143543J251821L88510n38821r28634j010472p33011M03075
$$ 505063 686621 1830164 3081985 3470495 2931674 2003040 992568 259557 662632
35271F62632J755372J594029j18986r42340M21857J671069K86903k324543k809897
$$ 662632 2418004 4012033 3893047 2950707 3372564 5043633 5330536 3005993 196096
35262A96096q32972Q29992N39170o21555j213392r04465K11279J491369J352154
$$ 196096 -636876 193116 732286 110731 -1102661 -2007126 -1795847 -304478 1047676
35253A047676p33748k504363j657383N53267J384057J182551K146822L330237
$$ 1047676 313928 -2190435 -3847818 -3294551 -1910494 -727943 1418879 4749116
35245D749116J622457k133271l195509l82596J658674j33946k516511j806826
$$ 4749116 6371573 4238302 1042793 660197 2318871 2184925 -331586 -2138412
35237b138412J08200j91777j404584k02563K476136K942937R43002n12992m46889
$$ -2138412 -2030212 -2221989 -3626573 -3829136 -1353000 1589937 2532939 2019947 1573058
35228A573058m20110m73584P81409K276738J321690j451614k453471r67580j03775
$$ 1573058 1152948 679364 1460773 3737511 5059201 3607587 1154116 186536 82761
35219H2761j035745j031994J086827K220960L42834j637802p48244Q59177l45288
$$ 82761 -952984 -1984978 -898151 1322809 1665643 27841 -720403 138774 -206514
35210b06514k972197k706333P90049L387288K602062L35658q25001o77576J7358
$$ -206514 -3178711 -5885044 -5094995 -1707707 894355 1230013 405012 -272564 -255206
35201b55206J137124K139294J652203m39890k112086j785165n94760o56895j851829
$$ -255206 881918 3021212 4673415 4233525 2121439 336274 -258486 -915381 -2767210
35192b767210j914577K43060K598808K285842n94602k622931j216354J812211
$$ -2767210 -4681787 -4438727 -1839919 445923 -148679 -2771610 -3987964 -2175753
35184b175753K482201J57588j511087o594K199087J390611j657810k815744p06956
$$ -2175753 306448 464036 -1047051 -1053645 1145442 2536053 878243 -1937501 -2644457
35175b644457J692632J829933O78527k7402o25828j657340j692491L04055K157706
$$ -2644457 -951825 878108 1556635 1529233 903405 -753935 -2446426 -2142371 15335
35166A5335J111242j577027j926384P94009K639875O86102k659832l114946l40544
$$ 15335 1126577 -450450 -2376834 -1582825 1057050 1743152 -916680 -4031626 -4372170
35157d372170K263167K512973J393951K60920j019569k313868k154904r2621J742441
$$ -4372170 -2109003 403970 1797921 2058841 1039272 -1274596 -3429500 -3522121 -1779680
35148a779680J446124L52469R02810K454607K082429n60068k265509j043206R47110
$$ -1779680 -333556 18913 921723 3376330 5458759 4898691 2633182 1589976 2537086
35139B537086Q87279o32312j282077r11100j051590j588656r28343P48459J324777
$$ 2537086 3424365 2792053 1509976 598876 -452714 -2041370 -2969713 -2221254 -896477
35130h96477L13721q7438J394866K732956J515650j328731k664413j259385R50405
$$ -896477 -582756 -670194 724672 3457628 4973278 3644547 980134 -279251 671154
35121F71154J528457J65585j466199j633829j68974J374083J250639m94153j921999
$$ 671154 2199611 2365196 898997 -734832 -903806 470277 1720916 1226763 -695236
35112f95236j478445J24732R83305N34672L847L20176P14309M5998j207504j386400
$$ -695236 -2173681 -2048949 -1065644 -530972 -527125 -206949 507360 553358 -654146 -2040546
35102b040546l0603J263609R36122m16357r76513k28380P23181J108140J187942
$$ -2040546 -2071149 -807540 128582 -287775 -1264288 -1492668 -769487 338653 1526595
35093A526595Q77403m24342j941758j541992R73325K574465R85372j798629k442797
$$ 1526595 2403998 1979656 37898 -1504094 -530769 2043696 3029068 1230439 -1212358
35084a212358j114572k94150j00541J216220K720699J431686j890185k484916
$$ -1212358 -2326930 -2621080 -2721621 -1505401 1215298 2646984 756799 -1728117
35076a728117J042713L733784J542888k520358l265278q90669P32188O69922R00994
$$ -1728117 -685404 3048380 4591268 2070910 -1194368 -2085037 -1352849 -682927 218067
35067B18067J456198P07296m42404K50726J445912k11412l463314l109099J484261
$$ 218067 1674265 2381561 1939157 2189883 3635795 3424383 -38931 -3148030 -1663769
35058a663769M339235J831014j729385j218401J282857O08513k627321l107966
$$ -1663769 2675466 4506480 2777095 1558694 2841551 3450064 822743 -2285223
35050b285223M85634L361593J747319k128717l623378j448579J646787K392822
$$ -2285223 -1799589 1562004 3309323 1180606 -2442772 -3891351 -2244564 148258
35042A48258J87248k487579k672136l77883J422546R93481K99106J521172L011632
$$ 148258 335506 -2152073 -4824209 -5202092 -3779546 -2786065 -2486959 -965787 2045845
35033B045845J673683j772313l425987j903999Q6175L30533p9254L95734J072186
$$ 2045845 3719528 1947215 -1478772 -3382771 -3296596 -2966063 -3045317 -2649583 -1577397
35024a577397Q33121K12819L9415r3083n31936n36157R7961J96012o24771q36378
$$ -1577397 -744276 -531457 -492042 -585125 -1117061 -1653218 -1555257 -1359245 -1984016 -2820394
35014b820394M09133J514239J052026J99497M31781O80276n91585k057530j333170
$$ -2820394 -2411261 -897022 155004 354501 786282 1466558 874973 -1182557 -2515727
35005b515727Q85399J678442M37990o16423m09698l24085j069979j254671m9220
$$ -2515727 -1630328 48114 486104 -130319 -540017 -864102 -1934081 -3188752 -3237972
34996c237972J290013J668152J628268J511441M69068j381178k085774p66350
$$ -3237972 -1947959 -279807 1348461 2859902 3328970 1947792 -137982 -904332
34988i04332O39019L26652n88066k35736Q21437Q74090R5121j69555O279k51703
$$ -904332 -265313 61339 -526727 -762463 58974 933064 1028185 858630 864909 613206
34978F13206m21112L08841O31537j075645l065792j875558K107014M352743K479208
$$ 613206 192094 500935 1132472 56827 -3008965 -4884523 -2777509 1575234 4054442
34969D054442n95370j405880o29139o84126j392524j036078J17577M58716N8167
$$ 4054442 3459072 2053192 1424053 739927 -652597 -1688675 -1571098 -1112382 -1054215
34960a054215J55171M95906M4527l75451P37106K146387J122786j667711k211545
$$ -1054215 -899044 -403138 -358611 -734062 3044 2149431 3272217 1604506 -607039
34951f07039P76919L345729J882274j787066l476939k421469r13503O1587J326169
$$ -607039 169880 3515609 5397883 3610817 133878 -2287591 -3201094 -3139507 -1813338
34942a813338K478464J901459q1268j117652m20096K45128j75738m48406K15885
$$ -1813338 665126 2566585 2485317 1367665 947569 1192697 1016959 568553 784438
34933G84438M61562o06587j404445m09449J153121J325291N60337M88463Q22741
$$ 784438 1246000 639413 -765032 -1174481 -21360 1303931 1864268 2352731 3175472
34924C175472J65044r54578p53711M02649K84339j274567j737820k1930J568381
$$ 3175472 3340516 2385938 1632227 2034876 2319215 1044648 -693172 -715102 853279
34915H53279J048326j20512L15847J561394J083306j295146l043451k377259j69614
$$ 853279 1901605 1781093 2096940 3658334 4741640 3446494 403043 -1974216 -2143830
34906b143830J556385J613639J98253j353484j439007K41813K205015K919896
$$ -2143830 -587445 1026194 1224447 -129037 -1568044 -1326231 878784 3798680
34898C798680K359204J134095o48366k394770k380420j43251J695241N99484j751812
$$ 3798680 6157884 7291979 6643613 4248843 1868423 1725172 3420413 4019897 2268085
34889B268085j623910Q55578J644874p67264k804828j450812J168255J616505
$$ 2268085 644175 1499753 3144627 2377363 -427465 -1878277 -710022 906483
34881I06483N86687Q86524K031296J078826j854762l118155j059771J594234K103189
$$ 906483 1493170 2379694 4410990 5489816 3635054 516899 -542872 1051362 3154551
34872C154551J342043J291076J486441L89891j386162j842436q07464j8961k66924
$$ 3154551 4496594 5787670 7274111 7664002 6277840 4435404 3627940 3608979 3342055
34863C342055o52503p56335j284621j946788r80680J765914L228694Q79560l081337
$$ 3342055 2689552 1933217 648596 -1298192 -2278872 -512958 2715736 3595296 513959
34854E13959m068462j374668R70160L21759p93770R08297L895490L913624L69464
$$ 513959 -3554503 -4929171 -3959011 -3637252 -4431022 -3522725 372765 4286389 4655853
34845D655853k881803k976399j064977N67829J414719J736991J259066K97239
$$ 4655853 1774050 -1202349 -2267326 -1699497 -284778 1452213 2711279 3008518
34837C008518J11693P92083P16261o62994j597582r77025j85187l54602k61094
$$ 3008518 3120211 3912294 4628555 3965561 2367979 1390954 1205767 851165 590071
34828E90071Q45433Q92888j572316l893312k874271l8542Q13581k8178R17163
$$ 590071 1435504 2328392 756076 -3137236 -6011507 -6050049 -5236468 -5264646 -4347483
34819d347483L497200L396494n38790l627737k357019L88574L73182j303619o91200
$$ -4347483 -850283 2546211 2007421 -1620316 -3977335 -3588761 -3215579 -4519198 -5210398
34810e210398K122488L113689O82335k062900j965896J71103J418811O94102m37487
$$ -5210398 -3087910 25779 708114 -1354786 -3320682 -3149579 -1730768 -1036666 -1474153
34801a474153j72515J283493J968033N33035j916964k958449j759670J20264J003553
$$ -1474153 -1646668 -363175 1604858 2137893 220929 -2737520 -4497190 -4376926 -3373373
34792c373373Q98728N65490J99335j01175J03111N25137k2620j511885j826973
$$ -3373373 -2474645 -1909155 -1709820 -1810995 -1707884 -1182747 -1205367 -2717252 -4544225
34783d544225L06738K744756K433727j89720j692834n06724J082241N53520j201819
$$ -4544225 -4237487 -1492731 940996 751276 -941558 -1448282 -366041 187479 -1014340
34774a014340j325531R56848L351153L489624J660348k6689m61152m82964j063829
$$ -1014340 -2339871 -1383023 1968130 5457754 7118102 7091413 6630261 6147297 5083468
34765E083468j766492j750192j307633j148848q47942L93901J810243J764643
$$ 5083468 3316976 1566784 259151 -889697 -1737639 -1343738 466505 2231148
34757B231148L80809n06471k90253l18163j083346j050714N22200J798479J044686
$$ 2231148 2611957 2105486 1815233 1497070 413724 -636990 -114790 1683689 2728375
34748B728375p28954j587811j506841j472271j197409J31178J833909K453985
$$ 2728375 1999421 411610 -1095231 -2567502 -3764911 -3633733 -1799824 654161
34740F54161J780228O04037o04301j360322q12390O55734R68503o06104j611887
$$ 654161 2434389 3038426 2434125 1073803 261413 917147 1885650 1279546 -332341
34731c32341R3933K590676K407166m66374k956431l243394j828910O04273L184084
$$ -332341 -238408 2352268 4759434 4293060 1336629 -1906765 -3735675 -3131402 52682
34722E2682L726593J180511j593140j227413P70237L52135j974649j647087J970532
$$ 52682 3779275 4959786 3366646 2139233 2909470 3261605 1286956 -360131 1610401
34713A610401L830165J196785k027189j820748n6928l24039j768671j387232N02874
$$ 1610401 5440566 6637351 4610162 2789414 2732486 2408447 639776 -747456 -244582
34704b44582J406476J150272J186613J058697n14188k245861j758329L27521J212229
$$ -244582 1161894 2312166 3498779 4557476 4043288 1797427 39098 366619 1578848
34695A578848K39388p72363r48029r80472p89677L20901J413981Q58003n84126
$$ 1578848 1818236 1045873 97844 -882628 -1672305 -1351404 62577 920580 336454
34686C36454n91514P57346R21223q30175k068709r95388R96732J669434Q40691
$$ 336454 -255060 502286 1423509 593334 -1475375 -2470763 -1474031 195403 1036094
34677A036094j41254l18260L14314J066395J020717J49973l38584J02764M6081
$$ 1036094 894840 576580 890894 1957289 2978006 3127979 2789395 2892159 2938240
34668B938240j530283k667006r07513K371593L331025J221949q76123j206022
$$ 2938240 1407957 -1259049 -2166562 205031 3536056 4758005 3881882 2675860
34660B675860j483415k772083k952585m82745K305083K339304K06284j131860
$$ 2675860 1192445 -1579638 -4532223 -5014968 -2709885 -370581 -164297 -1296157
34652a296157n93900L47702L07589o17884j506389j361051J45553J905231K336139
$$ -1296157 -1890057 -1542355 -1234766 -1852650 -3359039 -4720090 -4574537 -2669306 -333167
34643c33167J548669J048876R66386j76310k211010k601129m32732J612307J248911
$$ -333167 1215502 2264378 3230764 3054454 843444 -1757685 -2190417 -578110 670801
34634F70801q3235k47210j15259j245899k204553q24380J515144J653990l55793
$$ 670801 587566 340356 225097 -1020802 -3225355 -4049735 -2534591 -880601 -1236394
34625a236394j664834j236339m11031M78955K184136L476227K029699j292891
$$ -1236394 -2901228 -4137567 -4548598 -4069643 -1885507 1590720 3620419 2327528
34617B327528k804403j268165P04790J140600R39566Q22300j11466j476385j024973
$$ 2327528 -476875 -1745040 -1040250 100350 1039916 1862216 1750750 274365 -750608
34608g50608J331994K509238J124687k08434L84535Q00168p50657j927074l50121
$$ -750608 581386 3090624 4215311 4006877 4391412 5191580 4440923 2513849 2163728
34599B163728J707850R41318j251421j286308K33147k98513k841022l393395n78836
$$ 2163728 3871578 4812896 3561475 2275167 2508314 2209801 -631221 -4024616 -4603452
34590d603452K117003J796400m3225o79921l1254L76622L4394m97942o40343J4210
$$ -4603452 -2486449 -690049 -733274 -1413195 -1444449 -1067827 -1033433 -1531375 -2171718 -2157508
34580b157508J271933J849568P95346p26669q60218Q0810L36352j60271q382O20572
$$ -2157508 -885575 963993 1759339 1032670 172452 253262 589614 429343 420961 1041533
34570A041533K50753o46342j14503J287144P71828j576959k114907M08313K357329
$$ 1041533 1292286 645944 531441 1818585 2590413 1013454 -1101453 -693140 1664189
34561A664189R99026j164248q99573M79333Q2657j217340o67834J168045J453419
$$ 1664189 2663215 1498967 599394 1078727 1161384 -55956 -723790 444255 1897674
34552A897674J25395k56814Q52104J322793K26896r74009j198432q29915r9796
$$ 1897674 2023069 1766255 2618359 3941152 4168048 3194039 1995607 1165692 1065896
34543A065896R32407J083325m81680j891743p43844J708597J950755k42147j375151
$$ 1065896 1998303 3081628 2599948 708205 -35639 1672958 3623713 3381566 2006415
34534B006415R0006J424794K94922j709713k062614j032342m09170o27716r72745
$$ 2006415 2096421 3521215 3816137 2106424 43810 -988532 -1397702 -2025418 -2998163
34525b998163r85258l18190J189023K394068J767628J61042K00180J992089K390619
$$ -2998163 -3983421 -4301611 -3112588 -718520 1049108 1210150 1410330 3402419 5793038
34516E793038L2297k100807j413690J07384n02452k051179j443583P79085J325427
$$ 5793038 5825335 3724528 2310838 2418222 1915770 -135409 -1578992 -799907 525520
34507E25520k90144j202934j85091O81509K9072n08138O25190K203281K209334
$$ 525520 235376 -967558 -1152649 -471140 -442068 -950206 -325016 1878265 4087599
34498D087599O61295r73580j780998j648536p11681M04324P38254J78545l69038
$$ 4087599 4748894 3775314 1994316 345780 -365901 38423 776677 955222 586184
34489E86184m75503p19815j210631r55920M18655J624865J532724R00723R23828
$$ 586184 110681 -609134 -1819765 -2775685 -2357030 -732165 800559 1701282 2625110
34480B625110J059830O1045j445359j525745j35717M85487n62360r80468J187137
$$ 2625110 3684940 3745985 2300626 774881 639164 1124651 562291 -418177 768960
34471G68960L803052L130997n18621k788761j521809J94534r25369l143940k664607
$$ 768960 4572012 7703009 7184388 4395627 2873818 3068352 2142983 -1000957 -3665564
34462c665564J18561J369448J56118l26492J485568K842896J576363j89609L6495
$$ -3665564 -3547003 -2177555 -2021437 -2347929 -862361 1980535 3556898 3367289 3403784
34453C403784P60138m16205j970211r31708J505287J488036j005381j945397Q2211
$$ 3403784 4163922 3747717 1777506 845798 2351085 3839121 2833740 888343 970554
34444I70554J649092L27688j547566j267935j36588m01821r03959M48986K066475
$$ 970554 2619646 2947334 1399768 131833 -4755 -406576 -1310535 -861549 1204926
34435A204926Q15800k320057l131947o91882J325628P14092n9320J287679K579531
$$ 1204926 2020726 -299331 -3431278 -4123160 -2797532 -2083440 -2142760 -855081 1724450
34426A724450J001527j604887j354399J273625K052042k56675k235394j690142
$$ 1724450 2725977 1121090 -233309 1040316 3092358 2835683 600289 -1089853
34418a089853p92374j386920j324756J258750L477747J908189j145738q13094
$$ -1089853 -1882227 -3269147 -4593903 -3335153 142594 2050783 905045 91951
34410I1951K114390J986321k296768m767185j540332K974372K845193o11951j671912
$$ 91951 2206341 4192662 1895894 -2871291 -4411623 -1437251 1407942 795991 -875921
34401h75921Q48501K660434J023906j959833l209455k168953l4590J676560J565091
$$ -875921 -27420 2633014 3656920 1697087 -1512368 -3681321 -3715911 -2039351 -474260
34392d74260k28992j262303J37570J773054O00816j944277j633310J642888L203090
$$ -474260 -703252 -1965555 -1827985 -54931 545885 -1398392 -3031702 -1388814 1814276
34383A814276Q40129j784606j112658J033980J147712k96864n00187N57694M36913
$$ 1814276 2654405 869799 -242859 791121 1938833 1641969 1141782 1699476 2136389
34374B136389j416021k925643k642488j215198K26937J220892J652501J682381
$$ 2136389 720368 -2205275 -4847763 -6062961 -5836024 -4615132 -2962631 -1280250
34366a280250J659660J342292K45199o40759N08778K865409K796454p17031l415349
$$ -1280250 379410 1721702 1966901 1326142 1834920 4700329 7496783 6779752 3364403
34357C364403j692977J507475J074292k017532k263821J230037L147744N36776
$$ 3364403 1671426 3178901 4253193 2235661 -28160 1201877 4349621 4886397
34349D886397k678341k235493K26239R13941P8279L82833J648027J444587m39966
$$ 4886397 2208056 -27437 198802 1112743 1191022 1573855 3221882 4666469 4226503
34340D226503j881047j993359j572427o19540J339702K833615J660650j279861
$$ 4226503 2345456 352097 -1220330 -1839870 -500168 2333447 3994097 2714236
34332B714236k481000p75777J041503M93705j262951j733690n46317R12416J652479
$$ 2714236 233236 -542541 498962 992667 -270284 -2003974 -2550291 -1637875 14604
34323A4604J407989K10038r97331o36275J203874K046876K37971k288975k396786
$$ 14604 1422593 1632631 635300 -975 1202899 3249775 3487746 1198771 -1198015
34314a198015j05520J603547J089722o8640Q0112J084605J196482j9322j372717
$$ -1198015 -1303535 300012 1389734 1321094 1401206 2485811 3682293 3662971 2290254
34305B290254j715318r30296M14380J520150J515988j2175k231989l245394j784724
$$ 2290254 574936 -355360 59020 1579170 3095158 3082983 850994 -2394400 -4179124
34296d179124J087684K591516J186956j412416k106841k34378J666433J308645
$$ -4179124 -3091440 -499924 687032 -725384 -2832225 -3066603 -1400170 -91525
34288i1525m44944j138320j20814J065874J166500N35554L3260m9980K31315O66179
$$ -91525 -536469 -1674789 -1795603 -729729 436771 972325 1005585 955605 1186920 1853099
34278A853099O09341m91791k007092k443725j162744R52373K676370L435133K972979
$$ 1853099 2462440 1970649 -36443 -2480168 -3642912 -2690539 -14169 3420964 6393943
34269F393943J113172j549975l457790l326812j423782O63883J437378P69006
$$ 6393943 7507115 5957140 2499350 -827462 -2251244 -1587361 -149983 619023
34261F19023l3241K35428R49364L66544j462279j999184J76649K589938K036243
$$ 619023 585782 821210 1770574 2137118 674839 -1324345 -1147696 1442242 3478485
34252C478485n16254j225531P45473K099009P11136j430648j980721j630593j682737
$$ 3478485 2962231 1736700 2482173 4581182 5292318 3861670 1880949 250356 -1432381
34243a432381j195956P19818K110086P92210j805694k438190o08509J380675J975760
$$ -1432381 -2628337 -1908519 201567 993777 -811917 -3250107 -3858616 -2477941 -502181
34234e02181J342646k29481k128608k495701m11055J735264J131189q80636o21240
$$ -502181 840465 610984 -1517624 -4013325 -4424380 -2689116 -1557927 -2438563 -3059803
34225c059803J866221K612406J21354k121395j106921J283071J547915m97763
$$ -3059803 -1193582 1418824 1540178 -581217 -1688138 -405067 1142848 645085
34217F45085k461908k951054k068473j1867K479921L464324J798132q73110j897067
$$ 645085 -1816823 -4767877 -6836350 -6848217 -4368296 -903972 894160 21050 -1876017
34208a876017q20543O42180J200803J060692Q01354N11518l035q70001j806738
$$ -1876017 -2696560 -2054380 -853577 207115 1008469 1519987 1516952 646951 -1159787
34199a159787j902187n05994J417016J969323Q16204l09090j91154K96073Q4712
$$ -1159787 -3061974 -3567968 -2150952 -181629 634575 325485 134331 430404 515116
34190E15116k52004J19218N00173j44662j237285j402293m77189O47020J449224
$$ 515116 263112 382330 882503 737841 -499444 -1901737 -2378926 -1731906 -282682
34181b82682J802082J378674K58384o69356r57610j200554j358419q3738K686448
$$ -282682 1519400 2898074 3156458 2487102 1529492 328938 -1029481 -1113219 1573229
34172A573229M208723K335641r37921k063431j027027p03942j738434j736953
$$ 1573229 5781952 8117593 7179672 5116241 4089214 3385272 1646838 -90115
34164i0115J04152J278136J92410j118257m66235R31314P37345o48057j092299
$$ -90115 14037 1292173 1484583 366326 -99909 831405 1568750 920693 -171606
34155a71606k71724L42508K73064M17683R66069J051819M30518k54093p58902
$$ -171606 -443330 -100822 172242 589925 1555994 2607813 3038331 2784238 2025336
34146B025336j149857p53504Q49487K055029Q63392j589483j883543N41875K070221
$$ 2025336 875479 121975 971462 3026491 3889883 2300400 416857 958732 3028953
34137C028953L47824j898912j150783J234879J271899j183176k370412p43996
$$ 3028953 3376777 1477865 327082 1561961 2833860 1650684 -719728 -1463724
34129a463724J082139J214068J180856K095119J951363n90357k896171k154276
$$ -1463724 -381585 832483 2013339 4108458 6059821 5469464 2573293 419017
34121D19017p0036n1642j474713r78583J361284J746393r66835k879034p80830
$$ 419017 348981 297339 -1177374 -2155957 -794673 951720 -15115 -2894149 -3674979
34112c674979L034003M092527J713552q50965j086833K46575R80536K32064j132613
$$ -3674979 -640976 3451551 5165103 4314138 3227305 3473880 4454416 4686480 3553867
34103C553867j882056j692312r99499M84J357270K275228J422011q28289k007909
$$ 3553867 1671811 -20501 -1020000 -1019516 337754 2612982 4034993 3206704 1198795
34094A198795q60384N60557R0897r48444j71503J358224P56963j357439j503873
$$ 1198795 338411 898968 989865 41421 -130082 1228142 1985105 627666 -876207
34085h76207O47227J521936j36103j025013P49631J978887l19109l615762l647472
$$ -876207 -228980 1292956 1156853 131840 881471 2860358 2541249 -1074513 -4721985
34076d721985p40687J479432J757579J769927K197554J833843K90803j176616
$$ -4721985 -5462672 -3983240 -2225661 -455734 1741820 3575663 3866466 2689850
34068B689850j525737q25007K56046O32756m31889j727945j071035J004175J159319
$$ 2689850 1164113 339106 595152 1227908 796019 -931926 -2002961 -998786 160533
34059A60533j405803k773591k72602K669148J582825j856231k475038L89542K644708
$$ 160533 -1245270 -4018861 -4291463 -1622315 -39490 -1895721 -4370759 -3981217 -1336509
$$ [...]
##END NTUPLES=NMR SPECTRUM
##END=
